{"text_format":"1","workbook":"xlsx","n_sheets":6,"sheets":["Réservations","Calendrier AUTO.","Calendrier MANUEL","Tableau de bord","Données","Périodes adm."],"not_rendered":{"charts":0,"images":0,"macros":1,"external_links":0,"defined_names":17,"comments":0,"pivot_tables":8},"unopened":[],"bounds":{"document_bytes":16777216,"sheet_cells":100000,"rows_first":2000,"rows_last":500,"rows_between":2000,"halvings":0,"cell_chars":16384,"cell_head_chars":4096},"cells_cut":0,"cells_raw":0,"read":"whole","date_system":"1900"}

{"sheet":"Réservations","index":0,"n_rows":35,"n_cols":35,"rows_kept":35,"cut":false,"hidden":false,"merged":[[1,1,1,6]]}
[]
[null,"Réservations - Hébergement temporaire"]
[null,"Numéro\ndossier","Nom","Prénom","Nom, Prénom","Date de naissance","Âge","Profil","ISO-SMAF","RLS","Site","No chambre","Date dépôt \ndemande","Période (dépôt)","Année (dépôt)","Référant\n(Nom, Prénom)","Titre d'emploi","Motif de la demande","Connu SAD","Demande confirmée","Date arrivée","Période (arrivée)","Année (arrivée)","Séjour 1","Date départ","Période (départ)","Année (départ)","Séjour 2","Durée\nséjour","Test COVID \ndemandé","Avis envoyé","Commentaires","Statut","Statut modifié","Actif"]
[null,null,null,"Réjean",{"$f":"CONCATENATE(Tableau15[[#This Row],[Nom]],\", \",Tableau15[[#This Row],[Prénom]])","v":", Réjean"},"1964-07-09",{"$f":"IF(Tableau15[[#This Row],[Date de naissance]]<>\"\",DATEDIF(Tableau15[[#This Row],[Date de naissance]],TODAY(),\"Y\"),\"\")","v":56},null,null,{"$f":"IF(Tableau15[[#This Row],[Numéro\ndossier]]<>\"\",\"Arthabaska-Érable\",\"\")","v":""},"Marchand",102,"2021-03-22",{"$f":"IFERROR(VLOOKUP(Tableau15[[#This Row],[Date dépôt \ndemande]],Tableau16[],4,1),\"\")","v":"P13"},{"$f":"IFERROR(VLOOKUP(Tableau15[[#This Row],[Date dépôt \ndemande]],Tableau16[],5,1),\"\")","v":"2020-2021"},null,null,"Répit aidants",null,"Oui","2021-04-01",{"$f":"IFERROR(VLOOKUP(Tableau15[[#This Row],[Date arrivée]],Tableau16[],4,1),\"\")","v":"P01"},{"$f":"IFERROR(VLOOKUP(Tableau15[[#This Row],[Date arrivée]],Tableau16[],5,1),\"\")","v":"2021-2022"},null,"2021-04-10",{"$f":"IFERROR(VLOOKUP(Tableau15[[#This Row],[Date départ]],Tableau16[],4,1),\"\")","v":"P01"},{"$f":"IFERROR(VLOOKUP(Tableau15[[#This Row],[Date départ]],Tableau16[],5,1),\"\")","v":"2021-2022"},null,{"$f":"IF(AND(Tableau15[[#This Row],[Statut]]=\"Réservé (Confirmé)\",Tableau15[[#This Row],[Statut modifié]]=\"\"),Tableau15[[#This Row],[Date départ]]-Tableau15[[#This Row],[Date arrivée]]+1,0)","v":0},null,null,null,"Réservé (Confirmé)","Annulé",{"$f":"IF(Tableau15[[#This Row],[Date départ]]<TODAY(),\"Inactif\",\"Actif\")","v":"Inactif"}]
[null,null,null,"Solange",{"$f":"CONCATENATE(Tableau15[[#This Row],[Nom]],\", \",Tableau15[[#This Row],[Prénom]])","v":", Solange"},"1946-08-13",{"$f":"IF(Tableau15[[#This Row],[Date de naissance]]<>\"\",DATEDIF(Tableau15[[#This Row],[Date de naissance]],TODAY(),\"Y\"),\"\")","v":74},null,9,{"$f":"IF(Tableau15[[#This Row],[Numéro\ndossier]]<>\"\",\"Arthabaska-Érable\",\"\")","v":""},"St_Eusèbe",204,"2021-04-28",{"$f":"IFERROR(VLOOKUP(Tableau15[[#This Row],[Date dépôt \ndemande]],Tableau16[],4,1),\"\")","v":"P02"},{"$f":"IFERROR(VLOOKUP(Tableau15[[#This Row],[Date dépôt \ndemande]],Tableau16[],5,1),\"\")","v":"2021-2022"},null,null,"Répit aidants",null,"Oui","2021-06-14",{"$f":"IFERROR(VLOOKUP(Tableau15[[#This Row],[Date arrivée]],Tableau16[],4,1),\"\")","v":"P03"},{"$f":"IFERROR(VLOOKUP(Tableau15[[#This Row],[Date arrivée]],Tableau16[],5,1),\"\")","v":"2021-2022"},null,"2021-06-21",{"$f":"IFERROR(VLOOKUP(Tableau15[[#This Row],[Date départ]],Tableau16[],4,1),\"\")","v":"P04"},{"$f":"IFERROR(VLOOKUP(Tableau15[[#This Row],[Date départ]],Tableau16[],5,1),\"\")","v":"2021-2022"},null,{"$f":"IF(AND(Tableau15[[#This Row],[Statut]]=\"Réservé (Confirmé)\",Tableau15[[#This Row],[Statut modifié]]=\"\"),Tableau15[[#This Row],[Date départ]]-Tableau15[[#This Row],[Date arrivée]]+1,0)","v":8},null,null,null,"Réservé (Confirmé)",null,{"$f":"IF(Tableau15[[#This Row],[Date départ]]<TODAY(),\"Inactif\",\"Actif\")","v":"Actif"}]
[null,null,null,"Solange",{"$f":"CONCATENATE(Tableau15[[#This Row],[Nom]],\", \",Tableau15[[#This Row],[Prénom]])","v":", Solange"},"1946-08-13",{"$f":"IF(Tableau15[[#This Row],[Date de naissance]]<>\"\",DATEDIF(Tableau15[[#This Row],[Date de naissance]],TODAY(),\"Y\"),\"\")","v":74},null,9,{"$f":"IF(Tableau15[[#This Row],[Numéro\ndossier]]<>\"\",\"Arthabaska-Érable\",\"\")","v":""},"St_Eusèbe",204,"2021-04-28",{"$f":"IFERROR(VLOOKUP(Tableau15[[#This Row],[Date dépôt \ndemande]],Tableau16[],4,1),\"\")","v":"P02"},{"$f":"IFERROR(VLOOKUP(Tableau15[[#This Row],[Date dépôt \ndemande]],Tableau16[],5,1),\"\")","v":"2021-2022"},null,null,"Répit aidants",null,"Oui","2021-07-28",{"$f":"IFERROR(VLOOKUP(Tableau15[[#This Row],[Date arrivée]],Tableau16[],4,1),\"\")","v":"P05"},{"$f":"IFERROR(VLOOKUP(Tableau15[[#This Row],[Date arrivée]],Tableau16[],5,1),\"\")","v":"2021-2022"},null,"2021-08-04",{"$f":"IFERROR(VLOOKUP(Tableau15[[#This Row],[Date départ]],Tableau16[],4,1),\"\")","v":"P05"},{"$f":"IFERROR(VLOOKUP(Tableau15[[#This Row],[Date départ]],Tableau16[],5,1),\"\")","v":"2021-2022"},null,{"$f":"IF(AND(Tableau15[[#This Row],[Statut]]=\"Réservé (Confirmé)\",Tableau15[[#This Row],[Statut modifié]]=\"\"),Tableau15[[#This Row],[Date départ]]-Tableau15[[#This Row],[Date arrivée]]+1,0)","v":0},null,null,null,"Réservé (Confirmé)","Annulé",{"$f":"IF(Tableau15[[#This Row],[Date départ]]<TODAY(),\"Inactif\",\"Actif\")","v":"Actif"}]
[null,null,null,"Solange",{"$f":"CONCATENATE(Tableau15[[#This Row],[Nom]],\", \",Tableau15[[#This Row],[Prénom]])","v":", Solange"},"1946-08-13",{"$f":"IF(Tableau15[[#This Row],[Date de naissance]]<>\"\",DATEDIF(Tableau15[[#This Row],[Date de naissance]],TODAY(),\"Y\"),\"\")","v":74},null,9,{"$f":"IF(Tableau15[[#This Row],[Numéro\ndossier]]<>\"\",\"Arthabaska-Érable\",\"\")","v":""},"St_Eusèbe",204,"2021-03-04",{"$f":"IFERROR(VLOOKUP(Tableau15[[#This Row],[Date dépôt \ndemande]],Tableau16[],4,1),\"\")","v":"P13"},{"$f":"IFERROR(VLOOKUP(Tableau15[[#This Row],[Date dépôt \ndemande]],Tableau16[],5,1),\"\")","v":"2020-2021"},"                              ",null,"Répit aidants",null,"Oui","2021-04-09",{"$f":"IFERROR(VLOOKUP(Tableau15[[#This Row],[Date arrivée]],Tableau16[],4,1),\"\")","v":"P01"},{"$f":"IFERROR(VLOOKUP(Tableau15[[#This Row],[Date arrivée]],Tableau16[],5,1),\"\")","v":"2021-2022"},null,"2021-04-16",{"$f":"IFERROR(VLOOKUP(Tableau15[[#This Row],[Date départ]],Tableau16[],4,1),\"\")","v":"P01"},{"$f":"IFERROR(VLOOKUP(Tableau15[[#This Row],[Date départ]],Tableau16[],5,1),\"\")","v":"2021-2022"},null,{"$f":"IF(AND(Tableau15[[#This Row],[Statut]]=\"Réservé (Confirmé)\",Tableau15[[#This Row],[Statut modifié]]=\"\"),Tableau15[[#This Row],[Date départ]]-Tableau15[[#This Row],[Date arrivée]]+1,0)","v":8},null,null,null,"Réservé (Confirmé)",null,{"$f":"IF(Tableau15[[#This Row],[Date départ]]<TODAY(),\"Inactif\",\"Actif\")","v":"Inactif"}]
[null,null,null,"Solange",{"$f":"CONCATENATE(Tableau15[[#This Row],[Nom]],\", \",Tableau15[[#This Row],[Prénom]])","v":", Solange"},"1946-08-13",{"$f":"IF(Tableau15[[#This Row],[Date de naissance]]<>\"\",DATEDIF(Tableau15[[#This Row],[Date de naissance]],TODAY(),\"Y\"),\"\")","v":74},null,9,{"$f":"IF(Tableau15[[#This Row],[Numéro\ndossier]]<>\"\",\"Arthabaska-Érable\",\"\")","v":""},"St_Eusèbe",204,"2021-03-04",{"$f":"IFERROR(VLOOKUP(Tableau15[[#This Row],[Date dépôt \ndemande]],Tableau16[],4,1),\"\")","v":"P13"},{"$f":"IFERROR(VLOOKUP(Tableau15[[#This Row],[Date dépôt \ndemande]],Tableau16[],5,1),\"\")","v":"2020-2021"},null,null,"Répit aidants",null,"Oui","2021-05-17",{"$f":"IFERROR(VLOOKUP(Tableau15[[#This Row],[Date arrivée]],Tableau16[],4,1),\"\")","v":"P02"},{"$f":"IFERROR(VLOOKUP(Tableau15[[#This Row],[Date arrivée]],Tableau16[],5,1),\"\")","v":"2021-2022"},null,"2021-05-24",{"$f":"IFERROR(VLOOKUP(Tableau15[[#This Row],[Date départ]],Tableau16[],4,1),\"\")","v":"P03"},{"$f":"IFERROR(VLOOKUP(Tableau15[[#This Row],[Date départ]],Tableau16[],5,1),\"\")","v":"2021-2022"},null,{"$f":"IF(AND(Tableau15[[#This Row],[Statut]]=\"Réservé (Confirmé)\",Tableau15[[#This Row],[Statut modifié]]=\"\"),Tableau15[[#This Row],[Date départ]]-Tableau15[[#This Row],[Date arrivée]]+1,0)","v":8},null,null,null,"Réservé (Confirmé)",null,{"$f":"IF(Tableau15[[#This Row],[Date départ]]<TODAY(),\"Inactif\",\"Actif\")","v":"Inactif"}]
[null,null,null,"Réal",{"$f":"CONCATENATE(Tableau15[[#This Row],[Nom]],\", \",Tableau15[[#This Row],[Prénom]])","v":", Réal"},"1937-05-22",{"$f":"IF(Tableau15[[#This Row],[Date de naissance]]<>\"\",DATEDIF(Tableau15[[#This Row],[Date de naissance]],TODAY(),\"Y\"),\"\")","v":84},null,12,{"$f":"IF(Tableau15[[#This Row],[Numéro\ndossier]]<>\"\",\"Arthabaska-Érable\",\"\")","v":""},"St_Eusèbe",204,"2021-04-27",{"$f":"IFERROR(VLOOKUP(Tableau15[[#This Row],[Date dépôt \ndemande]],Tableau16[],4,1),\"\")","v":"P02"},{"$f":"IFERROR(VLOOKUP(Tableau15[[#This Row],[Date dépôt \ndemande]],Tableau16[],5,1),\"\")","v":"2021-2022"},null,null,"Répit aidants",null,"Oui","2021-06-25",{"$f":"IFERROR(VLOOKUP(Tableau15[[#This Row],[Date arrivée]],Tableau16[],4,1),\"\")","v":"P04"},{"$f":"IFERROR(VLOOKUP(Tableau15[[#This Row],[Date arrivée]],Tableau16[],5,1),\"\")","v":"2021-2022"},null,"2021-07-26",{"$f":"IFERROR(VLOOKUP(Tableau15[[#This Row],[Date départ]],Tableau16[],4,1),\"\")","v":"P05"},{"$f":"IFERROR(VLOOKUP(Tableau15[[#This Row],[Date départ]],Tableau16[],5,1),\"\")","v":"2021-2022"},null,{"$f":"IF(AND(Tableau15[[#This Row],[Statut]]=\"Réservé (Confirmé)\",Tableau15[[#This Row],[Statut modifié]]=\"\"),Tableau15[[#This Row],[Date départ]]-Tableau15[[#This Row],[Date arrivée]]+1,0)","v":0},null,null,null,"Réservé (En attente)",null,{"$f":"IF(Tableau15[[#This Row],[Date départ]]<TODAY(),\"Inactif\",\"Actif\")","v":"Actif"}]
[null,null,null,"Gilles",{"$f":"CONCATENATE(Tableau15[[#This Row],[Nom]],\", \",Tableau15[[#This Row],[Prénom]])","v":", Gilles"},"1933-08-29",{"$f":"IF(Tableau15[[#This Row],[Date de naissance]]<>\"\",DATEDIF(Tableau15[[#This Row],[Date de naissance]],TODAY(),\"Y\"),\"\")","v":87},null,11,{"$f":"IF(Tableau15[[#This Row],[Numéro\ndossier]]<>\"\",\"Arthabaska-Érable\",\"\")","v":""},"St_Eusèbe",204,"2021-05-27",{"$f":"IFERROR(VLOOKUP(Tableau15[[#This Row],[Date dépôt \ndemande]],Tableau16[],4,1),\"\")","v":"P03"},{"$f":"IFERROR(VLOOKUP(Tableau15[[#This Row],[Date dépôt \ndemande]],Tableau16[],5,1),\"\")","v":"2021-2022"},null,null,"Répit aidants",null,"Oui","2021-05-31",{"$f":"IFERROR(VLOOKUP(Tableau15[[#This Row],[Date arrivée]],Tableau16[],4,1),\"\")","v":"P03"},{"$f":"IFERROR(VLOOKUP(Tableau15[[#This Row],[Date arrivée]],Tableau16[],5,1),\"\")","v":"2021-2022"},null,"2021-06-12",{"$f":"IFERROR(VLOOKUP(Tableau15[[#This Row],[Date départ]],Tableau16[],4,1),\"\")","v":"P03"},{"$f":"IFERROR(VLOOKUP(Tableau15[[#This Row],[Date départ]],Tableau16[],5,1),\"\")","v":"2021-2022"},null,{"$f":"IF(AND(Tableau15[[#This Row],[Statut]]=\"Réservé (Confirmé)\",Tableau15[[#This Row],[Statut modifié]]=\"\"),Tableau15[[#This Row],[Date départ]]-Tableau15[[#This Row],[Date arrivée]]+1,0)","v":13},null,null,null,"Réservé (Confirmé)",null,{"$f":"IF(Tableau15[[#This Row],[Date départ]]<TODAY(),\"Inactif\",\"Actif\")","v":"Actif"}]
[null,null,null,"Jeannine",{"$f":"CONCATENATE(Tableau15[[#This Row],[Nom]],\", \",Tableau15[[#This Row],[Prénom]])","v":", Jeannine"},"1927-08-06",{"$f":"IF(Tableau15[[#This Row],[Date de naissance]]<>\"\",DATEDIF(Tableau15[[#This Row],[Date de naissance]],TODAY(),\"Y\"),\"\")","v":93},null,null,{"$f":"IF(Tableau15[[#This Row],[Numéro\ndossier]]<>\"\",\"Arthabaska-Érable\",\"\")","v":""},"Tilleul",215,"2021-05-25",{"$f":"IFERROR(VLOOKUP(Tableau15[[#This Row],[Date dépôt \ndemande]],Tableau16[],4,1),\"\")","v":"P03"},{"$f":"IFERROR(VLOOKUP(Tableau15[[#This Row],[Date dépôt \ndemande]],Tableau16[],5,1),\"\")","v":"2021-2022"},null,null,"Répit aidants",null,"Oui","2021-06-10",{"$f":"IFERROR(VLOOKUP(Tableau15[[#This Row],[Date arrivée]],Tableau16[],4,1),\"\")","v":"P03"},{"$f":"IFERROR(VLOOKUP(Tableau15[[#This Row],[Date arrivée]],Tableau16[],5,1),\"\")","v":"2021-2022"},null,"2021-06-19",{"$f":"IFERROR(VLOOKUP(Tableau15[[#This Row],[Date départ]],Tableau16[],4,1),\"\")","v":"P03"},{"$f":"IFERROR(VLOOKUP(Tableau15[[#This Row],[Date départ]],Tableau16[],5,1),\"\")","v":"2021-2022"},null,{"$f":"IF(AND(Tableau15[[#This Row],[Statut]]=\"Réservé (Confirmé)\",Tableau15[[#This Row],[Statut modifié]]=\"\"),Tableau15[[#This Row],[Date départ]]-Tableau15[[#This Row],[Date arrivée]]+1,0)","v":10},null,null,null,"Réservé (Confirmé)",null,{"$f":"IF(Tableau15[[#This Row],[Date départ]]<TODAY(),\"Inactif\",\"Actif\")","v":"Actif"}]
[null,null,null,"Noella",{"$f":"CONCATENATE(Tableau15[[#This Row],[Nom]],\", \",Tableau15[[#This Row],[Prénom]])","v":", Noella"},"1927-09-22",{"$f":"IF(Tableau15[[#This Row],[Date de naissance]]<>\"\",DATEDIF(Tableau15[[#This Row],[Date de naissance]],TODAY(),\"Y\"),\"\")","v":93},null,13,{"$f":"IF(Tableau15[[#This Row],[Numéro\ndossier]]<>\"\",\"Arthabaska-Érable\",\"\")","v":""},"Tilleul",215,"2021-05-04",{"$f":"IFERROR(VLOOKUP(Tableau15[[#This Row],[Date dépôt \ndemande]],Tableau16[],4,1),\"\")","v":"P02"},{"$f":"IFERROR(VLOOKUP(Tableau15[[#This Row],[Date dépôt \ndemande]],Tableau16[],5,1),\"\")","v":"2021-2022"},null,null,"Répit aidants",null,"Oui","2021-05-07",{"$f":"IFERROR(VLOOKUP(Tableau15[[#This Row],[Date arrivée]],Tableau16[],4,1),\"\")","v":"P02"},{"$f":"IFERROR(VLOOKUP(Tableau15[[#This Row],[Date arrivée]],Tableau16[],5,1),\"\")","v":"2021-2022"},null,"2021-05-23",{"$f":"IFERROR(VLOOKUP(Tableau15[[#This Row],[Date départ]],Tableau16[],4,1),\"\")","v":"P03"},{"$f":"IFERROR(VLOOKUP(Tableau15[[#This Row],[Date départ]],Tableau16[],5,1),\"\")","v":"2021-2022"},null,{"$f":"IF(AND(Tableau15[[#This Row],[Statut]]=\"Réservé (Confirmé)\",Tableau15[[#This Row],[Statut modifié]]=\"\"),Tableau15[[#This Row],[Date départ]]-Tableau15[[#This Row],[Date arrivée]]+1,0)","v":17},null,null,null,"Réservé (Confirmé)",null,{"$f":"IF(Tableau15[[#This Row],[Date départ]]<TODAY(),\"Inactif\",\"Actif\")","v":"Inactif"}]
[null,null,null,"Irène",{"$f":"CONCATENATE(Tableau15[[#This Row],[Nom]],\", \",Tableau15[[#This Row],[Prénom]])","v":", Irène"},"1932-03-20",{"$f":"IF(Tableau15[[#This Row],[Date de naissance]]<>\"\",DATEDIF(Tableau15[[#This Row],[Date de naissance]],TODAY(),\"Y\"),\"\")","v":89},null,10,{"$f":"IF(Tableau15[[#This Row],[Numéro\ndossier]]<>\"\",\"Arthabaska-Érable\",\"\")","v":""},"Tilleul",215,"2021-05-07",{"$f":"IFERROR(VLOOKUP(Tableau15[[#This Row],[Date dépôt \ndemande]],Tableau16[],4,1),\"\")","v":"P02"},{"$f":"IFERROR(VLOOKUP(Tableau15[[#This Row],[Date dépôt \ndemande]],Tableau16[],5,1),\"\")","v":"2021-2022"},null,null,"Répit aidants",null,"Oui","2021-05-17",{"$f":"IFERROR(VLOOKUP(Tableau15[[#This Row],[Date arrivée]],Tableau16[],4,1),\"\")","v":"P02"},{"$f":"IFERROR(VLOOKUP(Tableau15[[#This Row],[Date arrivée]],Tableau16[],5,1),\"\")","v":"2021-2022"},null,"2021-05-26",{"$f":"IFERROR(VLOOKUP(Tableau15[[#This Row],[Date départ]],Tableau16[],4,1),\"\")","v":"P03"},{"$f":"IFERROR(VLOOKUP(Tableau15[[#This Row],[Date départ]],Tableau16[],5,1),\"\")","v":"2021-2022"},null,{"$f":"IF(AND(Tableau15[[#This Row],[Statut]]=\"Réservé (Confirmé)\",Tableau15[[#This Row],[Statut modifié]]=\"\"),Tableau15[[#This Row],[Date départ]]-Tableau15[[#This Row],[Date arrivée]]+1,0)","v":10},null,null,null,"Réservé (Confirmé)",null,{"$f":"IF(Tableau15[[#This Row],[Date départ]]<TODAY(),\"Inactif\",\"Actif\")","v":"Inactif"}]
[null,null,null,"Irène",{"$f":"CONCATENATE(Tableau15[[#This Row],[Nom]],\", \",Tableau15[[#This Row],[Prénom]])","v":", Irène"},"1932-03-20",{"$f":"IF(Tableau15[[#This Row],[Date de naissance]]<>\"\",DATEDIF(Tableau15[[#This Row],[Date de naissance]],TODAY(),\"Y\"),\"\")","v":89},null,10,{"$f":"IF(Tableau15[[#This Row],[Numéro\ndossier]]<>\"\",\"Arthabaska-Érable\",\"\")","v":""},"Tilleul",215,"2021-05-07",{"$f":"IFERROR(VLOOKUP(Tableau15[[#This Row],[Date dépôt \ndemande]],Tableau16[],4,1),\"\")","v":"P02"},{"$f":"IFERROR(VLOOKUP(Tableau15[[#This Row],[Date dépôt \ndemande]],Tableau16[],5,1),\"\")","v":"2021-2022"},null,null,"Répit aidants",null,"Oui","2021-06-21",{"$f":"IFERROR(VLOOKUP(Tableau15[[#This Row],[Date arrivée]],Tableau16[],4,1),\"\")","v":"P04"},{"$f":"IFERROR(VLOOKUP(Tableau15[[#This Row],[Date arrivée]],Tableau16[],5,1),\"\")","v":"2021-2022"},null,"2021-06-27",{"$f":"IFERROR(VLOOKUP(Tableau15[[#This Row],[Date départ]],Tableau16[],4,1),\"\")","v":"P04"},{"$f":"IFERROR(VLOOKUP(Tableau15[[#This Row],[Date départ]],Tableau16[],5,1),\"\")","v":"2021-2022"},null,{"$f":"IF(AND(Tableau15[[#This Row],[Statut]]=\"Réservé (Confirmé)\",Tableau15[[#This Row],[Statut modifié]]=\"\"),Tableau15[[#This Row],[Date départ]]-Tableau15[[#This Row],[Date arrivée]]+1,0)","v":7},null,null,null,"Réservé (Confirmé)",null,{"$f":"IF(Tableau15[[#This Row],[Date départ]]<TODAY(),\"Inactif\",\"Actif\")","v":"Actif"}]
[null,null,null,"Irène",{"$f":"CONCATENATE(Tableau15[[#This Row],[Nom]],\", \",Tableau15[[#This Row],[Prénom]])","v":", Irène"},"1932-03-20",{"$f":"IF(Tableau15[[#This Row],[Date de naissance]]<>\"\",DATEDIF(Tableau15[[#This Row],[Date de naissance]],TODAY(),\"Y\"),\"\")","v":89},null,10,{"$f":"IF(Tableau15[[#This Row],[Numéro\ndossier]]<>\"\",\"Arthabaska-Érable\",\"\")","v":""},"Tilleul",215,"2021-05-07",{"$f":"IFERROR(VLOOKUP(Tableau15[[#This Row],[Date dépôt \ndemande]],Tableau16[],4,1),\"\")","v":"P02"},{"$f":"IFERROR(VLOOKUP(Tableau15[[#This Row],[Date dépôt \ndemande]],Tableau16[],5,1),\"\")","v":"2021-2022"},null,null,"Répit aidants",null,"Oui","2021-07-19",{"$f":"IFERROR(VLOOKUP(Tableau15[[#This Row],[Date arrivée]],Tableau16[],4,1),\"\")","v":"P05"},{"$f":"IFERROR(VLOOKUP(Tableau15[[#This Row],[Date arrivée]],Tableau16[],5,1),\"\")","v":"2021-2022"},null,"2021-07-24",{"$f":"IFERROR(VLOOKUP(Tableau15[[#This Row],[Date départ]],Tableau16[],4,1),\"\")","v":"P05"},{"$f":"IFERROR(VLOOKUP(Tableau15[[#This Row],[Date départ]],Tableau16[],5,1),\"\")","v":"2021-2022"},null,{"$f":"IF(AND(Tableau15[[#This Row],[Statut]]=\"Réservé (Confirmé)\",Tableau15[[#This Row],[Statut modifié]]=\"\"),Tableau15[[#This Row],[Date départ]]-Tableau15[[#This Row],[Date arrivée]]+1,0)","v":6},null,null,null,"Réservé (Confirmé)",null,{"$f":"IF(Tableau15[[#This Row],[Date départ]]<TODAY(),\"Inactif\",\"Actif\")","v":"Actif"}]
[null,null,null,"Jacques",{"$f":"CONCATENATE(Tableau15[[#This Row],[Nom]],\", \",Tableau15[[#This Row],[Prénom]])","v":", Jacques"},"1944-01-04",{"$f":"IF(Tableau15[[#This Row],[Date de naissance]]<>\"\",DATEDIF(Tableau15[[#This Row],[Date de naissance]],TODAY(),\"Y\"),\"\")","v":77},null,7,{"$f":"IF(Tableau15[[#This Row],[Numéro\ndossier]]<>\"\",\"Arthabaska-Érable\",\"\")","v":""},"Tilleul",215,"2021-03-01",{"$f":"IFERROR(VLOOKUP(Tableau15[[#This Row],[Date dépôt \ndemande]],Tableau16[],4,1),\"\")","v":"P13"},{"$f":"IFERROR(VLOOKUP(Tableau15[[#This Row],[Date dépôt \ndemande]],Tableau16[],5,1),\"\")","v":"2020-2021"},null,null,"Répit aidants",null,"Oui","2021-05-17",{"$f":"IFERROR(VLOOKUP(Tableau15[[#This Row],[Date arrivée]],Tableau16[],4,1),\"\")","v":"P02"},{"$f":"IFERROR(VLOOKUP(Tableau15[[#This Row],[Date arrivée]],Tableau16[],5,1),\"\")","v":"2021-2022"},null,"2021-06-07",{"$f":"IFERROR(VLOOKUP(Tableau15[[#This Row],[Date départ]],Tableau16[],4,1),\"\")","v":"P03"},{"$f":"IFERROR(VLOOKUP(Tableau15[[#This Row],[Date départ]],Tableau16[],5,1),\"\")","v":"2021-2022"},null,{"$f":"IF(AND(Tableau15[[#This Row],[Statut]]=\"Réservé (Confirmé)\",Tableau15[[#This Row],[Statut modifié]]=\"\"),Tableau15[[#This Row],[Date départ]]-Tableau15[[#This Row],[Date arrivée]]+1,0)","v":22},null,null,null,"Réservé (Confirmé)",null,{"$f":"IF(Tableau15[[#This Row],[Date départ]]<TODAY(),\"Inactif\",\"Actif\")","v":"Inactif"}]
[null,null,null,"Jacques",{"$f":"CONCATENATE(Tableau15[[#This Row],[Nom]],\", \",Tableau15[[#This Row],[Prénom]])","v":", Jacques"},"1944-01-04",{"$f":"IF(Tableau15[[#This Row],[Date de naissance]]<>\"\",DATEDIF(Tableau15[[#This Row],[Date de naissance]],TODAY(),\"Y\"),\"\")","v":77},null,7,{"$f":"IF(Tableau15[[#This Row],[Numéro\ndossier]]<>\"\",\"Arthabaska-Érable\",\"\")","v":""},"Tilleul",215,"2021-01-21",{"$f":"IFERROR(VLOOKUP(Tableau15[[#This Row],[Date dépôt \ndemande]],Tableau16[],4,1),\"\")","v":"P11"},{"$f":"IFERROR(VLOOKUP(Tableau15[[#This Row],[Date dépôt \ndemande]],Tableau16[],5,1),\"\")","v":"2020-2021"},null,null,"Répit aidants",null,"Oui","2021-04-02",{"$f":"IFERROR(VLOOKUP(Tableau15[[#This Row],[Date arrivée]],Tableau16[],4,1),\"\")","v":"P01"},{"$f":"IFERROR(VLOOKUP(Tableau15[[#This Row],[Date arrivée]],Tableau16[],5,1),\"\")","v":"2021-2022"},null,"2021-04-26",{"$f":"IFERROR(VLOOKUP(Tableau15[[#This Row],[Date départ]],Tableau16[],4,1),\"\")","v":"P02"},{"$f":"IFERROR(VLOOKUP(Tableau15[[#This Row],[Date départ]],Tableau16[],5,1),\"\")","v":"2021-2022"},null,{"$f":"IF(AND(Tableau15[[#This Row],[Statut]]=\"Réservé (Confirmé)\",Tableau15[[#This Row],[Statut modifié]]=\"\"),Tableau15[[#This Row],[Date départ]]-Tableau15[[#This Row],[Date arrivée]]+1,0)","v":25},null,null,null,"Réservé (Confirmé)",null,{"$f":"IF(Tableau15[[#This Row],[Date départ]]<TODAY(),\"Inactif\",\"Actif\")","v":"Inactif"}]
[null,null,null,"Gilles",{"$f":"CONCATENATE(Tableau15[[#This Row],[Nom]],\", \",Tableau15[[#This Row],[Prénom]])","v":", Gilles"},"1941-11-01",{"$f":"IF(Tableau15[[#This Row],[Date de naissance]]<>\"\",DATEDIF(Tableau15[[#This Row],[Date de naissance]],TODAY(),\"Y\"),\"\")","v":79},null,12,{"$f":"IF(Tableau15[[#This Row],[Numéro\ndossier]]<>\"\",\"Arthabaska-Érable\",\"\")","v":""},"Tilleul",215,"2021-05-18",{"$f":"IFERROR(VLOOKUP(Tableau15[[#This Row],[Date dépôt \ndemande]],Tableau16[],4,1),\"\")","v":"P02"},{"$f":"IFERROR(VLOOKUP(Tableau15[[#This Row],[Date dépôt \ndemande]],Tableau16[],5,1),\"\")","v":"2021-2022"},null,null,"Répit aidants",null,"Oui","2021-05-28",{"$f":"IFERROR(VLOOKUP(Tableau15[[#This Row],[Date arrivée]],Tableau16[],4,1),\"\")","v":"P03"},{"$f":"IFERROR(VLOOKUP(Tableau15[[#This Row],[Date arrivée]],Tableau16[],5,1),\"\")","v":"2021-2022"},null,"2021-06-01",{"$f":"IFERROR(VLOOKUP(Tableau15[[#This Row],[Date départ]],Tableau16[],4,1),\"\")","v":"P03"},{"$f":"IFERROR(VLOOKUP(Tableau15[[#This Row],[Date départ]],Tableau16[],5,1),\"\")","v":"2021-2022"},null,{"$f":"IF(AND(Tableau15[[#This Row],[Statut]]=\"Réservé (Confirmé)\",Tableau15[[#This Row],[Statut modifié]]=\"\"),Tableau15[[#This Row],[Date départ]]-Tableau15[[#This Row],[Date arrivée]]+1,0)","v":5},null,null,null,"Réservé (Confirmé)",null,{"$f":"IF(Tableau15[[#This Row],[Date départ]]<TODAY(),\"Inactif\",\"Actif\")","v":"Inactif"}]
[null,null,null,"Gilles",{"$f":"CONCATENATE(Tableau15[[#This Row],[Nom]],\", \",Tableau15[[#This Row],[Prénom]])","v":", Gilles"},"1941-11-01",{"$f":"IF(Tableau15[[#This Row],[Date de naissance]]<>\"\",DATEDIF(Tableau15[[#This Row],[Date de naissance]],TODAY(),\"Y\"),\"\")","v":79},null,12,{"$f":"IF(Tableau15[[#This Row],[Numéro\ndossier]]<>\"\",\"Arthabaska-Érable\",\"\")","v":""},"Tilleul",215,"2021-05-18",{"$f":"IFERROR(VLOOKUP(Tableau15[[#This Row],[Date dépôt \ndemande]],Tableau16[],4,1),\"\")","v":"P02"},{"$f":"IFERROR(VLOOKUP(Tableau15[[#This Row],[Date dépôt \ndemande]],Tableau16[],5,1),\"\")","v":"2021-2022"},null,null,"Répit aidants",null,"Oui","2021-07-02",{"$f":"IFERROR(VLOOKUP(Tableau15[[#This Row],[Date arrivée]],Tableau16[],4,1),\"\")","v":"P04"},{"$f":"IFERROR(VLOOKUP(Tableau15[[#This Row],[Date arrivée]],Tableau16[],5,1),\"\")","v":"2021-2022"},null,"2021-07-06",{"$f":"IFERROR(VLOOKUP(Tableau15[[#This Row],[Date départ]],Tableau16[],4,1),\"\")","v":"P04"},{"$f":"IFERROR(VLOOKUP(Tableau15[[#This Row],[Date départ]],Tableau16[],5,1),\"\")","v":"2021-2022"},null,{"$f":"IF(AND(Tableau15[[#This Row],[Statut]]=\"Réservé (Confirmé)\",Tableau15[[#This Row],[Statut modifié]]=\"\"),Tableau15[[#This Row],[Date départ]]-Tableau15[[#This Row],[Date arrivée]]+1,0)","v":5},null,null,null,"Réservé (Confirmé)",null,{"$f":"IF(Tableau15[[#This Row],[Date départ]]<TODAY(),\"Inactif\",\"Actif\")","v":"Actif"}]
[null,null,null,"Gilles",{"$f":"CONCATENATE(Tableau15[[#This Row],[Nom]],\", \",Tableau15[[#This Row],[Prénom]])","v":", Gilles"},"1941-11-01",{"$f":"IF(Tableau15[[#This Row],[Date de naissance]]<>\"\",DATEDIF(Tableau15[[#This Row],[Date de naissance]],TODAY(),\"Y\"),\"\")","v":79},null,12,{"$f":"IF(Tableau15[[#This Row],[Numéro\ndossier]]<>\"\",\"Arthabaska-Érable\",\"\")","v":""},"Tilleul",215,"2021-05-03",{"$f":"IFERROR(VLOOKUP(Tableau15[[#This Row],[Date dépôt \ndemande]],Tableau16[],4,1),\"\")","v":"P02"},{"$f":"IFERROR(VLOOKUP(Tableau15[[#This Row],[Date dépôt \ndemande]],Tableau16[],5,1),\"\")","v":"2021-2022"},null,null,"Répit aidants",null,"Oui","2021-08-02",{"$f":"IFERROR(VLOOKUP(Tableau15[[#This Row],[Date arrivée]],Tableau16[],4,1),\"\")","v":"P05"},{"$f":"IFERROR(VLOOKUP(Tableau15[[#This Row],[Date arrivée]],Tableau16[],5,1),\"\")","v":"2021-2022"},null,"2021-08-06",{"$f":"IFERROR(VLOOKUP(Tableau15[[#This Row],[Date départ]],Tableau16[],4,1),\"\")","v":"P05"},{"$f":"IFERROR(VLOOKUP(Tableau15[[#This Row],[Date départ]],Tableau16[],5,1),\"\")","v":"2021-2022"},null,{"$f":"IF(AND(Tableau15[[#This Row],[Statut]]=\"Réservé (Confirmé)\",Tableau15[[#This Row],[Statut modifié]]=\"\"),Tableau15[[#This Row],[Date départ]]-Tableau15[[#This Row],[Date arrivée]]+1,0)","v":5},null,null,null,"Réservé (Confirmé)",null,{"$f":"IF(Tableau15[[#This Row],[Date départ]]<TODAY(),\"Inactif\",\"Actif\")","v":"Actif"}]
[null,null,null,"Gilles",{"$f":"CONCATENATE(Tableau15[[#This Row],[Nom]],\", \",Tableau15[[#This Row],[Prénom]])","v":", Gilles"},"1941-11-01",{"$f":"IF(Tableau15[[#This Row],[Date de naissance]]<>\"\",DATEDIF(Tableau15[[#This Row],[Date de naissance]],TODAY(),\"Y\"),\"\")","v":79},null,12,{"$f":"IF(Tableau15[[#This Row],[Numéro\ndossier]]<>\"\",\"Arthabaska-Érable\",\"\")","v":""},"Tilleul",215,"2021-02-25",{"$f":"IFERROR(VLOOKUP(Tableau15[[#This Row],[Date dépôt \ndemande]],Tableau16[],4,1),\"\")","v":"P12"},{"$f":"IFERROR(VLOOKUP(Tableau15[[#This Row],[Date dépôt \ndemande]],Tableau16[],5,1),\"\")","v":"2020-2021"},null,null,"Répit aidants",null,"Oui","2021-04-30",{"$f":"IFERROR(VLOOKUP(Tableau15[[#This Row],[Date arrivée]],Tableau16[],4,1),\"\")","v":"P02"},{"$f":"IFERROR(VLOOKUP(Tableau15[[#This Row],[Date arrivée]],Tableau16[],5,1),\"\")","v":"2021-2022"},null,"2021-05-04",{"$f":"IFERROR(VLOOKUP(Tableau15[[#This Row],[Date départ]],Tableau16[],4,1),\"\")","v":"P02"},{"$f":"IFERROR(VLOOKUP(Tableau15[[#This Row],[Date départ]],Tableau16[],5,1),\"\")","v":"2021-2022"},null,{"$f":"IF(AND(Tableau15[[#This Row],[Statut]]=\"Réservé (Confirmé)\",Tableau15[[#This Row],[Statut modifié]]=\"\"),Tableau15[[#This Row],[Date départ]]-Tableau15[[#This Row],[Date arrivée]]+1,0)","v":5},null,null,null,"Réservé (Confirmé)",null,{"$f":"IF(Tableau15[[#This Row],[Date départ]]<TODAY(),\"Inactif\",\"Actif\")","v":"Inactif"}]
[null,null,null,"Henri",{"$f":"CONCATENATE(Tableau15[[#This Row],[Nom]],\", \",Tableau15[[#This Row],[Prénom]])","v":", Henri"},"1939-05-19",{"$f":"IF(Tableau15[[#This Row],[Date de naissance]]<>\"\",DATEDIF(Tableau15[[#This Row],[Date de naissance]],TODAY(),\"Y\"),\"\")","v":82},null,6,{"$f":"IF(Tableau15[[#This Row],[Numéro\ndossier]]<>\"\",\"Arthabaska-Érable\",\"\")","v":""},"Chêne",227,"2021-04-06",{"$f":"IFERROR(VLOOKUP(Tableau15[[#This Row],[Date dépôt \ndemande]],Tableau16[],4,1),\"\")","v":"P01"},{"$f":"IFERROR(VLOOKUP(Tableau15[[#This Row],[Date dépôt \ndemande]],Tableau16[],5,1),\"\")","v":"2021-2022"},null,null,"Répit aidants",null,"Non","2021-06-07",{"$f":"IFERROR(VLOOKUP(Tableau15[[#This Row],[Date arrivée]],Tableau16[],4,1),\"\")","v":"P03"},{"$f":"IFERROR(VLOOKUP(Tableau15[[#This Row],[Date arrivée]],Tableau16[],5,1),\"\")","v":"2021-2022"},null,"2021-06-11",{"$f":"IFERROR(VLOOKUP(Tableau15[[#This Row],[Date départ]],Tableau16[],4,1),\"\")","v":"P03"},{"$f":"IFERROR(VLOOKUP(Tableau15[[#This Row],[Date départ]],Tableau16[],5,1),\"\")","v":"2021-2022"},null,{"$f":"IF(AND(Tableau15[[#This Row],[Statut]]=\"Réservé (Confirmé)\",Tableau15[[#This Row],[Statut modifié]]=\"\"),Tableau15[[#This Row],[Date départ]]-Tableau15[[#This Row],[Date arrivée]]+1,0)","v":5},null,null,null,"Réservé (Confirmé)",null,{"$f":"IF(Tableau15[[#This Row],[Date départ]]<TODAY(),\"Inactif\",\"Actif\")","v":"Actif"}]
[null,null,null,"Henri",{"$f":"CONCATENATE(Tableau15[[#This Row],[Nom]],\", \",Tableau15[[#This Row],[Prénom]])","v":", Henri"},"1939-05-19",{"$f":"IF(Tableau15[[#This Row],[Date de naissance]]<>\"\",DATEDIF(Tableau15[[#This Row],[Date de naissance]],TODAY(),\"Y\"),\"\")","v":82},null,6,{"$f":"IF(Tableau15[[#This Row],[Numéro\ndossier]]<>\"\",\"Arthabaska-Érable\",\"\")","v":""},"Chêne",227,"2021-04-06",{"$f":"IFERROR(VLOOKUP(Tableau15[[#This Row],[Date dépôt \ndemande]],Tableau16[],4,1),\"\")","v":"P01"},{"$f":"IFERROR(VLOOKUP(Tableau15[[#This Row],[Date dépôt \ndemande]],Tableau16[],5,1),\"\")","v":"2021-2022"},null,null,"Répit aidants",null,"Oui","2021-07-05",{"$f":"IFERROR(VLOOKUP(Tableau15[[#This Row],[Date arrivée]],Tableau16[],4,1),\"\")","v":"P04"},{"$f":"IFERROR(VLOOKUP(Tableau15[[#This Row],[Date arrivée]],Tableau16[],5,1),\"\")","v":"2021-2022"},null,"2021-07-08",{"$f":"IFERROR(VLOOKUP(Tableau15[[#This Row],[Date départ]],Tableau16[],4,1),\"\")","v":"P04"},{"$f":"IFERROR(VLOOKUP(Tableau15[[#This Row],[Date départ]],Tableau16[],5,1),\"\")","v":"2021-2022"},null,{"$f":"IF(AND(Tableau15[[#This Row],[Statut]]=\"Réservé (Confirmé)\",Tableau15[[#This Row],[Statut modifié]]=\"\"),Tableau15[[#This Row],[Date départ]]-Tableau15[[#This Row],[Date arrivée]]+1,0)","v":4},null,null,null,"Réservé (Confirmé)",null,{"$f":"IF(Tableau15[[#This Row],[Date départ]]<TODAY(),\"Inactif\",\"Actif\")","v":"Actif"}]
[null,null,null,"Henri",{"$f":"CONCATENATE(Tableau15[[#This Row],[Nom]],\", \",Tableau15[[#This Row],[Prénom]])","v":", Henri"},"1939-05-19",{"$f":"IF(Tableau15[[#This Row],[Date de naissance]]<>\"\",DATEDIF(Tableau15[[#This Row],[Date de naissance]],TODAY(),\"Y\"),\"\")","v":82},null,6,{"$f":"IF(Tableau15[[#This Row],[Numéro\ndossier]]<>\"\",\"Arthabaska-Érable\",\"\")","v":""},"Chêne",227,"2021-03-01",{"$f":"IFERROR(VLOOKUP(Tableau15[[#This Row],[Date dépôt \ndemande]],Tableau16[],4,1),\"\")","v":"P13"},{"$f":"IFERROR(VLOOKUP(Tableau15[[#This Row],[Date dépôt \ndemande]],Tableau16[],5,1),\"\")","v":"2020-2021"},null,null,"Répit aidants",null,"Oui","2021-04-12",{"$f":"IFERROR(VLOOKUP(Tableau15[[#This Row],[Date arrivée]],Tableau16[],4,1),\"\")","v":"P01"},{"$f":"IFERROR(VLOOKUP(Tableau15[[#This Row],[Date arrivée]],Tableau16[],5,1),\"\")","v":"2021-2022"},null,"2021-04-15",{"$f":"IFERROR(VLOOKUP(Tableau15[[#This Row],[Date départ]],Tableau16[],4,1),\"\")","v":"P01"},{"$f":"IFERROR(VLOOKUP(Tableau15[[#This Row],[Date départ]],Tableau16[],5,1),\"\")","v":"2021-2022"},null,{"$f":"IF(AND(Tableau15[[#This Row],[Statut]]=\"Réservé (Confirmé)\",Tableau15[[#This Row],[Statut modifié]]=\"\"),Tableau15[[#This Row],[Date départ]]-Tableau15[[#This Row],[Date arrivée]]+1,0)","v":4},null,null,null,"Réservé (Confirmé)",null,{"$f":"IF(Tableau15[[#This Row],[Date départ]]<TODAY(),\"Inactif\",\"Actif\")","v":"Inactif"}]
[null,null,null,"Henri",{"$f":"CONCATENATE(Tableau15[[#This Row],[Nom]],\", \",Tableau15[[#This Row],[Prénom]])","v":", Henri"},"1939-05-19",{"$f":"IF(Tableau15[[#This Row],[Date de naissance]]<>\"\",DATEDIF(Tableau15[[#This Row],[Date de naissance]],TODAY(),\"Y\"),\"\")","v":82},null,6,{"$f":"IF(Tableau15[[#This Row],[Numéro\ndossier]]<>\"\",\"Arthabaska-Érable\",\"\")","v":""},"Chêne",227,"2021-03-01",{"$f":"IFERROR(VLOOKUP(Tableau15[[#This Row],[Date dépôt \ndemande]],Tableau16[],4,1),\"\")","v":"P13"},{"$f":"IFERROR(VLOOKUP(Tableau15[[#This Row],[Date dépôt \ndemande]],Tableau16[],5,1),\"\")","v":"2020-2021"},null,null,"Répit aidants",null,"Oui","2021-05-10",{"$f":"IFERROR(VLOOKUP(Tableau15[[#This Row],[Date arrivée]],Tableau16[],4,1),\"\")","v":"P02"},{"$f":"IFERROR(VLOOKUP(Tableau15[[#This Row],[Date arrivée]],Tableau16[],5,1),\"\")","v":"2021-2022"},null,"2021-05-13",{"$f":"IFERROR(VLOOKUP(Tableau15[[#This Row],[Date départ]],Tableau16[],4,1),\"\")","v":"P02"},{"$f":"IFERROR(VLOOKUP(Tableau15[[#This Row],[Date départ]],Tableau16[],5,1),\"\")","v":"2021-2022"},null,{"$f":"IF(AND(Tableau15[[#This Row],[Statut]]=\"Réservé (Confirmé)\",Tableau15[[#This Row],[Statut modifié]]=\"\"),Tableau15[[#This Row],[Date départ]]-Tableau15[[#This Row],[Date arrivée]]+1,0)","v":4},null,null,null,"Réservé (Confirmé)",null,{"$f":"IF(Tableau15[[#This Row],[Date départ]]<TODAY(),\"Inactif\",\"Actif\")","v":"Inactif"}]
[null,null,null,"Léo",{"$f":"CONCATENATE(Tableau15[[#This Row],[Nom]],\", \",Tableau15[[#This Row],[Prénom]])","v":", Léo"},"1933-05-28",{"$f":"IF(Tableau15[[#This Row],[Date de naissance]]<>\"\",DATEDIF(Tableau15[[#This Row],[Date de naissance]],TODAY(),\"Y\"),\"\")","v":88},null,10,{"$f":"IF(Tableau15[[#This Row],[Numéro\ndossier]]<>\"\",\"Arthabaska-Érable\",\"\")","v":""},"Chêne",227,"2021-04-02",{"$f":"IFERROR(VLOOKUP(Tableau15[[#This Row],[Date dépôt \ndemande]],Tableau16[],4,1),\"\")","v":"P01"},{"$f":"IFERROR(VLOOKUP(Tableau15[[#This Row],[Date dépôt \ndemande]],Tableau16[],5,1),\"\")","v":"2021-2022"},null,null,"Répit aidants",null,"Oui","2021-04-06",{"$f":"IFERROR(VLOOKUP(Tableau15[[#This Row],[Date arrivée]],Tableau16[],4,1),\"\")","v":"P01"},{"$f":"IFERROR(VLOOKUP(Tableau15[[#This Row],[Date arrivée]],Tableau16[],5,1),\"\")","v":"2021-2022"},null,"2021-04-10",{"$f":"IFERROR(VLOOKUP(Tableau15[[#This Row],[Date départ]],Tableau16[],4,1),\"\")","v":"P01"},{"$f":"IFERROR(VLOOKUP(Tableau15[[#This Row],[Date départ]],Tableau16[],5,1),\"\")","v":"2021-2022"},null,{"$f":"IF(AND(Tableau15[[#This Row],[Statut]]=\"Réservé (Confirmé)\",Tableau15[[#This Row],[Statut modifié]]=\"\"),Tableau15[[#This Row],[Date départ]]-Tableau15[[#This Row],[Date arrivée]]+1,0)","v":5},null,null,null,"Réservé (Confirmé)",null,{"$f":"IF(Tableau15[[#This Row],[Date départ]]<TODAY(),\"Inactif\",\"Actif\")","v":"Inactif"}]
[null,null,null,"Claude",{"$f":"CONCATENATE(Tableau15[[#This Row],[Nom]],\", \",Tableau15[[#This Row],[Prénom]])","v":", Claude"},"1941-08-30",{"$f":"IF(Tableau15[[#This Row],[Date de naissance]]<>\"\",DATEDIF(Tableau15[[#This Row],[Date de naissance]],TODAY(),\"Y\"),\"\")","v":79},null,null,{"$f":"IF(Tableau15[[#This Row],[Numéro\ndossier]]<>\"\",\"Arthabaska-Érable\",\"\")","v":""},"Chêne",227,"2021-03-24",{"$f":"IFERROR(VLOOKUP(Tableau15[[#This Row],[Date dépôt \ndemande]],Tableau16[],4,1),\"\")","v":"P13"},{"$f":"IFERROR(VLOOKUP(Tableau15[[#This Row],[Date dépôt \ndemande]],Tableau16[],5,1),\"\")","v":"2020-2021"},null,null,"Répit aidants",null,"Oui","2021-05-28",{"$f":"IFERROR(VLOOKUP(Tableau15[[#This Row],[Date arrivée]],Tableau16[],4,1),\"\")","v":"P03"},{"$f":"IFERROR(VLOOKUP(Tableau15[[#This Row],[Date arrivée]],Tableau16[],5,1),\"\")","v":"2021-2022"},null,"2021-06-05",{"$f":"IFERROR(VLOOKUP(Tableau15[[#This Row],[Date départ]],Tableau16[],4,1),\"\")","v":"P03"},{"$f":"IFERROR(VLOOKUP(Tableau15[[#This Row],[Date départ]],Tableau16[],5,1),\"\")","v":"2021-2022"},null,{"$f":"IF(AND(Tableau15[[#This Row],[Statut]]=\"Réservé (Confirmé)\",Tableau15[[#This Row],[Statut modifié]]=\"\"),Tableau15[[#This Row],[Date départ]]-Tableau15[[#This Row],[Date arrivée]]+1,0)","v":9},null,null,null,"Réservé (Confirmé)",null,{"$f":"IF(Tableau15[[#This Row],[Date départ]]<TODAY(),\"Inactif\",\"Actif\")","v":"Inactif"}]
[null,null,null,"Nicole",{"$f":"CONCATENATE(Tableau15[[#This Row],[Nom]],\", \",Tableau15[[#This Row],[Prénom]])","v":", Nicole"},"1938-11-08",{"$f":"IF(Tableau15[[#This Row],[Date de naissance]]<>\"\",DATEDIF(Tableau15[[#This Row],[Date de naissance]],TODAY(),\"Y\"),\"\")","v":82},null,8,{"$f":"IF(Tableau15[[#This Row],[Numéro\ndossier]]<>\"\",\"Arthabaska-Érable\",\"\")","v":""},"Chêne",227,"2021-04-27",{"$f":"IFERROR(VLOOKUP(Tableau15[[#This Row],[Date dépôt \ndemande]],Tableau16[],4,1),\"\")","v":"P02"},{"$f":"IFERROR(VLOOKUP(Tableau15[[#This Row],[Date dépôt \ndemande]],Tableau16[],5,1),\"\")","v":"2021-2022"},null,null,"Répit aidants",null,"Oui","2021-04-29",{"$f":"IFERROR(VLOOKUP(Tableau15[[#This Row],[Date arrivée]],Tableau16[],4,1),\"\")","v":"P02"},{"$f":"IFERROR(VLOOKUP(Tableau15[[#This Row],[Date arrivée]],Tableau16[],5,1),\"\")","v":"2021-2022"},null,"2021-04-29",{"$f":"IFERROR(VLOOKUP(Tableau15[[#This Row],[Date départ]],Tableau16[],4,1),\"\")","v":"P02"},{"$f":"IFERROR(VLOOKUP(Tableau15[[#This Row],[Date départ]],Tableau16[],5,1),\"\")","v":"2021-2022"},null,{"$f":"IF(AND(Tableau15[[#This Row],[Statut]]=\"Réservé (Confirmé)\",Tableau15[[#This Row],[Statut modifié]]=\"\"),Tableau15[[#This Row],[Date départ]]-Tableau15[[#This Row],[Date arrivée]]+1,0)","v":1},null,null,null,"Réservé (Confirmé)",null,{"$f":"IF(Tableau15[[#This Row],[Date départ]]<TODAY(),\"Inactif\",\"Actif\")","v":"Inactif"}]
[null,null,null,"Réal",{"$f":"CONCATENATE(Tableau15[[#This Row],[Nom]],\", \",Tableau15[[#This Row],[Prénom]])","v":", Réal"},"1943-02-12",{"$f":"IF(Tableau15[[#This Row],[Date de naissance]]<>\"\",DATEDIF(Tableau15[[#This Row],[Date de naissance]],TODAY(),\"Y\"),\"\")","v":78},null,5,{"$f":"IF(Tableau15[[#This Row],[Numéro\ndossier]]<>\"\",\"Arthabaska-Érable\",\"\")","v":""},"Chêne",227,"2021-05-04",{"$f":"IFERROR(VLOOKUP(Tableau15[[#This Row],[Date dépôt \ndemande]],Tableau16[],4,1),\"\")","v":"P02"},{"$f":"IFERROR(VLOOKUP(Tableau15[[#This Row],[Date dépôt \ndemande]],Tableau16[],5,1),\"\")","v":"2021-2022"},null,null,"Répit aidants",null,"Oui","2021-05-17",{"$f":"IFERROR(VLOOKUP(Tableau15[[#This Row],[Date arrivée]],Tableau16[],4,1),\"\")","v":"P02"},{"$f":"IFERROR(VLOOKUP(Tableau15[[#This Row],[Date arrivée]],Tableau16[],5,1),\"\")","v":"2021-2022"},null,"2021-05-21",{"$f":"IFERROR(VLOOKUP(Tableau15[[#This Row],[Date départ]],Tableau16[],4,1),\"\")","v":"P02"},{"$f":"IFERROR(VLOOKUP(Tableau15[[#This Row],[Date départ]],Tableau16[],5,1),\"\")","v":"2021-2022"},null,{"$f":"IF(AND(Tableau15[[#This Row],[Statut]]=\"Réservé (Confirmé)\",Tableau15[[#This Row],[Statut modifié]]=\"\"),Tableau15[[#This Row],[Date départ]]-Tableau15[[#This Row],[Date arrivée]]+1,0)","v":5},null,null,null,"Réservé (Confirmé)",null,{"$f":"IF(Tableau15[[#This Row],[Date départ]]<TODAY(),\"Inactif\",\"Actif\")","v":"Inactif"}]
[null,null,null,"Réal",{"$f":"CONCATENATE(Tableau15[[#This Row],[Nom]],\", \",Tableau15[[#This Row],[Prénom]])","v":", Réal"},"1943-02-12",{"$f":"IF(Tableau15[[#This Row],[Date de naissance]]<>\"\",DATEDIF(Tableau15[[#This Row],[Date de naissance]],TODAY(),\"Y\"),\"\")","v":78},null,null,{"$f":"IF(Tableau15[[#This Row],[Numéro\ndossier]]<>\"\",\"Arthabaska-Érable\",\"\")","v":""},"Chêne",227,"2021-04-26",{"$f":"IFERROR(VLOOKUP(Tableau15[[#This Row],[Date dépôt \ndemande]],Tableau16[],4,1),\"\")","v":"P02"},{"$f":"IFERROR(VLOOKUP(Tableau15[[#This Row],[Date dépôt \ndemande]],Tableau16[],5,1),\"\")","v":"2021-2022"},null,null,"Répit aidants",null,"Oui","2021-07-28",{"$f":"IFERROR(VLOOKUP(Tableau15[[#This Row],[Date arrivée]],Tableau16[],4,1),\"\")","v":"P05"},{"$f":"IFERROR(VLOOKUP(Tableau15[[#This Row],[Date arrivée]],Tableau16[],5,1),\"\")","v":"2021-2022"},null,"2021-08-09",{"$f":"IFERROR(VLOOKUP(Tableau15[[#This Row],[Date départ]],Tableau16[],4,1),\"\")","v":"P05"},{"$f":"IFERROR(VLOOKUP(Tableau15[[#This Row],[Date départ]],Tableau16[],5,1),\"\")","v":"2021-2022"},null,{"$f":"IF(AND(Tableau15[[#This Row],[Statut]]=\"Réservé (Confirmé)\",Tableau15[[#This Row],[Statut modifié]]=\"\"),Tableau15[[#This Row],[Date départ]]-Tableau15[[#This Row],[Date arrivée]]+1,0)","v":13},null,null,null,"Réservé (Confirmé)",null,{"$f":"IF(Tableau15[[#This Row],[Date départ]]<TODAY(),\"Inactif\",\"Actif\")","v":"Actif"}]
[null,null,null,"Maurice",{"$f":"CONCATENATE(Tableau15[[#This Row],[Nom]],\", \",Tableau15[[#This Row],[Prénom]])","v":", Maurice"},"1923-07-18",{"$f":"IF(Tableau15[[#This Row],[Date de naissance]]<>\"\",DATEDIF(Tableau15[[#This Row],[Date de naissance]],TODAY(),\"Y\"),\"\")","v":97},null,12,{"$f":"IF(Tableau15[[#This Row],[Numéro\ndossier]]<>\"\",\"Arthabaska-Érable\",\"\")","v":""},"Chêne",227,"2021-04-26",{"$f":"IFERROR(VLOOKUP(Tableau15[[#This Row],[Date dépôt \ndemande]],Tableau16[],4,1),\"\")","v":"P02"},{"$f":"IFERROR(VLOOKUP(Tableau15[[#This Row],[Date dépôt \ndemande]],Tableau16[],5,1),\"\")","v":"2021-2022"},null,null,"Répit aidants",null,"Oui","2021-07-19",{"$f":"IFERROR(VLOOKUP(Tableau15[[#This Row],[Date arrivée]],Tableau16[],4,1),\"\")","v":"P05"},{"$f":"IFERROR(VLOOKUP(Tableau15[[#This Row],[Date arrivée]],Tableau16[],5,1),\"\")","v":"2021-2022"},null,"2021-07-26",{"$f":"IFERROR(VLOOKUP(Tableau15[[#This Row],[Date départ]],Tableau16[],4,1),\"\")","v":"P05"},{"$f":"IFERROR(VLOOKUP(Tableau15[[#This Row],[Date départ]],Tableau16[],5,1),\"\")","v":"2021-2022"},null,{"$f":"IF(AND(Tableau15[[#This Row],[Statut]]=\"Réservé (Confirmé)\",Tableau15[[#This Row],[Statut modifié]]=\"\"),Tableau15[[#This Row],[Date départ]]-Tableau15[[#This Row],[Date arrivée]]+1,0)","v":8},null,null,null,"Réservé (Confirmé)",null,{"$f":"IF(Tableau15[[#This Row],[Date départ]]<TODAY(),\"Inactif\",\"Actif\")","v":"Actif"}]
[null,null,null,"Maurice",{"$f":"CONCATENATE(Tableau15[[#This Row],[Nom]],\", \",Tableau15[[#This Row],[Prénom]])","v":", Maurice"},"1923-07-18",{"$f":"IF(Tableau15[[#This Row],[Date de naissance]]<>\"\",DATEDIF(Tableau15[[#This Row],[Date de naissance]],TODAY(),\"Y\"),\"\")","v":97},null,12,{"$f":"IF(Tableau15[[#This Row],[Numéro\ndossier]]<>\"\",\"Arthabaska-Érable\",\"\")","v":""},"Chêne",227,"2021-03-24",{"$f":"IFERROR(VLOOKUP(Tableau15[[#This Row],[Date dépôt \ndemande]],Tableau16[],4,1),\"\")","v":"P13"},{"$f":"IFERROR(VLOOKUP(Tableau15[[#This Row],[Date dépôt \ndemande]],Tableau16[],5,1),\"\")","v":"2020-2021"},null,null,"Répit aidants",null,"Oui","2021-04-23",{"$f":"IFERROR(VLOOKUP(Tableau15[[#This Row],[Date arrivée]],Tableau16[],4,1),\"\")","v":"P01"},{"$f":"IFERROR(VLOOKUP(Tableau15[[#This Row],[Date arrivée]],Tableau16[],5,1),\"\")","v":"2021-2022"},null,"2021-04-25",{"$f":"IFERROR(VLOOKUP(Tableau15[[#This Row],[Date départ]],Tableau16[],4,1),\"\")","v":"P02"},{"$f":"IFERROR(VLOOKUP(Tableau15[[#This Row],[Date départ]],Tableau16[],5,1),\"\")","v":"2021-2022"},null,{"$f":"IF(AND(Tableau15[[#This Row],[Statut]]=\"Réservé (Confirmé)\",Tableau15[[#This Row],[Statut modifié]]=\"\"),Tableau15[[#This Row],[Date départ]]-Tableau15[[#This Row],[Date arrivée]]+1,0)","v":3},null,null,null,"Réservé (Confirmé)",null,{"$f":"IF(Tableau15[[#This Row],[Date départ]]<TODAY(),\"Inactif\",\"Actif\")","v":"Inactif"}]
[null,null,null,"Yvon",{"$f":"CONCATENATE(Tableau15[[#This Row],[Nom]],\", \",Tableau15[[#This Row],[Prénom]])","v":", Yvon"},"1944-08-13",{"$f":"IF(Tableau15[[#This Row],[Date de naissance]]<>\"\",DATEDIF(Tableau15[[#This Row],[Date de naissance]],TODAY(),\"Y\"),\"\")","v":76},null,null,{"$f":"IF(Tableau15[[#This Row],[Numéro\ndossier]]<>\"\",\"Arthabaska-Érable\",\"\")","v":""},"Tilleul",312,"2021-02-19",{"$f":"IFERROR(VLOOKUP(Tableau15[[#This Row],[Date dépôt \ndemande]],Tableau16[],4,1),\"\")","v":"P12"},{"$f":"IFERROR(VLOOKUP(Tableau15[[#This Row],[Date dépôt \ndemande]],Tableau16[],5,1),\"\")","v":"2020-2021"},null,null,"Répit aidants",null,"Oui","2021-04-01",{"$f":"IFERROR(VLOOKUP(Tableau15[[#This Row],[Date arrivée]],Tableau16[],4,1),\"\")","v":"P01"},{"$f":"IFERROR(VLOOKUP(Tableau15[[#This Row],[Date arrivée]],Tableau16[],5,1),\"\")","v":"2021-2022"},null,"2021-04-12",{"$f":"IFERROR(VLOOKUP(Tableau15[[#This Row],[Date départ]],Tableau16[],4,1),\"\")","v":"P01"},{"$f":"IFERROR(VLOOKUP(Tableau15[[#This Row],[Date départ]],Tableau16[],5,1),\"\")","v":"2021-2022"},null,{"$f":"IF(AND(Tableau15[[#This Row],[Statut]]=\"Réservé (Confirmé)\",Tableau15[[#This Row],[Statut modifié]]=\"\"),Tableau15[[#This Row],[Date départ]]-Tableau15[[#This Row],[Date arrivée]]+1,0)","v":12},null,null,null,"Réservé (Confirmé)",null,{"$f":"IF(Tableau15[[#This Row],[Date départ]]<TODAY(),\"Inactif\",\"Actif\")","v":"Inactif"}]
[null,null,null,"Irène",{"$f":"CONCATENATE(Tableau15[[#This Row],[Nom]],\", \",Tableau15[[#This Row],[Prénom]])","v":", Irène"},"1932-03-20",{"$f":"IF(Tableau15[[#This Row],[Date de naissance]]<>\"\",DATEDIF(Tableau15[[#This Row],[Date de naissance]],TODAY(),\"Y\"),\"\")","v":89},null,10,{"$f":"IF(Tableau15[[#This Row],[Numéro\ndossier]]<>\"\",\"Arthabaska-Érable\",\"\")","v":""},"Tilleul",312,"2021-05-31",{"$f":"IFERROR(VLOOKUP(Tableau15[[#This Row],[Date dépôt \ndemande]],Tableau16[],4,1),\"\")","v":"P03"},{"$f":"IFERROR(VLOOKUP(Tableau15[[#This Row],[Date dépôt \ndemande]],Tableau16[],5,1),\"\")","v":"2021-2022"},null,null,"Répit aidants",null,"Oui","2021-06-03",{"$f":"IFERROR(VLOOKUP(Tableau15[[#This Row],[Date arrivée]],Tableau16[],4,1),\"\")","v":"P03"},{"$f":"IFERROR(VLOOKUP(Tableau15[[#This Row],[Date arrivée]],Tableau16[],5,1),\"\")","v":"2021-2022"},null,"2021-07-04",{"$f":"IFERROR(VLOOKUP(Tableau15[[#This Row],[Date départ]],Tableau16[],4,1),\"\")","v":"P04"},{"$f":"IFERROR(VLOOKUP(Tableau15[[#This Row],[Date départ]],Tableau16[],5,1),\"\")","v":"2021-2022"},null,{"$f":"IF(AND(Tableau15[[#This Row],[Statut]]=\"Réservé (Confirmé)\",Tableau15[[#This Row],[Statut modifié]]=\"\"),Tableau15[[#This Row],[Date départ]]-Tableau15[[#This Row],[Date arrivée]]+1,0)","v":32},null,null,null,"Réservé (Confirmé)",null,{"$f":"IF(Tableau15[[#This Row],[Date départ]]<TODAY(),\"Inactif\",\"Actif\")","v":"Actif"}]
[null,null,null,"Gilles",{"$f":"CONCATENATE(Tableau15[[#This Row],[Nom]],\", \",Tableau15[[#This Row],[Prénom]])","v":", Gilles"},"1944-11-11",{"$f":"IF(Tableau15[[#This Row],[Date de naissance]]<>\"\",DATEDIF(Tableau15[[#This Row],[Date de naissance]],TODAY(),\"Y\"),\"\")","v":76},null,null,{"$f":"IF(Tableau15[[#This Row],[Numéro\ndossier]]<>\"\",\"Arthabaska-Érable\",\"\")","v":""},"Tilleul",312,"2021-04-08",{"$f":"IFERROR(VLOOKUP(Tableau15[[#This Row],[Date dépôt \ndemande]],Tableau16[],4,1),\"\")","v":"P01"},{"$f":"IFERROR(VLOOKUP(Tableau15[[#This Row],[Date dépôt \ndemande]],Tableau16[],5,1),\"\")","v":"2021-2022"},null,null,"Répit aidants",null,"Oui","2021-04-13",{"$f":"IFERROR(VLOOKUP(Tableau15[[#This Row],[Date arrivée]],Tableau16[],4,1),\"\")","v":"P01"},{"$f":"IFERROR(VLOOKUP(Tableau15[[#This Row],[Date arrivée]],Tableau16[],5,1),\"\")","v":"2021-2022"},null,"2021-05-17",{"$f":"IFERROR(VLOOKUP(Tableau15[[#This Row],[Date départ]],Tableau16[],4,1),\"\")","v":"P02"},{"$f":"IFERROR(VLOOKUP(Tableau15[[#This Row],[Date départ]],Tableau16[],5,1),\"\")","v":"2021-2022"},null,{"$f":"IF(AND(Tableau15[[#This Row],[Statut]]=\"Réservé (Confirmé)\",Tableau15[[#This Row],[Statut modifié]]=\"\"),Tableau15[[#This Row],[Date départ]]-Tableau15[[#This Row],[Date arrivée]]+1,0)","v":35},null,null,null,"Réservé (Confirmé)",null,{"$f":"IF(Tableau15[[#This Row],[Date départ]]<TODAY(),\"Inactif\",\"Actif\")","v":"Inactif"}]

{"sheet":"Calendrier AUTO.","index":1,"n_rows":73,"n_cols":372,"rows_kept":73,"cut":false,"hidden":false,"merged":[]}
[null,null,null,null,null,null,null,null,null,null,null,null,6]
[null,null,null,null,null,null,null,null,null,null,null,null,1]
[{"$f":"TODAY()","v":"2021-06-10"}]
["Actif","Statut","Nom, Prénom","Date arrivée","Date départ","Site","No chambre",{"$f":"DATE(M2+2020,M1,1)","v":"2021-06-01"},{"$f":"H4+1","v":"2021-06-02"},{"$f":"I4+1","v":"2021-06-03"},"2021-06-04","2021-06-05","2021-06-06","2021-06-07","2021-06-08","2021-06-09","2021-06-10","2021-06-11","2021-06-12","2021-06-13","2021-06-14","2021-06-15","2021-06-16","2021-06-17","2021-06-18","2021-06-19","2021-06-20","2021-06-21","2021-06-22","2021-06-23","2021-06-24","2021-06-25","2021-06-26","2021-06-27","2021-06-28","2021-06-29","2021-06-30","2021-07-01","2021-07-02","2021-07-03","2021-07-04","2021-07-05","2021-07-06","2021-07-07","2021-07-08","2021-07-09","2021-07-10","2021-07-11","2021-07-12","2021-07-13","2021-07-14","2021-07-15","2021-07-16","2021-07-17","2021-07-18","2021-07-19","2021-07-20","2021-07-21","2021-07-22","2021-07-23","2021-07-24","2021-07-25","2021-07-26","2021-07-27","2021-07-28","2021-07-29","2021-07-30","2021-07-31","2021-08-01","2021-08-02","2021-08-03","2021-08-04","2021-08-05",{"$f":"BU4+1","v":"2021-08-06"},"2021-08-07","2021-08-08","2021-08-09","2021-08-10","2021-08-11","2021-08-12","2021-08-13","2021-08-14","2021-08-15","2021-08-16","2021-08-17","2021-08-18","2021-08-19","2021-08-20","2021-08-21","2021-08-22","2021-08-23","2021-08-24","2021-08-25","2021-08-26","2021-08-27","2021-08-28","2021-08-29","2021-08-30","2021-08-31","2021-09-01","2021-09-02","2021-09-03","2021-09-04","2021-09-05","2021-09-06","2021-09-07","2021-09-08","2021-09-09","2021-09-10","2021-09-11","2021-09-12","2021-09-13","2021-09-14","2021-09-15","2021-09-16","2021-09-17","2021-09-18","2021-09-19","2021-09-20","2021-09-21","2021-09-22","2021-09-23","2021-09-24","2021-09-25","2021-09-26","2021-09-27","2021-09-28","2021-09-29","2021-09-30","2021-10-01","2021-10-02","2021-10-03","2021-10-04","2021-10-05","2021-10-06","2021-10-07","2021-10-08",{"$f":"EG4+1","v":"2021-10-09"},"2021-10-10","2021-10-11","2021-10-12","2021-10-13","2021-10-14","2021-10-15","2021-10-16","2021-10-17","2021-10-18","2021-10-19","2021-10-20","2021-10-21","2021-10-22","2021-10-23","2021-10-24","2021-10-25","2021-10-26","2021-10-27","2021-10-28","2021-10-29","2021-10-30","2021-10-31","2021-11-01","2021-11-02","2021-11-03","2021-11-04","2021-11-05","2021-11-06","2021-11-07","2021-11-08","2021-11-09","2021-11-10","2021-11-11","2021-11-12","2021-11-13","2021-11-14","2021-11-15","2021-11-16","2021-11-17","2021-11-18","2021-11-19","2021-11-20","2021-11-21","2021-11-22","2021-11-23","2021-11-24","2021-11-25","2021-11-26","2021-11-27","2021-11-28","2021-11-29","2021-11-30","2021-12-01","2021-12-02","2021-12-03","2021-12-04","2021-12-05","2021-12-06","2021-12-07","2021-12-08","2021-12-09","2021-12-10","2021-12-11",{"$f":"GS4+1","v":"2021-12-12"},"2021-12-13","2021-12-14","2021-12-15","2021-12-16","2021-12-17","2021-12-18","2021-12-19","2021-12-20","2021-12-21","2021-12-22","2021-12-23","2021-12-24","2021-12-25","2021-12-26","2021-12-27","2021-12-28","2021-12-29","2021-12-30","2021-12-31","2022-01-01","2022-01-02","2022-01-03","2022-01-04","2022-01-05","2022-01-06","2022-01-07","2022-01-08","2022-01-09","2022-01-10","2022-01-11","2022-01-12","2022-01-13","2022-01-14","2022-01-15","2022-01-16","2022-01-17","2022-01-18","2022-01-19","2022-01-20","2022-01-21","2022-01-22","2022-01-23","2022-01-24","2022-01-25","2022-01-26","2022-01-27","2022-01-28","2022-01-29","2022-01-30","2022-01-31","2022-02-01","2022-02-02","2022-02-03","2022-02-04","2022-02-05","2022-02-06","2022-02-07","2022-02-08","2022-02-09","2022-02-10","2022-02-11","2022-02-12","2022-02-13",{"$f":"JE4+1","v":"2022-02-14"},"2022-02-15","2022-02-16","2022-02-17","2022-02-18","2022-02-19","2022-02-20","2022-02-21","2022-02-22","2022-02-23","2022-02-24","2022-02-25","2022-02-26","2022-02-27","2022-02-28","2022-03-01","2022-03-02","2022-03-03","2022-03-04","2022-03-05","2022-03-06","2022-03-07","2022-03-08","2022-03-09","2022-03-10","2022-03-11","2022-03-12","2022-03-13","2022-03-14","2022-03-15","2022-03-16","2022-03-17","2022-03-18","2022-03-19","2022-03-20","2022-03-21","2022-03-22","2022-03-23","2022-03-24","2022-03-25","2022-03-26","2022-03-27","2022-03-28","2022-03-29","2022-03-30","2022-03-31","2022-04-01","2022-04-02","2022-04-03","2022-04-04","2022-04-05","2022-04-06","2022-04-07","2022-04-08","2022-04-09","2022-04-10","2022-04-11","2022-04-12","2022-04-13","2022-04-14","2022-04-15","2022-04-16","2022-04-17","2022-04-18",{"$f":"LQ4+1","v":"2022-04-19"},"2022-04-20","2022-04-21","2022-04-22","2022-04-23","2022-04-24","2022-04-25","2022-04-26","2022-04-27","2022-04-28","2022-04-29","2022-04-30","2022-05-01","2022-05-02","2022-05-03","2022-05-04","2022-05-05","2022-05-06","2022-05-07","2022-05-08","2022-05-09","2022-05-10","2022-05-11","2022-05-12","2022-05-13","2022-05-14","2022-05-15","2022-05-16","2022-05-17","2022-05-18","2022-05-19","2022-05-20","2022-05-21","2022-05-22","2022-05-23","2022-05-24","2022-05-25","2022-05-26","2022-05-27","2022-05-28","2022-05-29","2022-05-30","2022-05-31"]
["Actif","Réservé (Confirmé)",", Solange","2021-06-14","2021-06-21","St_Eusèbe",204,{"$f":"IF(AND(H$4>=$D5,H$4<=$E5,$B5=\"Réservé (Confirmé)\"),\"C\",IF(AND(H$4>=$D5,H$4<=$E5,$B5=\"Réservé (En attente)\"),\"A\",\"L\"))","v":"L"},{"$f":"IF(AND(I$4>=$D5,I$4<=$E5,$B5=\"Réservé (Confirmé)\"),\"C\",IF(AND(I$4>=$D5,I$4<=$E5,$B5=\"Réservé (En attente)\"),\"A\",\"L\"))","v":"L"},"L","L","L","L","L","L","L","L","L","L","L","C","C","C","C","C","C","C","C","L","L","L","L","L","L","L","L","L","L","L","L","L","L","L","L","L","L","L","L","L","L","L","L","L","L","L","L","L","L","L","L","L","L","L","L","L","L","L","L","L","L","L","L",{"$f":"IF(AND(BU$4>=$D5,BU$4<=$E5,$B5=\"Réservé (Confirmé)\"),\"C\",IF(AND(BU$4>=$D5,BU$4<=$E5,$B5=\"Réservé (En attente)\"),\"A\",\"L\"))","v":"L"},"L","L","L","L","L","L","L","L","L","L","L","L","L","L","L","L","L","L","L","L","L","L","L","L","L","L","L","L","L","L","L","L","L","L","L","L","L","L","L","L","L","L","L","L","L","L","L","L","L","L","L","L","L","L","L","L","L","L","L","L","L","L","L",{"$f":"IF(AND(EG$4>=$D5,EG$4<=$E5,$B5=\"Réservé (Confirmé)\"),\"C\",IF(AND(EG$4>=$D5,EG$4<=$E5,$B5=\"Réservé (En attente)\"),\"A\",\"L\"))","v":"L"},"L","L","L","L","L","L","L","L","L","L","L","L","L","L","L","L","L","L","L","L","L","L","L","L","L","L","L","L","L","L","L","L","L","L","L","L","L","L","L","L","L","L","L","L","L","L","L","L","L","L","L","L","L","L","L","L","L","L","L","L","L","L","L",{"$f":"IF(AND(GS$4>=$D5,GS$4<=$E5,$B5=\"Réservé (Confirmé)\"),\"C\",IF(AND(GS$4>=$D5,GS$4<=$E5,$B5=\"Réservé (En attente)\"),\"A\",\"L\"))","v":"L"},"L","L","L","L","L","L","L","L","L","L","L","L","L","L","L","L","L","L","L","L","L","L","L","L","L","L","L","L","L","L","L","L","L","L","L","L","L","L","L","L","L","L","L","L","L","L","L","L","L","L","L","L","L","L","L","L","L","L","L","L","L","L","L",{"$f":"IF(AND(JE$4>=$D5,JE$4<=$E5,$B5=\"Réservé (Confirmé)\"),\"C\",IF(AND(JE$4>=$D5,JE$4<=$E5,$B5=\"Réservé (En attente)\"),\"A\",\"L\"))","v":"L"},"L","L","L","L","L","L","L","L","L","L","L","L","L","L","L","L","L","L","L","L","L","L","L","L","L","L","L","L","L","L","L","L","L","L","L","L","L","L","L","L","L","L","L","L","L","L","L","L","L","L","L","L","L","L","L","L","L","L","L","L","L","L","L",{"$f":"IF(AND(LQ$4>=$D5,LQ$4<=$E5,$B5=\"Réservé (Confirmé)\"),\"C\",IF(AND(LQ$4>=$D5,LQ$4<=$E5,$B5=\"Réservé (En attente)\"),\"A\",\"L\"))","v":"L"},"L","L","L","L","L","L","L","L","L","L","L","L","L","L","L","L","L","L","L","L","L","L","L","L","L","L","L","L","L","L","L","L","L","L","L","L","L","L","L","L","L","L","L"]
["Actif","Réservé (Confirmé)",", Solange","2021-07-28","2021-08-04","St_Eusèbe",204,{"$f":"IF(AND(H$4>=$D6,H$4<=$E6,$B6=\"Réservé (Confirmé)\"),\"C\",IF(AND(H$4>=$D6,H$4<=$E6,$B6=\"Réservé (En attente)\"),\"A\",\"L\"))","v":"L"},"L","L","L","L","L","L","L","L","L","L","L","L","L","L","L","L","L","L","L","L","L","L","L","L","L","L","L","L","L","L","L","L","L","L","L","L","L","L","L","L","L","L","L","L","L","L","L","L","L","L","L","L","L","L","L","L","C","C","C","C","C","C","C","C","L","L","L","L","L","L","L","L","L","L","L","L","L","L","L","L","L","L","L","L","L","L","L","L","L","L","L","L","L","L","L","L","L","L","L","L","L","L","L","L","L","L","L","L","L","L","L","L","L","L","L","L","L","L","L","L","L","L","L","L","L","L","L","L","L","L","L","L","L","L","L","L","L","L","L","L","L","L","L","L","L","L","L","L","L","L","L","L","L","L","L","L","L","L","L","L","L","L","L","L","L","L","L","L","L","L","L","L","L","L","L","L","L","L","L","L","L","L","L","L","L","L","L","L","L","L","L","L","L","L","L","L","L","L","L","L","L","L","L","L","L","L","L","L","L","L","L","L","L","L","L","L","L","L","L","L","L","L","L","L","L","L","L","L","L","L","L","L","L","L","L","L","L","L","L","L","L","L","L","L","L","L","L","L","L","L","L","L","L","L","L","L","L","L","L","L","L","L","L","L","L","L","L","L","L","L","L","L","L","L","L","L","L","L","L","L","L","L","L","L","L","L","L","L","L","L","L","L","L","L","L","L","L","L","L","L","L","L","L","L","L","L","L","L","L","L","L","L","L","L","L","L","L","L","L","L","L","L","L","L","L","L","L","L","L","L","L","L","L","L","L","L","L","L","L","L","L","L","L","L","L","L","L","L","L","L","L","L","L","L","L","L","L","L","L","L","L","L","L","L"]
["Actif","Réservé (Confirmé)",", Réal","2021-07-28","2021-08-09","Chêne",227,"L","L","L","L","L","L","L","L","L","L","L","L","L","L","L","L","L","L","L","L","L","L","L","L","L","L","L","L","L","L","L","L","L","L","L","L","L","L","L","L","L","L","L","L","L","L","L","L","L","L","L","L","L","L","L","L","L","C","C","C","C","C","C","C","C","C","C","C","C","C","L","L","L","L","L","L","L","L","L","L","L","L","L","L","L","L","L","L","L","L","L","L","L","L","L","L","L","L","L","L","L","L","L","L","L","L","L","L","L","L","L","L","L","L","L","L","L","L","L","L","L","L","L","L","L","L","L","L","L","L","L","L","L","L","L","L","L","L","L","L","L","L","L","L","L","L","L","L","L","L","L","L","L","L","L","L","L","L","L","L","L","L","L","L","L","L","L","L","L","L","L","L","L","L","L","L","L","L","L","L","L","L","L","L","L","L","L","L","L","L","L","L","L","L","L","L","L","L","L","L","L","L","L","L","L","L","L","L","L","L","L","L","L","L","L","L","L","L","L","L","L","L","L","L","L","L","L","L","L","L","L","L","L","L","L","L","L","L","L","L","L","L","L","L","L","L","L","L","L","L","L","L","L","L","L","L","L","L","L","L","L","L","L","L","L","L","L","L","L","L","L","L","L","L","L","L","L","L","L","L","L","L","L","L","L","L","L","L","L","L","L","L","L","L","L","L","L","L","L","L","L","L","L","L","L","L","L","L","L","L","L","L","L","L","L","L","L","L","L","L","L","L","L","L","L","L","L","L","L","L","L","L","L","L","L","L","L","L","L","L","L","L","L","L","L","L","L","L","L","L","L","L","L","L","L","L","L","L","L","L","L","L","L","L","L"]
["Actif","Réservé (Confirmé)",", Gilles","2021-05-31","2021-06-12","St_Eusèbe",204,"C","C","C","C","C","C","C","C","C","C","C","C","L","L","L","L","L","L","L","L","L","L","L","L","L","L","L","L","L","L","L","L","L","L","L","L","L","L","L","L","L","L","L","L","L","L","L","L","L","L","L","L","L","L","L","L","L","L","L","L","L","L","L","L",{"$f":"IF(AND(BT$4>=$D8,BT$4<=$E8,$B8=\"Réservé (Confirmé)\"),\"C\",IF(AND(BT$4>=$D8,BT$4<=$E8,$B8=\"Réservé (En attente)\"),\"A\",\"L\"))","v":"L"},"L","L","L","L","L","L","L","L","L","L","L","L","L","L","L","L","L","L","L","L","L","L","L","L","L","L","L","L","L","L","L","L","L","L","L","L","L","L","L","L","L","L","L","L","L","L","L","L","L","L","L","L","L","L","L","L","L","L","L","L","L","L","L",{"$f":"IF(AND(EF$4>=$D8,EF$4<=$E8,$B8=\"Réservé (Confirmé)\"),\"C\",IF(AND(EF$4>=$D8,EF$4<=$E8,$B8=\"Réservé (En attente)\"),\"A\",\"L\"))","v":"L"},"L","L","L","L","L","L","L","L","L","L","L","L","L","L","L","L","L","L","L","L","L","L","L","L","L","L","L","L","L","L","L","L","L","L","L","L","L","L","L","L","L","L","L","L","L","L","L","L","L","L","L","L","L","L","L","L","L","L","L","L","L","L","L",{"$f":"IF(AND(GR$4>=$D8,GR$4<=$E8,$B8=\"Réservé (Confirmé)\"),\"C\",IF(AND(GR$4>=$D8,GR$4<=$E8,$B8=\"Réservé (En attente)\"),\"A\",\"L\"))","v":"L"},"L","L","L","L","L","L","L","L","L","L","L","L","L","L","L","L","L","L","L","L","L","L","L","L","L","L","L","L","L","L","L","L","L","L","L","L","L","L","L","L","L","L","L","L","L","L","L","L","L","L","L","L","L","L","L","L","L","L","L","L","L","L","L",{"$f":"IF(AND(JD$4>=$D8,JD$4<=$E8,$B8=\"Réservé (Confirmé)\"),\"C\",IF(AND(JD$4>=$D8,JD$4<=$E8,$B8=\"Réservé (En attente)\"),\"A\",\"L\"))","v":"L"},"L","L","L","L","L","L","L","L","L","L","L","L","L","L","L","L","L","L","L","L","L","L","L","L","L","L","L","L","L","L","L","L","L","L","L","L","L","L","L","L","L","L","L","L","L","L","L","L","L","L","L","L","L","L","L","L","L","L","L","L","L","L","L",{"$f":"IF(AND(LP$4>=$D8,LP$4<=$E8,$B8=\"Réservé (Confirmé)\"),\"C\",IF(AND(LP$4>=$D8,LP$4<=$E8,$B8=\"Réservé (En attente)\"),\"A\",\"L\"))","v":"L"},"L","L","L","L","L","L","L","L","L","L","L","L","L","L","L","L","L","L","L","L","L","L","L","L","L","L","L","L","L","L","L","L","L","L","L","L","L","L","L","L","L","L","L","L"]
["Actif","Réservé (Confirmé)",", Gilles","2021-07-02","2021-07-06","Tilleul",215,"L","L","L","L","L","L","L","L","L","L","L","L","L","L","L","L","L","L","L","L","L","L","L","L","L","L","L","L","L","L","L","C","C","C","C","C","L","L","L","L","L","L","L","L","L","L","L","L","L","L","L","L","L","L","L","L","L","L","L","L","L","L","L","L","L","L","L","L","L","L","L","L","L","L","L","L","L","L","L","L","L","L","L","L","L","L","L","L","L","L","L","L","L","L","L","L","L","L","L","L","L","L","L","L","L","L","L","L","L","L","L","L","L","L","L","L","L","L","L","L","L","L","L","L","L","L","L","L","L","L","L","L","L","L","L","L","L","L","L","L","L","L","L","L","L","L","L","L","L","L","L","L","L","L","L","L","L","L","L","L","L","L","L","L","L","L","L","L","L","L","L","L","L","L","L","L","L","L","L","L","L","L","L","L","L","L","L","L","L","L","L","L","L","L","L","L","L","L","L","L","L","L","L","L","L","L","L","L","L","L","L","L","L","L","L","L","L","L","L","L","L","L","L","L","L","L","L","L","L","L","L","L","L","L","L","L","L","L","L","L","L","L","L","L","L","L","L","L","L","L","L","L","L","L","L","L","L","L","L","L","L","L","L","L","L","L","L","L","L","L","L","L","L","L","L","L","L","L","L","L","L","L","L","L","L","L","L","L","L","L","L","L","L","L","L","L","L","L","L","L","L","L","L","L","L","L","L","L","L","L","L","L","L","L","L","L","L","L","L","L","L","L","L","L","L","L","L","L","L","L","L","L","L","L","L","L","L","L","L","L","L","L","L","L","L","L","L","L","L","L","L","L","L","L","L","L","L","L","L","L","L","L","L","L","L"]
["Actif","Réservé (Confirmé)",", Gilles","2021-08-02","2021-08-06","Tilleul",215,"L","L","L","L","L","L","L","L","L","L","L","L","L","L","L","L","L","L","L","L","L","L","L","L","L","L","L","L","L","L","L","L","L","L","L","L","L","L","L","L","L","L","L","L","L","L","L","L","L","L","L","L","L","L","L","L","L","L","L","L","L","L","C","C","C","C","C","L","L","L","L","L","L","L","L","L","L","L","L","L","L","L","L","L","L","L","L","L","L","L","L","L","L","L","L","L","L","L","L","L","L","L","L","L","L","L","L","L","L","L","L","L","L","L","L","L","L","L","L","L","L","L","L","L","L","L","L","L","L","L","L","L","L","L","L","L","L","L","L","L","L","L","L","L","L","L","L","L","L","L","L","L","L","L","L","L","L","L","L","L","L","L","L","L","L","L","L","L","L","L","L","L","L","L","L","L","L","L","L","L","L","L","L","L","L","L","L","L","L","L","L","L","L","L","L","L","L","L","L","L","L","L","L","L","L","L","L","L","L","L","L","L","L","L","L","L","L","L","L","L","L","L","L","L","L","L","L","L","L","L","L","L","L","L","L","L","L","L","L","L","L","L","L","L","L","L","L","L","L","L","L","L","L","L","L","L","L","L","L","L","L","L","L","L","L","L","L","L","L","L","L","L","L","L","L","L","L","L","L","L","L","L","L","L","L","L","L","L","L","L","L","L","L","L","L","L","L","L","L","L","L","L","L","L","L","L","L","L","L","L","L","L","L","L","L","L","L","L","L","L","L","L","L","L","L","L","L","L","L","L","L","L","L","L","L","L","L","L","L","L","L","L","L","L","L","L","L","L","L","L","L","L","L","L","L","L",{"$f":"IF(AND(MZ$4>=$D10,MZ$4<=$E10,$B10=\"Réservé (Confirmé)\"),\"C\",IF(AND(MZ$4>=$D10,MZ$4<=$E10,$B10=\"Réservé (En attente)\"),\"A\",\"L\"))","v":"L"},"L","L","L","L","L","L","L","L"]
["Actif","Réservé (Confirmé)",", Jeannine","2021-06-10","2021-06-19","Tilleul",215,"L","L","L","L","L","L","L","L","L","C","C","C","C","C","C","C","C","C","C","L","L","L","L","L","L","L","L","L","L","L","L","L","L","L","L","L","L","L","L","L","L","L","L","L","L","L","L","L","L","L","L","L","L","L","L","L","L","L","L","L","L","L","L","L","L","L","L","L","L","L","L","L","L","L","L","L","L","L","L","L","L","L","L","L","L","L","L","L","L","L","L","L","L","L","L","L","L","L","L","L","L","L","L","L","L","L","L","L","L","L","L","L","L","L","L","L","L","L","L","L","L","L","L","L","L","L","L","L","L","L","L","L","L","L","L","L","L","L","L","L","L","L","L","L","L","L","L","L","L","L","L","L","L","L","L","L","L","L","L","L","L","L","L","L","L","L","L","L","L","L","L","L","L","L","L","L","L","L","L","L","L","L","L","L","L","L","L","L","L","L","L","L","L","L","L","L","L","L","L","L","L","L","L","L","L","L","L","L","L","L","L","L","L","L","L","L","L","L","L","L","L","L","L","L","L","L","L","L","L","L","L","L","L","L","L","L","L","L","L","L","L","L","L","L","L","L","L","L","L","L","L","L","L","L","L","L","L","L","L","L","L","L","L","L","L","L","L","L","L","L","L","L","L","L","L","L","L","L","L","L","L","L","L","L","L","L","L","L","L","L","L","L","L","L","L","L","L","L","L","L","L","L","L","L","L","L","L","L","L","L","L","L","L","L","L","L","L","L","L","L","L",{"$f":"IF(AND(LQ$4>=$D11,LQ$4<=$E11,$B11=\"Réservé (Confirmé)\"),\"C\",IF(AND(LQ$4>=$D11,LQ$4<=$E11,$B11=\"Réservé (En attente)\"),\"A\",\"L\"))","v":"L"},"L","L","L","L","L","L","L","L","L","L","L","L","L","L","L",{"$f":"IF(AND(MG$4>=$D11,MG$4<=$E11,$B11=\"Réservé (Confirmé)\"),\"C\",IF(AND(MG$4>=$D11,MG$4<=$E11,$B11=\"Réservé (En attente)\"),\"A\",\"L\"))","v":"L"},"L","L","L","L","L","L","L","L","L","L","L","L","L","L","L",{"$f":"IF(AND(MW$4>=$D11,MW$4<=$E11,$B11=\"Réservé (Confirmé)\"),\"C\",IF(AND(MW$4>=$D11,MW$4<=$E11,$B11=\"Réservé (En attente)\"),\"A\",\"L\"))","v":"L"},"L","L","L","L","L","L","L","L","L","L","L"]
["Actif","Réservé (Confirmé)",", Irène","2021-06-03","2021-07-04","Tilleul",312,"L","L","C","C","C","C","C","C","C","C","C","C","C","C","C","C","C","C","C","C","C","C","C","C","C","C","C","C","C","C","C","C","C","C","L","L","L","L","L","L","L","L","L","L","L","L","L","L","L","L","L","L","L","L","L","L","L","L","L","L","L","L","L",{"$f":"IF(AND(BS$4>=$D12,BS$4<=$E12,$B12=\"Réservé (Confirmé)\"),\"C\",IF(AND(BS$4>=$D12,BS$4<=$E12,$B12=\"Réservé (En attente)\"),\"A\",\"L\"))","v":"L"},"L","L","L","L","L","L","L","L","L","L","L","L","L","L","L","L","L","L","L","L","L","L","L","L","L","L","L","L","L","L","L","L","L","L","L","L","L","L","L","L","L","L","L","L","L","L","L","L","L","L","L","L","L","L","L","L","L","L","L","L","L","L","L",{"$f":"IF(AND(EE$4>=$D12,EE$4<=$E12,$B12=\"Réservé (Confirmé)\"),\"C\",IF(AND(EE$4>=$D12,EE$4<=$E12,$B12=\"Réservé (En attente)\"),\"A\",\"L\"))","v":"L"},"L","L","L","L","L","L","L","L","L","L","L","L","L","L","L","L","L","L","L","L","L","L","L","L","L","L","L","L","L","L","L","L","L","L","L","L","L","L","L","L","L","L","L","L","L","L","L","L","L","L","L","L","L","L","L","L","L","L","L","L","L","L","L",{"$f":"IF(AND(GQ$4>=$D12,GQ$4<=$E12,$B12=\"Réservé (Confirmé)\"),\"C\",IF(AND(GQ$4>=$D12,GQ$4<=$E12,$B12=\"Réservé (En attente)\"),\"A\",\"L\"))","v":"L"},"L","L","L","L","L","L","L","L","L","L","L","L","L","L","L","L","L","L","L","L","L","L","L","L","L","L","L","L","L","L","L","L","L","L","L","L","L","L","L","L","L","L","L","L","L","L","L","L","L","L","L","L","L","L","L","L","L","L","L","L","L","L","L",{"$f":"IF(AND(JC$4>=$D12,JC$4<=$E12,$B12=\"Réservé (Confirmé)\"),\"C\",IF(AND(JC$4>=$D12,JC$4<=$E12,$B12=\"Réservé (En attente)\"),\"A\",\"L\"))","v":"L"},"L","L","L","L","L","L","L","L","L","L","L","L","L","L","L","L","L","L","L","L","L","L","L","L","L","L","L","L","L","L","L","L","L","L","L","L","L","L","L","L","L","L","L","L","L","L","L","L","L","L","L","L","L","L","L","L","L","L","L","L","L","L","L",{"$f":"IF(AND(LO$4>=$D12,LO$4<=$E12,$B12=\"Réservé (Confirmé)\"),\"C\",IF(AND(LO$4>=$D12,LO$4<=$E12,$B12=\"Réservé (En attente)\"),\"A\",\"L\"))","v":"L"},"L","L","L","L","L","L","L","L","L","L","L","L","L","L","L","L","L","L","L","L","L","L","L","L","L","L","L","L","L","L","L","L","L","L","L","L","L","L","L","L","L","L","L","L","L"]
["Actif","Réservé (Confirmé)",", Irène","2021-06-21","2021-06-27","Tilleul",215,"L","L","L","L","L","L","L","L","L","L","L","L","L","L","L","L",{"$f":"IF(AND(X$4>=$D13,X$4<=$E13,$B13=\"Réservé (Confirmé)\"),\"C\",IF(AND(X$4>=$D13,X$4<=$E13,$B13=\"Réservé (En attente)\"),\"A\",\"L\"))","v":"L"},"L","L","L","C","C","C","C","C","C","C","L","L","L","L","L",{"$f":"IF(AND(AN$4>=$D13,AN$4<=$E13,$B13=\"Réservé (Confirmé)\"),\"C\",IF(AND(AN$4>=$D13,AN$4<=$E13,$B13=\"Réservé (En attente)\"),\"A\",\"L\"))","v":"L"},"L","L","L","L","L","L","L","L","L","L","L","L","L","L","L",{"$f":"IF(AND(BD$4>=$D13,BD$4<=$E13,$B13=\"Réservé (Confirmé)\"),\"C\",IF(AND(BD$4>=$D13,BD$4<=$E13,$B13=\"Réservé (En attente)\"),\"A\",\"L\"))","v":"L"},"L","L","L","L","L","L","L","L","L","L","L","L","L","L","L","L","L","L","L","L","L","L","L","L","L","L","L","L","L","L",{"$f":"IF(AND(CI$4>=$D13,CI$4<=$E13,$B13=\"Réservé (Confirmé)\"),\"C\",IF(AND(CI$4>=$D13,CI$4<=$E13,$B13=\"Réservé (En attente)\"),\"A\",\"L\"))","v":"L"},"L","L","L","L","L","L","L","L","L","L","L","L","L","L","L",{"$f":"IF(AND(CY$4>=$D13,CY$4<=$E13,$B13=\"Réservé (Confirmé)\"),\"C\",IF(AND(CY$4>=$D13,CY$4<=$E13,$B13=\"Réservé (En attente)\"),\"A\",\"L\"))","v":"L"},"L","L","L","L","L","L","L","L","L","L","L","L","L","L","L",{"$f":"IF(AND(DO$4>=$D13,DO$4<=$E13,$B13=\"Réservé (Confirmé)\"),\"C\",IF(AND(DO$4>=$D13,DO$4<=$E13,$B13=\"Réservé (En attente)\"),\"A\",\"L\"))","v":"L"},"L","L","L","L","L","L","L","L","L","L","L","L","L","L","L","L","L","L","L","L","L","L","L","L","L","L","L","L","L","L","L",{"$f":"IF(AND(EU$4>=$D13,EU$4<=$E13,$B13=\"Réservé (Confirmé)\"),\"C\",IF(AND(EU$4>=$D13,EU$4<=$E13,$B13=\"Réservé (En attente)\"),\"A\",\"L\"))","v":"L"},"L","L","L","L","L","L","L","L","L","L","L","L","L","L","L",{"$f":"IF(AND(FK$4>=$D13,FK$4<=$E13,$B13=\"Réservé (Confirmé)\"),\"C\",IF(AND(FK$4>=$D13,FK$4<=$E13,$B13=\"Réservé (En attente)\"),\"A\",\"L\"))","v":"L"},"L","L","L","L","L","L","L","L","L","L","L","L","L","L","L",{"$f":"IF(AND(GA$4>=$D13,GA$4<=$E13,$B13=\"Réservé (Confirmé)\"),\"C\",IF(AND(GA$4>=$D13,GA$4<=$E13,$B13=\"Réservé (En attente)\"),\"A\",\"L\"))","v":"L"},"L","L","L","L","L","L","L","L","L","L","L","L","L","L","L","L","L","L","L","L","L","L","L","L","L","L","L","L","L","L","L",{"$f":"IF(AND(HG$4>=$D13,HG$4<=$E13,$B13=\"Réservé (Confirmé)\"),\"C\",IF(AND(HG$4>=$D13,HG$4<=$E13,$B13=\"Réservé (En attente)\"),\"A\",\"L\"))","v":"L"},"L","L","L","L","L","L","L","L","L","L","L","L","L","L","L",{"$f":"IF(AND(HW$4>=$D13,HW$4<=$E13,$B13=\"Réservé (Confirmé)\"),\"C\",IF(AND(HW$4>=$D13,HW$4<=$E13,$B13=\"Réservé (En attente)\"),\"A\",\"L\"))","v":"L"},"L","L","L","L","L","L","L","L","L","L","L","L","L","L","L",{"$f":"IF(AND(IM$4>=$D13,IM$4<=$E13,$B13=\"Réservé (Confirmé)\"),\"C\",IF(AND(IM$4>=$D13,IM$4<=$E13,$B13=\"Réservé (En attente)\"),\"A\",\"L\"))","v":"L"},"L","L","L","L","L","L","L","L","L","L","L","L","L","L","L","L","L","L","L","L","L","L","L","L","L","L","L","L","L","L","L",{"$f":"IF(AND(JS$4>=$D13,JS$4<=$E13,$B13=\"Réservé (Confirmé)\"),\"C\",IF(AND(JS$4>=$D13,JS$4<=$E13,$B13=\"Réservé (En attente)\"),\"A\",\"L\"))","v":"L"},"L","L","L","L","L","L","L","L","L","L","L","L","L","L","L",{"$f":"IF(AND(KI$4>=$D13,KI$4<=$E13,$B13=\"Réservé (Confirmé)\"),\"C\",IF(AND(KI$4>=$D13,KI$4<=$E13,$B13=\"Réservé (En attente)\"),\"A\",\"L\"))","v":"L"},"L","L","L","L","L","L","L","L","L","L","L","L","L","L","L",{"$f":"IF(AND(KY$4>=$D13,KY$4<=$E13,$B13=\"Réservé (Confirmé)\"),\"C\",IF(AND(KY$4>=$D13,KY$4<=$E13,$B13=\"Réservé (En attente)\"),\"A\",\"L\"))","v":"L"},"L","L","L","L","L","L","L","L","L","L","L","L","L","L","L","L","L","L","L","L","L","L","L","L","L","L","L","L","L","L","L","L","L","L","L","L","L","L","L","L","L","L","L","L","L","L","L","L","L","L","L","L","L","L","L","L","L","L","L","L","L"]
["Actif","Réservé (Confirmé)",", Irène","2021-07-19","2021-07-24","Tilleul",215,"L","L","L","L","L","L","L","L","L","L","L","L","L","L","L","L","L","L","L","L","L","L","L","L","L","L","L","L","L","L","L","L","L","L","L","L","L","L","L","L","L","L","L","L","L","L","L","L","C","C","C","C","C","C","L","L","L","L","L","L","L","L","L","L","L","L","L","L","L","L","L","L","L","L","L","L","L","L","L","L","L","L","L","L","L","L","L","L","L","L","L","L","L","L","L","L","L","L","L","L","L","L","L","L","L","L","L","L","L","L","L","L","L","L","L","L","L","L","L","L","L","L","L","L","L","L","L","L","L","L","L","L","L","L","L","L","L","L","L","L","L","L","L","L","L","L","L","L","L","L","L","L","L","L","L","L","L","L","L","L","L","L","L","L","L","L","L","L","L","L","L","L","L","L","L","L","L","L","L","L","L","L","L","L","L","L","L","L","L","L","L","L","L","L","L","L","L","L","L","L","L","L","L","L","L","L","L","L","L","L","L","L","L","L","L","L","L","L","L","L","L","L","L","L","L","L","L","L","L","L","L","L","L","L","L","L","L","L","L","L","L","L","L","L","L","L","L","L","L","L","L","L","L","L","L","L","L","L","L","L","L","L","L","L","L","L","L","L","L","L","L","L","L","L","L","L","L","L","L","L","L","L","L","L","L","L","L","L","L","L","L","L","L","L","L","L","L","L","L","L","L","L","L","L","L","L","L","L","L","L","L","L","L","L","L","L","L","L","L","L","L","L","L","L","L","L","L","L","L","L","L","L","L","L","L","L","L","L","L","L","L","L","L","L","L","L","L","L","L","L","L","L","L","L","L","L","L","L","L","L","L","L","L","L","L"]
["Actif","Réservé (Confirmé)",", Henri","2021-06-07","2021-06-11","Chêne",227,"L","L","L","L","L","L","C","C","C","C","C","L","L","L","L","L","L","L","L","L","L","L","L","L","L","L","L","L","L","L","L","L","L","L","L","L","L","L","L","L","L","L","L","L","L","L","L","L","L","L","L","L","L","L","L","L","L","L","L","L","L","L","L","L","L","L","L","L","L","L","L","L","L","L","L","L","L","L","L","L","L","L","L","L","L","L","L","L","L","L","L","L","L","L","L","L","L","L","L","L","L","L","L","L","L","L","L","L","L","L","L","L","L","L","L","L","L","L","L","L","L","L","L","L","L","L","L","L","L","L","L","L","L","L","L","L","L","L","L","L","L","L","L","L","L","L","L","L","L","L","L","L","L","L","L","L","L","L","L","L","L","L","L","L","L","L","L","L","L","L","L","L","L","L","L","L","L","L","L","L","L","L","L","L","L","L","L","L","L","L","L","L","L","L","L","L","L","L","L","L","L","L","L","L","L","L","L","L","L","L","L","L","L","L","L","L","L","L","L","L","L","L","L","L","L","L","L","L","L","L","L","L","L","L","L","L","L","L","L","L","L","L","L","L","L","L","L","L","L","L","L","L","L","L","L","L","L","L","L","L","L","L","L","L","L","L","L","L","L","L","L","L","L","L","L","L","L","L","L","L","L","L","L","L","L","L","L","L","L","L","L","L","L","L","L","L","L","L","L","L","L","L","L","L","L","L","L","L","L","L","L","L","L","L","L","L","L","L","L","L","L","L","L","L","L","L","L","L","L","L","L","L","L","L","L","L","L","L","L","L","L","L","L","L","L","L","L","L","L","L","L","L","L","L","L","L","L","L","L","L","L","L","L","L","L"]
["Actif","Réservé (Confirmé)",", Henri","2021-07-05","2021-07-08","Chêne",227,"L","L","L","L","L","L","L","L","L","L","L","L","L","L","L","L","L","L","L","L","L","L","L","L","L","L","L","L","L","L","L","L","L","L","C","C","C","C","L","L","L","L","L","L","L","L","L","L","L","L","L","L","L","L","L","L","L","L","L","L","L","L","L","L","L","L","L","L","L","L","L","L","L","L","L","L","L","L","L","L","L","L","L","L","L","L","L","L","L","L","L","L","L","L","L","L","L","L","L","L","L","L","L","L","L","L","L","L","L","L","L","L","L","L","L","L","L","L","L","L","L","L","L","L","L","L","L","L","L","L","L","L","L","L","L","L","L","L","L","L","L","L","L","L","L","L","L","L","L","L","L","L","L","L","L","L","L","L","L","L","L","L","L","L","L","L","L","L","L","L","L","L","L","L","L","L","L","L","L","L","L","L","L","L","L","L","L","L","L","L","L","L","L","L","L","L","L","L","L","L","L","L","L","L","L","L","L","L","L","L","L","L","L","L","L","L","L","L","L","L","L","L","L","L","L","L","L","L","L","L","L","L","L","L","L","L","L","L","L","L","L","L","L","L","L","L","L","L","L","L","L","L","L","L","L","L","L","L","L","L","L","L","L","L","L","L","L","L","L","L","L","L","L","L","L","L","L","L","L","L","L","L","L","L","L","L","L","L","L","L","L","L","L","L","L","L","L","L","L","L","L","L","L","L","L","L","L","L","L","L","L","L","L","L","L","L","L","L","L","L","L","L","L","L","L","L","L","L","L","L","L","L","L","L","L","L","L","L","L","L","L","L","L","L","L","L","L","L","L","L","L","L","L","L","L","L","L","L","L","L","L","L","L","L","L"]
["Actif","Réservé (Confirmé)",", Maurice","2021-07-19","2021-07-26","Chêne",227,"L","L","L","L","L","L","L","L","L","L","L","L","L","L","L","L","L","L","L","L","L","L","L","L","L","L","L","L","L","L","L","L","L","L","L","L","L","L","L","L","L","L","L","L","L","L","L","L","C","C","C","C","C","C","C","C","L","L","L","L","L","L","L","L","L","L","L","L","L","L","L","L","L","L","L","L","L","L","L","L","L","L","L","L","L","L","L","L","L","L","L","L","L","L","L","L","L","L","L","L","L","L","L","L","L","L","L","L","L","L","L","L","L","L","L","L","L","L","L","L","L","L","L","L","L","L","L","L","L","L","L","L","L","L","L","L","L","L","L","L","L","L","L","L","L","L","L","L","L","L","L","L","L","L","L","L","L","L","L","L","L","L","L","L","L","L","L","L","L","L","L","L","L","L","L","L","L","L","L","L","L","L","L","L","L","L","L","L","L","L","L","L","L","L","L","L","L","L","L","L","L","L","L","L","L","L","L","L","L","L","L","L","L","L","L","L","L","L","L","L","L","L","L","L","L","L","L","L","L","L","L","L","L","L","L","L","L","L","L","L","L","L","L","L","L","L","L","L","L","L","L","L","L","L","L","L","L","L","L","L","L","L","L","L","L","L","L","L","L","L","L","L","L","L","L","L","L","L","L","L","L","L","L","L","L","L","L","L","L","L","L","L","L","L","L","L","L","L","L","L","L","L","L","L","L","L","L","L","L","L","L","L","L","L","L","L","L","L","L","L","L","L","L","L","L","L","L","L","L","L","L","L","L","L","L","L","L","L","L","L","L","L","L","L","L","L","L","L","L","L","L","L","L","L","L","L","L","L","L","L","L","L","L","L","L"]
["Actif","Réservé (En attente)",", Réal","2021-06-25","2021-07-26","St_Eusèbe",204,"L","L","L","L","L","L","L","L","L","L","L","L","L","L","L","L","L","L","L","L","L","L","L","L","A","A","A","A","A","A","A","A","A","A","A","A","A","A","A","A","A","A","A","A","A","A","A","A","A","A","A","A","A","A","A","A","L","L","L","L","L","L","L","L","L","L","L","L","L","L","L","L","L","L","L","L","L","L","L","L","L","L","L","L","L","L","L","L","L","L","L","L","L","L","L","L","L","L","L","L","L","L","L","L","L","L","L","L","L","L","L","L","L","L","L","L","L","L","L","L","L","L","L","L","L","L","L","L","L","L","L","L","L","L","L","L","L","L","L","L","L","L","L","L","L","L","L","L","L","L","L","L","L","L","L","L","L","L","L","L","L","L","L","L","L","L","L","L","L","L","L","L","L","L","L","L","L","L","L","L","L","L","L","L","L","L","L","L","L","L","L","L","L","L","L","L","L","L","L","L","L","L","L","L","L","L","L","L","L","L","L","L","L","L","L","L","L","L","L","L","L","L","L","L","L","L","L","L","L","L","L","L","L","L","L","L","L","L","L","L","L","L","L","L","L","L","L","L","L","L","L","L","L","L","L","L","L","L","L","L","L","L","L","L","L","L","L","L","L","L","L","L","L","L","L","L","L","L","L","L","L","L","L","L","L","L","L","L","L","L","L","L","L","L","L","L","L","L","L","L","L","L","L","L","L","L","L","L","L","L","L","L","L","L","L","L","L","L","L","L","L","L","L","L","L","L","L","L","L","L","L","L","L","L","L","L","L","L","L","L","L","L","L","L","L","L","L","L","L","L","L","L","L","L","L","L","L","L","L","L","L","L","L","L","L"]
[null,null,null,null,null,null,null,"L","L","L","L","L","L","L","L","L","L","L","L","L","L","L","L","L","L","L","L","L","L","L","L","L","L","L","L","L","L","L","L","L","L","L","L","L","L","L","L","L","L","L","L","L","L","L","L","L","L","L","L","L","L","L","L","L","L","L","L","L","L","L","L","L","L","L","L","L","L","L","L","L","L","L","L","L","L","L","L","L","L","L","L","L","L","L","L","L","L","L","L","L","L","L","L","L","L","L","L","L","L","L","L","L","L","L","L","L","L","L","L","L","L","L","L","L","L","L","L","L","L","L","L","L","L","L","L","L","L","L","L","L","L","L","L","L","L","L","L","L","L","L","L","L","L","L","L","L","L","L","L","L","L","L","L","L","L","L","L","L","L","L","L","L","L","L","L","L","L","L","L","L","L","L","L","L","L","L","L","L","L","L","L","L","L","L","L","L","L","L","L","L","L","L","L","L","L","L","L","L","L","L","L","L","L","L","L","L","L","L","L","L","L","L","L","L","L","L","L","L","L","L","L","L","L","L","L","L","L","L","L","L","L","L","L","L","L","L","L","L","L","L","L","L","L","L","L","L","L","L","L","L","L","L","L","L","L","L","L","L","L","L","L","L","L","L","L","L","L","L","L","L","L","L","L","L","L","L","L","L","L","L","L","L","L","L","L","L","L","L","L","L","L","L","L","L","L","L","L","L","L","L","L","L","L","L","L","L","L","L","L","L","L","L","L","L","L","L","L","L","L","L","L","L","L","L","L","L","L","L","L","L","L","L","L","L","L","L","L","L","L","L","L","L","L","L","L","L","L","L","L","L","L","L","L","L","L","L","L","L","L","L","L","L"]
[null,null,null,null,null,null,null,"L","L","L","L","L","L","L","L","L","L","L","L","L","L","L","L","L","L","L","L","L","L","L","L","L","L","L","L","L","L","L","L","L","L","L","L","L","L","L","L","L","L","L","L","L","L","L","L","L","L","L","L","L","L","L","L","L","L","L","L","L","L","L","L","L","L","L","L","L","L","L","L","L","L","L","L","L","L","L","L","L","L","L","L","L","L","L","L","L","L","L","L","L","L","L","L","L","L","L","L","L","L","L","L","L","L","L","L","L","L","L","L","L","L","L","L","L","L","L","L","L","L","L","L","L","L","L","L","L","L","L","L","L","L","L","L","L","L","L","L","L","L","L","L","L","L","L","L","L","L","L","L","L","L","L","L","L","L","L","L","L","L","L","L","L","L","L","L","L","L","L","L","L","L","L","L","L","L","L","L","L","L","L","L","L","L","L","L","L","L","L","L","L","L","L","L","L","L","L","L","L","L","L","L","L","L","L","L","L","L","L","L","L","L","L","L","L","L","L","L","L","L","L","L","L","L","L","L","L","L","L","L","L","L","L","L","L","L","L","L","L","L","L","L","L","L","L","L","L","L","L","L","L","L","L","L","L","L","L","L","L","L","L","L","L","L","L","L","L","L","L","L","L","L","L","L","L","L","L","L","L","L","L","L","L","L","L","L","L","L","L","L","L","L","L","L","L","L","L","L","L","L","L","L","L","L","L","L","L","L","L","L","L","L","L","L","L","L","L","L","L","L","L","L","L","L","L","L","L","L","L","L","L","L","L","L","L","L","L","L","L","L","L","L","L","L","L","L","L","L","L","L","L","L","L","L","L","L","L","L","L","L","L","L","L"]
[null,null,null,null,null,null,null,"L","L","L","L","L","L","L","L","L","L","L","L","L","L","L","L","L","L","L","L","L","L","L","L","L","L","L","L","L","L","L","L","L","L","L","L","L","L","L","L","L","L","L","L","L","L","L","L","L","L","L","L","L","L","L","L","L","L","L","L","L","L","L","L","L","L","L","L","L","L","L","L","L","L","L","L","L","L","L","L","L","L","L","L","L","L","L","L","L","L","L","L","L","L","L","L","L","L","L","L","L","L","L","L","L","L","L","L","L","L","L","L","L","L","L","L","L","L","L","L","L","L","L","L","L","L","L","L","L","L","L","L","L","L","L","L","L","L","L","L","L","L","L","L","L","L","L","L","L","L","L","L","L","L","L","L","L","L","L","L","L","L","L","L","L","L","L","L","L","L","L","L","L","L","L","L","L","L","L","L","L","L","L","L","L","L","L","L","L","L","L","L","L","L","L","L","L","L","L","L","L","L","L","L","L","L","L","L","L","L","L","L","L","L","L","L","L","L","L","L","L","L","L","L","L","L","L","L","L","L","L","L","L","L","L","L","L","L","L","L","L","L","L","L","L","L","L","L","L","L","L","L","L","L","L","L","L","L","L","L","L","L","L","L","L","L","L","L","L","L","L","L","L","L","L","L","L","L","L","L","L","L","L","L","L","L","L","L","L","L","L","L","L","L","L","L","L","L","L","L","L","L","L","L","L","L","L","L","L","L","L","L","L","L","L","L","L","L","L","L","L","L","L","L","L","L","L","L","L","L","L","L","L","L","L","L","L","L","L","L","L","L","L","L","L","L","L","L","L","L","L","L","L","L","L","L","L","L","L","L","L","L","L","L","L"]
[null,null,null,null,null,null,null,"L","L","L","L","L","L","L","L","L","L","L","L","L","L","L","L","L","L","L","L","L","L","L","L","L","L","L","L","L","L","L","L","L","L","L","L","L","L","L","L","L","L","L","L","L","L","L","L","L","L","L","L","L","L","L","L","L","L","L","L","L","L","L","L","L","L","L","L","L","L","L","L","L","L","L","L","L","L","L","L","L","L","L","L","L","L","L","L","L","L","L","L","L","L","L","L","L","L","L","L","L","L","L","L","L","L","L","L","L","L","L","L","L","L","L","L","L","L","L","L","L","L","L","L","L","L","L","L","L","L","L","L","L","L","L","L","L","L","L","L","L","L","L","L","L","L","L","L","L","L","L","L","L","L","L","L","L","L","L","L","L","L","L","L","L","L","L","L","L","L","L","L","L","L","L","L","L","L","L","L","L","L","L","L","L","L","L","L","L","L","L","L","L","L","L","L","L","L","L","L","L","L","L","L","L","L","L","L","L","L","L","L","L","L","L","L","L","L","L","L","L","L","L","L","L","L","L","L","L","L","L","L","L","L","L","L","L","L","L","L","L","L","L","L","L","L","L","L","L","L","L","L","L","L","L","L","L","L","L","L","L","L","L","L","L","L","L","L","L","L","L","L","L","L","L","L","L","L","L","L","L","L","L","L","L","L","L","L","L","L","L","L","L","L","L","L","L","L","L","L","L","L","L","L","L","L","L","L","L","L","L","L","L","L","L","L","L","L","L","L","L","L","L","L","L","L","L","L","L","L","L","L","L","L","L","L","L","L","L","L","L","L","L","L","L","L","L","L","L","L","L","L","L","L","L","L","L","L","L","L","L","L","L","L","L"]
[null,null,null,null,null,null,null,"L","L","L","L","L","L","L","L","L","L","L","L","L","L","L","L","L","L","L","L","L","L","L","L","L","L","L","L","L","L","L","L","L","L","L","L","L","L","L","L","L","L","L","L","L","L","L","L","L","L","L","L","L","L","L","L","L","L","L","L","L","L","L","L","L","L","L","L","L","L","L","L","L","L","L","L","L","L","L","L","L","L","L","L","L","L","L","L","L","L","L","L","L","L","L","L","L","L","L","L","L","L","L","L","L","L","L","L","L","L","L","L","L","L","L","L","L","L","L","L","L","L","L","L","L","L","L","L","L","L","L","L","L","L","L","L","L","L","L","L","L","L","L","L","L","L","L","L","L","L","L","L","L","L","L","L","L","L","L","L","L","L","L","L","L","L","L","L","L","L","L","L","L","L","L","L","L","L","L","L","L","L","L","L","L","L","L","L","L","L","L","L","L","L","L","L","L","L","L","L","L","L","L","L","L","L","L","L","L","L","L","L","L","L","L","L","L","L","L","L","L","L","L","L","L","L","L","L","L","L","L","L","L","L","L","L","L","L","L","L","L","L","L","L","L","L","L","L","L","L","L","L","L","L","L","L","L","L","L","L","L","L","L","L","L","L","L","L","L","L","L","L","L","L","L","L","L","L","L","L","L","L","L","L","L","L","L","L","L","L","L","L","L","L","L","L","L","L","L","L","L","L","L","L","L","L","L","L","L","L","L","L","L","L","L","L","L","L","L","L","L","L","L","L","L","L","L","L","L","L","L","L","L","L","L","L","L","L","L","L","L","L","L","L","L","L","L","L","L","L","L","L","L","L","L","L","L","L","L","L","L","L","L","L","L"]
[null,null,null,null,null,null,null,"L","L","L","L","L","L","L","L","L","L","L","L","L","L","L","L","L","L","L","L","L","L","L","L","L","L","L","L","L","L","L","L","L","L","L","L","L","L","L","L","L","L","L","L","L","L","L","L","L","L","L","L","L","L","L","L","L","L","L","L","L","L","L","L","L","L","L","L","L","L","L","L","L","L","L","L","L","L","L","L","L","L","L","L","L","L","L","L","L","L","L","L","L","L","L","L","L","L","L","L","L","L","L","L","L","L","L","L","L","L","L","L","L","L","L","L","L","L","L","L","L","L","L","L","L","L","L","L","L","L","L","L","L","L","L","L","L","L","L","L","L","L","L","L","L","L","L","L","L","L","L","L","L","L","L","L","L","L","L","L","L","L","L","L","L","L","L","L","L","L","L","L","L","L","L","L","L","L","L","L","L","L","L","L","L","L","L","L","L","L","L","L","L","L","L","L","L","L","L","L","L","L","L","L","L","L","L","L","L","L","L","L","L","L","L","L","L","L","L","L","L","L","L","L","L","L","L","L","L","L","L","L","L","L","L","L","L","L","L","L","L","L","L","L","L","L","L","L","L","L","L","L","L","L","L","L","L","L","L","L","L","L","L","L","L","L","L","L","L","L","L","L","L","L","L","L","L","L","L","L","L","L","L","L","L","L","L","L","L","L","L","L","L","L","L","L","L","L","L","L","L","L","L","L","L","L","L","L","L","L","L","L","L","L","L","L","L","L","L","L","L","L","L","L","L","L","L","L","L","L","L","L","L","L","L","L","L","L","L","L","L","L","L","L","L","L","L","L","L","L","L","L","L","L","L","L","L","L","L","L","L","L","L","L","L"]
[null,null,null,null,null,null,null,"L","L","L","L","L","L","L","L","L","L","L","L","L","L","L","L","L","L","L","L","L","L","L","L","L","L","L","L","L","L","L","L","L","L","L","L","L","L","L","L","L","L","L","L","L","L","L","L","L","L","L","L","L","L","L","L","L","L","L","L","L","L","L","L","L","L","L","L","L","L","L","L","L","L","L","L","L","L","L","L","L","L","L","L","L","L","L","L","L","L","L","L","L","L","L","L","L","L","L","L","L","L","L","L","L","L","L","L","L","L","L","L","L","L","L","L","L","L","L","L","L","L","L","L","L","L","L","L","L","L","L","L","L","L","L","L","L","L","L","L","L","L","L","L","L","L","L","L","L","L","L","L","L","L","L","L","L","L","L","L","L","L","L","L","L","L","L","L","L","L","L","L","L","L","L","L","L","L","L","L","L","L","L","L","L","L","L","L","L","L","L","L","L","L","L","L","L","L","L","L","L","L","L","L","L","L","L","L","L","L","L","L","L","L","L","L","L","L","L","L","L","L","L","L","L","L","L","L","L","L","L","L","L","L","L","L","L","L","L","L","L","L","L","L","L","L","L","L","L","L","L","L","L","L","L","L","L","L","L","L","L","L","L","L","L","L","L","L","L","L","L","L","L","L","L","L","L","L","L","L","L","L","L","L","L","L","L","L","L","L","L","L","L","L","L","L","L","L","L","L","L","L","L","L","L","L","L","L","L","L","L","L","L","L","L","L","L","L","L","L","L","L","L","L","L","L","L","L","L","L","L","L","L","L","L","L","L","L","L","L","L","L","L","L","L","L","L","L","L","L","L","L","L","L","L","L","L","L","L","L","L","L","L","L","L"]
[null,null,null,null,null,null,null,"L","L","L","L","L","L","L","L","L","L","L","L","L","L","L","L","L","L","L","L","L","L","L","L","L","L","L","L","L","L","L","L","L","L","L","L","L","L","L","L","L","L","L","L","L","L","L","L","L","L","L","L","L","L","L","L","L","L","L","L","L","L","L","L","L","L","L","L","L","L","L","L","L","L","L","L","L","L","L","L","L","L","L","L","L","L","L","L","L","L","L","L","L","L","L","L","L","L","L","L","L","L","L","L","L","L","L","L","L","L","L","L","L","L","L","L","L","L","L","L","L","L","L","L","L","L","L","L","L","L","L","L","L","L","L","L","L","L","L","L","L","L","L","L","L","L","L","L","L","L","L","L","L","L","L","L","L","L","L","L","L","L","L","L","L","L","L","L","L","L","L","L","L","L","L","L","L","L","L","L","L","L","L","L","L","L","L","L","L","L","L","L","L","L","L","L","L","L","L","L","L","L","L","L","L","L","L","L","L","L","L","L","L","L","L","L","L","L","L","L","L","L","L","L","L","L","L","L","L","L","L","L","L","L","L","L","L","L","L","L","L","L","L","L","L","L","L","L","L","L","L","L","L","L","L","L","L","L","L","L","L","L","L","L","L","L","L","L","L","L","L","L","L","L","L","L","L","L","L","L","L","L","L","L","L","L","L","L","L","L","L","L","L","L","L","L","L","L","L","L","L","L","L","L","L","L","L","L","L","L","L","L","L","L","L","L","L","L","L","L","L","L","L","L","L","L","L","L","L","L","L","L","L","L","L","L",{"$f":"IF(AND(MF$4>=$D26,MF$4<=$E26,$B26=\"Réservé (Confirmé)\"),\"C\",IF(AND(MF$4>=$D26,MF$4<=$E26,$B26=\"Réservé (En attente)\"),\"A\",\"L\"))","v":"L"},"L","L","L","L","L","L","L","L","L","L","L","L","L","L","L","L","L","L","L","L","L","L","L","L","L","L","L","L"]
[null,null,null,null,null,null,null,"L","L","L","L","L","L","L","L","L","L","L","L","L","L","L","L","L","L","L","L","L","L","L","L","L","L","L","L","L","L","L","L","L","L","L","L","L","L","L","L","L","L","L","L","L","L","L","L","L","L","L","L","L","L","L","L","L","L","L","L","L","L","L","L","L","L","L","L","L","L","L","L","L","L","L","L","L","L","L","L","L","L","L","L","L","L","L","L","L","L","L","L","L","L","L","L","L","L","L","L","L","L","L","L","L","L","L","L","L","L","L","L","L","L","L","L","L","L","L","L","L","L","L","L","L","L","L","L","L","L","L","L","L","L","L","L","L","L","L","L","L","L","L","L","L","L","L","L","L","L","L","L","L","L","L","L","L","L","L","L","L","L","L","L","L","L","L","L","L","L","L","L","L","L","L","L","L","L","L","L","L","L","L","L","L","L","L","L","L","L","L","L","L","L","L","L","L","L","L","L","L","L","L","L","L","L","L","L","L","L","L","L","L","L","L","L","L","L","L","L","L","L","L","L","L","L","L","L","L","L","L","L","L","L","L","L","L","L","L","L","L","L","L","L","L","L","L","L","L","L","L","L","L","L","L","L","L","L","L","L","L","L","L","L","L","L","L","L","L","L","L","L","L","L","L","L","L","L","L","L","L","L","L","L","L","L","L","L","L","L","L","L","L","L","L","L","L","L","L","L","L","L","L","L","L","L","L","L","L","L","L","L","L","L","L","L","L","L","L","L","L","L","L","L","L","L","L","L","L","L","L","L","L","L","L",{"$f":"IF(AND(ME$4>=$D27,ME$4<=$E27,$B27=\"Réservé (Confirmé)\"),\"C\",IF(AND(ME$4>=$D27,ME$4<=$E27,$B27=\"Réservé (En attente)\"),\"A\",\"L\"))","v":"L"},"L","L","L","L","L","L","L","L","L","L","L","L","L","L","L","L","L","L","L","L","L","L","L","L","L","L","L","L","L"]
[null,null,null,null,null,null,null,"L","L","L","L","L","L","L","L",{"$f":"IF(AND(P$4>=$D28,P$4<=$E28,$B28=\"Réservé (Confirmé)\"),\"C\",IF(AND(P$4>=$D28,P$4<=$E28,$B28=\"Réservé (En attente)\"),\"A\",\"L\"))","v":"L"},"L","L","L","L","L","L","L","L","L","L","L","L","L","L","L","L","L","L","L","L","L","L","L","L","L","L","L","L","L","L","L","L","L","L","L","L","L","L",{"$f":"IF(AND(BC$4>=$D28,BC$4<=$E28,$B28=\"Réservé (Confirmé)\"),\"C\",IF(AND(BC$4>=$D28,BC$4<=$E28,$B28=\"Réservé (En attente)\"),\"A\",\"L\"))","v":"L"},"L","L","L","L","L","L","L","L","L","L","L","L","L","L","L","L","L","L","L","L","L","L","L","L","L","L","L","L","L","L","L","L","L","L","L","L","L","L","L","L","L","L","L","L","L","L",{"$f":"IF(AND(CX$4>=$D28,CX$4<=$E28,$B28=\"Réservé (Confirmé)\"),\"C\",IF(AND(CX$4>=$D28,CX$4<=$E28,$B28=\"Réservé (En attente)\"),\"A\",\"L\"))","v":"L"},"L","L","L","L","L","L","L","L","L","L","L","L","L","L","L","L","L","L","L","L","L","L","L","L","L","L","L","L","L","L","L",{"$f":"IF(AND(ED$4>=$D28,ED$4<=$E28,$B28=\"Réservé (Confirmé)\"),\"C\",IF(AND(ED$4>=$D28,ED$4<=$E28,$B28=\"Réservé (En attente)\"),\"A\",\"L\"))","v":"L"},"L","L","L","L","L","L","L","L","L","L","L","L","L","L","L",{"$f":"IF(AND(ET$4>=$D28,ET$4<=$E28,$B28=\"Réservé (Confirmé)\"),\"C\",IF(AND(ET$4>=$D28,ET$4<=$E28,$B28=\"Réservé (En attente)\"),\"A\",\"L\"))","v":"L"},"L","L","L","L","L","L","L","L","L","L","L","L","L","L","L","L","L","L","L","L","L","L","L","L","L","L","L","L","L","L","L",{"$f":"IF(AND(FZ$4>=$D28,FZ$4<=$E28,$B28=\"Réservé (Confirmé)\"),\"C\",IF(AND(FZ$4>=$D28,FZ$4<=$E28,$B28=\"Réservé (En attente)\"),\"A\",\"L\"))","v":"L"},"L","L","L","L","L","L","L","L","L","L","L","L","L","L","L","L","L","L","L","L","L","L","L","L","L","L","L","L","L",{"$f":"IF(AND(HD$4>=$D28,HD$4<=$E28,$B28=\"Réservé (Confirmé)\"),\"C\",IF(AND(HD$4>=$D28,HD$4<=$E28,$B28=\"Réservé (En attente)\"),\"A\",\"L\"))","v":"L"},"L","L","L","L","L","L","L","L","L","L","L","L","L","L","L","L","L","L","L","L","L","L","L","L","L","L","L","L","L","L","L","L","L",{"$f":"IF(AND(IL$4>=$D28,IL$4<=$E28,$B28=\"Réservé (Confirmé)\"),\"C\",IF(AND(IL$4>=$D28,IL$4<=$E28,$B28=\"Réservé (En attente)\"),\"A\",\"L\"))","v":"L"},"L","L","L","L","L","L","L","L","L","L","L","L","L","L","L","L","L","L","L","L","L","L","L","L","L","L","L","L","L",{"$f":"IF(AND(JP$4>=$D28,JP$4<=$E28,$B28=\"Réservé (Confirmé)\"),\"C\",IF(AND(JP$4>=$D28,JP$4<=$E28,$B28=\"Réservé (En attente)\"),\"A\",\"L\"))","v":"L"},"L","L","L","L","L","L","L","L","L","L","L","L","L","L","L","L","L","L","L","L","L","L","L","L","L","L","L","L","L","L","L","L","L",{"$f":"IF(AND(KX$4>=$D28,KX$4<=$E28,$B28=\"Réservé (Confirmé)\"),\"C\",IF(AND(KX$4>=$D28,KX$4<=$E28,$B28=\"Réservé (En attente)\"),\"A\",\"L\"))","v":"L"},"L","L","L","L","L","L","L","L","L","L","L","L","L","L","L","L","L","L","L","L","L","L","L","L","L","L","L","L","L","L","L","L","L","L","L","L","L","L","L","L","L","L","L","L","L","L","L","L","L","L","L","L","L","L","L","L","L","L","L","L","L","L"]
[null,null,null,null,null,null,null,{"$f":"IF(AND(H$4>=$D29,H$4<=$E29,$B29=\"Réservé (Confirmé)\"),\"C\",IF(AND(H$4>=$D29,H$4<=$E29,$B29=\"Réservé (En attente)\"),\"A\",\"L\"))","v":"L"},"L","L","L","L","L","L","L","L","L","L","L","L","L","L","L","L","L","L","L","L","L","L","L","L","L","L","L","L","L","L",{"$f":"IF(AND(AM$4>=$D29,AM$4<=$E29,$B29=\"Réservé (Confirmé)\"),\"C\",IF(AND(AM$4>=$D29,AM$4<=$E29,$B29=\"Réservé (En attente)\"),\"A\",\"L\"))","v":"L"},"L","L","L","L","L","L","L","L","L","L","L","L","L","L","L","L","L","L","L","L","L","L","L","L","L","L","L","L","L","L","L","L","L","L","L","L","L","L","L","L","L","L","L","L","L",{"$f":"IF(AND(CG$4>=$D29,CG$4<=$E29,$B29=\"Réservé (Confirmé)\"),\"C\",IF(AND(CG$4>=$D29,CG$4<=$E29,$B29=\"Réservé (En attente)\"),\"A\",\"L\"))","v":"L"},"L","L","L","L","L","L","L","L","L","L","L","L","L","L","L",{"$f":"IF(AND(CW$4>=$D29,CW$4<=$E29,$B29=\"Réservé (Confirmé)\"),\"C\",IF(AND(CW$4>=$D29,CW$4<=$E29,$B29=\"Réservé (En attente)\"),\"A\",\"L\"))","v":"L"},"L","L","L","L","L","L","L","L","L","L","L","L","L","L","L","L","L",{"$f":"IF(AND(DO$4>=$D29,DO$4<=$E29,$B29=\"Réservé (Confirmé)\"),\"C\",IF(AND(DO$4>=$D29,DO$4<=$E29,$B29=\"Réservé (En attente)\"),\"A\",\"L\"))","v":"L"},"L","L","L","L","L","L","L","L","L","L","L","L","L","L","L","L","L","L","L","L","L","L","L","L","L","L","L","L","L","L","L","L","L","L","L","L","L","L","L","L","L","L","L","L","L","L","L",{"$f":"IF(AND(FK$4>=$D29,FK$4<=$E29,$B29=\"Réservé (Confirmé)\"),\"C\",IF(AND(FK$4>=$D29,FK$4<=$E29,$B29=\"Réservé (En attente)\"),\"A\",\"L\"))","v":"L"},"L","L","L","L","L","L","L","L","L","L","L","L","L","L","L","L","L","L","L","L","L","L","L","L","L","L","L","L","L","L","L",{"$f":"IF(AND(GQ$4>=$D29,GQ$4<=$E29,$B29=\"Réservé (Confirmé)\"),\"C\",IF(AND(GQ$4>=$D29,GQ$4<=$E29,$B29=\"Réservé (En attente)\"),\"A\",\"L\"))","v":"L"},"L","L","L","L","L","L","L","L","L","L","L","L","L","L","L","L","L","L","L","L","L","L","L","L","L","L","L","L","L","L","L",{"$f":"IF(AND(HW$4>=$D29,HW$4<=$E29,$B29=\"Réservé (Confirmé)\"),\"C\",IF(AND(HW$4>=$D29,HW$4<=$E29,$B29=\"Réservé (En attente)\"),\"A\",\"L\"))","v":"L"},"L","L","L","L","L","L","L","L","L","L","L","L","L","L","L","L","L","L","L","L","L","L","L","L","L","L","L","L","L","L","L",{"$f":"IF(AND(JC$4>=$D29,JC$4<=$E29,$B29=\"Réservé (Confirmé)\"),\"C\",IF(AND(JC$4>=$D29,JC$4<=$E29,$B29=\"Réservé (En attente)\"),\"A\",\"L\"))","v":"L"},"L","L","L","L","L","L","L","L","L","L","L","L","L","L","L","L","L","L","L","L","L","L","L","L","L","L","L","L","L","L","L",{"$f":"IF(AND(KI$4>=$D29,KI$4<=$E29,$B29=\"Réservé (Confirmé)\"),\"C\",IF(AND(KI$4>=$D29,KI$4<=$E29,$B29=\"Réservé (En attente)\"),\"A\",\"L\"))","v":"L"},"L","L","L","L","L","L","L","L","L","L","L","L","L","L","L","L","L","L","L","L","L","L","L","L","L","L","L","L","L","L","L","L","L","L","L","L","L","L","L","L","L","L","L","L","L","L","L","L","L","L","L","L","L","L","L","L","L","L","L","L","L","L","L","L","L","L","L","L","L","L","L","L","L","L","L","L","L"]
[null,null,null,null,null,null,null,"L","L","L","L","L","L","L","L","L","L","L","L","L","L","L","L","L","L","L","L","L","L","L","L",{"$f":"IF(AND(AF$4>=$D30,AF$4<=$E30,$B30=\"Réservé (Confirmé)\"),\"C\",IF(AND(AF$4>=$D30,AF$4<=$E30,$B30=\"Réservé (En attente)\"),\"A\",\"L\"))","v":"L"},"L","L","L","L","L","L","L","L","L","L","L","L","L","L","L","L","L","L","L","L","L","L","L","L","L","L","L","L","L","L","L","L","L","L","L","L","L","L","L",{"$f":"IF(AND(BT$4>=$D30,BT$4<=$E30,$B30=\"Réservé (Confirmé)\"),\"C\",IF(AND(BT$4>=$D30,BT$4<=$E30,$B30=\"Réservé (En attente)\"),\"A\",\"L\"))","v":"L"},"L","L","L","L","L","L","L","L","L","L","L","L","L","L","L","L","L","L","L","L","L","L","L","L","L","L","L","L","L","L","L","L","L","L","L","L","L","L","L","L","L","L","L","L","L","L","L","L","L","L","L","L","L","L","L","L","L","L","L","L","L","L","L","L","L","L","L","L","L","L","L","L","L","L","L","L","L","L","L","L","L","L","L","L","L","L","L","L","L","L","L","L","L","L","L","L","L","L","L","L","L","L","L","L","L","L","L","L","L","L","L","L","L","L","L","L","L","L","L","L","L","L","L","L","L","L","L","L","L","L","L","L","L","L","L","L","L","L","L","L","L","L","L","L","L","L","L","L","L","L","L","L","L","L","L","L","L","L","L","L","L","L","L","L","L","L","L","L","L","L","L","L","L","L","L","L","L","L","L","L","L","L","L","L","L","L","L","L","L","L","L","L","L","L","L","L","L","L","L","L","L","L","L","L","L","L","L","L","L","L","L","L","L","L","L","L","L","L","L","L","L","L","L","L","L","L","L","L","L","L","L","L","L","L","L","L","L","L","L","L","L","L","L","L","L","L","L","L","L","L","L","L","L","L","L","L","L","L","L","L","L","L","L","L","L","L","L","L","L","L","L","L","L","L","L","L","L","L","L","L","L","L","L","L","L","L","L","L","L","L","L","L","L","L","L","L","L","L","L","L"]
[null,null,null,null,null,null,null,"L","L","L","L","L","L","L","L","L","L","L","L","L","L","L","L","L","L","L","L","L","L","L","L","L","L","L","L","L","L","L","L","L","L","L","L","L","L","L","L","L","L","L","L","L","L","L","L","L","L","L","L","L","L","L","L","L","L","L","L","L","L","L","L","L","L","L","L","L","L","L","L","L","L","L","L","L","L","L","L","L","L","L","L","L","L","L","L","L","L","L","L","L","L","L","L","L","L","L","L","L","L","L","L","L","L","L","L","L","L","L","L","L","L","L","L","L","L","L","L","L","L","L","L","L","L","L","L","L","L","L","L","L","L","L","L","L","L","L","L","L","L","L","L","L","L","L","L","L","L","L","L","L","L","L","L","L","L","L","L","L","L","L","L","L","L","L","L","L","L","L","L","L","L","L","L","L","L","L","L","L","L","L","L","L","L","L","L","L","L","L","L","L","L","L","L","L","L","L","L","L","L","L","L","L","L","L","L","L","L","L","L","L","L","L","L","L","L","L","L","L","L","L","L","L","L","L","L","L","L","L","L","L","L","L","L","L","L","L","L","L","L","L","L","L","L","L","L","L","L","L","L","L","L","L","L","L","L","L","L","L","L","L","L","L","L","L","L","L","L","L","L","L","L","L","L","L","L","L","L","L","L","L","L","L","L","L","L","L","L","L","L","L","L","L","L","L","L","L","L","L","L","L","L","L","L","L","L","L","L","L","L","L","L","L","L","L","L","L","L","L","L","L","L","L","L","L","L","L","L","L","L","L","L","L","L","L","L","L","L","L","L","L","L","L","L","L","L","L","L","L","L","L","L","L","L","L","L","L","L","L","L","L","L","L"]
[null,null,null,null,null,null,null,"L","L","L","L","L","L","L","L","L","L","L","L","L","L","L","L","L","L","L","L","L","L","L","L","L","L","L","L","L","L","L","L","L","L","L","L","L","L","L","L","L","L","L","L","L","L","L","L","L","L","L","L","L","L","L","L","L","L","L","L","L","L","L","L","L","L","L","L","L","L","L","L","L","L","L","L","L","L","L","L","L","L","L","L","L","L","L","L","L","L","L","L","L","L","L","L","L","L","L","L","L","L","L","L","L","L","L","L","L","L","L","L","L","L","L","L","L","L","L","L","L","L","L","L","L","L","L","L","L","L","L","L","L","L","L","L","L","L","L","L","L","L","L","L","L","L","L","L","L","L","L","L","L","L","L","L","L","L","L","L","L","L","L","L","L","L","L","L","L","L","L","L","L","L","L","L","L","L","L","L","L","L","L","L","L","L","L","L","L","L","L","L","L","L","L","L","L","L","L","L","L","L","L","L","L","L","L","L","L","L","L","L","L","L","L","L","L","L","L","L","L","L","L","L","L","L","L","L","L","L","L","L","L","L","L","L","L","L","L","L","L","L","L","L","L","L","L","L","L","L","L","L","L","L","L","L","L","L","L","L","L","L","L","L","L","L","L","L","L","L","L","L","L","L","L","L","L","L","L","L","L","L","L","L","L","L","L","L","L","L","L","L","L","L","L","L","L","L","L","L","L","L","L","L","L","L","L","L","L","L","L","L","L","L","L","L","L","L","L","L","L","L","L","L","L","L","L","L","L","L","L","L","L","L","L","L","L","L","L","L","L","L","L","L","L","L","L","L","L","L","L","L","L","L","L","L",{"$f":"IF(AND(MZ$4>=$D32,MZ$4<=$E32,$B32=\"Réservé (Confirmé)\"),\"C\",IF(AND(MZ$4>=$D32,MZ$4<=$E32,$B32=\"Réservé (En attente)\"),\"A\",\"L\"))","v":"L"},"L","L","L","L","L","L","L","L"]
[null,null,null,null,null,null,null,"L","L","L","L","L","L","L","L","L","L","L","L","L","L","L","L","L","L","L","L","L","L","L","L","L","L","L","L","L","L","L","L","L","L","L","L","L","L","L","L","L","L","L","L","L","L","L","L","L","L","L","L","L","L","L","L","L","L","L","L","L","L","L","L","L","L","L","L","L","L","L","L","L","L","L","L","L","L","L","L","L","L","L","L","L","L","L","L","L","L","L","L","L","L","L","L","L","L","L","L","L","L","L","L","L","L","L","L","L","L","L","L","L","L","L","L","L","L","L","L","L","L","L","L","L","L","L","L","L","L","L","L","L","L","L","L","L","L","L","L","L","L","L","L","L","L","L","L","L","L","L","L","L","L","L","L","L","L","L","L","L","L","L","L","L","L","L","L","L","L","L","L","L","L","L","L","L","L","L","L","L","L","L","L","L","L","L","L","L","L","L","L","L","L","L","L","L","L","L","L","L","L","L","L","L","L","L","L","L","L","L","L","L","L","L","L","L","L","L","L",{"$f":"IF(AND(HT$4>=$D33,HT$4<=$E33,$B33=\"Réservé (Confirmé)\"),\"C\",IF(AND(HT$4>=$D33,HT$4<=$E33,$B33=\"Réservé (En attente)\"),\"A\",\"L\"))","v":"L"},"L","L","L","L","L","L","L","L","L","L","L","L","L","L","L","L","L","L","L","L","L","L","L","L","L","L","L","L","L","L","L","L","L","L","L","L","L","L","L","L","L","L","L","L","L","L","L","L","L","L","L","L","L","L","L","L","L","L","L","L","L","L","L",{"$f":"IF(AND(KF$4>=$D33,KF$4<=$E33,$B33=\"Réservé (Confirmé)\"),\"C\",IF(AND(KF$4>=$D33,KF$4<=$E33,$B33=\"Réservé (En attente)\"),\"A\",\"L\"))","v":"L"},"L","L","L","L","L","L","L","L","L","L","L","L","L","L","L","L","L","L","L","L","L","L","L","L","L","L","L","L","L","L","L","L","L","L","L","L","L","L","L","L","L","L","L","L","L","L","L","L","L","L","L","L","L","L","L","L","L","L","L","L","L","L","L","L","L","L","L","L",{"$f":"IF(AND(MW$4>=$D33,MW$4<=$E33,$B33=\"Réservé (Confirmé)\"),\"C\",IF(AND(MW$4>=$D33,MW$4<=$E33,$B33=\"Réservé (En attente)\"),\"A\",\"L\"))","v":"L"},"L","L","L","L","L","L","L","L","L","L","L"]
[null,null,null,null,null,null,null,"L","L","L","L","L","L","L","L","L","L","L","L","L","L","L","L","L","L","L","L","L","L","L","L","L","L","L","L","L","L","L","L","L","L","L","L","L","L","L","L","L","L","L","L","L","L","L","L","L","L","L","L","L","L","L","L","L","L","L","L","L","L","L","L","L","L","L","L","L","L","L","L","L","L","L","L","L","L","L","L","L","L","L","L","L","L","L","L","L","L","L","L","L","L","L","L","L","L","L","L","L","L","L","L","L","L","L","L","L","L","L","L","L","L","L","L","L","L","L","L","L","L","L","L","L","L","L","L","L","L","L","L","L","L","L","L","L","L","L","L","L","L","L","L","L","L","L","L","L","L","L","L","L","L","L","L","L","L","L","L","L","L","L","L","L","L","L","L","L","L","L","L","L","L","L","L","L","L","L","L","L","L","L","L","L","L","L","L","L","L","L","L","L","L","L","L","L","L","L","L","L","L","L","L","L","L","L","L","L","L","L","L","L","L","L","L","L","L","L","L","L","L","L","L","L","L","L","L","L","L","L","L","L","L","L","L","L","L","L","L","L","L","L","L","L","L","L","L","L","L","L","L","L","L","L","L","L","L","L","L","L","L","L","L","L","L","L","L","L","L","L","L","L","L","L","L","L","L","L","L","L","L","L","L","L","L","L","L","L","L","L","L","L","L","L","L","L","L","L","L","L","L","L","L","L","L","L","L","L","L","L","L","L","L","L","L","L","L","L","L","L","L","L","L","L","L","L","L","L","L","L","L","L","L","L","L","L","L","L","L","L","L","L","L","L","L","L","L","L","L","L","L","L","L","L","L","L","L","L","L","L","L","L","L","L"]
[null,null,null,null,null,null,null,"L","L","L","L","L","L","L","L","L","L","L","L","L","L","L","L","L","L","L","L","L","L","L","L","L","L","L","L","L","L","L","L","L","L","L","L","L","L","L","L","L","L","L","L","L","L","L","L","L","L","L","L","L","L","L","L","L","L","L","L","L","L","L","L","L","L","L","L","L","L","L","L","L","L","L","L","L","L","L","L","L","L","L","L","L","L","L","L","L","L","L","L","L","L","L","L","L","L","L","L","L","L","L","L","L","L","L","L","L","L","L","L","L","L","L","L","L","L","L","L","L","L","L","L","L","L","L","L","L","L","L","L","L","L","L","L","L","L","L","L","L","L","L","L","L","L","L","L","L","L","L","L","L","L","L","L","L","L","L","L","L","L","L","L","L","L","L","L","L","L","L","L","L","L","L","L","L","L","L","L","L","L","L","L","L","L","L","L","L","L","L","L","L","L","L","L","L","L","L","L","L","L","L","L","L","L","L","L","L","L","L","L","L","L","L","L","L","L","L","L","L","L","L","L","L","L","L","L","L","L","L","L","L","L","L","L","L","L","L","L","L","L","L","L","L","L","L","L","L","L","L","L","L","L","L","L","L","L","L","L","L","L","L","L","L","L","L","L","L","L","L","L","L","L","L","L","L","L","L","L","L","L","L","L","L","L","L","L","L","L","L","L","L","L","L","L","L","L","L","L","L","L","L","L","L","L","L","L","L","L","L","L","L","L","L","L","L","L","L","L","L","L","L","L","L","L","L","L","L","L","L","L","L","L","L","L","L","L","L","L","L","L","L","L","L","L","L","L","L","L","L","L","L","L","L","L","L","L","L","L","L","L","L","L","L"]
[null,null,null,null,null,null,null,"L","L","L","L","L","L","L","L","L","L","L","L","L","L","L","L","L","L","L","L","L","L","L","L","L","L","L","L","L","L","L","L","L","L","L","L","L","L","L","L","L","L","L","L","L","L","L","L","L","L","L","L","L","L","L","L","L","L","L","L","L","L","L","L","L","L","L","L","L","L","L","L","L","L","L","L","L","L","L","L","L","L","L","L","L","L","L","L","L","L","L","L","L","L","L","L","L","L","L","L","L","L","L","L","L","L","L","L","L","L","L","L","L","L","L","L","L","L","L","L","L","L","L","L","L","L","L","L","L","L","L","L","L","L","L","L","L","L","L","L","L","L","L","L","L","L","L","L","L","L","L","L","L","L","L","L","L","L","L","L","L","L","L","L","L","L","L","L","L","L","L","L","L","L","L","L","L","L","L","L","L","L","L","L","L","L","L","L","L","L","L","L","L","L","L","L","L","L","L","L","L","L","L","L","L","L","L","L","L","L","L","L","L","L","L","L","L","L","L","L","L","L","L","L","L","L","L","L","L","L","L","L","L","L","L","L","L","L","L","L","L","L","L","L","L","L","L","L","L","L","L","L","L","L","L","L","L","L","L","L","L","L","L","L","L","L","L","L","L","L","L","L","L","L","L","L","L","L","L","L","L","L","L","L","L","L","L","L","L","L","L","L","L","L","L","L","L","L","L","L","L","L","L","L","L","L","L","L","L","L","L","L","L","L","L","L","L","L","L","L","L","L","L","L","L","L","L","L","L","L","L","L","L","L","L","L","L","L","L","L","L","L","L","L","L","L","L","L","L","L","L","L","L","L","L","L","L","L","L","L","L","L","L","L","L"]
[null,null,null,null,null,null,null,"L","L","L","L","L","L","L","L","L","L","L","L","L","L","L","L","L","L","L","L","L","L","L","L","L","L","L","L","L","L","L","L","L","L","L","L","L","L","L","L","L","L","L","L","L","L","L","L","L","L","L","L","L","L","L","L","L","L","L","L","L","L","L","L","L","L","L","L","L","L","L","L","L","L","L","L","L","L","L","L","L","L","L","L","L","L","L","L","L","L","L","L","L","L","L","L","L","L","L","L","L","L","L","L","L","L","L","L","L","L","L","L","L","L","L","L","L","L","L","L","L","L","L","L","L","L","L","L","L","L","L","L","L","L","L","L","L","L","L","L","L","L","L","L","L","L","L","L","L","L","L","L","L","L","L","L","L","L","L","L","L","L","L","L","L","L","L","L","L","L","L","L","L","L","L","L","L","L","L","L","L","L","L","L","L","L","L","L","L","L","L","L","L","L","L","L","L","L","L","L","L","L","L","L","L","L","L","L","L","L","L","L","L","L","L","L","L","L","L","L","L","L","L","L","L","L","L","L","L","L","L","L","L","L","L","L","L","L","L","L","L","L","L","L","L","L","L","L","L","L","L","L","L","L","L","L","L","L","L","L","L","L","L","L","L","L","L","L","L","L","L","L","L","L","L","L","L","L","L","L","L","L","L","L","L","L","L","L","L","L","L","L","L","L","L","L","L","L","L","L","L","L","L","L","L","L","L","L","L","L","L","L","L","L","L","L","L","L","L","L","L","L","L","L","L","L","L","L","L","L","L","L","L","L","L","L","L","L","L","L","L","L","L","L","L","L","L","L","L","L","L","L","L","L","L","L","L","L","L","L","L","L","L","L","L"]
[null,null,null,null,null,null,null,"L","L","L","L","L","L","L","L","L","L","L","L","L","L","L","L","L","L","L","L","L","L","L","L","L","L","L","L","L","L","L","L","L","L","L","L","L","L","L","L","L","L","L","L","L","L","L","L","L","L","L","L","L","L","L","L","L","L","L","L","L","L","L","L","L","L","L","L","L","L","L","L","L","L","L","L","L","L","L","L","L","L","L","L","L","L","L","L","L","L","L","L","L","L","L","L","L","L","L","L","L","L","L","L","L","L","L","L","L","L","L","L","L","L","L","L","L","L","L","L","L","L","L","L","L","L","L","L","L","L","L","L","L","L","L","L","L","L","L","L","L","L","L","L","L","L","L","L","L","L","L","L","L","L","L","L","L","L","L","L","L","L","L","L","L","L","L","L","L","L","L","L","L","L","L","L","L","L","L","L","L","L","L","L","L","L","L","L","L","L","L","L","L","L","L","L","L","L","L","L","L","L","L","L","L","L","L","L","L","L","L","L","L","L","L","L","L","L","L","L","L","L","L","L","L","L","L","L","L","L","L","L","L","L","L","L","L","L","L","L","L","L","L","L","L","L","L","L","L","L","L","L","L","L","L","L","L","L","L","L","L","L","L","L","L","L","L","L","L","L","L","L","L","L","L","L","L","L","L","L","L","L","L","L","L","L","L","L","L","L","L","L","L","L","L","L","L","L","L","L","L","L","L","L","L","L","L","L","L","L","L","L","L","L","L","L","L","L","L","L","L","L","L","L","L","L","L","L","L","L","L","L","L","L","L","L","L","L","L","L","L","L","L","L","L","L","L","L","L","L","L","L","L","L","L","L","L","L","L","L","L","L","L","L","L"]
[null,null,null,null,null,null,null,"L","L","L","L","L","L","L","L","L","L","L","L","L","L","L","L","L","L","L","L","L","L","L","L","L","L","L","L","L","L","L","L","L","L","L","L","L","L","L","L","L","L","L","L","L","L","L","L","L","L","L","L","L","L","L","L","L","L","L","L","L","L","L","L","L","L","L","L","L","L","L","L","L","L","L","L","L","L","L","L","L","L","L","L","L","L","L","L","L","L","L","L","L","L","L","L","L","L","L","L","L","L","L","L","L","L","L","L","L","L","L","L","L","L","L","L","L","L","L","L","L","L","L","L","L","L","L","L","L","L","L","L","L","L","L","L","L","L","L","L","L","L","L","L","L","L","L","L","L","L","L","L","L","L","L","L","L","L","L","L","L","L","L","L","L","L","L","L","L","L","L","L","L","L","L","L","L","L","L","L","L","L","L","L","L","L","L","L","L","L","L","L","L","L","L","L","L","L","L","L","L","L","L","L","L","L","L","L","L","L","L","L","L","L","L","L","L","L","L","L","L","L","L","L","L","L","L","L","L","L","L","L","L","L","L","L","L","L","L","L","L","L","L","L","L","L","L","L","L","L","L","L","L","L","L","L","L","L","L","L","L","L","L","L","L","L","L","L","L","L","L","L","L","L","L","L","L","L","L","L","L","L","L","L","L","L","L","L","L","L","L","L","L","L","L","L","L","L","L","L","L","L","L","L","L","L","L","L","L","L","L","L","L","L","L","L","L","L","L","L","L","L","L","L","L","L","L","L","L","L","L","L","L","L","L","L","L","L","L","L","L","L","L","L","L","L","L","L","L","L","L","L","L","L","L","L","L","L","L","L","L","L","L","L","L"]
[null,null,null,null,null,null,null,"L","L","L","L","L","L","L","L","L","L","L","L","L","L","L","L","L","L","L","L","L","L","L","L","L","L","L","L","L","L","L","L","L","L","L","L","L","L","L","L","L","L","L","L","L","L","L","L","L","L","L","L","L","L","L","L","L","L","L","L","L","L","L","L","L","L","L","L","L","L","L","L","L","L","L","L","L","L","L","L","L","L","L","L","L","L","L","L","L","L","L","L","L","L","L","L","L","L","L","L","L","L","L","L","L","L","L","L","L","L","L","L","L","L","L","L","L","L","L","L","L","L","L","L","L","L","L","L","L","L","L","L","L","L","L","L","L","L","L","L","L","L","L","L","L","L","L","L","L","L","L","L","L","L","L","L","L","L","L","L","L","L","L","L","L","L","L","L","L","L","L","L","L","L","L","L","L","L","L","L","L","L","L","L","L","L","L","L","L","L","L","L","L","L","L","L","L","L","L","L","L","L","L","L","L","L","L","L","L","L","L","L","L","L","L","L","L","L","L","L","L","L","L","L","L","L","L","L","L","L","L","L","L","L","L","L","L","L","L","L","L","L","L","L","L","L","L","L","L","L","L","L","L","L","L","L","L","L","L","L","L","L","L","L","L","L","L","L","L","L","L","L","L","L","L","L","L","L","L","L","L","L","L","L","L","L","L","L","L","L","L","L","L","L","L","L","L","L","L","L","L","L","L","L","L","L","L","L","L","L","L","L","L","L","L","L","L","L","L","L","L","L","L","L","L","L","L","L","L","L","L","L","L","L","L","L","L","L","L","L","L","L","L","L","L","L","L","L","L","L","L","L","L","L","L","L","L","L","L","L","L","L","L","L","L"]
[null,null,null,null,null,null,null,"L","L","L","L","L","L","L","L","L","L","L","L","L","L","L","L","L","L","L","L","L","L","L","L","L","L","L","L","L","L","L","L","L","L","L","L","L","L","L","L","L","L","L","L","L","L","L","L","L","L","L","L","L","L","L","L","L","L","L","L","L","L","L","L","L","L","L","L","L","L","L","L","L","L","L","L","L","L","L","L","L","L","L","L","L","L","L","L","L","L","L","L","L","L","L","L","L","L","L","L","L","L","L","L","L","L","L","L","L","L","L","L","L","L","L","L","L","L","L","L","L","L","L","L","L","L","L","L","L","L","L","L","L","L","L","L","L","L","L","L","L","L","L","L","L","L","L","L","L","L","L","L","L","L","L","L","L","L","L","L","L","L","L","L","L","L","L","L","L","L","L","L","L","L","L","L","L","L","L","L","L","L","L","L","L","L","L","L","L","L","L","L","L","L","L","L","L","L","L","L","L","L","L","L","L","L","L","L","L","L","L","L","L","L","L","L","L","L","L","L","L","L","L","L","L","L","L","L","L","L","L","L","L","L","L","L","L","L","L","L","L","L","L","L","L","L","L","L","L","L","L","L","L","L","L","L","L","L","L","L","L","L","L","L","L","L","L","L","L","L","L","L","L","L","L","L","L","L","L","L","L","L","L","L","L","L","L","L","L","L","L","L","L","L","L","L","L","L","L","L","L","L","L","L","L","L","L","L","L","L","L","L","L","L","L","L","L","L","L","L",{"$f":"IF(AND(LP$4>=$D41,LP$4<=$E41,$B41=\"Réservé (Confirmé)\"),\"C\",IF(AND(LP$4>=$D41,LP$4<=$E41,$B41=\"Réservé (En attente)\"),\"A\",\"L\"))","v":"L"},"L","L","L","L","L","L","L","L","L","L","L","L","L","L","L","L","L","L","L","L","L","L","L","L","L","L","L","L","L","L","L",{"$f":"IF(AND(MV$4>=$D41,MV$4<=$E41,$B41=\"Réservé (Confirmé)\"),\"C\",IF(AND(MV$4>=$D41,MV$4<=$E41,$B41=\"Réservé (En attente)\"),\"A\",\"L\"))","v":"L"},"L","L","L","L","L","L","L","L","L","L","L","L"]
[null,null,null,null,null,null,null,"L","L","L","L","L","L","L","L","L","L","L","L","L","L","L","L","L","L","L","L","L","L","L","L","L","L","L","L","L","L","L","L","L","L","L","L","L","L","L","L","L","L","L","L","L","L","L","L","L","L","L","L","L","L","L","L","L","L","L","L","L","L","L","L","L","L","L","L","L","L","L","L","L","L","L","L","L","L","L","L","L","L","L","L","L","L","L","L","L","L","L","L","L","L","L","L","L","L","L","L","L","L","L","L","L","L","L","L","L","L","L","L","L","L","L","L","L","L","L","L","L","L","L","L","L","L","L","L","L","L","L","L","L","L","L","L","L","L","L","L","L","L","L","L","L","L","L","L","L","L","L","L","L","L","L","L","L","L","L","L","L","L","L","L","L","L","L","L","L","L","L","L","L","L","L","L","L","L","L","L","L","L","L","L","L","L","L","L","L","L","L","L","L","L","L","L","L","L","L","L","L","L","L","L","L","L","L","L","L","L","L","L","L","L","L","L","L","L","L","L","L","L","L","L","L","L","L","L","L","L","L","L","L","L","L","L","L","L","L","L","L","L","L","L","L","L","L","L","L","L","L","L","L","L","L","L","L","L","L","L","L","L","L","L","L","L","L","L","L","L","L","L","L","L","L","L","L","L","L","L","L","L","L","L","L","L","L","L","L","L","L","L","L","L","L","L","L","L","L","L","L","L","L","L","L","L","L","L","L","L","L","L","L","L","L","L","L","L","L",{"$f":"IF(AND(LO$4>=$D42,LO$4<=$E42,$B42=\"Réservé (Confirmé)\"),\"C\",IF(AND(LO$4>=$D42,LO$4<=$E42,$B42=\"Réservé (En attente)\"),\"A\",\"L\"))","v":"L"},"L","L","L","L","L","L","L","L","L","L","L","L","L","L","L","L","L","L","L","L","L","L","L","L","L","L","L","L","L","L","L","L","L","L","L","L","L","L","L","L","L","L","L","L","L"]
[null,null,null,null,null,null,null,"L","L","L","L","L","L","L","L","L","L","L","L","L","L","L","L","L","L","L","L","L","L","L","L","L","L","L","L","L","L","L","L","L","L","L","L","L","L","L","L","L","L","L","L","L","L","L","L","L","L","L","L","L","L","L","L","L","L","L","L","L","L",{"$f":"IF(AND(BR$4>=$D43,BR$4<=$E43,$B43=\"Réservé (Confirmé)\"),\"C\",IF(AND(BR$4>=$D43,BR$4<=$E43,$B43=\"Réservé (En attente)\"),\"A\",\"L\"))","v":"L"},"L","L","L","L","L","L","L","L","L","L","L","L","L","L","L","L","L","L","L","L","L","L","L","L","L","L","L","L","L","L","L","L","L","L","L","L","L","L","L","L","L","L","L","L","L","L","L",{"$f":"IF(AND(DN$4>=$D43,DN$4<=$E43,$B43=\"Réservé (Confirmé)\"),\"C\",IF(AND(DN$4>=$D43,DN$4<=$E43,$B43=\"Réservé (En attente)\"),\"A\",\"L\"))","v":"L"},"L","L","L","L","L","L","L","L","L","L","L","L","L","L","L","L","L","L","L","L","L","L","L","L","L","L","L","L","L","L","L","L","L","L","L","L","L","L","L","L","L","L","L","L","L","L",{"$f":"IF(AND(FI$4>=$D43,FI$4<=$E43,$B43=\"Réservé (Confirmé)\"),\"C\",IF(AND(FI$4>=$D43,FI$4<=$E43,$B43=\"Réservé (En attente)\"),\"A\",\"L\"))","v":"L"},"L","L","L","L","L","L","L","L","L","L","L","L","L","L","L","L","L","L","L","L","L","L","L","L","L","L","L","L","L","L","L","L",{"$f":"IF(AND(GP$4>=$D43,GP$4<=$E43,$B43=\"Réservé (Confirmé)\"),\"C\",IF(AND(GP$4>=$D43,GP$4<=$E43,$B43=\"Réservé (En attente)\"),\"A\",\"L\"))","v":"L"},"L","L","L","L","L","L","L","L","L","L","L","L","L","L","L","L","L","L","L","L","L","L","L","L","L","L","L","L","L","L","L","L","L","L","L","L","L","L","L","L","L","L","L","L","L","L","L","L","L","L","L","L","L","L","L","L","L","L","L","L","L","L","L",{"$f":"IF(AND(JB$4>=$D43,JB$4<=$E43,$B43=\"Réservé (Confirmé)\"),\"C\",IF(AND(JB$4>=$D43,JB$4<=$E43,$B43=\"Réservé (En attente)\"),\"A\",\"L\"))","v":"L"},"L","L","L","L","L","L","L","L","L","L","L","L","L","L","L","L","L","L","L","L","L","L","L","L","L","L","L","L","L","L","L","L","L","L","L","L","L","L","L","L","L","L","L","L","L","L","L","L","L","L","L","L","L","L","L","L","L","L","L","L","L","L","L",{"$f":"IF(AND(LN$4>=$D43,LN$4<=$E43,$B43=\"Réservé (Confirmé)\"),\"C\",IF(AND(LN$4>=$D43,LN$4<=$E43,$B43=\"Réservé (En attente)\"),\"A\",\"L\"))","v":"L"},"L","L","L","L","L","L","L","L","L","L","L","L","L","L","L","L","L","L",{"$f":"IF(AND(MG$4>=$D43,MG$4<=$E43,$B43=\"Réservé (Confirmé)\"),\"C\",IF(AND(MG$4>=$D43,MG$4<=$E43,$B43=\"Réservé (En attente)\"),\"A\",\"L\"))","v":"L"},"L","L","L","L","L","L","L","L","L","L","L","L","L","L","L","L","L","L","L","L","L","L","L","L","L","L","L"]
[null,null,null,null,null,null,null,"L","L","L","L","L","L","L","L","L","L","L","L","L","L","L",{"$f":"IF(AND(W$4>=$D44,W$4<=$E44,$B44=\"Réservé (Confirmé)\"),\"C\",IF(AND(W$4>=$D44,W$4<=$E44,$B44=\"Réservé (En attente)\"),\"A\",\"L\"))","v":"L"},"L","L","L","L","L","L","L","L","L","L","L","L","L","L","L","L","L","L","L","L","L","L","L","L","L","L","L","L","L","L","L",{"$f":"IF(AND(BC$4>=$D44,BC$4<=$E44,$B44=\"Réservé (Confirmé)\"),\"C\",IF(AND(BC$4>=$D44,BC$4<=$E44,$B44=\"Réservé (En attente)\"),\"A\",\"L\"))","v":"L"},"L","L","L","L","L","L","L","L","L","L","L","L","L","L","L","L","L","L","L","L","L","L","L","L","L","L","L","L","L","L","L","L","L","L","L","L","L","L","L","L","L","L","L","L","L","L","L","L","L","L","L","L","L","L","L","L","L","L","L","L",{"$f":"IF(AND(DL$4>=$D44,DL$4<=$E44,$B44=\"Réservé (Confirmé)\"),\"C\",IF(AND(DL$4>=$D44,DL$4<=$E44,$B44=\"Réservé (En attente)\"),\"A\",\"L\"))","v":"L"},"L","L","L","L","L","L","L","L","L","L","L","L","L","L","L","L","L","L","L","L","L","L","L","L","L","L","L","L","L","L","L","L","L",{"$f":"IF(AND(ET$4>=$D44,ET$4<=$E44,$B44=\"Réservé (Confirmé)\"),\"C\",IF(AND(ET$4>=$D44,ET$4<=$E44,$B44=\"Réservé (En attente)\"),\"A\",\"L\"))","v":"L"},"L","L","L","L","L","L","L","L","L","L","L","L","L","L","L","L","L","L","L","L","L","L","L","L","L","L","L","L","L","L","L","L","L","L","L","L","L","L","L","L","L","L","L","L","L","L",{"$f":"IF(AND(GO$4>=$D44,GO$4<=$E44,$B44=\"Réservé (Confirmé)\"),\"C\",IF(AND(GO$4>=$D44,GO$4<=$E44,$B44=\"Réservé (En attente)\"),\"A\",\"L\"))","v":"L"},"L","L","L","L","L","L","L","L","L","L","L","L","L","L","L","L","L","L","L","L","L","L","L","L","L","L","L","L","L","L","L","L","L","L","L","L","L","L","L","L","L","L","L","L","L","L","L","L","L","L","L","L","L","L","L","L","L","L","L","L","L","L","L",{"$f":"IF(AND(JA$4>=$D44,JA$4<=$E44,$B44=\"Réservé (Confirmé)\"),\"C\",IF(AND(JA$4>=$D44,JA$4<=$E44,$B44=\"Réservé (En attente)\"),\"A\",\"L\"))","v":"L"},"L","L","L","L","L","L","L","L","L","L","L","L","L","L","L","L","L","L","L","L","L","L","L","L","L","L","L","L","L","L","L","L","L","L","L","L","L","L","L","L","L","L","L","L","L","L","L","L","L","L","L","L","L","L","L","L","L","L","L","L","L","L","L",{"$f":"IF(AND(LM$4>=$D44,LM$4<=$E44,$B44=\"Réservé (Confirmé)\"),\"C\",IF(AND(LM$4>=$D44,LM$4<=$E44,$B44=\"Réservé (En attente)\"),\"A\",\"L\"))","v":"L"},"L","L","L","L","L","L","L","L","L","L","L","L","L","L","L","L","L","L",{"$f":"IF(AND(MF$4>=$D44,MF$4<=$E44,$B44=\"Réservé (Confirmé)\"),\"C\",IF(AND(MF$4>=$D44,MF$4<=$E44,$B44=\"Réservé (En attente)\"),\"A\",\"L\"))","v":"L"},"L","L","L","L","L","L","L","L","L","L","L","L","L","L","L","L","L","L","L","L","L","L","L","L","L","L","L","L"]
[null,null,null,null,null,null,null,{"$f":"IF(AND(H$4>=$D45,H$4<=$E45,$B45=\"Réservé (Confirmé)\"),\"C\",IF(AND(H$4>=$D45,H$4<=$E45,$B45=\"Réservé (En attente)\"),\"A\",\"L\"))","v":"L"},"L","L","L","L","L","L","L","L","L","L","L","L","L","L","L","L","L","L","L","L","L","L","L","L","L","L","L","L","L","L","L","L","L","L","L","L","L","L","L","L","L","L","L","L","L","L","L","L","L","L","L","L","L","L","L","L","L","L","L","L","L","L","L","L","L","L","L","L","L","L","L","L","L","L","L","L","L","L","L","L","L","L","L","L","L","L","L","L","L","L","L","L",{"$f":"IF(AND(CW$4>=$D45,CW$4<=$E45,$B45=\"Réservé (Confirmé)\"),\"C\",IF(AND(CW$4>=$D45,CW$4<=$E45,$B45=\"Réservé (En attente)\"),\"A\",\"L\"))","v":"L"},"L","L","L","L","L","L","L","L","L","L","L","L","L","L","L","L","L","L","L","L","L","L","L","L","L","L","L","L","L","L","L","L","L","L","L","L","L","L","L","L","L","L","L","L","L",{"$f":"IF(AND(EQ$4>=$D45,EQ$4<=$E45,$B45=\"Réservé (Confirmé)\"),\"C\",IF(AND(EQ$4>=$D45,EQ$4<=$E45,$B45=\"Réservé (En attente)\"),\"A\",\"L\"))","v":"L"},"L","L","L","L","L","L","L","L","L","L","L","L","L","L","L","L","L","L","L","L","L","L","L","L","L","L","L","L","L","L","L","L","L","L","L",{"$f":"IF(AND(GA$4>=$D45,GA$4<=$E45,$B45=\"Réservé (Confirmé)\"),\"C\",IF(AND(GA$4>=$D45,GA$4<=$E45,$B45=\"Réservé (En attente)\"),\"A\",\"L\"))","v":"L"},"L","L","L","L","L","L","L","L","L","L","L","L","L","L","L","L","L","L","L","L",{"$f":"IF(AND(GV$4>=$D45,GV$4<=$E45,$B45=\"Réservé (Confirmé)\"),\"C\",IF(AND(GV$4>=$D45,GV$4<=$E45,$B45=\"Réservé (En attente)\"),\"A\",\"L\"))","v":"L"},"L","L","L","L","L","L","L","L","L","L","L","L","L","L","L","L","L","L","L","L","L","L","L","L","L","L","L","L","L","L","L","L","L","L","L","L","L","L","L","L","L","L",{"$f":"IF(AND(IM$4>=$D45,IM$4<=$E45,$B45=\"Réservé (Confirmé)\"),\"C\",IF(AND(IM$4>=$D45,IM$4<=$E45,$B45=\"Réservé (En attente)\"),\"A\",\"L\"))","v":"L"},"L","L","L","L","L","L","L","L","L","L","L","L","L","L","L","L","L","L","L","L",{"$f":"IF(AND(JH$4>=$D45,JH$4<=$E45,$B45=\"Réservé (Confirmé)\"),\"C\",IF(AND(JH$4>=$D45,JH$4<=$E45,$B45=\"Réservé (En attente)\"),\"A\",\"L\"))","v":"L"},"L","L","L","L","L","L","L","L","L","L","L","L","L","L","L","L","L","L","L","L","L","L","L","L","L","L","L","L","L","L","L","L","L","L","L","L","L","L","L","L","L","L",{"$f":"IF(AND(KY$4>=$D45,KY$4<=$E45,$B45=\"Réservé (Confirmé)\"),\"C\",IF(AND(KY$4>=$D45,KY$4<=$E45,$B45=\"Réservé (En attente)\"),\"A\",\"L\"))","v":"L"},"L","L","L","L","L","L","L","L","L","L","L","L","L","L","L","L","L","L","L","L","L","L","L","L","L","L","L","L","L","L","L","L","L","L","L","L","L","L","L","L","L","L","L","L","L","L","L","L","L","L","L","L","L","L","L","L","L","L","L","L","L"]
[null,null,null,null,null,null,null,"L","L","L","L","L","L","L","L","L","L","L","L","L","L","L","L","L","L","L","L","L","L","L","L","L","L","L","L","L","L","L","L","L","L","L","L","L","L","L","L","L","L","L","L","L","L","L","L","L","L","L","L","L","L","L","L","L","L","L","L","L","L","L","L","L","L","L",{"$f":"IF(AND(BW$4>=$D46,BW$4<=$E46,$B46=\"Réservé (Confirmé)\"),\"C\",IF(AND(BW$4>=$D46,BW$4<=$E46,$B46=\"Réservé (En attente)\"),\"A\",\"L\"))","v":"L"},"L","L","L","L","L","L","L","L","L","L","L","L","L","L","L","L","L","L","L","L","L","L","L","L","L","L","L","L","L","L","L","L","L","L","L","L","L","L","L","L","L","L","L","L","L","L","L","L","L","L","L","L","L","L","L","L","L","L","L",{"$f":"IF(AND(EE$4>=$D46,EE$4<=$E46,$B46=\"Réservé (Confirmé)\"),\"C\",IF(AND(EE$4>=$D46,EE$4<=$E46,$B46=\"Réservé (En attente)\"),\"A\",\"L\"))","v":"L"},"L","L","L","L","L","L","L","L","L","L","L","L","L","L","L","L","L","L","L","L","L","L","L","L","L","L","L","L","L","L","L","L","L","L","L","L","L","L","L","L","L","L","L","L","L","L","L","L","L","L","L","L","L","L","L","L","L","L","L","L","L","L","L","L","L","L","L","L","L","L","L","L","L","L","L","L","L","L","L","L","L","L","L","L","L","L","L","L","L","L","L","L","L","L","L","L","L","L","L","L","L","L","L","L","L","L","L","L","L","L","L","L","L","L","L","L","L","L","L","L","L","L","L","L","L","L","L","L","L","L","L","L","L","L","L","L","L","L","L","L","L","L","L","L","L","L","L","L","L","L","L","L","L","L","L","L","L","L","L","L","L","L","L","L","L","L","L","L","L","L","L","L","L","L","L","L","L","L","L","L","L","L","L","L","L","L","L","L","L","L","L","L","L","L","L","L","L","L","L","L","L","L","L","L","L","L","L","L","L","L","L","L","L","L","L","L","L","L","L","L","L","L","L","L","L","L","L","L","L","L","L","L","L","L","L","L","L"]
[null,null,null,null,null,null,null,"L","L","L","L","L","L","L","L","L","L","L","L","L","L","L","L","L","L","L","L","L","L","L","L","L","L","L","L","L","L","L","L","L","L","L",{"$f":"IF(AND(AQ$4>=$D47,AQ$4<=$E47,$B47=\"Réservé (Confirmé)\"),\"C\",IF(AND(AQ$4>=$D47,AQ$4<=$E47,$B47=\"Réservé (En attente)\"),\"A\",\"L\"))","v":"L"},"L","L","L","L","L","L","L","L","L","L","L","L","L","L","L","L","L","L","L","L","L","L","L","L","L","L","L","L","L","L","L","L","L","L","L","L","L","L","L","L","L","L","L","L","L","L","L","L","L","L","L","L","L","L","L","L","L","L","L","L","L","L","L","L","L","L","L","L","L","L","L","L","L","L","L","L","L","L","L","L","L","L","L","L","L","L","L","L","L","L","L","L","L","L","L","L","L","L","L","L","L","L","L","L","L","L","L","L","L","L","L","L","L","L","L","L","L","L","L","L","L","L","L","L","L","L","L","L","L","L","L","L","L","L","L","L","L","L","L","L","L","L","L","L","L","L","L","L","L","L","L","L","L","L","L","L","L","L","L","L","L","L","L","L","L","L","L","L","L","L","L","L","L","L","L","L","L","L","L","L","L","L","L","L","L","L","L","L","L","L","L","L","L","L","L","L","L","L","L","L","L","L","L","L","L","L","L","L","L","L","L","L","L","L","L","L","L","L","L","L","L","L","L","L","L","L","L","L","L","L","L","L","L","L","L","L","L","L","L","L","L","L","L","L","L","L","L","L","L","L","L","L","L","L","L","L","L","L","L","L","L","L","L","L","L","L","L","L","L","L","L","L","L","L","L","L","L","L","L","L","L","L","L","L","L","L","L","L","L","L","L","L","L","L","L","L","L","L","L","L","L","L","L","L","L","L","L","L","L","L","L","L","L","L","L","L","L","L","L","L","L","L","L","L","L","L","L","L","L"]
[null,null,null,null,null,null,null,"L","L","L","L","L","L","L","L","L","L","L","L","L","L","L","L","L","L","L","L","L","L","L","L","L","L","L","L","L","L","L",{"$f":"IF(AND(AM$4>=$D48,AM$4<=$E48,$B48=\"Réservé (Confirmé)\"),\"C\",IF(AND(AM$4>=$D48,AM$4<=$E48,$B48=\"Réservé (En attente)\"),\"A\",\"L\"))","v":"L"},"L","L","L","L","L","L","L","L","L","L","L","L","L","L","L","L","L","L","L","L","L","L","L","L","L","L","L","L","L","L","L","L","L","L","L","L","L","L","L","L","L","L","L","L","L","L","L","L","L","L","L","L","L","L","L","L","L","L","L","L","L","L","L","L","L","L","L","L","L","L","L","L","L","L","L","L","L","L","L","L","L","L","L","L","L","L","L","L","L","L","L","L","L","L","L","L","L","L","L","L","L","L","L","L","L","L","L","L","L","L","L","L","L","L","L","L","L","L","L","L","L","L","L","L","L","L","L","L","L","L","L","L","L","L","L","L","L","L","L","L","L","L","L","L","L","L","L","L","L","L","L","L","L","L","L","L","L","L","L","L","L","L","L","L","L","L","L","L","L","L","L","L","L","L","L","L","L","L","L","L","L","L","L","L","L","L","L",{"$f":"IF(AND(HS$4>=$D48,HS$4<=$E48,$B48=\"Réservé (Confirmé)\"),\"C\",IF(AND(HS$4>=$D48,HS$4<=$E48,$B48=\"Réservé (En attente)\"),\"A\",\"L\"))","v":"L"},"L","L","L","L","L","L","L","L","L","L","L","L","L","L","L","L","L","L","L","L","L","L","L","L","L","L","L","L","L","L","L","L","L","L","L","L","L","L","L","L","L","L","L","L","L","L","L","L","L","L","L","L","L","L","L","L","L","L","L","L","L","L","L",{"$f":"IF(AND(KE$4>=$D48,KE$4<=$E48,$B48=\"Réservé (Confirmé)\"),\"C\",IF(AND(KE$4>=$D48,KE$4<=$E48,$B48=\"Réservé (En attente)\"),\"A\",\"L\"))","v":"L"},"L","L","L","L","L","L","L","L","L","L","L","L","L","L","L","L","L","L","L","L","L","L","L","L","L","L","L","L","L","L","L","L","L","L","L","L","L","L","L","L","L","L","L","L","L","L","L","L","L","L","L","L","L","L","L","L","L","L","L","L","L","L","L","L","L","L","L","L","L","L","L","L","L","L","L","L","L","L","L","L","L"]
[null,null,null,null,null,null,null,"L","L","L","L","L","L","L","L","L","L","L","L","L","L","L","L","L","L","L","L","L","L","L","L","L","L","L","L","L","L","L","L","L","L","L","L","L","L","L","L","L","L","L","L","L","L","L","L","L","L","L","L","L","L","L","L","L","L","L","L","L","L","L","L","L","L","L","L","L","L","L","L","L","L","L","L","L","L","L","L","L","L","L","L",{"$f":"IF(AND(CN$4>=$D49,CN$4<=$E49,$B49=\"Réservé (Confirmé)\"),\"C\",IF(AND(CN$4>=$D49,CN$4<=$E49,$B49=\"Réservé (En attente)\"),\"A\",\"L\"))","v":"L"},"L","L","L","L","L","L","L","L","L","L","L","L","L","L","L","L","L","L","L","L","L","L","L","L","L","L","L","L","L","L","L","L","L","L","L","L","L","L","L","L","L","L","L","L","L","L","L","L","L","L","L","L","L","L","L","L","L","L","L","L","L","L","L","L","L","L","L","L","L","L","L","L","L","L","L","L","L","L","L","L","L","L","L","L","L","L","L","L","L","L","L","L","L","L","L","L","L","L","L","L","L","L","L","L","L","L","L","L","L","L","L","L","L","L","L","L","L","L","L","L","L","L","L","L","L","L","L",{"$f":"IF(AND(HL$4>=$D49,HL$4<=$E49,$B49=\"Réservé (Confirmé)\"),\"C\",IF(AND(HL$4>=$D49,HL$4<=$E49,$B49=\"Réservé (En attente)\"),\"A\",\"L\"))","v":"L"},"L","L","L","L","L","L","L","L","L","L","L","L","L","L","L","L","L","L","L","L","L","L","L","L","L","L","L","L","L","L","L","L","L","L","L","L","L","L","L","L","L","L","L","L","L","L","L","L","L","L","L","L","L","L","L","L","L","L","L","L","L","L","L",{"$f":"IF(AND(JX$4>=$D49,JX$4<=$E49,$B49=\"Réservé (Confirmé)\"),\"C\",IF(AND(JX$4>=$D49,JX$4<=$E49,$B49=\"Réservé (En attente)\"),\"A\",\"L\"))","v":"L"},"L","L","L","L","L","L","L","L","L","L","L","L","L","L","L","L","L","L","L","L","L","L","L","L","L","L","L","L","L","L","L","L","L","L","L","L","L","L","L","L","L","L","L","L","L","L","L","L","L","L","L","L","L","L","L","L","L","L","L","L","L","L","L","L","L","L","L","L","L","L","L","L","L","L","L","L","L","L","L","L","L","L","L","L","L","L","L","L"]
[null,null,null,null,null,null,null,"L","L","L","L","L","L","L","L","L","L","L","L","L","L","L","L","L","L","L","L","L","L","L","L","L","L","L","L","L","L","L","L","L","L","L","L","L","L","L","L","L","L","L","L","L","L","L","L","L","L","L","L","L","L","L","L","L","L","L","L","L","L","L","L","L","L","L","L","L","L","L","L","L","L","L","L","L","L","L","L","L","L","L",{"$f":"IF(AND(CM$4>=$D50,CM$4<=$E50,$B50=\"Réservé (Confirmé)\"),\"C\",IF(AND(CM$4>=$D50,CM$4<=$E50,$B50=\"Réservé (En attente)\"),\"A\",\"L\"))","v":"L"},"L","L","L","L","L","L","L","L","L","L","L","L","L","L","L","L","L","L","L","L","L","L","L","L","L","L","L","L","L","L","L","L","L","L","L","L","L","L","L","L","L","L","L","L","L","L","L","L","L","L","L","L","L","L","L","L","L","L","L","L","L","L","L","L","L","L","L","L","L","L","L","L","L","L","L","L","L","L","L","L","L","L","L","L","L","L","L","L","L","L","L","L","L","L","L","L","L","L","L","L","L","L","L","L","L","L","L","L","L","L","L","L","L","L","L","L","L","L","L","L","L","L","L","L","L","L","L","L","L","L","L","L","L","L","L","L","L","L","L","L","L","L","L","L","L","L","L","L","L","L","L","L","L","L","L","L","L","L","L","L","L","L","L","L","L","L","L","L","L","L","L","L","L","L","L","L","L","L","L","L","L","L","L","L","L","L","L","L","L","L","L","L","L","L","L","L","L","L","L","L","L","L","L","L","L","L","L","L","L","L","L","L","L","L","L","L","L","L","L","L","L","L","L","L","L","L","L","L","L","L","L","L","L","L","L","L","L","L","L","L","L","L","L","L","L","L","L","L","L","L","L","L","L","L","L","L","L","L","L","L","L","L","L","L","L","L","L","L","L","L","L","L","L","L","L","L","L","L","L","L","L"]
[null,null,null,null,null,null,null,"L","L","L","L","L","L","L","L","L","L","L","L","L","L","L","L","L","L","L","L","L","L","L","L","L","L","L","L","L","L","L","L","L","L","L","L","L","L","L","L","L","L","L","L","L","L","L","L","L","L","L","L","L","L","L","L","L","L","L","L","L","L","L","L","L","L","L","L","L","L","L","L","L","L","L","L","L","L","L","L","L","L","L","L","L","L","L","L","L","L","L","L","L","L","L","L","L","L","L","L","L","L","L","L","L","L","L","L","L","L","L","L","L","L","L","L","L","L","L","L","L","L","L","L","L","L","L","L","L","L","L","L","L","L","L","L","L","L","L","L","L","L","L","L","L","L","L","L","L","L","L","L","L","L","L","L","L","L","L","L","L","L","L","L","L","L","L","L","L","L","L","L","L","L","L","L","L","L","L","L","L","L","L","L","L","L","L","L","L","L","L","L","L","L","L","L","L","L","L","L","L","L","L","L","L","L","L","L","L","L","L","L","L","L","L","L","L","L","L","L","L","L","L","L","L","L","L","L","L","L","L","L","L","L","L","L","L","L","L","L","L","L","L","L","L","L","L","L","L","L","L","L","L","L","L","L","L","L","L","L","L","L","L","L","L","L","L","L","L","L","L","L","L","L","L","L","L","L","L","L","L","L","L","L","L","L","L","L","L","L","L","L","L","L","L","L","L","L","L","L","L","L","L","L","L","L","L","L","L","L","L","L","L","L","L","L","L","L","L","L","L","L","L","L","L","L","L","L","L","L","L","L","L","L","L","L","L","L","L","L","L","L","L","L","L","L","L","L","L","L","L","L","L","L","L","L","L","L","L","L","L","L","L","L","L"]
[null,null,null,null,null,null,null,"L","L","L","L","L","L","L","L","L","L","L","L","L","L","L","L","L","L","L","L","L","L","L","L","L","L","L","L","L","L","L","L","L","L","L","L","L","L","L","L","L","L","L","L","L","L","L","L","L","L","L","L","L","L","L","L","L","L","L","L","L","L","L","L","L","L","L","L","L","L","L","L","L","L","L","L","L","L","L","L","L","L","L","L","L","L","L","L","L","L","L","L","L","L","L","L","L","L","L","L","L","L","L","L","L","L","L","L","L","L","L","L","L","L","L","L","L","L","L","L","L","L","L","L","L","L","L","L","L","L","L","L","L","L","L","L","L","L","L","L","L","L","L","L","L","L","L","L","L","L","L","L","L","L","L","L","L","L","L","L","L","L","L","L","L","L","L","L","L","L","L","L","L","L","L","L","L","L","L","L","L","L","L","L","L","L","L","L","L","L","L","L","L","L","L","L","L","L","L","L","L","L","L","L","L","L","L","L","L","L","L","L","L","L","L","L","L","L","L","L","L","L","L","L","L","L","L","L","L","L","L","L","L","L","L","L","L","L","L","L","L","L","L","L","L","L","L","L","L","L","L","L","L","L","L","L","L","L","L","L","L","L","L","L","L","L","L","L","L","L","L","L","L","L","L","L","L","L","L","L","L","L","L","L","L","L","L","L","L","L","L","L","L","L","L","L","L","L","L","L","L","L","L","L","L","L","L","L","L","L","L","L","L","L","L","L","L","L","L","L","L","L","L","L","L","L","L","L","L","L","L","L","L","L","L","L","L","L","L","L","L","L","L","L","L","L","L","L","L","L","L","L","L","L","L","L","L","L","L","L","L","L","L","L","L"]
[null,null,null,null,null,null,null,"L","L","L","L","L","L","L","L","L","L","L","L","L","L","L","L","L","L","L","L","L","L","L","L","L","L","L","L","L","L","L","L","L","L","L","L","L","L","L","L","L","L","L","L","L","L","L","L","L","L","L","L","L","L","L","L","L","L","L","L","L","L","L","L","L","L","L","L","L","L","L","L","L","L","L","L","L","L","L","L","L","L","L","L","L","L","L","L","L","L","L","L","L","L","L","L","L","L","L","L","L","L","L","L","L","L","L","L","L","L","L","L","L","L","L","L","L","L","L","L","L","L","L","L","L","L","L","L","L","L","L","L","L","L","L","L","L","L","L","L","L","L","L","L","L","L","L","L","L","L","L","L","L","L","L","L","L","L","L","L","L","L","L","L","L","L","L","L","L","L","L","L","L","L","L","L","L","L","L","L","L","L","L","L","L","L","L","L","L","L","L","L","L","L","L","L","L","L","L","L","L","L","L","L","L","L","L","L","L","L","L","L","L","L","L","L","L","L","L","L","L","L","L","L","L","L","L","L","L","L","L","L","L","L","L","L","L","L","L","L","L","L","L","L","L","L","L","L","L","L","L","L","L","L","L","L","L","L","L","L","L","L","L","L","L","L","L","L","L","L","L","L","L","L","L","L","L","L","L","L","L","L","L","L","L","L","L","L","L","L","L","L","L","L","L","L","L","L","L","L","L","L","L","L","L","L","L","L","L","L","L","L","L","L","L","L","L","L","L","L","L","L","L","L","L","L","L","L","L","L","L","L","L","L","L","L","L","L","L","L","L","L","L","L","L","L","L","L","L","L","L","L","L","L","L","L","L","L","L","L","L","L","L","L","L"]
[null,null,null,null,null,null,null,"L","L","L","L","L","L","L","L","L","L","L","L","L","L","L","L","L","L","L","L","L","L","L","L","L","L","L","L","L","L","L","L","L","L","L","L","L","L","L","L","L","L","L","L","L","L","L","L","L","L","L","L","L","L","L","L","L","L","L","L","L","L","L","L","L","L","L","L","L","L","L","L","L","L","L","L","L","L","L","L","L","L","L","L","L","L","L","L","L","L","L","L","L","L","L","L","L","L","L","L","L","L","L","L","L","L","L","L","L","L","L","L","L","L","L","L","L","L","L","L","L","L","L","L","L","L","L","L","L","L","L","L","L","L","L","L","L","L","L","L","L","L","L","L","L","L","L","L","L","L","L","L","L","L","L","L","L","L","L","L","L","L","L","L","L","L","L","L","L","L","L","L","L","L","L","L","L","L","L","L","L","L","L","L","L","L","L","L","L","L","L","L","L","L","L","L","L","L","L","L","L","L","L","L","L","L","L","L","L","L","L","L","L","L","L","L","L","L","L","L","L","L","L","L","L","L","L","L","L","L","L","L","L","L","L","L","L","L","L","L","L","L","L","L","L","L","L","L","L","L","L","L","L","L","L","L","L","L","L","L","L","L","L","L","L","L","L","L","L","L","L","L","L","L","L","L","L","L","L","L","L","L","L","L","L","L","L","L","L","L","L","L","L","L","L","L","L","L","L","L","L","L","L","L","L","L","L","L","L","L","L","L","L","L","L","L","L","L","L","L","L","L","L","L","L","L","L","L","L","L","L","L","L","L","L","L","L","L","L","L","L","L","L","L","L","L","L","L","L","L","L","L","L","L","L","L","L","L","L","L","L","L","L","L","L"]
[null,null,null,null,null,null,null,"L","L","L","L","L","L","L","L","L","L","L","L","L","L","L","L","L","L","L","L","L","L","L","L","L","L","L","L","L","L","L","L","L","L","L","L","L","L","L","L","L","L","L","L","L","L","L","L","L","L","L","L","L","L","L","L","L","L","L","L","L","L","L","L","L","L","L","L","L","L","L","L","L","L","L","L","L","L","L","L","L","L","L","L","L","L","L","L","L","L","L","L","L","L","L","L","L","L","L","L","L","L","L","L","L","L","L","L","L","L","L","L","L","L","L","L","L","L","L","L","L","L","L","L","L","L","L","L","L","L","L","L","L","L","L","L","L","L","L","L","L","L","L","L","L","L","L","L","L","L","L","L","L","L","L","L","L","L","L","L","L","L","L","L","L","L","L","L","L","L","L","L","L","L","L","L","L","L","L","L","L","L","L","L","L","L","L","L","L","L","L","L","L","L","L","L","L","L","L","L","L","L","L","L","L","L","L","L","L","L","L","L","L","L","L","L","L","L","L","L","L","L","L","L","L","L","L","L","L","L","L","L","L","L","L","L","L","L","L","L","L","L","L","L","L","L","L","L","L","L","L","L","L","L","L","L","L","L","L","L","L","L","L","L","L","L","L","L","L","L","L","L","L","L","L","L","L","L","L","L","L","L","L","L","L","L","L","L","L","L","L","L","L","L","L","L","L","L","L","L","L","L","L","L","L","L","L","L","L","L","L","L","L","L","L","L","L","L","L","L","L","L","L","L","L","L","L","L","L","L","L","L","L","L","L","L","L","L","L","L","L","L","L","L","L","L","L","L","L","L","L","L","L","L","L","L","L","L","L","L","L","L","L","L","L"]
[null,null,null,null,null,null,null,"L","L","L","L","L","L","L","L","L","L","L","L","L","L","L","L","L","L","L","L","L","L","L","L","L","L","L","L","L","L","L","L","L","L","L","L","L","L","L","L","L","L","L","L","L","L","L","L","L","L","L","L","L","L","L","L","L","L","L","L","L","L","L","L","L","L","L","L","L","L","L","L","L","L","L","L","L","L","L","L","L","L","L","L","L","L","L","L","L","L","L","L","L","L","L","L","L","L","L","L","L","L","L","L","L","L","L","L","L","L","L","L","L","L","L","L","L","L","L","L","L","L","L","L","L","L","L","L","L","L","L","L","L","L","L","L","L","L","L","L","L","L","L","L","L","L","L","L","L","L","L","L","L","L","L","L","L","L","L","L","L","L","L","L","L","L","L","L","L","L","L","L","L","L","L","L","L","L","L","L","L","L","L","L","L","L","L","L","L","L","L","L","L","L","L","L","L","L","L","L","L","L","L","L","L","L","L","L","L","L","L","L","L","L","L","L","L","L","L","L","L","L","L","L","L","L","L","L","L","L","L","L","L","L","L","L","L","L","L","L","L","L","L","L","L","L","L","L","L","L","L","L","L","L","L","L","L","L","L","L","L","L","L","L","L","L","L","L","L","L","L","L","L","L","L","L","L","L","L","L","L","L","L","L","L","L","L","L","L","L","L","L","L","L","L","L","L","L","L","L","L","L","L","L","L","L","L","L","L","L","L","L","L","L","L","L","L","L","L","L","L","L","L","L","L","L","L","L","L","L","L","L","L","L","L","L","L","L","L","L","L","L","L","L","L","L","L","L","L","L","L","L","L","L","L","L","L","L","L","L","L","L","L","L","L"]
[null,null,null,null,null,null,null,"L","L","L","L","L","L","L","L","L","L","L","L","L","L","L","L","L","L","L","L","L","L","L","L","L","L","L","L","L","L","L","L","L","L","L","L","L","L","L","L","L","L","L","L","L","L","L","L","L","L","L","L","L","L","L","L","L","L","L","L","L","L","L","L","L","L","L","L","L","L","L","L","L","L","L","L","L","L","L","L","L","L","L","L","L","L","L","L","L","L","L","L","L","L","L","L","L","L","L","L","L","L","L","L","L","L","L","L","L","L","L","L","L","L","L","L","L","L","L","L","L","L","L","L","L","L","L","L","L","L","L","L","L","L","L","L","L","L","L","L","L","L","L","L","L","L","L","L","L","L","L","L","L","L","L","L","L","L","L","L","L","L","L","L","L","L","L","L","L","L","L","L","L","L","L","L","L","L","L","L","L","L","L","L","L","L","L","L","L","L","L","L","L","L","L","L","L","L","L","L","L","L","L","L","L","L","L","L","L","L","L","L","L","L","L","L","L","L","L","L","L","L","L","L","L","L","L","L","L","L","L","L","L","L","L","L","L","L","L","L","L","L","L","L","L","L","L","L","L","L","L","L","L","L","L","L","L","L","L","L","L","L","L","L","L","L","L","L","L","L","L","L","L","L","L","L","L","L","L","L","L","L","L","L","L","L","L","L","L","L","L","L","L","L","L","L","L","L","L","L","L","L","L","L","L","L","L","L","L","L","L","L","L","L","L","L","L","L","L","L","L","L","L","L","L","L","L","L","L","L","L","L","L","L","L",{"$f":"IF(AND(ME$4>=$D57,ME$4<=$E57,$B57=\"Réservé (Confirmé)\"),\"C\",IF(AND(ME$4>=$D57,ME$4<=$E57,$B57=\"Réservé (En attente)\"),\"A\",\"L\"))","v":"L"},"L","L","L","L","L","L","L","L","L","L","L","L","L","L","L","L","L","L","L","L","L","L","L","L","L","L","L","L","L"]
[null,null,null,null,null,null,null,"L","L","L","L","L","L","L","L","L","L","L","L","L","L","L","L","L","L","L","L","L","L","L","L","L","L","L","L","L","L","L","L","L","L","L","L","L","L","L","L","L","L","L","L","L","L","L","L","L","L","L","L","L","L","L","L","L","L","L","L","L","L","L","L","L","L","L","L","L","L","L","L","L","L","L","L","L","L","L","L","L","L","L","L","L","L","L","L","L","L","L","L","L","L","L","L","L","L","L","L","L","L","L","L","L","L","L","L","L","L","L","L","L","L","L","L","L","L","L","L","L","L","L","L","L","L","L","L","L","L","L","L","L","L","L","L","L","L","L","L","L","L","L","L","L","L","L","L","L","L","L","L","L","L","L","L","L","L","L","L","L","L","L","L","L","L","L","L","L","L","L","L","L","L",{"$f":"IF(AND(FZ$4>=$D58,FZ$4<=$E58,$B58=\"Réservé (Confirmé)\"),\"C\",IF(AND(FZ$4>=$D58,FZ$4<=$E58,$B58=\"Réservé (En attente)\"),\"A\",\"L\"))","v":"L"},"L","L","L","L","L","L","L","L","L","L","L","L","L","L","L","L","L","L","L","L","L","L","L","L","L","L","L","L","L","L","L","L","L","L","L","L","L","L","L","L","L","L","L","L","L","L","L","L","L","L","L","L","L","L","L","L","L","L","L","L","L","L","L","L","L","L","L","L","L","L","L","L","L","L","L","L","L","L","L","L","L","L","L","L","L","L","L","L","L","L","L","L","L","L","L","L","L","L","L","L","L","L","L","L","L","L","L","L","L","L","L","L","L","L","L","L","L","L","L","L","L","L","L","L","L","L","L","L","L","L","L","L","L","L","L","L","L","L","L","L","L","L","L","L","L","L","L","L","L","L","L","L","L","L","L","L","L","L",{"$f":"IF(AND(MC$4>=$D58,MC$4<=$E58,$B58=\"Réservé (Confirmé)\"),\"C\",IF(AND(MC$4>=$D58,MC$4<=$E58,$B58=\"Réservé (En attente)\"),\"A\",\"L\"))","v":"L"},"L","L","L","L","L","L","L","L","L","L","L","L","L","L","L","L","L","L","L","L","L","L","L","L","L","L","L","L","L","L","L"]
[null,null,null,null,null,null,null,"L","L","L","L","L","L","L","L","L","L","L","L","L","L","L","L","L","L","L","L","L","L","L","L","L","L","L","L","L","L","L","L","L","L","L","L","L","L","L","L","L","L","L","L","L","L","L","L","L","L","L","L","L","L","L","L","L","L","L","L","L","L","L","L","L","L","L","L","L","L","L","L","L","L","L","L","L","L","L","L","L","L","L","L","L","L","L","L","L","L","L","L","L","L","L","L","L","L","L","L","L","L","L","L","L","L","L","L","L","L","L","L","L","L","L","L","L","L","L","L","L","L","L","L","L","L","L","L","L","L","L","L","L","L","L","L","L","L","L","L","L","L","L","L","L","L","L","L","L","L","L","L","L","L","L","L","L","L","L","L","L","L","L","L","L","L","L","L","L","L","L","L",{"$f":"IF(AND(FX$4>=$D59,FX$4<=$E59,$B59=\"Réservé (Confirmé)\"),\"C\",IF(AND(FX$4>=$D59,FX$4<=$E59,$B59=\"Réservé (En attente)\"),\"A\",\"L\"))","v":"L"},"L","L","L","L","L","L","L","L","L","L","L","L","L","L","L","L","L","L","L","L","L","L","L","L","L","L","L","L","L","L","L","L","L","L","L","L","L","L","L","L","L","L","L","L","L","L","L","L","L","L","L","L","L","L","L","L","L","L","L","L","L","L","L","L","L","L","L","L","L","L","L","L","L","L","L","L","L","L","L","L","L","L","L","L","L","L","L","L","L","L","L","L","L","L","L","L","L","L","L","L","L","L","L","L","L","L","L","L","L","L","L","L","L","L","L","L","L","L","L","L","L","L","L","L","L","L","L","L","L","L","L","L","L","L","L","L","L","L","L","L","L","L","L","L","L","L","L","L","L","L","L","L","L","L","L","L","L","L","L","L","L","L","L","L","L","L","L","L","L","L","L","L","L","L","L","L","L","L","L","L","L","L","L","L","L","L","L","L","L","L","L","L"]
[null,null,null,null,null,null,null,"L","L","L","L","L","L","L","L","L","L","L","L","L","L","L",{"$f":"IF(AND(W$4>=$D60,W$4<=$E60,$B60=\"Réservé (Confirmé)\"),\"C\",IF(AND(W$4>=$D60,W$4<=$E60,$B60=\"Réservé (En attente)\"),\"A\",\"L\"))","v":"L"},"L","L","L","L","L","L","L","L","L","L","L","L","L","L","L","L","L","L","L","L","L","L","L","L","L","L","L","L","L","L","L","L","L","L","L","L","L","L","L","L","L","L","L","L","L","L","L","L","L","L","L","L","L","L","L","L","L","L","L","L","L","L","L","L","L","L","L","L","L","L","L","L","L","L","L","L","L","L","L","L","L","L","L","L","L","L","L","L","L","L","L","L","L","L","L","L","L","L","L","L","L","L","L","L","L","L","L",{"$f":"IF(AND(EA$4>=$D60,EA$4<=$E60,$B60=\"Réservé (Confirmé)\"),\"C\",IF(AND(EA$4>=$D60,EA$4<=$E60,$B60=\"Réservé (En attente)\"),\"A\",\"L\"))","v":"L"},"L","L","L","L","L","L","L","L","L","L","L","L","L","L","L","L","L","L","L","L","L","L","L","L","L","L","L","L","L","L","L","L","L","L",{"$f":"IF(AND(FJ$4>=$D60,FJ$4<=$E60,$B60=\"Réservé (Confirmé)\"),\"C\",IF(AND(FJ$4>=$D60,FJ$4<=$E60,$B60=\"Réservé (En attente)\"),\"A\",\"L\"))","v":"L"},"L","L","L","L","L","L","L","L","L","L","L","L","L","L","L","L","L","L","L","L","L","L","L","L","L","L","L","L","L","L","L","L","L","L","L","L","L","L","L","L","L","L","L","L","L","L","L","L","L","L","L","L","L","L","L","L","L","L","L","L","L","L","L","L","L","L","L","L","L","L","L","L","L","L","L","L","L","L","L","L","L","L","L","L","L","L","L","L","L","L","L","L","L","L","L",{"$f":"IF(AND(JB$4>=$D60,JB$4<=$E60,$B60=\"Réservé (Confirmé)\"),\"C\",IF(AND(JB$4>=$D60,JB$4<=$E60,$B60=\"Réservé (En attente)\"),\"A\",\"L\"))","v":"L"},"L","L","L","L","L","L","L","L","L","L","L","L","L","L","L","L","L","L","L","L","L","L","L","L","L","L","L","L","L","L","L","L","L","L","L","L","L","L","L","L","L","L","L","L","L","L","L","L","L","L","L","L","L","L","L","L","L","L","L","L","L","L","L",{"$f":"IF(AND(LN$4>=$D60,LN$4<=$E60,$B60=\"Réservé (Confirmé)\"),\"C\",IF(AND(LN$4>=$D60,LN$4<=$E60,$B60=\"Réservé (En attente)\"),\"A\",\"L\"))","v":"L"},"L","L","L","L","L","L","L","L","L","L","L","L","L","L","L","L","L","L","L","L","L","L","L","L","L","L","L","L","L","L","L","L","L","L","L","L","L","L","L","L","L","L","L","L","L","L"]
[null,null,null,null,null,null,null,{"$f":"IF(AND(H$4>=$D61,H$4<=$E61,$B61=\"Réservé (Confirmé)\"),\"C\",IF(AND(H$4>=$D61,H$4<=$E61,$B61=\"Réservé (En attente)\"),\"A\",\"L\"))","v":"L"},"L","L","L","L","L","L","L","L","L","L","L","L","L","L","L","L","L","L","L","L","L","L","L","L","L","L","L","L","L","L","L","L","L","L","L","L","L","L","L","L","L","L","L","L","L","L","L","L","L","L","L","L","L","L","L","L","L","L","L","L","L","L","L","L","L","L","L","L","L","L","L","L","L","L","L","L","L","L","L","L","L","L","L","L","L","L","L","L","L","L","L","L","L","L","L","L","L","L","L","L","L","L","L","L","L","L","L","L",{"$f":"IF(AND(DM$4>=$D61,DM$4<=$E61,$B61=\"Réservé (Confirmé)\"),\"C\",IF(AND(DM$4>=$D61,DM$4<=$E61,$B61=\"Réservé (En attente)\"),\"A\",\"L\"))","v":"L"},"L","L","L","L","L","L","L","L","L","L","L","L","L","L","L","L","L","L","L","L","L","L","L","L","L","L","L","L","L","L","L","L","L","L","L","L","L","L","L","L","L","L","L","L","L","L","L","L","L","L","L","L","L","L","L","L","L","L","L","L","L","L","L","L","L","L","L","L","L","L","L","L","L","L","L","L","L","L","L","L","L","L","L","L","L","L","L","L","L","L","L","L","L","L","L","L","L","L","L","L","L","L","L","L","L","L","L","L","L","L","L","L","L","L","L","L","L","L","L","L","L","L","L","L","L","L","L","L","L",{"$f":"IF(AND(IM$4>=$D61,IM$4<=$E61,$B61=\"Réservé (Confirmé)\"),\"C\",IF(AND(IM$4>=$D61,IM$4<=$E61,$B61=\"Réservé (En attente)\"),\"A\",\"L\"))","v":"L"},"L","L","L","L","L","L","L","L","L","L","L","L","L","L","L","L","L","L","L","L","L","L","L","L","L","L","L","L","L","L","L","L","L","L","L","L","L","L","L","L","L","L","L","L","L","L","L","L","L","L","L","L","L","L","L","L","L","L","L","L","L","L","L",{"$f":"IF(AND(KY$4>=$D61,KY$4<=$E61,$B61=\"Réservé (Confirmé)\"),\"C\",IF(AND(KY$4>=$D61,KY$4<=$E61,$B61=\"Réservé (En attente)\"),\"A\",\"L\"))","v":"L"},"L","L","L","L","L","L","L","L","L","L","L","L","L","L","L","L","L","L","L","L","L","L","L","L","L","L","L","L","L","L","L","L","L","L","L","L","L","L","L","L","L","L","L","L","L","L","L","L","L","L","L","L","L","L","L","L","L","L","L","L","L"]
[null,null,null,null,null,null,null,"L","L","L","L","L","L","L","L","L","L","L","L","L","L","L","L","L","L","L","L","L","L","L","L","L","L","L","L","L","L","L","L","L","L","L","L","L","L","L","L","L","L","L","L","L","L","L","L","L","L","L","L","L","L","L","L","L","L","L","L","L","L","L","L","L","L","L","L","L","L","L","L","L","L","L","L","L","L","L","L","L","L","L","L","L","L","L","L","L","L","L","L","L","L","L","L","L","L","L","L","L","L","L","L","L","L","L","L","L","L","L","L","L","L","L","L","L","L","L","L","L","L","L","L","L","L","L","L","L","L","L","L",{"$f":"IF(AND(EJ$4>=$D62,EJ$4<=$E62,$B62=\"Réservé (Confirmé)\"),\"C\",IF(AND(EJ$4>=$D62,EJ$4<=$E62,$B62=\"Réservé (En attente)\"),\"A\",\"L\"))","v":"L"},"L","L","L","L","L","L","L","L","L","L","L","L","L","L","L","L","L","L","L","L","L","L","L","L","L","L","L","L","L","L","L","L","L","L","L","L","L","L","L","L","L","L","L","L","L","L","L","L","L","L","L","L","L","L","L","L","L","L","L","L","L","L","L","L","L","L","L","L","L","L","L","L","L","L","L","L","L","L","L","L","L","L","L","L","L","L","L","L","L","L","L","L","L","L","L","L","L","L","L","L","L","L","L","L","L","L","L","L","L","L","L","L","L","L","L","L","L","L","L","L","L","L","L","L","L","L","L","L","L","L","L","L","L","L","L","L","L","L","L","L","L","L","L","L","L","L","L","L","L","L","L","L","L","L","L","L","L","L","L","L","L","L","L","L","L","L","L","L","L","L","L","L","L","L","L","L","L","L","L","L","L","L","L","L","L","L","L","L","L","L","L","L","L","L","L","L","L","L","L","L","L","L","L","L","L","L","L","L","L","L","L","L","L","L","L","L","L","L","L","L","L",{"$f":"IF(AND(MX$4>=$D62,MX$4<=$E62,$B62=\"Réservé (Confirmé)\"),\"C\",IF(AND(MX$4>=$D62,MX$4<=$E62,$B62=\"Réservé (En attente)\"),\"A\",\"L\"))","v":"L"},"L","L","L","L","L","L","L","L","L","L"]
[null,null,null,null,null,null,null,"L","L","L","L","L","L","L","L","L","L","L","L","L","L","L","L","L","L","L","L","L","L","L","L","L","L","L","L","L","L","L","L","L","L","L","L","L","L","L","L","L","L","L","L","L","L",{"$f":"IF(AND(BB$4>=$D63,BB$4<=$E63,$B63=\"Réservé (Confirmé)\"),\"C\",IF(AND(BB$4>=$D63,BB$4<=$E63,$B63=\"Réservé (En attente)\"),\"A\",\"L\"))","v":"L"},"L","L","L","L","L","L","L","L","L","L","L","L","L","L","L","L","L","L","L","L","L","L",{"$f":"IF(AND(BY$4>=$D63,BY$4<=$E63,$B63=\"Réservé (Confirmé)\"),\"C\",IF(AND(BY$4>=$D63,BY$4<=$E63,$B63=\"Réservé (En attente)\"),\"A\",\"L\"))","v":"L"},"L","L","L","L","L","L","L","L","L","L","L","L","L","L","L","L","L","L","L","L","L","L","L","L","L","L","L","L","L","L","L","L","L","L","L","L","L","L","L","L","L","L","L","L","L","L","L","L","L","L","L","L","L","L","L","L","L","L","L","L","L","L","L","L","L","L","L","L","L","L","L","L","L","L","L","L","L","L","L","L","L","L","L","L","L","L","L","L","L","L","L","L","L","L","L","L","L","L","L","L","L","L","L","L","L","L","L","L","L","L","L","L","L","L","L","L","L","L","L","L","L","L","L","L","L","L","L","L","L","L","L","L",{"$f":"IF(AND(HB$4>=$D63,HB$4<=$E63,$B63=\"Réservé (Confirmé)\"),\"C\",IF(AND(HB$4>=$D63,HB$4<=$E63,$B63=\"Réservé (En attente)\"),\"A\",\"L\"))","v":"L"},"L","L","L","L","L","L","L","L","L","L","L","L","L","L","L","L","L","L","L","L","L","L","L","L","L","L","L","L","L","L","L","L",{"$f":"IF(AND(II$4>=$D63,II$4<=$E63,$B63=\"Réservé (Confirmé)\"),\"C\",IF(AND(II$4>=$D63,II$4<=$E63,$B63=\"Réservé (En attente)\"),\"A\",\"L\"))","v":"L"},"L","L","L","L","L","L","L","L","L","L","L","L","L","L","L","L","L","L","L","L","L","L","L","L","L","L","L","L","L","L","L","L","L","L","L","L","L","L","L","L","L","L","L","L","L","L","L","L","L","L","L","L","L","L","L","L","L","L","L","L","L","L","L",{"$f":"IF(AND(KU$4>=$D63,KU$4<=$E63,$B63=\"Réservé (Confirmé)\"),\"C\",IF(AND(KU$4>=$D63,KU$4<=$E63,$B63=\"Réservé (En attente)\"),\"A\",\"L\"))","v":"L"},"L","L","L","L","L","L","L","L","L","L","L","L","L","L","L","L","L","L","L","L","L","L","L","L","L","L","L","L","L","L","L","L","L","L","L","L","L","L","L","L","L","L","L","L","L","L","L","L","L","L","L","L","L",{"$f":"IF(AND(MW$4>=$D63,MW$4<=$E63,$B63=\"Réservé (Confirmé)\"),\"C\",IF(AND(MW$4>=$D63,MW$4<=$E63,$B63=\"Réservé (En attente)\"),\"A\",\"L\"))","v":"L"},"L","L","L","L","L","L","L","L","L","L","L"]
[null,null,null,null,null,null,null,"L","L","L","L","L","L","L","L","L","L","L","L","L","L","L","L","L","L","L","L","L","L","L","L","L","L","L","L","L","L","L",{"$f":"IF(AND(AM$4>=$D64,AM$4<=$E64,$B64=\"Réservé (Confirmé)\"),\"C\",IF(AND(AM$4>=$D64,AM$4<=$E64,$B64=\"Réservé (En attente)\"),\"A\",\"L\"))","v":"L"},"L","L","L","L","L","L","L","L","L","L","L","L","L","L","L","L","L","L","L","L","L","L","L","L","L","L","L","L","L","L","L",{"$f":"IF(AND(BS$4>=$D64,BS$4<=$E64,$B64=\"Réservé (Confirmé)\"),\"C\",IF(AND(BS$4>=$D64,BS$4<=$E64,$B64=\"Réservé (En attente)\"),\"A\",\"L\"))","v":"L"},"L","L","L","L","L","L","L","L","L","L","L","L","L","L","L","L","L","L","L","L","L","L","L","L","L","L","L","L","L","L","L","L","L","L","L","L","L","L","L","L","L","L","L","L","L","L","L","L","L","L","L","L","L","L","L","L","L","L","L","L","L","L","L","L","L","L","L","L","L","L","L","L","L","L","L","L","L","L","L","L","L","L","L","L","L","L","L","L","L","L","L","L","L","L","L","L","L","L","L","L","L","L","L","L","L","L","L","L","L","L","L","L","L","L","L","L","L","L","L","L","L","L","L","L","L","L","L",{"$f":"IF(AND(GQ$4>=$D64,GQ$4<=$E64,$B64=\"Réservé (Confirmé)\"),\"C\",IF(AND(GQ$4>=$D64,GQ$4<=$E64,$B64=\"Réservé (En attente)\"),\"A\",\"L\"))","v":"L"},"L","L","L","L","L","L","L","L","L","L","L","L","L","L","L","L","L","L","L","L","L","L","L","L","L","L","L","L","L","L","L","L","L","L","L","L","L","L","L","L","L","L","L","L","L","L","L","L","L","L","L","L","L","L","L","L","L","L","L","L","L","L","L","L","L","L","L","L","L","L",{"$f":"IF(AND(JJ$4>=$D64,JJ$4<=$E64,$B64=\"Réservé (Confirmé)\"),\"C\",IF(AND(JJ$4>=$D64,JJ$4<=$E64,$B64=\"Réservé (En attente)\"),\"A\",\"L\"))","v":"L"},"L","L","L","L","L","L","L","L","L","L","L","L","L","L","L","L","L","L","L","L","L","L","L","L","L","L","L","L","L","L","L","L","L","L","L","L","L","L","L","L","L","L","L","L","L","L","L","L","L","L","L","L","L","L","L","L","L","L","L","L","L","L","L","L","L","L","L","L","L","L","L","L","L","L","L","L","L","L","L","L","L","L","L","L","L","L","L","L","L","L","L","L","L","L","L","L","L","L","L","L","L","L"]
[null,null,null,null,null,null,null,"L","L","L","L","L","L","L","L","L","L","L","L","L","L","L","L","L","L","L","L","L","L","L","L","L","L","L","L","L","L","L","L","L","L","L","L","L","L","L","L","L","L","L","L","L","L","L","L","L","L","L","L","L","L","L","L","L","L","L","L","L","L","L","L","L","L","L","L","L","L","L","L","L","L","L","L","L","L","L","L","L","L","L","L","L","L","L","L","L","L","L","L","L","L","L","L","L","L","L","L","L","L","L","L","L","L","L","L","L","L","L","L","L","L","L","L","L","L","L","L","L","L","L","L","L","L","L","L","L","L","L","L","L","L","L","L","L","L","L","L","L","L","L","L","L","L","L","L","L","L","L","L","L","L","L","L","L","L","L","L","L","L","L","L","L","L","L","L","L","L","L","L","L","L","L","L","L","L","L","L","L","L","L","L","L","L","L","L","L","L","L","L","L","L","L","L","L","L","L","L","L","L","L","L","L","L","L","L","L","L","L","L","L","L","L","L","L","L","L","L","L","L","L","L","L","L","L","L","L","L","L","L","L","L","L","L","L","L","L","L","L","L","L","L","L","L","L","L","L","L","L","L","L","L","L","L","L","L","L","L","L","L","L","L","L","L","L","L","L","L","L","L","L","L","L","L","L","L","L",{"$f":"IF(AND(KA$4>=$D65,KA$4<=$E65,$B65=\"Réservé (Confirmé)\"),\"C\",IF(AND(KA$4>=$D65,KA$4<=$E65,$B65=\"Réservé (En attente)\"),\"A\",\"L\"))","v":"L"},"L","L","L","L","L","L","L","L","L","L","L","L","L","L","L","L","L","L","L","L","L","L","L","L","L","L","L","L","L","L","L","L","L","L","L","L","L","L","L","L","L","L","L","L","L","L","L","L","L","L","L","L","L","L","L","L","L","L","L","L","L","L","L","L","L","L","L","L","L","L","L","L","L","L","L","L","L","L","L","L","L","L","L","L","L"]
[null,null,null,null,null,null,null,"L","L","L","L","L","L","L","L","L","L","L","L","L","L","L","L","L","L","L","L","L","L","L","L","L","L","L","L","L","L","L","L","L","L","L","L","L","L","L","L","L","L","L","L","L","L","L","L","L","L","L","L","L","L","L","L","L","L","L","L","L","L","L","L","L","L","L","L","L","L","L","L","L","L","L","L","L","L","L","L","L","L","L","L","L","L","L","L","L","L",{"$f":"IF(AND(CT$4>=$D66,CT$4<=$E66,$B66=\"Réservé (Confirmé)\"),\"C\",IF(AND(CT$4>=$D66,CT$4<=$E66,$B66=\"Réservé (En attente)\"),\"A\",\"L\"))","v":"L"},"L","L","L","L","L","L","L","L","L","L","L","L","L","L","L","L","L","L","L","L","L","L","L","L","L","L","L","L","L","L","L","L","L","L","L","L","L","L","L","L","L","L","L","L","L","L","L","L","L","L","L","L","L","L","L","L","L","L","L","L","L","L","L","L","L","L","L","L","L","L","L","L","L","L","L","L","L","L","L","L","L","L","L","L","L","L","L","L","L","L","L","L","L","L","L","L","L","L","L","L","L","L","L","L","L","L","L","L","L","L","L","L","L","L","L","L","L","L","L","L","L","L","L","L","L","L","L","L",{"$f":"IF(AND(HS$4>=$D66,HS$4<=$E66,$B66=\"Réservé (Confirmé)\"),\"C\",IF(AND(HS$4>=$D66,HS$4<=$E66,$B66=\"Réservé (En attente)\"),\"A\",\"L\"))","v":"L"},"L","L","L","L","L","L","L","L","L","L","L","L","L","L","L","L","L","L","L","L","L","L","L","L","L","L","L","L","L","L","L","L","L","L","L","L","L","L","L","L","L","L","L","L","L","L","L","L","L","L","L","L","L","L","L","L","L","L",{"$f":"IF(AND(JZ$4>=$D66,JZ$4<=$E66,$B66=\"Réservé (Confirmé)\"),\"C\",IF(AND(JZ$4>=$D66,JZ$4<=$E66,$B66=\"Réservé (En attente)\"),\"A\",\"L\"))","v":"L"},"L","L","L","L","L","L","L","L","L","L","L","L","L","L","L","L","L","L","L","L","L","L","L","L","L","L","L","L","L","L","L","L","L","L","L","L","L","L","L","L","L","L","L","L","L","L","L","L","L","L","L","L","L","L","L","L","L","L","L","L","L","L","L","L","L","L","L","L","L","L","L","L","L","L","L","L","L","L","L","L","L","L","L","L","L","L"]
[null,null,null,null,null,null,null,"L","L","L","L","L","L","L","L","L","L","L","L","L","L","L","L","L","L","L","L","L","L","L","L","L","L","L","L","L","L","L","L","L","L","L","L","L","L","L","L","L","L","L","L","L","L","L","L","L","L","L","L","L","L","L","L","L","L","L","L","L","L","L","L","L","L","L","L","L","L","L","L","L","L","L","L","L","L","L","L","L","L","L","L","L",{"$f":"IF(AND(CO$4>=$D67,CO$4<=$E67,$B67=\"Réservé (Confirmé)\"),\"C\",IF(AND(CO$4>=$D67,CO$4<=$E67,$B67=\"Réservé (En attente)\"),\"A\",\"L\"))","v":"L"},"L","L","L","L","L","L","L","L","L","L","L","L","L","L","L","L","L","L","L","L","L","L","L","L","L","L","L","L","L","L","L","L","L","L","L","L","L","L","L","L","L","L","L","L","L","L","L","L","L","L","L","L","L","L","L","L","L","L","L","L","L","L","L","L","L","L","L","L","L","L","L","L","L","L","L","L","L","L","L","L","L","L","L","L","L","L","L","L","L","L","L","L","L","L","L","L","L","L","L","L","L","L","L","L","L","L","L","L","L","L","L","L","L","L","L","L","L","L","L","L","L","L","L","L","L","L","L","L","L","L","L","L",{"$f":"IF(AND(HR$4>=$D67,HR$4<=$E67,$B67=\"Réservé (Confirmé)\"),\"C\",IF(AND(HR$4>=$D67,HR$4<=$E67,$B67=\"Réservé (En attente)\"),\"A\",\"L\"))","v":"L"},"L","L","L","L","L","L","L","L","L","L","L","L","L","L","L","L","L","L","L","L","L","L","L","L","L","L","L","L","L","L","L","L","L","L","L","L","L","L","L","L","L","L","L","L","L","L","L","L","L","L","L","L","L","L","L","L","L","L","L","L","L","L","L","L","L","L","L","L","L","L","L","L","L","L","L","L","L","L","L","L","L","L","L","L","L","L","L","L","L","L","L","L","L","L","L","L","L","L","L","L","L","L","L","L","L","L","L","L","L","L","L","L","L","L","L","L","L","L","L","L","L","L","L","L","L","L","L","L","L","L","L","L","L","L","L","L","L","L","L","L","L","L","L","L","L","L"]
[null,null,null,null,null,null,null,"L","L","L","L","L","L","L","L","L","L","L","L","L","L","L","L","L","L","L","L","L","L","L","L","L","L","L","L","L","L","L","L","L","L","L","L","L","L","L","L","L","L","L","L","L","L","L","L","L","L","L","L","L","L","L","L","L","L","L","L","L","L","L","L","L","L","L","L","L","L","L","L","L","L","L","L","L","L","L","L","L","L","L","L","L","L","L","L","L","L","L","L","L","L","L","L","L","L","L","L","L","L","L","L","L","L","L","L","L","L","L","L","L","L","L","L","L","L","L","L","L","L","L","L","L","L","L","L","L","L","L","L","L","L","L","L","L","L","L","L","L","L","L","L","L","L","L","L","L","L","L","L","L",{"$f":"IF(AND(FE$4>=$D68,FE$4<=$E68,$B68=\"Réservé (Confirmé)\"),\"C\",IF(AND(FE$4>=$D68,FE$4<=$E68,$B68=\"Réservé (En attente)\"),\"A\",\"L\"))","v":"L"},"L","L","L","L","L","L","L","L","L","L","L","L","L","L","L","L","L","L","L","L","L","L","L","L","L","L","L","L","L","L","L","L","L","L","L","L","L","L","L","L","L","L","L","L","L","L","L","L","L","L","L","L","L","L","L","L","L","L","L","L","L","L","L","L","L","L","L","L","L","L","L","L","L","L","L","L","L","L","L","L","L","L","L","L","L","L","L","L","L","L","L","L","L","L","L","L","L","L","L","L","L","L","L","L","L","L","L","L","L","L","L","L","L","L","L","L","L","L","L","L","L","L","L","L","L","L","L","L","L","L","L","L","L","L","L","L","L","L","L","L","L","L","L","L","L","L","L","L","L","L","L","L","L","L","L","L","L","L","L","L","L","L","L","L","L","L","L","L","L","L","L","L","L","L","L","L","L","L","L","L","L","L","L","L","L","L","L","L","L","L","L","L","L","L","L","L","L","L","L","L","L","L","L","L","L","L","L","L","L","L","L"]
[null,null,null,null,null,null,null,"L","L","L","L","L","L","L","L","L","L","L","L","L","L","L","L","L","L","L","L","L","L","L","L","L","L","L","L","L","L","L","L","L","L","L","L","L","L","L","L","L","L","L","L","L","L","L","L","L","L","L","L","L","L","L","L","L","L","L","L","L","L","L","L","L","L","L","L","L","L","L","L","L","L","L","L","L","L","L","L","L","L","L","L","L","L","L","L","L","L","L","L","L","L","L","L","L","L","L","L","L","L","L","L","L","L","L","L","L","L","L","L","L","L","L","L","L","L","L","L","L","L","L","L","L","L","L","L","L","L","L","L","L","L","L","L","L","L","L","L","L","L","L","L","L","L","L","L",{"$f":"IF(AND(EZ$4>=$D69,EZ$4<=$E69,$B69=\"Réservé (Confirmé)\"),\"C\",IF(AND(EZ$4>=$D69,EZ$4<=$E69,$B69=\"Réservé (En attente)\"),\"A\",\"L\"))","v":"L"},"L","L","L","L","L","L","L","L","L","L","L","L","L","L","L","L","L","L","L","L","L","L","L","L","L","L","L","L","L","L","L","L","L","L","L","L","L","L","L","L","L","L","L","L","L","L","L","L","L","L","L","L","L","L","L","L","L","L","L","L","L","L","L","L","L","L","L","L","L","L","L","L","L","L","L","L","L","L","L","L","L","L","L","L","L","L","L","L","L","L","L","L","L","L","L","L","L","L","L","L","L","L","L","L","L","L","L","L","L","L","L","L","L","L","L","L","L","L","L","L","L","L","L","L","L","L","L","L","L","L","L","L","L","L","L","L","L","L","L","L","L","L","L","L","L","L","L","L","L","L","L","L","L","L","L","L","L","L","L","L","L","L","L","L","L","L","L","L","L","L","L","L","L","L","L","L","L","L","L","L","L","L","L","L","L","L","L","L","L","L","L","L","L","L","L","L","L","L","L","L","L","L","L","L","L","L","L","L","L","L","L","L","L","L","L","L"]
[null,null,null,null,null,null,null,"L","L","L","L","L","L","L","L","L","L","L","L","L","L","L","L","L","L","L","L","L","L","L","L","L","L","L","L","L","L","L","L","L","L","L","L","L","L","L","L","L","L","L","L","L","L","L","L","L","L","L","L","L","L","L","L","L","L","L","L","L","L","L","L","L","L","L","L","L","L","L","L","L","L","L","L","L","L","L","L","L","L","L","L","L","L","L","L","L","L","L","L","L","L","L","L","L","L","L","L","L","L","L","L","L","L","L","L","L","L","L","L","L","L","L","L","L","L","L","L","L","L","L","L","L","L","L","L","L","L","L","L","L","L","L","L","L","L","L","L","L","L","L","L","L","L","L","L","L","L","L","L","L","L","L","L","L","L","L","L","L","L","L","L","L","L","L","L","L","L","L","L","L","L","L","L","L","L","L","L","L","L","L","L","L","L","L","L","L","L","L","L","L","L","L","L","L","L","L","L","L","L","L","L","L","L","L","L","L","L","L","L","L","L","L","L","L","L","L","L","L","L","L","L","L","L","L","L","L","L","L","L","L","L","L","L","L","L","L","L","L","L","L","L","L","L","L","L","L","L","L","L","L","L","L","L","L","L","L","L","L","L","L","L","L","L","L","L","L","L","L","L","L","L","L","L","L","L","L","L","L","L","L","L","L","L","L","L","L","L","L","L","L","L","L","L","L","L","L","L","L","L","L","L","L","L","L","L","L","L","L","L","L","L","L","L","L","L","L","L","L","L","L","L","L","L","L","L","L","L","L","L","L","L","L","L","L","L","L","L","L","L","L","L","L","L","L","L","L","L","L","L","L","L","L","L","L","L","L","L","L","L","L","L","L"]
[null,null,null,null,null,null,null,"L","L","L","L","L","L","L","L","L","L","L","L","L","L","L","L","L","L","L","L","L","L","L","L","L","L","L","L","L","L","L","L","L","L","L","L","L","L","L","L","L","L","L","L","L","L","L","L","L","L","L","L","L","L","L","L","L","L","L","L","L","L","L","L","L","L","L","L","L","L","L","L","L","L","L","L","L","L","L","L","L","L","L","L","L","L","L","L","L","L","L","L","L","L","L","L","L","L","L","L","L","L","L","L","L","L","L","L","L","L","L","L","L","L","L","L","L","L","L","L","L","L","L","L","L","L","L","L","L","L","L","L","L","L","L","L","L","L","L","L","L","L","L","L","L","L","L","L","L","L","L","L","L","L","L","L","L","L","L","L","L","L","L","L","L","L","L","L","L","L","L","L","L","L","L","L","L","L","L","L","L","L","L","L","L","L","L","L","L","L","L","L","L","L","L","L","L","L","L","L","L","L","L","L","L","L","L","L","L","L","L","L","L","L","L","L","L","L","L","L","L","L","L","L","L","L","L","L","L","L","L","L","L","L","L","L","L","L","L","L","L","L","L","L","L","L","L","L","L","L","L","L","L","L","L","L","L","L","L","L","L","L","L","L","L","L","L","L","L","L","L","L","L","L","L","L","L","L","L","L","L","L","L","L","L","L","L","L","L","L","L","L","L","L","L","L","L","L","L","L","L","L","L","L","L","L","L","L","L","L","L","L","L","L","L","L","L","L","L","L","L","L","L","L","L","L","L","L","L","L","L","L","L","L","L","L","L","L","L","L","L","L","L","L","L","L","L","L","L","L","L","L","L","L","L","L","L","L","L","L","L","L","L","L","L"]
[null,null,null,null,null,null,null,"L","L","L","L","L","L","L","L","L","L","L","L","L","L","L","L","L","L","L","L","L","L","L","L","L","L","L","L","L","L","L","L","L","L","L","L","L","L","L","L","L","L","L","L","L","L","L","L","L","L","L","L","L","L","L","L","L","L","L","L","L","L","L","L","L","L","L","L","L","L","L","L","L","L","L","L","L","L","L","L","L","L","L","L","L","L","L","L","L","L","L","L","L","L","L","L","L","L","L","L","L","L","L","L","L","L","L","L","L","L","L","L","L","L","L","L","L","L","L","L","L","L","L","L","L","L","L","L","L","L","L","L","L","L","L","L","L","L","L","L","L","L","L","L","L","L","L","L","L","L","L","L","L","L","L","L","L","L","L","L","L","L","L","L","L","L","L","L","L","L","L","L","L","L","L","L","L","L","L","L","L","L","L","L","L","L","L","L","L","L","L","L","L","L","L","L","L","L","L","L","L","L","L","L","L","L","L","L","L","L","L","L","L","L","L","L","L","L","L","L","L","L","L","L","L","L","L","L","L","L","L","L","L","L","L","L","L","L","L","L","L","L","L","L","L","L","L","L","L","L","L","L","L","L","L","L","L","L","L","L","L","L","L","L","L","L","L","L","L","L","L","L","L","L","L","L","L","L","L","L","L","L","L","L","L","L","L","L","L","L","L","L","L","L","L","L","L","L","L","L","L","L","L","L","L","L","L","L","L","L","L","L","L","L","L","L","L","L","L","L","L","L","L","L","L","L","L","L","L","L","L","L","L","L","L","L","L","L","L","L","L","L","L","L","L","L","L","L","L","L","L","L","L","L","L","L","L","L","L","L","L","L","L","L","L"]
[null,null,null,null,null,null,null,"L","L","L","L","L","L","L","L","L","L","L","L","L","L","L","L","L","L","L","L","L","L","L","L","L","L","L","L","L","L","L","L","L","L","L","L","L","L","L","L","L","L","L","L","L","L","L","L","L","L","L","L","L","L","L","L","L","L","L","L","L","L","L","L","L","L","L","L","L","L","L","L","L","L","L","L","L","L","L","L","L","L","L","L","L","L","L","L","L","L","L","L","L","L","L","L","L","L","L","L","L","L","L","L","L","L","L","L","L","L","L","L","L","L","L","L","L","L","L","L","L","L","L","L","L","L","L","L","L","L","L","L","L","L","L","L","L","L","L","L","L","L","L","L","L","L","L","L","L","L","L","L","L","L","L","L","L","L","L","L","L","L","L","L","L","L","L","L","L","L","L","L","L","L","L","L","L","L","L","L","L","L","L","L","L","L","L","L","L","L","L","L","L","L","L","L","L","L","L","L","L","L","L","L","L","L","L","L","L","L","L","L","L","L","L","L","L","L","L","L","L","L","L","L","L","L","L","L","L","L","L","L","L","L","L","L","L","L","L","L","L","L","L","L","L","L","L","L","L","L","L","L","L","L","L","L","L","L","L","L","L","L","L","L","L","L","L","L","L","L","L","L","L","L","L","L","L","L","L","L","L","L","L","L","L","L","L","L","L","L","L","L","L","L","L","L","L","L","L","L","L","L","L","L","L","L","L","L","L","L","L","L","L","L","L","L","L","L","L","L","L","L","L","L","L","L","L","L","L","L","L","L","L","L","L","L","L","L","L","L","L","L","L","L","L","L","L","L",{"$f":"IF(AND(MR$4>=$D73,MR$4<=$E73,$B73=\"Réservé (Confirmé)\"),\"C\",IF(AND(MR$4>=$D73,MR$4<=$E73,$B73=\"Réservé (En attente)\"),\"A\",\"L\"))","v":"L"},"L","L","L","L","L","L","L","L","L","L","L","L","L","L","L","L"]

{"sheet":"Calendrier MANUEL","index":2,"n_rows":11,"n_cols":367,"rows_kept":11,"cut":false,"hidden":false,"merged":[[0,216,0,245],[0,246,0,276],[0,277,0,307],[0,308,0,335],[0,336,0,366],[0,185,0,215],[3,0,5,0],[6,0,7,0],[9,0,10,0],[0,2,0,31],[1,0,2,0],[1,1,2,1],[0,32,0,62],[0,63,0,92],[0,93,0,123],[0,124,0,154],[0,155,0,184]]}
[null,null,"2021-04-01",null,null,null,null,null,null,null,null,null,null,null,null,null,null,null,null,null,null,null,null,null,null,null,null,null,null,null,null,null,"2021-05-01",null,null,null,null,null,null,null,null,null,null,null,null,null,null,null,null,null,null,null,null,null,null,null,null,null,null,null,null,null,null,"2021-06-01",null,null,null,null,null,null,null,null,null,null,null,null,null,null,null,null,null,null,null,null,null,null,null,null,null,null,null,null,null,"2021-07-01",null,null,null,null,null,null,null,null,null,null,null,null,null,null,null,null,null,null,null,null,null,null,null,null,null,null,null,null,null,null,"2021-08-01",null,null,null,null,null,null,null,null,null,null,null,null,null,null,null,null,null,null,null,null,null,null,null,null,null,null,null,null,null,null,"2021-09-01",null,null,null,null,null,null,null,null,null,null,null,null,null,null,null,null,null,null,null,null,null,null,null,null,null,null,null,null,null,"2021-10-01",null,null,null,null,null,null,null,null,null,null,null,null,null,null,null,null,null,null,null,null,null,null,null,null,null,null,null,null,null,null,"2021-11-01",null,null,null,null,null,null,null,null,null,null,null,null,null,null,null,null,null,null,null,null,null,null,null,null,null,null,null,null,null,"2021-12-01",null,null,null,null,null,null,null,null,null,null,null,null,null,null,null,null,null,null,null,null,null,null,null,null,null,null,null,null,null,null,"2022-01-01",null,null,null,null,null,null,null,null,null,null,null,null,null,null,null,null,null,null,null,null,null,null,null,null,null,null,null,null,null,null,"2022-02-01",null,null,null,null,null,null,null,null,null,null,null,null,null,null,null,null,null,null,null,null,null,null,null,null,null,null,null,"2022-03-01"]
["Site","Chambre","J","V","S","D","L","Ma","Me","J","V","S","D","L","Ma","Me","J","V","S","D","L","Ma","Me","J","V","S","D","L","Ma","Me","J","V","S","D","L","Ma","Me","J","V","S","D","L","Ma","Me","J","V","S","D","L","Ma","Me","J","V","S","D","L","Ma","Me","J","V","S","D","L","Ma","Me","J","V","S","D","L","Ma","Me","J","V","S","D","L","Ma","Me","J","V","S","D","L","Ma","Me","J","V","S","D","L","Ma","Me","J","V","S","D","L","Ma","Me","J","V","S","D","L","Ma","Me","J","V","S","D","L","Ma","Me","J","V","S","D","L","Ma","Me","J","V","S","D","L","Ma","Me","J","V","S","D","L","Ma","Me","J","V","S","D","L","Ma","Me","J","V","S","D","L","Ma","Me","J","V","S","D","L","Ma","Me","J","V","S","D","L","Ma","Me","J","V","S","D","L","Ma","Me","J","V","S","D","L","Ma","Me","J","V","S","D","L","Ma","Me","J","V","S","D","L","Ma","Me","J","V","S","D","L","Ma","Me","J","V","S","D","L","Ma","Me","J","V","S","D","L","Ma","Me","J","V","S","D","L","Ma","Me","J","V","S","D","L","Ma","Me","J","V","S","D","L","Ma","Me","J","V","S","D","L","Ma","Me","J","V","S","D","L","Ma","Me","J","V","S","D","L","Ma","Me","J","V","S","D","L","Ma","Me","J","V","S","D","L","Ma","Me","J","V","S","D","L","Ma","Me","J","V","S","D","L","Ma","Me","J","V","S","D","L","Ma","Me","J","V","S","D","L","Ma","Me","J","V","S","D","L","Ma","Me","J","V","S","D","L","Ma","Me","J","V","S","D","L","Ma","Me","J","V","S","D","L","Ma","Me","J","V","S","D","L","Ma","Me","J","V","S","D","L","Ma","Me","J","V","S","D","L","Ma","Me","J","V","S","D","L","Ma","Me","J","V","S","D","L","Ma","Me","J","V","S","D","L","Ma","Me","J"]
[null,null,"2021-04-01","2021-04-02","2021-04-03","2021-04-04","2021-04-05","2021-04-06","2021-04-07","2021-04-08","2021-04-09","2021-04-10","2021-04-11","2021-04-12","2021-04-13","2021-04-14","2021-04-15","2021-04-16","2021-04-17","2021-04-18","2021-04-19","2021-04-20","2021-04-21","2021-04-22","2021-04-23","2021-04-24","2021-04-25","2021-04-26","2021-04-27","2021-04-28","2021-04-29","2021-04-30","2021-05-01","2021-05-02","2021-05-03","2021-05-04","2021-05-05","2021-05-06","2021-05-07","2021-05-08","2021-05-09","2021-05-10","2021-05-11","2021-05-12","2021-05-13","2021-05-14","2021-05-15","2021-05-16","2021-05-17","2021-05-18","2021-05-19","2021-05-20","2021-05-21","2021-05-22","2021-05-23","2021-05-24","2021-05-25","2021-05-26","2021-05-27","2021-05-28","2021-05-29","2021-05-30","2021-05-31","2021-06-01","2021-06-02","2021-06-03","2021-06-04","2021-06-05","2021-06-06","2021-06-07","2021-06-08","2021-06-09","2021-06-10","2021-06-11","2021-06-12","2021-06-13","2021-06-14","2021-06-15","2021-06-16","2021-06-17","2021-06-18","2021-06-19","2021-06-20","2021-06-21","2021-06-22","2021-06-23","2021-06-24","2021-06-25","2021-06-26","2021-06-27","2021-06-28","2021-06-29","2021-06-30","2021-07-01","2021-07-02","2021-07-03","2021-07-04","2021-07-05","2021-07-06","2021-07-07","2021-07-08","2021-07-09","2021-07-10","2021-07-11","2021-07-12","2021-07-13","2021-07-14","2021-07-15","2021-07-16","2021-07-17","2021-07-18","2021-07-19","2021-07-20","2021-07-21","2021-07-22","2021-07-23","2021-07-24","2021-07-25","2021-07-26","2021-07-27","2021-07-28","2021-07-29","2021-07-30","2021-07-31","2021-08-01","2021-08-02","2021-08-03","2021-08-04","2021-08-05","2021-08-06","2021-08-07","2021-08-08","2021-08-09","2021-08-10","2021-08-11","2021-08-12","2021-08-13","2021-08-14","2021-08-15","2021-08-16","2021-08-17","2021-08-18","2021-08-19","2021-08-20","2021-08-21","2021-08-22","2021-08-23","2021-08-24","2021-08-25","2021-08-26","2021-08-27","2021-08-28","2021-08-29","2021-08-30","2021-08-31","2021-09-01","2021-09-02","2021-09-03","2021-09-04","2021-09-05","2021-09-06","2021-09-07","2021-09-08","2021-09-09","2021-09-10","2021-09-11","2021-09-12","2021-09-13","2021-09-14","2021-09-15","2021-09-16","2021-09-17","2021-09-18","2021-09-19","2021-09-20","2021-09-21","2021-09-22","2021-09-23","2021-09-24","2021-09-25","2021-09-26","2021-09-27","2021-09-28","2021-09-29","2021-09-30","2021-10-01","2021-10-02","2021-10-03","2021-10-04","2021-10-05","2021-10-06","2021-10-07","2021-10-08","2021-10-09","2021-10-10","2021-10-11","2021-10-12","2021-10-13","2021-10-14","2021-10-15","2021-10-16","2021-10-17","2021-10-18","2021-10-19","2021-10-20","2021-10-21","2021-10-22","2021-10-23","2021-10-24","2021-10-25","2021-10-26","2021-10-27","2021-10-28","2021-10-29","2021-10-30","2021-10-31","2021-11-01","2021-11-02","2021-11-03","2021-11-04","2021-11-05","2021-11-06","2021-11-07","2021-11-08","2021-11-09","2021-11-10","2021-11-11","2021-11-12","2021-11-13","2021-11-14","2021-11-15","2021-11-16","2021-11-17","2021-11-18","2021-11-19","2021-11-20","2021-11-21","2021-11-22","2021-11-23","2021-11-24","2021-11-25","2021-11-26","2021-11-27","2021-11-28","2021-11-29","2021-11-30","2021-12-01","2021-12-02","2021-12-03","2021-12-04","2021-12-05","2021-12-06","2021-12-07","2021-12-08","2021-12-09","2021-12-10","2021-12-11","2021-12-12","2021-12-13","2021-12-14","2021-12-15","2021-12-16","2021-12-17","2021-12-18","2021-12-19","2021-12-20","2021-12-21","2021-12-22","2021-12-23","2021-12-24","2021-12-25","2021-12-26","2021-12-27","2021-12-28","2021-12-29","2021-12-30","2021-12-31","2022-01-01","2022-01-02","2022-01-03","2022-01-04","2022-01-05","2022-01-06","2022-01-07","2022-01-08","2022-01-09","2022-01-10","2022-01-11","2022-01-12","2022-01-13","2022-01-14","2022-01-15","2022-01-16","2022-01-17","2022-01-18","2022-01-19","2022-01-20","2022-01-21","2022-01-22","2022-01-23","2022-01-24","2022-01-25","2022-01-26","2022-01-27","2022-01-28","2022-01-29","2022-01-30","2022-01-31","2022-02-01","2022-02-02","2022-02-03","2022-02-04","2022-02-05","2022-02-06","2022-02-07","2022-02-08","2022-02-09","2022-02-10","2022-02-11","2022-02-12","2022-02-13","2022-02-14","2022-02-15","2022-02-16","2022-02-17","2022-02-18","2022-02-19","2022-02-20","2022-02-21","2022-02-22","2022-02-23","2022-02-24","2022-02-25","2022-02-26","2022-02-27","2022-02-28","2022-03-01","2022-03-02","2022-03-03","2022-03-04","2022-03-05","2022-03-06","2022-03-07","2022-03-08","2022-03-09","2022-03-10","2022-03-11","2022-03-12","2022-03-13","2022-03-14","2022-03-15","2022-03-16","2022-03-17","2022-03-18","2022-03-19","2022-03-20","2022-03-21","2022-03-22","2022-03-23","2022-03-24","2022-03-25","2022-03-26","2022-03-27","2022-03-28","2022-03-29","2022-03-30","2022-03-31"]
["Marchand",101]
[null,102]
[null,103]
["Chêne",127]
[null,227]
["St-Eusèbe",204]
["Tilleul",215]
[null,312]

{"sheet":"Tableau de bord","index":3,"n_rows":32,"n_cols":16,"rows_kept":32,"cut":false,"hidden":false,"merged":[[1,1,1,15]]}
[]
[null,"Tableau de bord"]
[]
[null,null,"Durée totale de séjour par site",null,null,"Durée moyenne de séjour par usager",null,null,"Durée totale de séjour par usager",null,null,"Nombre d'épisodes de séjour par usager",null,null,"Demandes déposées par période"]
[]
[null,null,"Sites/Chambres","Durée séjour",null,"Usagers","DMS",null,"Usagers","Total séjour (jrs)",null,"Usagers","Nbre de séjour",null,"Années/Périodes","Nbre demandes"]
[null,null,"Chêne",61,null,", Réjean",0,null,", Réjean",0,null,", Réjean",1,null,"2020-2021",11]
[null,null,227,61,null,", Solange",6,null,", Solange",24,null,", Solange",4,null,"P11",1]
[null,null,"Marchand",0,null,", Réal",6,null,", Réal",18,null,", Réal",3,null,"P12",2]
[null,null,102,0,null,", Gilles",11.333333333333334,null,", Gilles",68,null,", Gilles",6,null,"P13",8]
[null,null,"St_Eusèbe",37,null,", Jeannine",10,null,", Jeannine",10,null,", Jeannine",1,null,"2021-2022",21]
[null,null,204,37,null,", Noella",17,null,", Noella",17,null,", Noella",1,null,"P01",4]
[null,null,"Tilleul",196,null,", Irène",13.75,null,", Irène",55,null,", Irène",4,null,"P02",14]
[null,null,312,79,null,", Jacques",23.5,null,", Jacques",47,null,", Jacques",2,null,"P03",3]
[null,null,215,117,null,", Henri",4.25,null,", Henri",17,null,", Henri",4,null,"Total général",32]
[null,null,"Total général",294,null,", Léo",5,null,", Léo",5,null,", Léo",1]
[null,null,null,null,null,", Claude",9,null,", Claude",9,null,", Claude",1]
[null,null,"Motifs des demandes par site",null,null,", Nicole",1,null,", Nicole",1,null,", Nicole",1]
[null,null,null,null,null,", Maurice",5.5,null,", Maurice",11,null,", Maurice",2]
[null,null,"Motif/Site","Nombre",null,", Yvon",12,null,", Yvon",12,null,", Yvon",1]
[null,null,"Répit aidants",32,null,"Total général",9.1875,null,"Total général",294,null,"Total général",32]
[null,null,"Chêne",11]
[null,null,"Marchand",1]
[null,null,"St_Eusèbe",6]
[null,null,"Tilleul",14]
[null,null,"Total général",32]
[]
[null,null,"Demandes annulées"]
[]
[null,null,"Statut modifié","Nombre"]
[null,null,"Annulé",2]
[null,null,"Total général",2]

{"sheet":"Données","index":4,"n_rows":17,"n_cols":35,"rows_kept":17,"cut":false,"hidden":false,"merged":[]}
["RLS",null,"Sites",null,"Chêne",null,"Marchand",null,"St_Eusèbe",null,"Tilleul",null,"# Chambres",null,"Statut",null,"Statut modifié",null,"Motif",null,"Titre d'emploi",null,"Profil",null,"ISO-SMAF",null,"Connu SAD",null,"Avis",null,"Test",null,"Mois",null,"Année"]
["Arthabaska-Érable",null,"Chêne",null,127,null,101,null,204,null,215,null,"101 (Marchand)",null,"Réservé (Confirmé)",null,"Annulé",null,"Dépannage",null,"Inhalothérapie",null,110,null,"Non connu",null,"Oui",null,"Oui",null,"Oui",null,"Janvier",null,2021]
["BNY",null,"Marchand",null,227,null,102,null,null,null,312,null,"102 (Marchand)",null,"Réservé (En attente)",null,"Décédé",null,"Protection sociale",null,"Médecin-IPSPL",null,121,null,0,null,"Non",null,"Non",null,"Non",null,"Février",null,2022]
["Drummondville",null,"St_Eusèbe",null,null,null,103,null,null,null,null,null,"103 (Marchand)",null,null,null,"Refusé",null,"Répit aidants",null,"Nutrition",null,131,null,1,null,null,null,null,null,null,null,"Mars",null,2023]
[null,null,"Tilleul",null,null,null,null,null,null,null,null,null,"127 (Chêne)",null,null,null,null,null,null,null,"Psychosocial",null,191,null,2,null,null,null,null,null,null,null,"Avril",null,2024]
[null,null,null,null,null,null,null,null,null,null,null,null,"227 (Chêne)",null,null,null,null,null,null,null,"Réadaptation",null,192,null,3,null,null,null,null,null,null,null,"Mai",null,2025]
[null,null,null,null,null,null,null,null,null,null,null,null,"204 (St-Eusèbe)",null,null,null,null,null,null,null,"Soins infirmiers",null,210,null,4,null,null,null,null,null,null,null,"Juin"]
[null,null,null,null,null,null,null,null,null,null,null,null,"215 (Tileul)",null,null,null,null,null,null,null,"Autres",null,311,null,5,null,null,null,null,null,null,null,"Juillet"]
[null,null,null,null,null,null,null,null,null,null,null,null,"314 (Tileul)",null,null,null,null,null,null,null,null,null,312,null,6,null,null,null,null,null,null,null,"Août"]
[null,null,null,null,null,null,null,null,null,null,null,null,null,null,null,null,null,null,null,null,null,null,410,null,7,null,null,null,null,null,null,null,"Septembre"]
[null,null,null,null,null,null,null,null,null,null,null,null,null,null,null,null,null,null,null,null,null,null,420,null,8,null,null,null,null,null,null,null,"Octobre"]
[null,null,null,null,null,null,null,null,null,null,null,null,null,null,null,null,null,null,null,null,null,null,710,null,9,null,null,null,null,null,null,null,"Novembre"]
[null,null,null,null,null,null,null,null,null,null,null,null,null,null,null,null,null,null,null,null,null,null,null,null,10,null,null,null,null,null,null,null,"Décembre"]
[null,null,null,null,null,null,null,null,null,null,null,null,null,null,null,null,null,null,null,null,null,null,null,null,11]
[null,null,null,null,null,null,null,null,null,null,null,null,null,null,null,null,null,null,null,null,null,null,null,null,12]
[null,null,null,null,null,null,null,null,null,null,null,null,null,null,null,null,null,null,null,null,null,null,null,null,13]
[null,null,null,null,null,null,null,null,null,null,null,null,null,null,null,null,null,null,null,null,null,null,null,null,14]

{"sheet":"Périodes adm.","index":5,"n_rows":79,"n_cols":5,"rows_kept":79,"cut":false,"hidden":false,"merged":[]}
["Date début","Date fin","Nbre jours","Périodes","Année"]
["2018-04-01","2018-04-28",27,"P01","2018-2019"]
["2018-04-29","2018-05-26",27,"P02","2018-2019"]
["2018-05-27","2018-06-23",27,"P03","2018-2019"]
["2018-06-24","2018-07-21",27,"P04","2018-2019"]
["2018-07-22","2018-08-18",27,"P05","2018-2019"]
["2018-08-19","2018-09-15",27,"P06","2018-2019"]
["2018-09-16","2018-10-13",27,"P07","2018-2019"]
["2018-10-14","2018-11-10",27,"P08","2018-2019"]
["2018-11-11","2018-12-08",27,"P09","2018-2019"]
["2018-12-09","2019-01-05",27,"P10","2018-2019"]
["2019-01-06","2019-02-02",27,"P11","2018-2019"]
["2019-02-03","2019-03-02",27,"P12","2018-2019"]
["2019-03-03","2019-03-31",28,"P13","2018-2019"]
["2019-04-01","2019-04-27",26,"P01","2019-2020"]
["2019-04-28","2019-05-25",27,"P02","2019-2020"]
["2019-05-26","2019-06-22",27,"P03","2019-2020"]
["2019-06-23","2019-07-20",27,"P04","2019-2020"]
["2019-07-21","2019-08-17",27,"P05","2019-2020"]
["2019-08-18","2019-09-14",27,"P06","2019-2020"]
["2019-09-15","2019-10-12",27,"P07","2019-2020"]
["2019-10-13","2019-11-09",27,"P08","2019-2020"]
["2019-11-10","2019-12-07",27,"P09","2019-2020"]
["2019-12-08","2020-01-04",27,"P10","2019-2020"]
["2020-01-05","2020-02-01",27,"P11","2019-2020"]
["2020-02-02","2020-02-29",27,"P12","2019-2020"]
["2020-03-01","2020-03-31",30,"P13","2019-2020"]
["2020-04-01","2020-04-25",24,"P01","2020-2021"]
["2020-04-26","2020-05-23",27,"P02","2020-2021"]
["2020-05-24","2020-06-20",27,"P03","2020-2021"]
["2020-06-21","2020-07-18",27,"P04","2020-2021"]
["2020-07-19","2020-08-15",27,"P05","2020-2021"]
["2020-08-16","2020-09-12",27,"P06","2020-2021"]
["2020-09-13","2020-10-10",27,"P07","2020-2021"]
["2020-10-11","2020-11-07",27,"P08","2020-2021"]
["2020-11-08","2020-12-05",27,"P09","2020-2021"]
["2020-12-06","2021-01-02",27,"P10","2020-2021"]
["2021-01-03","2021-01-30",27,"P11","2020-2021"]
["2021-01-31","2021-02-27",27,"P12","2020-2021"]
["2021-02-28","2021-03-31",31,"P13","2020-2021"]
["2021-04-01","2021-04-24",23,"P01","2021-2022"]
["2021-04-25","2021-05-22",27,"P02","2021-2022"]
["2021-05-23","2021-06-19",27,"P03","2021-2022"]
["2021-06-20","2021-07-17",27,"P04","2021-2022"]
["2021-07-18","2021-08-14",27,"P05","2021-2022"]
["2021-08-15","2021-09-11",27,"P06","2021-2022"]
["2021-09-12","2021-10-09",27,"P07","2021-2022"]
["2021-10-10","2021-11-06",27,"P08","2021-2022"]
["2021-11-07","2021-12-04",27,"P09","2021-2022"]
["2021-12-05","2022-01-01",27,"P10","2021-2022"]
["2022-01-02","2022-01-29",27,"P11","2021-2022"]
["2022-01-30","2022-02-26",27,"P12","2021-2022"]
["2022-02-27","2022-03-31",32,"P13","2021-2022"]
["2022-04-01","2022-04-23",22,"P01","2022-2023"]
["2022-04-24","2022-05-21",27,"P02","2022-2023"]
["2022-05-22","2022-06-18",27,"P03","2022-2023"]
["2022-06-19","2022-07-16",27,"P04","2022-2023"]
["2022-07-17","2022-08-13",27,"P05","2022-2023"]
["2022-08-14","2022-09-10",27,"P06","2022-2023"]
["2022-09-11","2022-10-08",27,"P07","2022-2023"]
["2022-10-09","2022-11-05",27,"P08","2022-2023"]
["2022-11-06","2022-12-03",27,"P09","2022-2023"]
["2022-12-04","2022-12-31",27,"P10","2022-2023"]
["2023-01-01","2023-01-28",27,"P11","2022-2023"]
["2023-01-29","2023-02-25",27,"P12","2022-2023"]
["2023-02-26","2023-03-31",33,"P13","2022-2023"]
["2023-04-01","2023-04-22",21,"P01","2023-2024"]
["2023-04-23","2023-05-20",27,"P02","2023-2024"]
["2023-05-21","2023-06-17",27,"P03","2023-2024"]
["2023-06-18","2023-07-15",27,"P04","2023-2024"]
["2023-07-16","2023-08-12",27,"P05","2023-2024"]
["2023-08-13","2023-09-09",27,"P06","2023-2024"]
["2023-09-10","2023-10-07",27,"P07","2023-2024"]
["2023-10-08","2023-11-04",27,"P08","2023-2024"]
["2023-11-05","2023-12-02",27,"P09","2023-2024"]
["2023-12-03","2023-12-30",27,"P10","2023-2024"]
["2023-12-31","2024-01-27",27,"P11","2023-2024"]
["2024-01-28","2024-02-24",27,"P12","2023-2024"]
["2024-02-25","2024-03-31",35,"P13","2023-2024"]