{"text_format":"1","workbook":"xlsx","n_sheets":4,"sheets":["Lits NSA-LPH","Tableau de bord","Chambres","Menus (données)"],"not_rendered":{"charts":0,"images":0,"macros":1,"external_links":0,"defined_names":12,"comments":0,"pivot_tables":10},"unopened":[],"bounds":{"document_bytes":16777216,"sheet_cells":100000,"rows_first":2000,"rows_last":500,"rows_between":2000,"halvings":0,"cell_chars":16384,"cell_head_chars":4096},"cells_cut":0,"cells_raw":0,"read":"whole","date_system":"1900"}

{"sheet":"Lits NSA-LPH","index":0,"n_rows":84,"n_cols":37,"rows_kept":84,"cut":false,"hidden":false,"merged":[]}
[]
["Site","No chambre","Catégorie","Statut","Nom","Prénom","Numéro\ndossier","Date de\nnaissance","Âge","Groupe d'âge","Date dépôt demande","Motif de la\ndemande","Provenance","Date\nd'admission","Classif.\nà planifier","Durée prévue (en jours)","Profil à\nl'arrivée","ISO SMAF\narrivée","Usager actif au SAD","Justification admission","Date de fin\nSoins actifs","Soins actifs","Date \ncongé prévu","Date \ncongé","Orientation au congé","Profil au congé","ISO SMAF\ncongé","Référence au SAD","Temps attente (dépôt/adm.)","Durée séjour","Date dépôt MAH","Date orientation","Temps attente orientation vs sortie","Bloquants\nEnjeux","Commentaires","Année financière","Période"]
["René_Léosa",11,{"$f":"VLOOKUP(B3,Chambres!$A$2:$C$33,3,FALSE)","v":"Régulier"},{"$f":"IF(AND(Tableau1[[#This Row],[Date\nd''admission]]<>\"\",Tableau1[[#This Row],[Date \ncongé]]=\"\"),\"Occupée\",IF(Tableau1[[#This Row],[Date \ncongé]]<>\"\",\"Congé\",\"Libre\"))","v":"Congé"},null,null,"P081174","1961-12-12",{"$f":"(IF(Tableau1[[#This Row],[Date de\nnaissance]]<>\"\",DATEDIF(Tableau1[[#This Row],[Date de\nnaissance]],TODAY(),\"Y\"),\"\"))","v":59},{"$f":"IF(Tableau1[[#This Row],[Âge]]<=60,\"60 et -\",IF(Tableau1[[#This Row],[Âge]]<=65,\"61-65\",IF(Tableau1[[#This Row],[Âge]]<=70,\"66-70\",IF(Tableau1[[#This Row],[Âge]]<=75,\"71-75\",IF(Tableau1[[#This Row],[Âge]]<=80,\"76-80\",IF(Tableau1[[#This Row],[Âge]]<=85,\"81-85\",IF(Tableau1[[#This Row],[Âge]]<=110,\"86 et +\",\"\")))))))","v":"60 et -"},"2021-01-05","Éval-ori","HSC","2021-01-11",{"$f":"IF(Tableau1[[#This Row],[Date\nd''admission]]<>\"\",IF(Tableau1[[#This Row],[Site]]=\"René_Léosa\",Tableau1[[#This Row],[Date\nd''admission]]+45,\"\"))","v":"2021-02-25"},null,710,null,"Non",null,{"$f":"IF(Tableau1[[#This Row],[Date \ncongé]]<>\"\",Tableau1[[#This Row],[Date \ncongé]],\"\")","v":"2021-01-21"},{"$f":"IF(Tableau1[[#This Row],[Date de fin\nSoins actifs]]<>\"\",\"Non\",\"Oui\")","v":"Non"},null,"2021-01-21","Retour à domicile",710,null,"Soins infirmiers",{"$f":"IFERROR(DATEDIF(Tableau1[[#This Row],[Date dépôt demande]],Tableau1[[#This Row],[Date\nd''admission]],\"D\"),\"\")","v":6},{"$f":"IFERROR(IF(AND(Tableau1[[#This Row],[Date\nd''admission]]<>\"\",Tableau1[[#This Row],[Date \ncongé]]<>\"\"),DATEDIF(Tableau1[[#This Row],[Date\nd''admission]],Tableau1[[#This Row],[Date \ncongé]],\"D\"),\"\"),\"\")","v":10},null,null,{"$f":"IFERROR(DATEDIF(Tableau1[[#This Row],[Date dépôt MAH]],Tableau1[[#This Row],[Date orientation]],\"D\"),\"\")","v":0}]
["René_Léosa",11,{"$f":"VLOOKUP(B4,Chambres!$A$2:$C$33,3,FALSE)","v":"Régulier"},{"$f":"IF(AND(Tableau1[[#This Row],[Date\nd''admission]]<>\"\",Tableau1[[#This Row],[Date \ncongé]]=\"\"),\"Occupée\",IF(Tableau1[[#This Row],[Date \ncongé]]<>\"\",\"Congé\",\"Libre\"))","v":"Libre"},null,null,null,null,{"$f":"(IF(Tableau1[[#This Row],[Date de\nnaissance]]<>\"\",DATEDIF(Tableau1[[#This Row],[Date de\nnaissance]],TODAY(),\"Y\"),\"\"))","v":""},{"$f":"IF(Tableau1[[#This Row],[Âge]]<=60,\"60 et -\",IF(Tableau1[[#This Row],[Âge]]<=65,\"61-65\",IF(Tableau1[[#This Row],[Âge]]<=70,\"66-70\",IF(Tableau1[[#This Row],[Âge]]<=75,\"71-75\",IF(Tableau1[[#This Row],[Âge]]<=80,\"76-80\",IF(Tableau1[[#This Row],[Âge]]<=85,\"81-85\",IF(Tableau1[[#This Row],[Âge]]<=110,\"86 et +\",\"\")))))))","v":""},null,null,null,null,{"$f":"IF(Tableau1[[#This Row],[Date\nd''admission]]<>\"\",IF(Tableau1[[#This Row],[Site]]=\"René_Léosa\",Tableau1[[#This Row],[Date\nd''admission]]+45,\"\"))","v":false},null,null,null,null,null,{"$f":"IF(Tableau1[[#This Row],[Date \ncongé]]<>\"\",Tableau1[[#This Row],[Date \ncongé]],\"\")","v":""},{"$f":"IF(Tableau1[[#This Row],[Date de fin\nSoins actifs]]<>\"\",\"Non\",\"Oui\")","v":"Oui"},null,null,null,null,null,null,{"$f":"IFERROR(DATEDIF(Tableau1[[#This Row],[Date dépôt demande]],Tableau1[[#This Row],[Date\nd''admission]],\"D\"),\"\")","v":0},{"$f":"IFERROR(IF(AND(Tableau1[[#This Row],[Date\nd''admission]]<>\"\",Tableau1[[#This Row],[Date \ncongé]]<>\"\"),DATEDIF(Tableau1[[#This Row],[Date\nd''admission]],Tableau1[[#This Row],[Date \ncongé]],\"D\"),\"\"),\"\")","v":""},null,null,{"$f":"IFERROR(DATEDIF(Tableau1[[#This Row],[Date dépôt MAH]],Tableau1[[#This Row],[Date orientation]],\"D\"),\"\")","v":0}]
["René_Léosa",13,{"$f":"VLOOKUP(B5,Chambres!$A$2:$C$33,3,FALSE)","v":"Régulier"},{"$f":"IF(AND(Tableau1[[#This Row],[Date\nd''admission]]<>\"\",Tableau1[[#This Row],[Date \ncongé]]=\"\"),\"Occupée\",IF(Tableau1[[#This Row],[Date \ncongé]]<>\"\",\"Congé\",\"Libre\"))","v":"Congé"},null,null,"P092211","1948-05-14",{"$f":"(IF(Tableau1[[#This Row],[Date de\nnaissance]]<>\"\",DATEDIF(Tableau1[[#This Row],[Date de\nnaissance]],TODAY(),\"Y\"),\"\"))","v":73},{"$f":"IF(Tableau1[[#This Row],[Âge]]<=60,\"60 et -\",IF(Tableau1[[#This Row],[Âge]]<=65,\"61-65\",IF(Tableau1[[#This Row],[Âge]]<=70,\"66-70\",IF(Tableau1[[#This Row],[Âge]]<=75,\"71-75\",IF(Tableau1[[#This Row],[Âge]]<=80,\"76-80\",IF(Tableau1[[#This Row],[Âge]]<=85,\"81-85\",IF(Tableau1[[#This Row],[Âge]]<=110,\"86 et +\",\"\")))))))","v":"71-75"},"2021-03-15","Éval-ori","HSC","2021-03-16",{"$f":"IF(Tableau1[[#This Row],[Date\nd''admission]]<>\"\",IF(Tableau1[[#This Row],[Site]]=\"René_Léosa\",Tableau1[[#This Row],[Date\nd''admission]]+45,\"\"))","v":"2021-04-30"},null,710,null,null,null,{"$f":"IF(Tableau1[[#This Row],[Date \ncongé]]<>\"\",Tableau1[[#This Row],[Date \ncongé]],\"\")","v":"2021-04-01"},{"$f":"IF(Tableau1[[#This Row],[Date de fin\nSoins actifs]]<>\"\",\"Non\",\"Oui\")","v":"Non"},null,"2021-04-01","Retour à domicile",710,null,"Soins infirmiers",{"$f":"IFERROR(DATEDIF(Tableau1[[#This Row],[Date dépôt demande]],Tableau1[[#This Row],[Date\nd''admission]],\"D\"),\"\")","v":1},{"$f":"IFERROR(IF(AND(Tableau1[[#This Row],[Date\nd''admission]]<>\"\",Tableau1[[#This Row],[Date \ncongé]]<>\"\"),DATEDIF(Tableau1[[#This Row],[Date\nd''admission]],Tableau1[[#This Row],[Date \ncongé]],\"D\"),\"\"),\"\")","v":16},null,null,{"$f":"IFERROR(DATEDIF(Tableau1[[#This Row],[Date dépôt MAH]],Tableau1[[#This Row],[Date orientation]],\"D\"),\"\")","v":0}]
["René_Léosa",13,{"$f":"VLOOKUP(B6,Chambres!$A$2:$C$33,3,FALSE)","v":"Régulier"},{"$f":"IF(AND(Tableau1[[#This Row],[Date\nd''admission]]<>\"\",Tableau1[[#This Row],[Date \ncongé]]=\"\"),\"Occupée\",IF(Tableau1[[#This Row],[Date \ncongé]]<>\"\",\"Congé\",\"Libre\"))","v":"Occupée"},null,null,"P065245","1952-02-11",{"$f":"(IF(Tableau1[[#This Row],[Date de\nnaissance]]<>\"\",DATEDIF(Tableau1[[#This Row],[Date de\nnaissance]],TODAY(),\"Y\"),\"\"))","v":69},{"$f":"IF(Tableau1[[#This Row],[Âge]]<=60,\"60 et -\",IF(Tableau1[[#This Row],[Âge]]<=65,\"61-65\",IF(Tableau1[[#This Row],[Âge]]<=70,\"66-70\",IF(Tableau1[[#This Row],[Âge]]<=75,\"71-75\",IF(Tableau1[[#This Row],[Âge]]<=80,\"76-80\",IF(Tableau1[[#This Row],[Âge]]<=85,\"81-85\",IF(Tableau1[[#This Row],[Âge]]<=110,\"86 et +\",\"\")))))))","v":"66-70"},"2021-04-21","Éval-ori","HSC","2021-04-23",{"$f":"IF(Tableau1[[#This Row],[Date\nd''admission]]<>\"\",IF(Tableau1[[#This Row],[Site]]=\"René_Léosa\",Tableau1[[#This Row],[Date\nd''admission]]+45,\"\"))","v":"2021-06-07"},null,710,null,"Oui",null,{"$f":"IF(Tableau1[[#This Row],[Date \ncongé]]<>\"\",Tableau1[[#This Row],[Date \ncongé]],\"\")","v":""},{"$f":"IF(Tableau1[[#This Row],[Date de fin\nSoins actifs]]<>\"\",\"Non\",\"Oui\")","v":"Oui"},null,null,"Relocalisation RI physique",null,4,null,{"$f":"IFERROR(DATEDIF(Tableau1[[#This Row],[Date dépôt demande]],Tableau1[[#This Row],[Date\nd''admission]],\"D\"),\"\")","v":2},{"$f":"IFERROR(IF(AND(Tableau1[[#This Row],[Date\nd''admission]]<>\"\",Tableau1[[#This Row],[Date \ncongé]]<>\"\"),DATEDIF(Tableau1[[#This Row],[Date\nd''admission]],Tableau1[[#This Row],[Date \ncongé]],\"D\"),\"\"),\"\")","v":""},"2021-05-03","2021-05-03",{"$f":"IFERROR(DATEDIF(Tableau1[[#This Row],[Date dépôt MAH]],Tableau1[[#This Row],[Date orientation]],\"D\"),\"\")","v":0}]
["René_Léosa",14,{"$f":"VLOOKUP(B7,Chambres!$A$2:$C$33,3,FALSE)","v":"Régulier"},{"$f":"IF(AND(Tableau1[[#This Row],[Date\nd''admission]]<>\"\",Tableau1[[#This Row],[Date \ncongé]]=\"\"),\"Occupée\",IF(Tableau1[[#This Row],[Date \ncongé]]<>\"\",\"Congé\",\"Libre\"))","v":"Congé"},null,null,"P082785","1941-11-07",{"$f":"(IF(Tableau1[[#This Row],[Date de\nnaissance]]<>\"\",DATEDIF(Tableau1[[#This Row],[Date de\nnaissance]],TODAY(),\"Y\"),\"\"))","v":79},{"$f":"IF(Tableau1[[#This Row],[Âge]]<=60,\"60 et -\",IF(Tableau1[[#This Row],[Âge]]<=65,\"61-65\",IF(Tableau1[[#This Row],[Âge]]<=70,\"66-70\",IF(Tableau1[[#This Row],[Âge]]<=75,\"71-75\",IF(Tableau1[[#This Row],[Âge]]<=80,\"76-80\",IF(Tableau1[[#This Row],[Âge]]<=85,\"81-85\",IF(Tableau1[[#This Row],[Âge]]<=110,\"86 et +\",\"\")))))))","v":"76-80"},"2020-09-02","Éval-ori","HSC","2020-09-08",{"$f":"IF(Tableau1[[#This Row],[Date\nd''admission]]<>\"\",IF(Tableau1[[#This Row],[Site]]=\"René_Léosa\",Tableau1[[#This Row],[Date\nd''admission]]+45,\"\"))","v":"2020-10-23"},null,710,null,"Non",null,{"$f":"IF(Tableau1[[#This Row],[Date \ncongé]]<>\"\",Tableau1[[#This Row],[Date \ncongé]],\"\")","v":"2020-10-02"},{"$f":"IF(Tableau1[[#This Row],[Date de fin\nSoins actifs]]<>\"\",\"Non\",\"Oui\")","v":"Non"},null,"2020-10-02","Retour à domicile",710,null,"Ergothérapie",{"$f":"IFERROR(DATEDIF(Tableau1[[#This Row],[Date dépôt demande]],Tableau1[[#This Row],[Date\nd''admission]],\"D\"),\"\")","v":6},{"$f":"IFERROR(IF(AND(Tableau1[[#This Row],[Date\nd''admission]]<>\"\",Tableau1[[#This Row],[Date \ncongé]]<>\"\"),DATEDIF(Tableau1[[#This Row],[Date\nd''admission]],Tableau1[[#This Row],[Date \ncongé]],\"D\"),\"\"),\"\")","v":24},null,null,{"$f":"IFERROR(DATEDIF(Tableau1[[#This Row],[Date dépôt MAH]],Tableau1[[#This Row],[Date orientation]],\"D\"),\"\")","v":0}]
["René_Léosa",14,{"$f":"VLOOKUP(B8,Chambres!$A$2:$C$33,3,FALSE)","v":"Régulier"},{"$f":"IF(AND(Tableau1[[#This Row],[Date\nd''admission]]<>\"\",Tableau1[[#This Row],[Date \ncongé]]=\"\"),\"Occupée\",IF(Tableau1[[#This Row],[Date \ncongé]]<>\"\",\"Congé\",\"Libre\"))","v":"Occupée"},null,null,"P009088","1949-07-07",{"$f":"(IF(Tableau1[[#This Row],[Date de\nnaissance]]<>\"\",DATEDIF(Tableau1[[#This Row],[Date de\nnaissance]],TODAY(),\"Y\"),\"\"))","v":71},{"$f":"IF(Tableau1[[#This Row],[Âge]]<=60,\"60 et -\",IF(Tableau1[[#This Row],[Âge]]<=65,\"61-65\",IF(Tableau1[[#This Row],[Âge]]<=70,\"66-70\",IF(Tableau1[[#This Row],[Âge]]<=75,\"71-75\",IF(Tableau1[[#This Row],[Âge]]<=80,\"76-80\",IF(Tableau1[[#This Row],[Âge]]<=85,\"81-85\",IF(Tableau1[[#This Row],[Âge]]<=110,\"86 et +\",\"\")))))))","v":"71-75"},"2021-04-02","Autre","HSC","2021-04-06",{"$f":"IF(Tableau1[[#This Row],[Date\nd''admission]]<>\"\",IF(Tableau1[[#This Row],[Site]]=\"René_Léosa\",Tableau1[[#This Row],[Date\nd''admission]]+45,\"\"))","v":"2021-05-21"},null,191,null,"Oui",null,{"$f":"IF(Tableau1[[#This Row],[Date \ncongé]]<>\"\",Tableau1[[#This Row],[Date \ncongé]],\"\")","v":""},{"$f":"IF(Tableau1[[#This Row],[Date de fin\nSoins actifs]]<>\"\",\"Non\",\"Oui\")","v":"Oui"},null,null,null,null,null,null,{"$f":"IFERROR(DATEDIF(Tableau1[[#This Row],[Date dépôt demande]],Tableau1[[#This Row],[Date\nd''admission]],\"D\"),\"\")","v":4},{"$f":"IFERROR(IF(AND(Tableau1[[#This Row],[Date\nd''admission]]<>\"\",Tableau1[[#This Row],[Date \ncongé]]<>\"\"),DATEDIF(Tableau1[[#This Row],[Date\nd''admission]],Tableau1[[#This Row],[Date \ncongé]],\"D\"),\"\"),\"\")","v":""},null,null,{"$f":"IFERROR(DATEDIF(Tableau1[[#This Row],[Date dépôt MAH]],Tableau1[[#This Row],[Date orientation]],\"D\"),\"\")","v":0}]
["René_Léosa",15,{"$f":"VLOOKUP(B9,Chambres!$A$2:$C$33,3,FALSE)","v":"Régulier"},{"$f":"IF(AND(Tableau1[[#This Row],[Date\nd''admission]]<>\"\",Tableau1[[#This Row],[Date \ncongé]]=\"\"),\"Occupée\",IF(Tableau1[[#This Row],[Date \ncongé]]<>\"\",\"Congé\",\"Libre\"))","v":"Congé"},null,null,"P051448",null,{"$f":"(IF(Tableau1[[#This Row],[Date de\nnaissance]]<>\"\",DATEDIF(Tableau1[[#This Row],[Date de\nnaissance]],TODAY(),\"Y\"),\"\"))","v":""},{"$f":"IF(Tableau1[[#This Row],[Âge]]<=60,\"60 et -\",IF(Tableau1[[#This Row],[Âge]]<=65,\"61-65\",IF(Tableau1[[#This Row],[Âge]]<=70,\"66-70\",IF(Tableau1[[#This Row],[Âge]]<=75,\"71-75\",IF(Tableau1[[#This Row],[Âge]]<=80,\"76-80\",IF(Tableau1[[#This Row],[Âge]]<=85,\"81-85\",IF(Tableau1[[#This Row],[Âge]]<=110,\"86 et +\",\"\")))))))","v":""},"2021-02-12","UTRF","HSC","2021-02-15",{"$f":"IF(Tableau1[[#This Row],[Date\nd''admission]]<>\"\",IF(Tableau1[[#This Row],[Site]]=\"René_Léosa\",Tableau1[[#This Row],[Date\nd''admission]]+45,\"\"))","v":"2021-04-01"},null,191,null,"Non",null,{"$f":"IF(Tableau1[[#This Row],[Date \ncongé]]<>\"\",Tableau1[[#This Row],[Date \ncongé]],\"\")","v":"2021-03-19"},{"$f":"IF(Tableau1[[#This Row],[Date de fin\nSoins actifs]]<>\"\",\"Non\",\"Oui\")","v":"Non"},null,"2021-03-19","Retour à domicile",null,null,"Physiothérapie",{"$f":"IFERROR(DATEDIF(Tableau1[[#This Row],[Date dépôt demande]],Tableau1[[#This Row],[Date\nd''admission]],\"D\"),\"\")","v":3},{"$f":"IFERROR(IF(AND(Tableau1[[#This Row],[Date\nd''admission]]<>\"\",Tableau1[[#This Row],[Date \ncongé]]<>\"\"),DATEDIF(Tableau1[[#This Row],[Date\nd''admission]],Tableau1[[#This Row],[Date \ncongé]],\"D\"),\"\"),\"\")","v":32},null,null,{"$f":"IFERROR(DATEDIF(Tableau1[[#This Row],[Date dépôt MAH]],Tableau1[[#This Row],[Date orientation]],\"D\"),\"\")","v":0}]
["René_Léosa",15,{"$f":"VLOOKUP(B10,Chambres!$A$2:$C$33,3,FALSE)","v":"Régulier"},{"$f":"IF(AND(Tableau1[[#This Row],[Date\nd''admission]]<>\"\",Tableau1[[#This Row],[Date \ncongé]]=\"\"),\"Occupée\",IF(Tableau1[[#This Row],[Date \ncongé]]<>\"\",\"Congé\",\"Libre\"))","v":"Libre"},null,null,null,null,{"$f":"(IF(Tableau1[[#This Row],[Date de\nnaissance]]<>\"\",DATEDIF(Tableau1[[#This Row],[Date de\nnaissance]],TODAY(),\"Y\"),\"\"))","v":""},{"$f":"IF(Tableau1[[#This Row],[Âge]]<=60,\"60 et -\",IF(Tableau1[[#This Row],[Âge]]<=65,\"61-65\",IF(Tableau1[[#This Row],[Âge]]<=70,\"66-70\",IF(Tableau1[[#This Row],[Âge]]<=75,\"71-75\",IF(Tableau1[[#This Row],[Âge]]<=80,\"76-80\",IF(Tableau1[[#This Row],[Âge]]<=85,\"81-85\",IF(Tableau1[[#This Row],[Âge]]<=110,\"86 et +\",\"\")))))))","v":""},null,null,null,null,{"$f":"IF(Tableau1[[#This Row],[Date\nd''admission]]<>\"\",IF(Tableau1[[#This Row],[Site]]=\"René_Léosa\",Tableau1[[#This Row],[Date\nd''admission]]+45,\"\"))","v":false},null,null,null,null,null,{"$f":"IF(Tableau1[[#This Row],[Date \ncongé]]<>\"\",Tableau1[[#This Row],[Date \ncongé]],\"\")","v":""},{"$f":"IF(Tableau1[[#This Row],[Date de fin\nSoins actifs]]<>\"\",\"Non\",\"Oui\")","v":"Oui"},null,null,null,null,null,null,{"$f":"IFERROR(DATEDIF(Tableau1[[#This Row],[Date dépôt demande]],Tableau1[[#This Row],[Date\nd''admission]],\"D\"),\"\")","v":0},{"$f":"IFERROR(IF(AND(Tableau1[[#This Row],[Date\nd''admission]]<>\"\",Tableau1[[#This Row],[Date \ncongé]]<>\"\"),DATEDIF(Tableau1[[#This Row],[Date\nd''admission]],Tableau1[[#This Row],[Date \ncongé]],\"D\"),\"\"),\"\")","v":""},null,null,{"$f":"IFERROR(DATEDIF(Tableau1[[#This Row],[Date dépôt MAH]],Tableau1[[#This Row],[Date orientation]],\"D\"),\"\")","v":0}]
{"$rows_left_out":75}
{"sheet":"Tableau de bord","index":1,"n_rows":73,"n_cols":16,"rows_kept":73,"cut":false,"hidden":false,"merged":[[32,1,32,2],[16,10,17,14],[1,1,1,14],[4,10,4,14],[4,4,4,5],[4,1,4,2],[14,1,14,2],[4,7,4,8],[14,4,14,5],[12,7,12,8]]}
[]
[null,"Tableau de bord"]
[]
[null,"Statut","Congé"]
[null,"Durée moyenne de séjour par site",null,null,"Durée moyenne d'attente du dépôt de la demande à l'admission par site",null,null,"Nombre d'usagers admis actifs au SAD",null,null,"Portrait des profils par usager à l'admission selon le site"]
[null,"Sites","DMS",null,"Site","Moyenne attente",null,"Actif au SAD","Nombre de Nom",null,null,"Sites"]
[null,"CFGH",52.863636363636367,null,"CFGH",6.8990825688073398,null,"Non",60,null,"Profil","CFGH","René_Léosa","_600_Bousquet_HT","_600_Bousquet_NSA","Total général"]
[null,"René_Léosa",34,null,"René_Léosa",4.4749999999999996,null,"Oui",138,null,110]
[null,"_600_Bousquet_NSA",34.478260869565219,null,"_600_Bousquet_HT",3,null,"(vide)",30,null,121]
[null,"Total général",42.863874345549739,null,"_600_Bousquet_NSA",3.625,null,"Total général",228,null,191]
{"$rows_left_out":64}
{"sheet":"Chambres","index":2,"n_rows":36,"n_cols":5,"rows_kept":36,"cut":false,"hidden":false,"merged":[]}
["No","Site","Catégorie",null,"Catégorie"]
[11,"René-Léosa","Régulier",null,"1NC"]
[13,"René-Léosa","Régulier",null,"1NP"]
[14,"René-Léosa","Régulier",null,"Prothétique"]
[15,"René-Léosa","Régulier",null,"Régulier"]
[17,"René-Léosa","Régulier"]
[18,"René-Léosa","Régulier"]
[218,"_600_Bousquet_NSA","Régulier"]
[276,"_600_Bousquet_NSA","Prothétique"]
[277,"_600_Bousquet_NSA","Prothétique"]
{"$rows_left_out":27}
{"sheet":"Menus (données)","index":3,"n_rows":17,"n_cols":25,"rows_kept":17,"cut":false,"hidden":false,"merged":[]}
["Motif",null,"Provenance",null,"Orientation",null,"Iso Smaff",null,"Profil",null,"Actif_SAD",null,"Référence",null,"Statut",null,"Période",null,"Site",null,"CFGH",null,"René_Léosa",null,"_600_Bousquet_NSA"]
["Conval",null,"CH ext.",null,"CHSLD",null,0,null,110,null,"Oui",null,"Ergothérapie",null,"Annulée",null,"P01",null,"_600_Bousquet_NSA",null,1048,null,11,null,218]
["Éval-ori",null,"CHUS",null,"Décès",null,1,null,121,null,"Non",null,"Inhalothérapie",null,"Réservée",null,"P02",null,"CFGH",null,1049,null,13,null,276]
["UTRF",null,"HSC",null,"Maison S. Pall.",null,2,null,131,null,null,null,"Nutrition",null,"Transférée",null,"P03",null,"René_Léosa",null,1050,null,14,null,277]
["Urgence sociale",null,"UCDG",null,"Relocalisation RI cognitive",null,3,null,191,null,null,null,"Physiothérapie",null,null,null,"P04",null,null,null,1051,null,15,null,279]
["Autre",null,"Autre",null,"Relocalisation RI multiproblématiques",null,4,null,192,null,null,null,"Service social",null,null,null,"P05",null,null,null,1052,null,17,null,280]
[null,null,null,null,"Relocalisation RI physique",null,5,null,210,null,null,null,"Soins infirmiers",null,null,null,"P06",null,null,null,1053,null,18,null,281]
[null,null,null,null,"Relocalisation RPA",null,6,null,311,null,null,null,null,null,null,null,"P07",null,null,null,1054,null,null,null,282]
[null,null,null,null,"Relocalisation RTF",null,7,null,312,null,null,null,null,null,null,null,"P08",null,null,null,1056,null,null,null,370]
[null,null,null,null,"Retour à domicile",null,8,null,410,null,null,null,null,null,null,null,"P09",null,null,null,1057,null,null,null,386]
{"$rows_left_out":7}