{"text_format":"1","workbook":"xlsx","n_sheets":9,"sheets":["HOWTO","Timesheet","MyTime","Projets","WEEK","VBA","Absence","Log","Abs"],"not_rendered":{"charts":0,"images":2,"macros":1,"external_links":1,"defined_names":17,"comments":0,"pivot_tables":0},"unopened":[],"bounds":{"document_bytes":16777216,"sheet_cells":100000,"rows_first":2000,"rows_last":500,"rows_between":2000,"halvings":0,"cell_chars":16384,"cell_head_chars":4096},"cells_cut":0,"cells_raw":0,"read":"whole","date_system":"1900"}

{"sheet":"HOWTO","index":0,"n_rows":55,"n_cols":4,"rows_kept":55,"cut":false,"hidden":false,"merged":[]}
[]
[]
[]
[null,"Utilisation Générale"]
[]
[1,"Le Template est préparé chaque année par le CFO"]
[]
[2,"Renommer le fichier en faisant bien attention à respecter le coding pour le nom de fichier"]
[null,"(Note: Les matricules sont dispo dans Horoquartz)"]
[]
[]
[]
[]
[]
[]
[3,"Donner au CFO l'emplacement sur le réseau où est conservée la Timesheet"]
[]
[4,"Dans l'onglet Timesheet, cliquer sur le bouton \"Mettre à jour mes absences\""]
[]
[]
{"$rows_left_out":36}
{"sheet":"Timesheet","index":1,"n_rows":263,"n_cols":23,"rows_kept":263,"cut":false,"hidden":false,"merged":[]}
[null,null,"Nb jours > 8h",{"$f":"VBA!C9","v":0}]
[null,null,"Nb jours non alloué",{"$f":"VBA!C10","v":1}]
[null,null,null,null,null,{"$f":"IF(ISNA(VLOOKUP(F9,Projets!$B:$B,1,FALSE))=TRUE,1,0)","v":0},{"$f":"IF(ISNA(VLOOKUP(G9,Projets!$B:$B,1,FALSE))=TRUE,1,0)","v":0},{"$f":"IF(ISNA(VLOOKUP(H9,Projets!$B:$B,1,FALSE))=TRUE,1,0)","v":0},{"$f":"IF(ISNA(VLOOKUP(I9,Projets!$B:$B,1,FALSE))=TRUE,1,0)","v":0},{"$f":"IF(ISNA(VLOOKUP(J9,Projets!$B:$B,1,FALSE))=TRUE,1,0)","v":0},{"$f":"IF(ISNA(VLOOKUP(K9,Projets!$B:$B,1,FALSE))=TRUE,1,0)","v":0},null,{"$f":"IF(ISNA(VLOOKUP(M9,Projets!$B:$B,1,FALSE))=TRUE,1,0)","v":1},{"$f":"IF(ISNA(VLOOKUP(N9,Projets!$B:$B,1,FALSE))=TRUE,1,0)","v":0},null,null,null,null,null,null,null,null,{"$f":"IF(ISNA(VLOOKUP(W9,Projets!$B:$B,1,FALSE))=TRUE,1,0)","v":1}]
[null,null,null,{"$f":"VBA!C5","v":"MAT"},null,{"$f":"ROW(F9)+1","v":10},{"$f":"ROW(G9)+1","v":10},10,10,10,{"$f":"ROW(K9)+1","v":10},null,{"$f":"ROW(M9)+1","v":10},10,null,null,null,null,null,null,null,null,{"$f":"ROW(W9)+1","v":10}]
[null,null,null,null,null,{"$f":"ROW(F9)+F6","v":9},{"$f":"ROW(G9)+G6","v":9},9,9,9,{"$f":"ROW(K9)+K6","v":9},null,{"$f":"ROW(M9)+M6","v":9},10,null,null,null,null,null,null,null,null,{"$f":"ROW(W9)+W6","v":9}]
[null,null,null,null,null,{"$f":"COUNTIF(F$9:F$10154,\">0\")","v":0},0,0,0,0,0,null,{"$f":"COUNTIF(M$9:M$10154,\">0\")","v":0},{"$f":"COUNTIF(N$9:N$10154,\">0\")+COUNTIF(N$9:N$10154,\"<0\")","v":1},{"$f":"COUNTIF(O$9:O$10154,\">8\")","v":0},null,null,null,null,null,null,null,{"$f":"COUNTIF(W$9:W$10154,\">0\")","v":0}]
[null,null,null,null,null,"Heures projet",null,null,null,null,null,null,"Heures totales"]
[null,null,null,"Projet",null,{"$f":"IFERROR(VLOOKUP(F9,Projets!$B:$E,2,FALSE),\"\")","v":"MONTANA"},{"$f":"IFERROR(VLOOKUP(G9,Projets!$B:$E,2,FALSE),\"Saisir code projet ci-dessous\")","v":"VEGA"},{"$f":"IFERROR(VLOOKUP(H9,Projets!$B:$E,2,FALSE),\"Saisir code projet ci-dessous\")","v":"GTT"},{"$f":"IFERROR(VLOOKUP(I9,Projets!$B:$E,2,FALSE),\"\")","v":"Autres projets / Vie Série"},{"$f":"IFERROR(VLOOKUP(J9,Projets!$B:$E,2,FALSE),\"\")","v":"Non projet"},{"$f":"IFERROR(VLOOKUP(K9,Projets!$B:$E,2,FALSE),\"\")","v":"Absence"},null,"Alloué",{"$f":"IFERROR(VLOOKUP(N9,Projets!$B:$E,2,FALSE),\"\")","v":"Non Alloué"},"TOTAL",null,null,null,null,null,null,null,{"$f":"IFERROR(VLOOKUP(W9,Projets!$B:$E,2,FALSE),\"Saisir code projet ci-dessous\")","v":"Saisir code projet ci-dessous"}]
["Semaine","Type jour","Jour","Commentaires","Empty","2020_MONTANA","2020_ALAT_VEGA","2020_GTT_LH1488001","2020_VIESERIE","NOP","ABS","Empty","ALLOC","NOA","TOTAL",null,null,null,null,null,null,null,"NEW"]
[{"$f":"VLOOKUP(C10,WEEK!B:E,2,FALSE)","v":1},{"$f":"VLOOKUP(C10,WEEK!B:E,4,FALSE)","v":"ON"},"2021-01-04",null,null,null,null,null,null,null,{"$f":"SUMIF(Absence!$B:$B,$D$4&\"-\"&C10,Absence!D:D)/COUNTIF(C:C,C10)*8/7","v":0},null,{"$f":"SUM(E10:L10)","v":0},{"$f":"IF(C10>VBA!$C$19,0,(8-SUMIF($C:$C,C10,M:M))/COUNTIF(C:C,C10))","v":8},{"$f":"SUM(M10:N10)","v":8}]
[{"$f":"VLOOKUP(C11,WEEK!B:E,2,FALSE)","v":1},{"$f":"VLOOKUP(C11,WEEK!B:E,4,FALSE)","v":"ON"},"2021-01-05",null,null,null,null,null,null,null,{"$f":"SUMIF(Absence!$B:$B,$D$4&\"-\"&C11,Absence!D:D)/COUNTIF(C:C,C11)*8/7","v":0},null,0,{"$f":"IF(C11>VBA!$C$19,0,(8-SUMIF($C:$C,C11,M:M))/COUNTIF(C:C,C11))","v":0},0]
[{"$f":"VLOOKUP(C12,WEEK!B:E,2,FALSE)","v":1},{"$f":"VLOOKUP(C12,WEEK!B:E,4,FALSE)","v":"ON"},"2021-01-06",null,null,null,null,null,null,null,{"$f":"SUMIF(Absence!$B:$B,$D$4&\"-\"&C12,Absence!D:D)/COUNTIF(C:C,C12)*8/7","v":0},null,0,{"$f":"IF(C12>VBA!$C$19,0,(8-SUMIF($C:$C,C12,M:M))/COUNTIF(C:C,C12))","v":0},0]
[{"$f":"VLOOKUP(C13,WEEK!B:E,2,FALSE)","v":1},{"$f":"VLOOKUP(C13,WEEK!B:E,4,FALSE)","v":"ON"},"2021-01-07",null,null,null,null,null,null,null,{"$f":"SUMIF(Absence!$B:$B,$D$4&\"-\"&C13,Absence!D:D)/COUNTIF(C:C,C13)*8/7","v":0},null,0,{"$f":"IF(C13>VBA!$C$19,0,(8-SUMIF($C:$C,C13,M:M))/COUNTIF(C:C,C13))","v":0},0]
[{"$f":"VLOOKUP(C14,WEEK!B:E,2,FALSE)","v":1},{"$f":"VLOOKUP(C14,WEEK!B:E,4,FALSE)","v":"ON"},"2021-01-08",null,null,null,null,null,null,null,{"$f":"SUMIF(Absence!$B:$B,$D$4&\"-\"&C14,Absence!D:D)/COUNTIF(C:C,C14)*8/7","v":0},null,0,{"$f":"IF(C14>VBA!$C$19,0,(8-SUMIF($C:$C,C14,M:M))/COUNTIF(C:C,C14))","v":0},{"$f":"SUM(M14:N14)","v":0}]
[{"$f":"VLOOKUP(C15,WEEK!B:E,2,FALSE)","v":2},{"$f":"VLOOKUP(C15,WEEK!B:E,4,FALSE)","v":"ON"},"2021-01-11",null,null,null,null,null,null,null,{"$f":"SUMIF(Absence!$B:$B,$D$4&\"-\"&C15,Absence!D:D)/COUNTIF(C:C,C15)*8/7","v":0},null,0,{"$f":"IF(C15>VBA!$C$19,0,(8-SUMIF($C:$C,C15,M:M))/COUNTIF(C:C,C15))","v":0},0]
[{"$f":"VLOOKUP(C16,WEEK!B:E,2,FALSE)","v":2},{"$f":"VLOOKUP(C16,WEEK!B:E,4,FALSE)","v":"ON"},"2021-01-12",null,null,null,null,null,null,null,{"$f":"SUMIF(Absence!$B:$B,$D$4&\"-\"&C16,Absence!D:D)/COUNTIF(C:C,C16)*8/7","v":0},null,0,{"$f":"IF(C16>VBA!$C$19,0,(8-SUMIF($C:$C,C16,M:M))/COUNTIF(C:C,C16))","v":0},0]
[{"$f":"VLOOKUP(C17,WEEK!B:E,2,FALSE)","v":2},{"$f":"VLOOKUP(C17,WEEK!B:E,4,FALSE)","v":"ON"},"2021-01-13",null,null,null,null,null,null,null,{"$f":"SUMIF(Absence!$B:$B,$D$4&\"-\"&C17,Absence!D:D)/COUNTIF(C:C,C17)*8/7","v":0},null,0,{"$f":"IF(C17>VBA!$C$19,0,(8-SUMIF($C:$C,C17,M:M))/COUNTIF(C:C,C17))","v":0},{"$f":"SUM(M17:N17)","v":0}]
[{"$f":"VLOOKUP(C18,WEEK!B:E,2,FALSE)","v":2},{"$f":"VLOOKUP(C18,WEEK!B:E,4,FALSE)","v":"ON"},"2021-01-14",null,null,null,null,null,null,null,{"$f":"SUMIF(Absence!$B:$B,$D$4&\"-\"&C18,Absence!D:D)/COUNTIF(C:C,C18)*8/7","v":0},null,0,{"$f":"IF(C18>VBA!$C$19,0,(8-SUMIF($C:$C,C18,M:M))/COUNTIF(C:C,C18))","v":0},0]
[{"$f":"VLOOKUP(C19,WEEK!B:E,2,FALSE)","v":2},{"$f":"VLOOKUP(C19,WEEK!B:E,4,FALSE)","v":"ON"},"2021-01-15",null,null,null,null,null,null,null,{"$f":"SUMIF(Absence!$B:$B,$D$4&\"-\"&C19,Absence!D:D)/COUNTIF(C:C,C19)*8/7","v":0},null,0,{"$f":"IF(C19>VBA!$C$19,0,(8-SUMIF($C:$C,C19,M:M))/COUNTIF(C:C,C19))","v":0},0]
[{"$f":"VLOOKUP(C20,WEEK!B:E,2,FALSE)","v":3},{"$f":"VLOOKUP(C20,WEEK!B:E,4,FALSE)","v":"ON"},"2021-01-18",null,null,null,null,null,null,null,{"$f":"SUMIF(Absence!$B:$B,$D$4&\"-\"&C20,Absence!D:D)/COUNTIF(C:C,C20)*8/7","v":0},null,0,{"$f":"IF(C20>VBA!$C$19,0,(8-SUMIF($C:$C,C20,M:M))/COUNTIF(C:C,C20))","v":0},{"$f":"SUM(M20:N20)","v":0}]
{"$rows_left_out":244}
{"sheet":"MyTime","index":2,"n_rows":16,"n_cols":16,"rows_kept":16,"cut":false,"hidden":false,"merged":[]}
[]
[null,null,{"$f":"EOMONTH(DATE(VBA!$C$6,C8,1),0)+1","v":"2021-02-01"},{"$f":"EOMONTH(DATE(VBA!$C$6,D8,1),0)+1","v":"2021-03-01"},{"$f":"EOMONTH(DATE(VBA!$C$6,E8,1),0)+1","v":"2021-04-01"},{"$f":"EOMONTH(DATE(VBA!$C$6,F8,1),0)+1","v":"2021-05-01"},{"$f":"EOMONTH(DATE(VBA!$C$6,G8,1),0)+1","v":"2021-06-01"},{"$f":"EOMONTH(DATE(VBA!$C$6,H8,1),0)+1","v":"2021-07-01"},{"$f":"EOMONTH(DATE(VBA!$C$6,I8,1),0)+1","v":"2021-08-01"},{"$f":"EOMONTH(DATE(VBA!$C$6,J8,1),0)+1","v":"2021-09-01"},{"$f":"EOMONTH(DATE(VBA!$C$6,K8,1),0)+1","v":"2021-10-01"},{"$f":"EOMONTH(DATE(VBA!$C$6,L8,1),0)+1","v":"2021-11-01"},{"$f":"EOMONTH(DATE(VBA!$C$6,M8,1),0)+1","v":"2021-12-01"},{"$f":"EOMONTH(DATE(VBA!$C$6,N8,1),0)+1","v":"2022-01-01"}]
[]
[]
[]
[]
[null,null,"Mois",null,null,null,null,null,null,null,null,null,null,null,{"$f":"\"TOTAL \"&VBA!C6","v":"TOTAL 2021"}]
[null,"Projet",1,2,3,4,5,6,7,8,9,10,11,12,"En heures","En %"]
[{"$f":"COLUMN(Timesheet!F8)","v":6},{"$f":"Timesheet!F8","v":"MONTANA"},{"$f":"SUMIF(Timesheet!$C:$C,\"<\"&MyTime!C$2,Timesheet!$F:$F)","v":0},{"$f":"SUMIF(Timesheet!$C:$C,\"<\"&MyTime!D$2,Timesheet!$F:$F)-SUM($C9:C9)","v":0},{"$f":"SUMIF(Timesheet!$C:$C,\"<\"&MyTime!E$2,Timesheet!$F:$F)-SUM($C9:D9)","v":0},{"$f":"SUMIF(Timesheet!$C:$C,\"<\"&MyTime!F$2,Timesheet!$F:$F)-SUM($C9:E9)","v":0},{"$f":"SUMIF(Timesheet!$C:$C,\"<\"&MyTime!G$2,Timesheet!$F:$F)-SUM($C9:F9)","v":0},{"$f":"SUMIF(Timesheet!$C:$C,\"<\"&MyTime!H$2,Timesheet!$F:$F)-SUM($C9:G9)","v":0},{"$f":"SUMIF(Timesheet!$C:$C,\"<\"&MyTime!I$2,Timesheet!$F:$F)-SUM($C9:H9)","v":0},{"$f":"SUMIF(Timesheet!$C:$C,\"<\"&MyTime!J$2,Timesheet!$F:$F)-SUM($C9:I9)","v":0},{"$f":"SUMIF(Timesheet!$C:$C,\"<\"&MyTime!K$2,Timesheet!$F:$F)-SUM($C9:J9)","v":0},{"$f":"SUMIF(Timesheet!$C:$C,\"<\"&MyTime!L$2,Timesheet!$F:$F)-SUM($C9:K9)","v":0},{"$f":"SUMIF(Timesheet!$C:$C,\"<\"&MyTime!M$2,Timesheet!$F:$F)-SUM($C9:L9)","v":0},{"$f":"SUMIF(Timesheet!$C:$C,\"<\"&MyTime!N$2,Timesheet!$F:$F)-SUM($C9:M9)","v":0},{"$f":"IF(B9=\"\",\"\",SUM(C9:N9))","v":0},{"$f":"IFERROR(O9/$O$16,\"\")","v":0}]
[{"$f":"+A9+1","v":7},{"$f":"OFFSET(Timesheet!$F$8,0,A10-$A$9)","v":"VEGA"},{"$f":"SUMIF(Timesheet!$C:$C,\"<\"&MyTime!C$2,Timesheet!$G:$G)","v":0},{"$f":"SUMIF(Timesheet!$C:$C,\"<\"&MyTime!D$2,Timesheet!$G:$G)-SUM($C10:C10)","v":0},{"$f":"SUMIF(Timesheet!$C:$C,\"<\"&MyTime!E$2,Timesheet!$G:$G)-SUM($C10:D10)","v":0},{"$f":"SUMIF(Timesheet!$C:$C,\"<\"&MyTime!F$2,Timesheet!$G:$G)-SUM($C10:E10)","v":0},{"$f":"SUMIF(Timesheet!$C:$C,\"<\"&MyTime!G$2,Timesheet!$G:$G)-SUM($C10:F10)","v":0},{"$f":"SUMIF(Timesheet!$C:$C,\"<\"&MyTime!H$2,Timesheet!$G:$G)-SUM($C10:G10)","v":0},{"$f":"SUMIF(Timesheet!$C:$C,\"<\"&MyTime!I$2,Timesheet!$G:$G)-SUM($C10:H10)","v":0},{"$f":"SUMIF(Timesheet!$C:$C,\"<\"&MyTime!J$2,Timesheet!$G:$G)-SUM($C10:I10)","v":0},{"$f":"SUMIF(Timesheet!$C:$C,\"<\"&MyTime!K$2,Timesheet!$G:$G)-SUM($C10:J10)","v":0},{"$f":"SUMIF(Timesheet!$C:$C,\"<\"&MyTime!L$2,Timesheet!$G:$G)-SUM($C10:K10)","v":0},{"$f":"SUMIF(Timesheet!$C:$C,\"<\"&MyTime!M$2,Timesheet!$G:$G)-SUM($C10:L10)","v":0},{"$f":"SUMIF(Timesheet!$C:$C,\"<\"&MyTime!N$2,Timesheet!$G:$G)-SUM($C10:M10)","v":0},{"$f":"IF(B10=\"\",\"\",SUM(C10:N10))","v":0},0]
[{"$f":"+A10+1","v":8},{"$f":"OFFSET(Timesheet!$F$8,0,A11-$A$9)","v":"GTT"},{"$f":"SUMIF(Timesheet!$C:$C,\"<\"&MyTime!C$2,Timesheet!$H:$H)","v":0},{"$f":"SUMIF(Timesheet!$C:$C,\"<\"&MyTime!D$2,Timesheet!$H:$H)-SUM($C11:C11)","v":0},{"$f":"SUMIF(Timesheet!$C:$C,\"<\"&MyTime!E$2,Timesheet!$H:$H)-SUM($C11:D11)","v":0},{"$f":"SUMIF(Timesheet!$C:$C,\"<\"&MyTime!F$2,Timesheet!$H:$H)-SUM($C11:E11)","v":0},{"$f":"SUMIF(Timesheet!$C:$C,\"<\"&MyTime!G$2,Timesheet!$H:$H)-SUM($C11:F11)","v":0},{"$f":"SUMIF(Timesheet!$C:$C,\"<\"&MyTime!H$2,Timesheet!$H:$H)-SUM($C11:G11)","v":0},{"$f":"SUMIF(Timesheet!$C:$C,\"<\"&MyTime!I$2,Timesheet!$H:$H)-SUM($C11:H11)","v":0},{"$f":"SUMIF(Timesheet!$C:$C,\"<\"&MyTime!J$2,Timesheet!$H:$H)-SUM($C11:I11)","v":0},{"$f":"SUMIF(Timesheet!$C:$C,\"<\"&MyTime!K$2,Timesheet!$H:$H)-SUM($C11:J11)","v":0},{"$f":"SUMIF(Timesheet!$C:$C,\"<\"&MyTime!L$2,Timesheet!$H:$H)-SUM($C11:K11)","v":0},{"$f":"SUMIF(Timesheet!$C:$C,\"<\"&MyTime!M$2,Timesheet!$H:$H)-SUM($C11:L11)","v":0},{"$f":"SUMIF(Timesheet!$C:$C,\"<\"&MyTime!N$2,Timesheet!$H:$H)-SUM($C11:M11)","v":0},0,0]
[{"$f":"COLUMN(Timesheet!I8)","v":9},{"$f":"OFFSET(Timesheet!$F$8,0,A12-$A$9)","v":"Autres projets / Vie Série"},{"$f":"SUMIF(Timesheet!$C:$C,\"<\"&MyTime!C$2,Timesheet!$I:$I)","v":0},{"$f":"SUMIF(Timesheet!$C:$C,\"<\"&MyTime!D$2,Timesheet!$I:$I)-SUM($C12:C12)","v":0},{"$f":"SUMIF(Timesheet!$C:$C,\"<\"&MyTime!E$2,Timesheet!$I:$I)-SUM($C12:D12)","v":0},{"$f":"SUMIF(Timesheet!$C:$C,\"<\"&MyTime!F$2,Timesheet!$I:$I)-SUM($C12:E12)","v":0},{"$f":"SUMIF(Timesheet!$C:$C,\"<\"&MyTime!G$2,Timesheet!$I:$I)-SUM($C12:F12)","v":0},{"$f":"SUMIF(Timesheet!$C:$C,\"<\"&MyTime!H$2,Timesheet!$I:$I)-SUM($C12:G12)","v":0},{"$f":"SUMIF(Timesheet!$C:$C,\"<\"&MyTime!I$2,Timesheet!$I:$I)-SUM($C12:H12)","v":0},{"$f":"SUMIF(Timesheet!$C:$C,\"<\"&MyTime!J$2,Timesheet!$I:$I)-SUM($C12:I12)","v":0},{"$f":"SUMIF(Timesheet!$C:$C,\"<\"&MyTime!K$2,Timesheet!$I:$I)-SUM($C12:J12)","v":0},{"$f":"SUMIF(Timesheet!$C:$C,\"<\"&MyTime!L$2,Timesheet!$I:$I)-SUM($C12:K12)","v":0},{"$f":"SUMIF(Timesheet!$C:$C,\"<\"&MyTime!M$2,Timesheet!$I:$I)-SUM($C12:L12)","v":0},{"$f":"SUMIF(Timesheet!$C:$C,\"<\"&MyTime!N$2,Timesheet!$I:$I)-SUM($C12:M12)","v":0},0,0]
[null,{"$f":"Timesheet!J8","v":"Non projet"},{"$f":"SUMIF(Timesheet!$C:$C,\"<\"&MyTime!C$2,Timesheet!$J:$J)","v":0},{"$f":"SUMIF(Timesheet!$C:$C,\"<\"&MyTime!D$2,Timesheet!$J:$J)-SUM($C13:C13)","v":0},{"$f":"SUMIF(Timesheet!$C:$C,\"<\"&MyTime!E$2,Timesheet!$J:$J)-SUM($C13:D13)","v":0},{"$f":"SUMIF(Timesheet!$C:$C,\"<\"&MyTime!F$2,Timesheet!$J:$J)-SUM($C13:E13)","v":0},{"$f":"SUMIF(Timesheet!$C:$C,\"<\"&MyTime!G$2,Timesheet!$J:$J)-SUM($C13:F13)","v":0},{"$f":"SUMIF(Timesheet!$C:$C,\"<\"&MyTime!H$2,Timesheet!$J:$J)-SUM($C13:G13)","v":0},{"$f":"SUMIF(Timesheet!$C:$C,\"<\"&MyTime!I$2,Timesheet!$J:$J)-SUM($C13:H13)","v":0},{"$f":"SUMIF(Timesheet!$C:$C,\"<\"&MyTime!J$2,Timesheet!$J:$J)-SUM($C13:I13)","v":0},{"$f":"SUMIF(Timesheet!$C:$C,\"<\"&MyTime!K$2,Timesheet!$J:$J)-SUM($C13:J13)","v":0},{"$f":"SUMIF(Timesheet!$C:$C,\"<\"&MyTime!L$2,Timesheet!$J:$J)-SUM($C13:K13)","v":0},{"$f":"SUMIF(Timesheet!$C:$C,\"<\"&MyTime!M$2,Timesheet!$J:$J)-SUM($C13:L13)","v":0},{"$f":"SUMIF(Timesheet!$C:$C,\"<\"&MyTime!N$2,Timesheet!$J:$J)-SUM($C13:M13)","v":0},{"$f":"IF(B13=\"\",\"\",SUM(C13:N13))","v":0},0]
[null,{"$f":"Timesheet!K8","v":"Absence"},{"$f":"SUMIF(Timesheet!$C:$C,\"<\"&MyTime!C$2,Timesheet!$K:$K)","v":0},{"$f":"SUMIF(Timesheet!$C:$C,\"<\"&MyTime!D$2,Timesheet!$K:$K)-SUM($C14:C14)","v":0},{"$f":"SUMIF(Timesheet!$C:$C,\"<\"&MyTime!E$2,Timesheet!$K:$K)-SUM($C14:D14)","v":0},{"$f":"SUMIF(Timesheet!$C:$C,\"<\"&MyTime!F$2,Timesheet!$K:$K)-SUM($C14:E14)","v":0},{"$f":"SUMIF(Timesheet!$C:$C,\"<\"&MyTime!G$2,Timesheet!$K:$K)-SUM($C14:F14)","v":0},{"$f":"SUMIF(Timesheet!$C:$C,\"<\"&MyTime!H$2,Timesheet!$K:$K)-SUM($C14:G14)","v":0},{"$f":"SUMIF(Timesheet!$C:$C,\"<\"&MyTime!I$2,Timesheet!$K:$K)-SUM($C14:H14)","v":0},{"$f":"SUMIF(Timesheet!$C:$C,\"<\"&MyTime!J$2,Timesheet!$K:$K)-SUM($C14:I14)","v":0},{"$f":"SUMIF(Timesheet!$C:$C,\"<\"&MyTime!K$2,Timesheet!$K:$K)-SUM($C14:J14)","v":0},{"$f":"SUMIF(Timesheet!$C:$C,\"<\"&MyTime!L$2,Timesheet!$K:$K)-SUM($C14:K14)","v":0},{"$f":"SUMIF(Timesheet!$C:$C,\"<\"&MyTime!M$2,Timesheet!$K:$K)-SUM($C14:L14)","v":0},{"$f":"SUMIF(Timesheet!$C:$C,\"<\"&MyTime!N$2,Timesheet!$K:$K)-SUM($C14:M14)","v":0},{"$f":"IF(B14=\"\",\"\",SUM(C14:N14))","v":0},0]
[null,{"$f":"Timesheet!N8","v":"Non Alloué"},{"$f":"SUMIF(Timesheet!$C:$C,\"<\"&MyTime!C$2,Timesheet!$N:$N)","v":8},{"$f":"SUMIF(Timesheet!$C:$C,\"<\"&MyTime!D$2,Timesheet!$N:$N)-SUM($C15:C15)","v":0},{"$f":"SUMIF(Timesheet!$C:$C,\"<\"&MyTime!E$2,Timesheet!$N:$N)-SUM($C15:D15)","v":0},{"$f":"SUMIF(Timesheet!$C:$C,\"<\"&MyTime!F$2,Timesheet!$N:$N)-SUM($C15:E15)","v":0},{"$f":"SUMIF(Timesheet!$C:$C,\"<\"&MyTime!G$2,Timesheet!$N:$N)-SUM($C15:F15)","v":0},{"$f":"SUMIF(Timesheet!$C:$C,\"<\"&MyTime!H$2,Timesheet!$N:$N)-SUM($C15:G15)","v":0},{"$f":"SUMIF(Timesheet!$C:$C,\"<\"&MyTime!I$2,Timesheet!$N:$N)-SUM($C15:H15)","v":0},{"$f":"SUMIF(Timesheet!$C:$C,\"<\"&MyTime!J$2,Timesheet!$N:$N)-SUM($C15:I15)","v":0},{"$f":"SUMIF(Timesheet!$C:$C,\"<\"&MyTime!K$2,Timesheet!$N:$N)-SUM($C15:J15)","v":0},{"$f":"SUMIF(Timesheet!$C:$C,\"<\"&MyTime!L$2,Timesheet!$N:$N)-SUM($C15:K15)","v":0},{"$f":"SUMIF(Timesheet!$C:$C,\"<\"&MyTime!M$2,Timesheet!$N:$N)-SUM($C15:L15)","v":0},{"$f":"SUMIF(Timesheet!$C:$C,\"<\"&MyTime!N$2,Timesheet!$N:$N)-SUM($C15:M15)","v":0},8,1]
[null,"TOTAL HEURES",{"$f":"SUM(C9:C15)","v":8},{"$f":"SUM(D9:D15)","v":0},0,0,0,0,0,0,0,0,0,0,{"$f":"SUM(C16:N16)","v":8},1]

{"sheet":"Projets","index":3,"n_rows":16,"n_cols":10,"rows_kept":16,"cut":false,"hidden":false,"merged":[]}
[]
[null,"NOP","Non projet","Vie_Serie",{"$f":"E3","v":2021}]
[null,"ABS","Absence","Autres",{"$f":"VBA!C6","v":2021}]
[null,"NOA","Non Alloué","Erreur",{"$f":"E3","v":2021},null,null,null,null,"Type"]
[null,null,null,null,null,null,null,null,null,"Montana"]
[null,null,null,null,null,null,null,null,null,"CIR"]
[null,"Code_Projet","Projet","Type","Annee","Project Leader",null,null,null,"NRE"]
[null,"2020_MONTANA","MONTANA","Montana",2020,"Benjamin Cros",null,null,null,"Vie_Serie"]
[null,"2020_VIESERIE","Autres projets / Vie Série","Vie_Serie",2020,"Aucun",null,null,null,"Autres"]
[null,"2020_ALAT_VEGA","VEGA","CIR1",2020,"Alexandre Henry",null,null,null,"Erreur"]
[null,"2020_AIRBUS_ORION","ORION","CIR2",2020,"Alexandre Henry"]
[null,"2020_Airbus_FlangesClamps","FLANGE & CLAMPS","CIR3",2020,"Maxime Duault"]
[null,"2020_GTT_LH1488001","GTT","CIR4",2020,"Mikael bosella"]
[null,"2020_ARIANE6","ARIANE 6","CIR5",2020,"Mikael bosella"]
[null,"2020_Prometheus","PROMETHEE","CIR6",2020,"Mourad Ben Abderrahmane"]
[null,"2020_Microturbo_PAC","PAC","CIR7",2020,"Mikael bosella"]

{"sheet":"WEEK","index":4,"n_rows":368,"n_cols":9,"rows_kept":368,"cut":false,"hidden":false,"merged":[]}
[]
[]
[null,"Jours","semaine","Jsemaine","TYPE",null,null,null,"FERIES"]
[null,"2021-01-01",0,"V",{"$f":"IF(ISNA(VLOOKUP(B4,I:I,1,FALSE))=FALSE,\"OFF\",IF(OR(D4=\"S\",D4=\"D\"),\"OFF\",\"ON\"))","v":"OFF"},null,null,null,"2021-01-01"]
[null,{"$f":"+B4+1","v":"2021-01-02"},{"$f":"+C4","v":0},"S",{"$f":"IF(ISNA(VLOOKUP(B5,I:I,1,FALSE))=FALSE,\"OFF\",IF(OR(D5=\"S\",D5=\"D\"),\"OFF\",\"ON\"))","v":"OFF"},null,null,null,"2021-04-05"]
[null,{"$f":"+B5+1","v":"2021-01-03"},{"$f":"+C5","v":0},"D","OFF",null,null,null,"2021-05-01"]
[null,"2021-01-04",{"$f":"+C6+1","v":1},"L",{"$f":"IF(ISNA(VLOOKUP(B7,I:I,1,FALSE))=FALSE,\"OFF\",IF(OR(D7=\"S\",D7=\"D\"),\"OFF\",\"ON\"))","v":"ON"},null,null,null,"2021-05-08"]
[null,"2021-01-05",{"$f":"+C7","v":1},"M","ON",null,null,null,"2021-05-13"]
[null,"2021-01-06",{"$f":"+C8","v":1},"M","ON",null,null,null,"2021-05-24"]
[null,"2021-01-07",1,"J","ON",null,null,null,"2021-07-14"]
[null,"2021-01-08",1,"V","ON",null,null,null,"2021-08-15"]
[null,"2021-01-09",1,"S","OFF",null,null,null,"2021-11-01"]
[null,"2021-01-10",1,"D","OFF",null,null,null,"2021-11-11"]
[null,{"$f":"+B13+1","v":"2021-01-11"},{"$f":"+C13+1","v":2},"L","ON",null,null,null,"2021-12-25"]
[null,"2021-01-12",{"$f":"+C14","v":2},"M","ON"]
[null,"2021-01-13",{"$f":"+C15","v":2},"M","ON"]
[null,"2021-01-14",2,"J","ON"]
[null,"2021-01-15",2,"V","ON"]
[null,"2021-01-16",2,"S","OFF"]
[null,"2021-01-17",2,"D","OFF"]
{"$rows_left_out":349}
{"sheet":"VBA","index":5,"n_rows":25,"n_cols":7,"rows_kept":25,"cut":false,"hidden":false,"merged":[]}
[]
[null,{"$f":"MID(CELL(\"adresse\",Timesheet!$D$4),SEARCH(\"]\",CELL(\"adresse\",Timesheet!$D$4),1)+1,SEARCH(\"!\",CELL(\"adresse\",Timesheet!$D$4),1)-SEARCH(\"]\",CELL(\"adresse\",Timesheet!$D$4),1)-1)","v":"Timesheet"}]
[null,{"$f":"MID(CELL(\"adresse\",Absence!$D$4),SEARCH(\"]\",CELL(\"adresse\",Absence!$D$4),1)+1,SEARCH(\"!\",CELL(\"adresse\",Absence!$D$4),1)-SEARCH(\"]\",CELL(\"adresse\",Absence!$D$4),1)-1)","v":"Absence"}]
[null,{"$f":"MID(CELL(\"adresse\",MyTime!$D$4),SEARCH(\"]\",CELL(\"adresse\",MyTime!$D$4),1)+1,SEARCH(\"!\",CELL(\"adresse\",MyTime!$D$4),1)-SEARCH(\"]\",CELL(\"adresse\",MyTime!$D$4),1)-1)","v":"MyTime"}]
[null,"Matricule:",{"$f":"MID(CELL(\"adresse\",Timesheet!D6),2,3)","v":"MAT"}]
[null,"Année:",{"$f":"MID(CELL(\"adresse\",Timesheet!D6),6,4)*1","v":2021}]
[null,"Première ligne:",{"$f":"ROW(Timesheet!C9)+1","v":10}]
[null,"Dernière ligne:",{"$f":"COUNTA(Timesheet!C:C)+C7","v":267}]
[null,"Nb jours > 7h",{"$f":"Timesheet!O6","v":0},null,"Nb jours OFF",{"$f":"COUNTIF(Timesheet!B:B,\"OFF\")","v":0}]
[null,"Nb jours non alloué",{"$f":"Timesheet!N6","v":1}]
[null,"Nb projets:",{"$f":"COUNTIF(Timesheet!E6:L6,\">0\")-COUNTIF(Timesheet!J6:L6,\">0\")","v":0}]
[null,"Col_Start",{"$f":"COLUMN(Timesheet!E9)+1","v":6},{"$f":"COLUMN(Timesheet!I8)","v":9}]
[null,"Col_End",{"$f":"C12+C11-1","v":5},{"$f":"COLUMN(Timesheet!K8)","v":11},{"$f":"COLUMN(Timesheet!O8)","v":15},{"$f":"COLUMN(Timesheet!W8)","v":23},{"$f":"COLUMN(Timesheet!I8)","v":9}]
[null,null,null,null,null,{"$f":"ROW(MyTime!A12)-1","v":11}]
[]
[null,"Projet S_Line",{"$f":"ROW(Timesheet!F4)","v":4}]
[null,"Projet E_Line",{"$f":"ROW(Timesheet!F5)","v":5}]
[]
[null,"Aujourdhui:",{"$f":"IF(D19=\"\",TODAY(),D19)","v":"2021-01-04"},null,null,null,{"$f":"DATE(C6,1,1)","v":"2021-01-01"}]
[]
{"$rows_left_out":6}
{"sheet":"Absence","index":6,"n_rows":54,"n_cols":4,"rows_kept":54,"cut":false,"hidden":false,"merged":[]}
[null,"CODING","Duree","Duree_Normalise"]
[null,"329-43831",7,7]
[null,"329-43833",7,7]
[null,"329-43868",7,7]
[null,"329-43889",3.5,3.5]
[null,"329-43924",7,7]
[null,"329-43931",7,7]
[null,"329-43934",7,7]
[null,"329-43944",7,7]
[null,"329-43945",7,7]
[null,"329-43952",7,7]
[null,"329-43959",7,7]
[null,"329-43969",7,7]
[null,"329-43970",7,7]
[null,"329-43971",7,7]
[null,"329-43972",7,7]
[null,"329-43973",7,7]
[null,"329-43983",7,7]
[null,"329-44008",7,7]
[null,"329-44025",7,7]
{"$rows_left_out":35}
{"sheet":"Log","index":7,"n_rows":4,"n_cols":3,"rows_kept":4,"cut":false,"hidden":false,"merged":[]}
[]
[]
[]
[null,"V1.0","Lancement Timesheet"]

{"sheet":"Abs","index":8,"n_rows":1,"n_cols":11,"rows_kept":1,"cut":false,"hidden":true,"merged":[]}
["DAT","NOMPRE","MATRI","MOTIF","VALORIS","MOTYPE","MOTIDUR","IEICATEGOR","CODING","Duree","Duree_Normalise"]