{"text_format":"1","workbook":"xlsx","n_sheets":10,"sheets":["inscriptions","descriptif_du_tournoi","participants retenu","participants_non_retenu","tirage_au_sort","Coupons","Coupons (NR)","poule 3","poule 4","poule 5"],"not_rendered":{"charts":0,"images":0,"macros":1,"external_links":0,"defined_names":11,"comments":6,"pivot_tables":0},"unopened":[],"bounds":{"document_bytes":16777216,"sheet_cells":100000,"rows_first":2000,"rows_last":500,"rows_between":2000,"halvings":0,"cell_chars":16384,"cell_head_chars":4096},"cells_cut":0,"cells_raw":0,"read":"whole","date_system":"1900"}

{"sheet":"inscriptions","index":0,"n_rows":155,"n_cols":9,"rows_kept":155,"cut":false,"hidden":false,"merged":[[0,0,0,8],[2,0,2,8],[9,9,9,11]]}
["Inscriptions tournoi"]
[]
["Tournoi de tennis de table"]
[]
["NB","NOM","Prénom","Écrou","Position","indice ligne","Bâtiments","CCR","avis mds"]
["1","DUPONT","GREGORY",1,111,{"$f":"IF(COUNTIF(G$5:G5,G6)>0,\"\",MAX(F$5:F5)+1)","v":1},"A",null,true]
["2","ATTAL","GABRIEL",45,258,{"$f":"IF(COUNTIF(G$5:G6,G7)>0,\"\",MAX(F$5:F6)+1)","v":""},"A",null,true]
["3","GULLIT","KARL",4500,125,{"$f":"IF(COUNTIF(G$5:G7,G8)>0,\"\",MAX(F$5:F7)+1)","v":2},"B","TASSIN",false]
["4","TASSIN","PETIVIER",2505,458,{"$f":"IF(COUNTIF(G$5:G8,G9)>0,\"\",MAX(F$5:F8)+1)","v":""},"B","GULLIT",false]
["5","BENZEMA","KARIM",58,1,{"$f":"IF(COUNTIF(G$5:G9,G10)>0,\"\",MAX(F$5:F9)+1)","v":3},"C",null,true]
["6","MERRAD","SEFEDINE",9471,144,{"$f":"IF(COUNTIF(G$5:G10,G11)>0,\"\",MAX(F$5:F10)+1)","v":""},"B",null,true]
["7","HAMEL","KAMEL",11052,150,{"$f":"IF(COUNTIF(G$5:G11,G12)>0,\"\",MAX(F$5:F11)+1)","v":""},"B",null,true]
["8","LAKROUF","BRAHIM",10924,109,{"$f":"IF(COUNTIF(G$5:G12,G13)>0,\"\",MAX(F$5:F12)+1)","v":""},"B",null,true]
["9","RENONCOURT","ALEXIS",10634,125,{"$f":"IF(COUNTIF(G$5:G13,G14)>0,\"\",MAX(F$5:F13)+1)","v":""},"B",null,true]
["10","EL JABLI","REDOUANE",10446,133,{"$f":"IF(COUNTIF(G$5:G14,G15)>0,\"\",MAX(F$5:F14)+1)","v":""},"A",null,true]
{"$rows_left_out":141}
{"sheet":"descriptif_du_tournoi","index":1,"n_rows":44,"n_cols":12,"rows_kept":44,"cut":false,"hidden":false,"merged":[[24,0,29,8],[30,0,34,8]]}
[null,null,null,null,null,null,null,null,null,null,null,{"$f":"IFERROR(IF(VLOOKUP(ROW(L1),inscriptions!F:G,2,FALSE)=0,\"\",VLOOKUP(ROW(L1),inscriptions!F:G,2,FALSE)),\"\")","v":"A"}]
[null,null,null,null,null,null,null,null,null,null,null,{"$f":"IFERROR(IF(VLOOKUP(ROW(L2),inscriptions!F:G,2,FALSE)=0,\"\",VLOOKUP(ROW(L2),inscriptions!F:G,2,FALSE)),\"\")","v":"B"}]
[null,"Bâtiment","A",null,"date","2021-04-06",null,"heure","10:00/12:00",null,null,{"$f":"IFERROR(IF(VLOOKUP(ROW(L3),inscriptions!F:G,2,FALSE)=0,\"\",VLOOKUP(ROW(L3),inscriptions!F:G,2,FALSE)),\"\")","v":"C"}]
[null,null,null,null,null,null,null,null,null,null,null,{"$f":"IFERROR(IF(VLOOKUP(ROW(L4),inscriptions!F:G,2,FALSE)=0,\"\",VLOOKUP(ROW(L4),inscriptions!F:G,2,FALSE)),\"\")","v":""}]
[null,null,null,null,null,null,null,null,null,null,null,{"$f":"IFERROR(IF(VLOOKUP(ROW(L5),inscriptions!F:G,2,FALSE)=0,\"\",VLOOKUP(ROW(L5),inscriptions!F:G,2,FALSE)),\"\")","v":""}]
[null,null,null,null,null,null,null,null,null,null,null,{"$f":"IFERROR(IF(VLOOKUP(ROW(L6),inscriptions!F:G,2,FALSE)=0,\"\",VLOOKUP(ROW(L6),inscriptions!F:G,2,FALSE)),\"\")","v":""}]
[null,"Bâtiment","B",null,"date","2021-04-07",null,"heure","14:00/16:00",null,null,{"$f":"IFERROR(IF(VLOOKUP(ROW(L7),inscriptions!F:G,2,FALSE)=0,\"\",VLOOKUP(ROW(L7),inscriptions!F:G,2,FALSE)),\"\")","v":""}]
[null,null,null,null,null,null,null,null,null,null,null,{"$f":"IFERROR(IF(VLOOKUP(ROW(L8),inscriptions!F:G,2,FALSE)=0,\"\",VLOOKUP(ROW(L8),inscriptions!F:G,2,FALSE)),\"\")","v":""}]
[null,null,null,null,null,null,null,null,null,null,null,{"$f":"IFERROR(IF(VLOOKUP(ROW(L9),inscriptions!F:G,2,FALSE)=0,\"\",VLOOKUP(ROW(L9),inscriptions!F:G,2,FALSE)),\"\")","v":""}]
[null,null,null,null,null,null,null,null,null,null,null,{"$f":"IFERROR(IF(VLOOKUP(ROW(L10),inscriptions!F:G,2,FALSE)=0,\"\",VLOOKUP(ROW(L10),inscriptions!F:G,2,FALSE)),\"\")","v":""}]
[null,"Bâtiment","C",null,"date","2021-04-08",null,"heure","9:00/11:00",null,null,{"$f":"IFERROR(IF(VLOOKUP(ROW(L11),inscriptions!F:G,2,FALSE)=0,\"\",VLOOKUP(ROW(L11),inscriptions!F:G,2,FALSE)),\"\")","v":""}]
[null,null,null,null,null,null,null,null,null,null,null,{"$f":"IFERROR(IF(VLOOKUP(ROW(L12),inscriptions!F:G,2,FALSE)=0,\"\",VLOOKUP(ROW(L12),inscriptions!F:G,2,FALSE)),\"\")","v":""}]
[null,null,null,null,null,null,null,null,null,null,null,{"$f":"IFERROR(IF(VLOOKUP(ROW(L13),inscriptions!F:G,2,FALSE)=0,\"\",VLOOKUP(ROW(L13),inscriptions!F:G,2,FALSE)),\"\")","v":""}]
[null,null,null,null,null,null,null,null,null,null,null,{"$f":"IFERROR(IF(VLOOKUP(ROW(L14),inscriptions!F:G,2,FALSE)=0,\"\",VLOOKUP(ROW(L14),inscriptions!F:G,2,FALSE)),\"\")","v":""}]
[null,"Bâtiment",null,null,"date",null,null,"heure",null,null,null,{"$f":"IFERROR(IF(VLOOKUP(ROW(L15),inscriptions!F:G,2,FALSE)=0,\"\",VLOOKUP(ROW(L15),inscriptions!F:G,2,FALSE)),\"\")","v":""}]
{"$rows_left_out":30}
{"sheet":"participants retenu","index":2,"n_rows":151,"n_cols":8,"rows_kept":151,"cut":false,"hidden":false,"merged":[]}
["NB","NOM","Prénom","Écrou","Position","Bâtiments","JOURS","HORAIRE"]
[1,"AA","JORDY",2569,258,"A","2021-04-06","10:00/12:00"]
[2,"ABDELAK","SAMMY",10948,241,"A","2021-04-06","10:00/12:00"]
[3,"ASSMER","ZAKARIA",11178,132,"A","2021-04-08","9:00/11:00"]
[4,"ATTAL","GABRIEL",45,258,"A","2021-04-07","14:00/16:00"]
[5,"CLAQUIN","RANDY",7728,134,"A","2021-04-07","14:00/16:00"]
[6,"DUPONT","GREGORY",1,111,"A","2021-04-07","14:00/16:00"]
[7,"EL JABLI","REDOUANE",10446,133,"A","2021-04-07","14:00/16:00"]
[8,"HADJALI","DJIM",8819,4,"A","2021-04-06","10:00/12:00"]
[9,"MOKHTARI","MOHAMMED",7608,133,"A","2021-04-08","9:00/11:00"]
[10,"HAMEL","KAMEL",11052,150,"B","2021-04-06","10:00/12:00"]
[11,"LAKROUF","BRAHIM",10924,109,"B","2021-04-08","9:00/11:00"]
[12,"MERRAD","SEFEDINE",9471,144,"B","2021-04-08","9:00/11:00"]
[13,"RENONCOURT","ALEXIS",10634,125,"B","2021-04-08","9:00/11:00"]
[14,"BENZEMA","KARIM",58,1,"C","2021-04-06","10:00/12:00"]
{"$rows_left_out":137}
{"sheet":"participants_non_retenu","index":3,"n_rows":151,"n_cols":15,"rows_kept":151,"cut":false,"hidden":false,"merged":[[165,0,165,5]]}
["NB","NOM","Prénom","Écrou","Position","Bâtiments",null," Votre inscription au tournoi a été refusé pour cause de CCR ou avis du responsable des sports"]
[1,"GULLIT","KARL",4500,125,"B",null,null,{"$f":"C2","v":"KARL"},"Position :",{"$f":"E2","v":125},"Bâtiment",{"$f":"F2","v":"B"},"écrou",{"$f":"D2","v":4500}]
[2,"TASSIN","PETIVIER",2505,458,"B"]
[3,"HOURDAIN","GREGORY",1212,245,"A"]
[4,null,null,null,null,null,null,null,{"$f":"C3","v":"PETIVIER"},"Position :",{"$f":"E3","v":458},"Bâtiment",{"$f":"F3","v":"B"},"écrou",{"$f":"D3","v":2505}]
[5]
[6]
[7,null,null,null,null,null,null,null,{"$f":"C4","v":"GREGORY"},"Position :",{"$f":"E4","v":245},"Bâtiment",{"$f":"F4","v":"A"},"écrou",{"$f":"D4","v":1212}]
[8]
[9]
[10]
[11]
[12]
[13]
[14]
{"$rows_left_out":137}
{"sheet":"tirage_au_sort","index":4,"n_rows":104,"n_cols":11,"rows_kept":104,"cut":false,"hidden":false,"merged":[[0,0,0,4],[35,0,35,4],[0,6,0,10],[35,6,35,10],[70,0,70,4],[70,6,70,10]]}
["A",null,null,null,null,null,"B"]
[null,"NOM","Prénom","écrou","present?",null,null,"NOM","Prénom","écrou","present?"]
[1,"DUPONT","GREGORY",1,null,null,1,"MERRAD","SEFEDINE",9471]
[2,"ATTAL","GABRIEL",45,null,null,2,"HAMEL","KAMEL",11052]
[3,"EL JABLI","REDOUANE",10446,null,null,3,"LAKROUF","BRAHIM",10924]
[4,"HADJALI","DJIM",8819,null,null,4,"RENONCOURT","ALEXIS",10634]
[5,"AA","JORDY",2569,null,null,5]
[6,"ABDELAK","SAMMY",10948,null,null,6]
[7,"ASSMER","ZAKARIA",11178,null,null,7]
[8,"CLAQUIN","RANDY",7728,null,null,8]
[9,"MOKHTARI","MOHAMMED",7608,null,null,9]
[10,null,null,null,null,null,10]
[11,null,null,null,null,null,11]
[12,null,null,null,null,null,12]
[13,null,null,null,null,null,13]
{"$rows_left_out":90}
{"sheet":"Coupons","index":5,"n_rows":232,"n_cols":9,"rows_kept":232,"cut":false,"hidden":false,"merged":[]}
[]
["Votre demande de participation au Tournoi de tennis de table a été prise en compte."]
[]
["NOM :","AA JORDY",null,"Ecrou :",2569,"Position :",258,"Bâtiment :","A"]
[]
["L’activité aura lieu le : ",null,"2021-06-04",null,null,"à","10:00/12:00"]
[]
["Merci de vous tenir prêt en cellule 15minutes avant le début de l’activité."]
[]
["Tout retard entraînera définitivement votre retrait du tournoi."]
[null,null,null,null,null,null,null,"Le service des sports."]
[]
[]
[]
["Votre demande de participation au Tournoi de tennis de table a été prise en compte."]
{"$rows_left_out":218}
{"sheet":"Coupons (NR)","index":6,"n_rows":25,"n_cols":9,"rows_kept":25,"cut":false,"hidden":false,"merged":[]}
[]
["Votre inscription au tournoi a été refusé pour cause de CCR ou avis du responsable des sports."]
["( Tournoi de tennis de table )"]
[]
["NOM :","GULLIT KARL",null,"Ecrou :",4500,"Position :",125,"Bâtiment :","B"]
[]
[null,null,null,null,null,null,null,"Le service des sports."]
[]
[]
[]
["Votre inscription au tournoi a été refusé pour cause de CCR ou avis du responsable des sports."]
["( Tournoi de tennis de table )"]
[]
["NOM :","TASSIN PETIVIER",null,"Ecrou :",2505,"Position :",458,"Bâtiment :","B"]
[]
{"$rows_left_out":11}
{"sheet":"poule 3","index":7,"n_rows":5,"n_cols":33,"rows_kept":5,"cut":false,"hidden":false,"merged":[[8,4,8,25],[0,0,1,0],[0,30,0,32],[0,22,0,24],[0,26,0,28],[0,1,0,3],[0,4,0,6],[0,7,0,9]]}
["joueurs","Match 1","Match 2","Match 3","Match 2","Match 5","Match 6","Match 3","Match 5","Match 6",null,null,null,null,null,null,null,null,null,null,null,null,"1er match",null,null,null,"2nd match",null,null,null,"3ème match"]
[null,"Set 1","Set 2","Set 3","set 1","set 2","set3","Set 1","Set 2","Set 3",null,null,"JOUEURS","rang","points","victoire","défaites","pour","contre","différence","Points",null,"points","victoire","défaites",null,"points","victoire","défaites",null,"points","victoire","défaites"]
[1,null,null,null,null,null,null,null,null,null,null,null,{"$f":"A3","v":1},{"$f":"RANK(U3,$U$3:$U$5)","v":1},{"$f":"W3+AA3+AE3","v":0},{"$f":"SUM(X3,AB3,AF3)","v":0},{"$f":"SUM(Y3,AC3,AG3)","v":0},{"$f":"B3+C3+D3+E3+F3+G3","v":0},{"$f":"B4+C4+D4+H5+I5+J5","v":0},{"$f":"(R3-S3)","v":0},{"$f":"O3+(SUM(P3:Q3,T3)/1000)","v":0},null,{"$f":"IF(X3>1,3,0)","v":0},{"$f":"SUMPRODUCT(--((OFFSET($A$1,MATCH($M3,$A$3:$A$5,0)+1,1,,3)-OFFSET($A$1,MATCH($M3,$A$3:$A$5,0)+2,1,,3))>=2))","v":0},{"$f":"COUNTA(B3:D3)-X3","v":0},null,{"$f":"IF(AB3>1,3,0)","v":0},{"$f":"SUMPRODUCT(--((OFFSET($A$1,MATCH($M3,$A$3:$A$5,0)+1,4,,3)-OFFSET($A$1,MATCH($M3,$A$3:$A$5,0)+3,4,,3))>=2))","v":0},{"$f":"COUNTA(E3:G3)-AB3","v":0},null,{"$f":"IF(AF3>1,3,0)","v":0},null,{"$f":"COUNTA(H3:J3)-AF3","v":0}]
[2,null,null,null,null,null,null,null,null,null,null,null,{"$f":"A4","v":2},{"$f":"RANK(U4,$U$3:$U$5)","v":1},{"$f":"W4+AA4+AE4","v":0},{"$f":"SUM(X4,AB4,AF4)","v":0},{"$f":"SUM(Y4,AC4,AG4)","v":0},{"$f":"B4+C4+D4+H4+I4+J4","v":0},{"$f":"B3+C3+D3+H5+I5+J5","v":0},{"$f":"(R4-S4)","v":0},{"$f":"O4+(SUM(P4:Q4,T4)/1000)","v":0},null,{"$f":"IF(X4>1,3,0)","v":0},{"$f":"SUMPRODUCT(--((OFFSET($A$1,MATCH($M4,$A$3:$A$5,0)+1,1,,3)-OFFSET($A$1,MATCH($M4,$A$3:$A$5,0),1,,3))>=2))","v":0},{"$f":"COUNTA(B4:D4)-X4","v":0},null,{"$f":"IF(AB4>1,3,0)","v":0},null,{"$f":"COUNTA(E4:G4)-AB4","v":0},null,{"$f":"IF(AF4>1,3,0)","v":0},{"$f":"SUMPRODUCT(--((OFFSET($A$1,MATCH($M4,$A$3:$A$5,0)+1,7,,3)-OFFSET($A$1,MATCH($M4,$A$3:$A$5,0)+2,7,,3))>=2))","v":0},{"$f":"COUNTA(H4:J4)-AF4","v":0}]
[3,null,null,null,null,null,null,null,null,null,null,null,{"$f":"A5","v":3},1,0,0,0,{"$f":"E5+F5+G5+H5+I5+J5","v":0},{"$f":"E3+F3+G3+H4+I4+J4","v":0},{"$f":"(R5-S5)","v":0},0,null,0,null,0,null,0,{"$f":"SUMPRODUCT(--((OFFSET($A$1,MATCH($M5,$A$3:$A$5,0)+1,4,,3)-OFFSET($A$1,MATCH($M5,$A$3:$A$5,0)-1,4,,3))>=2))","v":0},0,null,{"$f":"IF(AF5>1,3,0)","v":0},{"$f":"SUMPRODUCT(--((OFFSET($A$1,MATCH($M5,$A$3:$A$5,0)+1,7,,3)-OFFSET($A$1,MATCH($M5,$A$3:$A$5,0),7,,3))>=2))","v":0},{"$f":"COUNTA(H5:J5)-AF5","v":0}]

{"sheet":"poule 4","index":8,"n_rows":6,"n_cols":53,"rows_kept":6,"cut":false,"hidden":false,"merged":[[0,0,1,0],[0,1,0,3],[0,4,0,6],[0,7,0,9],[0,10,0,12],[5,1,5,3],[5,10,5,12],[5,13,5,15],[2,4,2,6],[2,10,2,12],[3,4,3,6],[3,7,3,9],[3,13,3,15],[0,42,0,44],[0,46,0,48],[0,50,0,52],[4,1,4,3],[4,7,4,9],[4,16,4,18],[2,16,2,18],[0,30,0,32],[0,34,0,36],[0,38,0,40],[0,16,0,18],[0,13,0,15]]}
["JOUEURS","Match 1","Match 2","Match 3","Match 2","Match 3","Match 4","Match 3","Match 4","Match 5","Match 4",null,null,"Match 5",null,null,"Match 6",null,null,null,null,null,null,null,null,null,null,null,null,null,"1er match",null,null,null,"2nd match",null,null,null,"3ème match",null,null,null,"4ème match",null,null,null,"5ème match",null,null,null,"6ème match"]
[null,"Set 1","Set 2","Set 3","Set 1","Set 2","Set 3","Set 1","Set 2","Set 3","Set 1","Set 2","Set 3","Set 1","Set 2","Set 3","Set 1","Set 2","Set 3",null,"JOUEURS","rang","points","victoire","défaites","pour","contre","différence","Points",null,"points","victoire","défaites",null,"points","victoire","défaites",null,"points","victoire","défaites",null,"points","victoire","défaites",null,"points","victoire","défaites",null,"points","victoire","défaites"]
[1,null,null,null,null,null,null,null,null,null,null,null,null,null,null,null,null,null,null,null,{"$f":"A3","v":1},{"$f":"RANK(AC3,$AC$3:$AC$6)","v":1},{"$f":"(AE3+AI3+AM3+AQ3+AU3+AY3)","v":0},{"$f":"SUM(AF3,AJ3,AN3,AR3,AV3,AZ3)","v":0},{"$f":"SUM(AG3,AK3,AO3,AS3,AW3,BA3)","v":0},{"$f":"SUM(B3:D3,H3:J3,N3:P3)","v":0},{"$f":"B4+C4+D4+H6+I6+J6+N5+O5+P5","v":0},{"$f":"(Z3-AA3)","v":0},{"$f":"W3+(SUM(X3:Y3,AB3)/1000)","v":0},null,{"$f":"IF(AF3>1,3,0)","v":0},{"$f":"SUMPRODUCT(--((OFFSET($A$1,MATCH($U3,$A$3:$A$6,0)+1,1,,3)-OFFSET($A$1,MATCH($U3,$A$3:$A$6,0)+2,1,,3))>=2))","v":0},{"$f":"COUNTA(B3:D3)-AF3","v":0},null,{"$f":"IF(AJ3>1,3,0)","v":0},null,{"$f":"COUNTA(E3:G3)-AJ3","v":0},null,{"$f":"IF(AN3>1,3,0)","v":0},{"$f":"SUMPRODUCT(--((OFFSET($A$1,MATCH($U3,$A$3:$A$6,0)+1,7,,3)-OFFSET($A$1,MATCH($U3,$A$3:$A$6,0)+4,7,,3))>=2))","v":0},{"$f":"COUNTA(H3:J3)-AN3","v":0},null,{"$f":"IF(AR3>1,3,0)","v":0},null,{"$f":"COUNTA(K3:M3)-AR3","v":0},null,{"$f":"IF(AV3>1,3,0)","v":0},{"$f":"SUMPRODUCT(--((OFFSET($A$1,MATCH($U3,$A$3:$A$6,0)+1,13,,3)-OFFSET($A$1,MATCH($U3,$A$3:$A$6,0)+3,13,,3))>=2))","v":0},{"$f":"COUNTA(N3:P3)-AV3","v":0},null,{"$f":"IF(AZ3>1,3,0)","v":0},null,{"$f":"COUNTA(Q3:S3)-AZ3","v":0}]
[2,null,null,null,null,null,null,null,null,null,null,null,null,null,null,null,null,null,null,null,{"$f":"A4","v":2},{"$f":"RANK(AC4,$AC$3:$AC$6)","v":1},{"$f":"(AE4+AI4+AM4+AQ4+AU4+AY4)","v":0},{"$f":"SUM(AF4,AJ4,AN4,AR4,AV4,AZ4)","v":0},{"$f":"SUM(AG4,AK4,AO4,AS4,AW4,BA4)","v":0},{"$f":"SUM(B4:D4,K4:M4,Q4:S4)","v":0},{"$f":"B3+C3+D3+K5+L5+M5+Q6+R6+S6","v":0},{"$f":"(Z4-AA4)","v":0},{"$f":"W4+(SUM(X4:Y4,AB4)/1000)","v":0},null,{"$f":"IF(AF4>1,3,0)","v":0},{"$f":"SUMPRODUCT(--((OFFSET($A$1,MATCH($U4,$A$3:$A$6,0)+1,1,,3)-OFFSET($A$1,MATCH($U4,$A$3:$A$6,0),1,,3))>=2))","v":0},{"$f":"COUNTA(B4:D4)-AF4","v":0},null,{"$f":"IF(AJ4>1,3,0)","v":0},null,{"$f":"COUNTA(E4:G4)-AJ4","v":0},null,{"$f":"IF(AN4>1,3,0)","v":0},null,{"$f":"COUNTA(H4:J4)-AN4","v":0},null,{"$f":"IF(AR4>1,3,0)","v":0},{"$f":"SUMPRODUCT(--((OFFSET($A$1,MATCH($U4,$A$3:$A$6,0)+1,10,,3)-OFFSET($A$1,MATCH($U4,$A$3:$A$6,0)+2,10,,3))>=2))","v":0},{"$f":"COUNTA(K4:M4)-AR4","v":0},null,{"$f":"IF(AV4>1,3,0)","v":0},null,{"$f":"COUNTA(N4:P4)-AV4","v":0},null,{"$f":"IF(AZ4>1,3,0)","v":0},{"$f":"SUMPRODUCT(--((OFFSET($A$1,MATCH($U4,$A$3:$A$6,0)+1,16,,3)-OFFSET($A$1,MATCH($U4,$A$3:$A$6,0)+3,16,,3))>=2))","v":0},{"$f":"COUNTA(Q4:S4)-AZ4","v":0}]
[3,null,null,null,null,null,null,null,null,null,null,null,null,null,null,null,null,null,null,null,{"$f":"A5","v":3},1,0,0,0,{"$f":"SUM(E5:G5,K5:P5)","v":0},{"$f":"E6+F6+G6+K4+L4+M4+N3+O3+P3","v":0},{"$f":"(Z5-AA5)","v":0},0,null,0,null,0,null,0,{"$f":"SUMPRODUCT(--((OFFSET($A$1,MATCH($U5,$A$3:$A$6,0)+1,4,,3)-OFFSET($A$1,MATCH($U5,$A$3:$A$6,0)+2,4,,3))>=2))","v":0},0,null,0,null,0,null,0,{"$f":"SUMPRODUCT(--((OFFSET($A$1,MATCH($U5,$A$3:$A$6,0)+1,10,,3)-OFFSET($A$1,MATCH($U5,$A$3:$A$6,0),10,,3))>=2))","v":0},0,null,0,{"$f":"SUMPRODUCT(--((OFFSET($A$1,MATCH($U5,$A$3:$A$6,0)+1,13,,3)-OFFSET($A$1,MATCH($U5,$A$3:$A$6,0)-1,13,,3))>=2))","v":0},0,null,0,null,0]
[4,null,null,null,null,null,null,null,null,null,null,null,null,null,null,null,null,null,null,null,{"$f":"A6","v":4},1,0,0,0,{"$f":"E6+F6+G6+H6+I6+J6+Q6+R6+S6","v":0},{"$f":"E5+F5+G5+H3+I3+J3+Q4+R4+S4","v":0},{"$f":"Z6-AA6","v":0},0,null,0,null,0,null,0,{"$f":"SUMPRODUCT(--((OFFSET($A$1,MATCH($U6,$A$3:$A$6,0)+1,4,,3)-OFFSET($A$1,MATCH($U6,$A$3:$A$6,0),4,,3))>=2))","v":0},0,null,0,{"$f":"SUMPRODUCT(--((OFFSET($A$1,MATCH($U6,$A$3:$A$6,0)+1,7,,3)-OFFSET($A$1,MATCH($U6,$A$3:$A$6,0)-2,7,,3))>=2))","v":0},0,null,0,null,0,null,0,null,0,null,0,{"$f":"SUMPRODUCT(--((OFFSET($A$1,MATCH($U6,$A$3:$A$6,0)+1,16,,3)-OFFSET($A$1,MATCH($U6,$A$3:$A$6,0)-1,16,,3))>=2))","v":0},0]

{"sheet":"poule 5","index":9,"n_rows":7,"n_cols":81,"rows_kept":7,"cut":false,"hidden":false,"merged":[[0,42,0,44],[0,46,0,48],[0,50,0,52],[0,54,0,56],[6,1,6,3],[0,19,0,21],[0,22,0,24],[0,25,0,27],[0,28,0,30],[4,1,4,3],[5,1,5,3],[0,16,0,18],[0,13,0,15],[0,0,1,0],[0,1,0,3],[0,4,0,6],[0,7,0,9],[0,10,0,12],[0,78,0,80],[0,58,0,60],[0,62,0,64],[0,66,0,68],[0,70,0,72],[0,74,0,76]]}
["JOUEURS","Match 1","Match 2","Match 3","Match 2","Match 3","Match 4","Match 3","Match 4","Match 5","Match 4",null,null,"Match 5",null,null,"Match 6",null,null,"Match 7",null,null,"Match 8",null,null,"Match 9",null,null,"Match 10",null,null,null,null,null,null,null,null,null,null,null,null,null,"1er match",null,null,null,"2nd match",null,null,null,"3ème match",null,null,null,"4ème match",null,null,null,"5ème match",null,null,null,"6ème match",null,null,null,"7ème match",null,null,null,"8ème match",null,null,null,"9ème match",null,null,null,"10ème match"]
[null,"Set 1","Set 2","Set 3","Set 1","Set 2","Set 3","Set 1","Set 2","Set 3","Set 1","Set 2","Set 3","Set 1","Set 2","Set 3","Set 1","Set 2","Set 3","Set 1","Set 2","Set 3","Set 1","Set 2","Set 3","Set 1","Set 2","Set 3","Set 1","Set 2","Set 3",null,"JOUEURS","rang","points","victoire","défaites","pour","contre","différence","Points",null,"points","victoire","défaites",null,"points","victoire","défaites",null,"points","victoire","défaites",null,"points","victoire","défaites",null,"points","victoire","défaites",null,"points","victoire","défaites",null,"points","victoire","défaites",null,"points","victoire","défaites",null,"points","victoire","défaites",null,"points","victoire","défaites"]
[1,null,null,null,null,null,null,null,null,null,null,null,null,null,null,null,null,null,null,null,null,null,null,null,null,null,null,null,null,null,null,null,{"$f":"A3","v":1},{"$f":"RANK(AO3,$AO$3:$AO$7)","v":1},{"$f":"AQ3+AU3+AY3+BC3+BG3+BK3+BO3+BS3+BW3+CA3","v":0},{"$f":"SUM(AR3,AV3,AZ3,BD3,BH3,BL3,BP3,BT3,BX3,CB3)","v":0},{"$f":"SUM(AS3,AW3,BA3,BE3,,BI3,BM3,BQ3,BU3,BY3,CC3)","v":0},{"$f":"B3+C3+D3+H3+I3+J3+Q3+R3+S3+W3+X3+Y3","v":0},{"$f":"B4+C4+D4+H7+I7+J7+Q5+R5+S5+W6+X6+Y6","v":0},{"$f":"(AL3-AM3)","v":0},{"$f":"AI3+(SUM(AJ3:AK3,AN3)/1000)","v":0},null,{"$f":"IF(AR3>1,3,0)","v":0},{"$f":"SUMPRODUCT(--((OFFSET($A$1,MATCH($AG3,$A$3:$A$7,0)+1,1,,3)-OFFSET($A$1,MATCH($AG3,$A$3:$A$7,0)+2,1,,3))>=2))","v":0},{"$f":"COUNTA(B3:D3)-AR3","v":0},null,{"$f":"IF(AV3>1,3,0)","v":0},null,{"$f":"COUNTA(E3:G3)-AV3","v":0},null,{"$f":"IF(AZ3>1,3,0)","v":0},{"$f":"SUMPRODUCT(--((OFFSET($A$1,MATCH($AG3,$A$3:$A$7,0)+1,7,,3)-OFFSET($A$1,MATCH($AG3,$A$3:$A$7,0)+5,7,,3))>=2))","v":0},{"$f":"COUNTA(H3:J3)-AZ3","v":0},null,{"$f":"IF(BD3>1,3,0)","v":0},null,{"$f":"COUNTA(K3:M3)-BD3","v":0},null,{"$f":"IF(BH3>1,3,0)","v":0},null,{"$f":"COUNTA(N3:P3)-BH3","v":0},null,{"$f":"IF(BL3>1,3,0)","v":0},{"$f":"SUMPRODUCT(--((OFFSET($A$1,MATCH($AG3,$A$3:$A$7,0)+1,16,,3)-OFFSET($A$1,MATCH($AG3,$A$3:$A$7,0)+3,16,,3))>=2))","v":0},{"$f":"COUNTA(Q3:S3)-BL3","v":0},null,{"$f":"IF(BP3>1,3,0)","v":0},null,{"$f":"COUNTA(T3:V3)-BP3","v":0},null,{"$f":"IF(BT3>1,3,0)","v":0},{"$f":"SUMPRODUCT(--((OFFSET($A$1,MATCH($AG3,$A$3:$A$7,0)+1,22,,3)-OFFSET($A$1,MATCH($AG3,$A$3:$A$7,0)+4,22,,3))>=2))","v":0},{"$f":"COUNTA(W3:Y3)-BT3","v":0},null,{"$f":"IF(BX3>1,3,0)","v":0},null,{"$f":"COUNTA(Z3:AB3)-BX3","v":0},null,{"$f":"IF(CB3>1,3,0)","v":0},null,{"$f":"COUNTA(AC3:AE3)-CB3","v":0}]
[2,null,null,null,null,null,null,null,null,null,null,null,null,null,null,null,null,null,null,null,null,null,null,null,null,null,null,null,null,null,null,null,{"$f":"A4","v":2},{"$f":"RANK(AO4,$AO$3:$AO$7)","v":1},{"$f":"AQ4+AU4+AY4+BC4+BG4+BK4+BO4+BS4+BW4+CA4","v":0},{"$f":"SUM(AR4,AV4,AZ4,BD4,BH4,BL4,BP4,BT4,BX4,CB4)","v":0},{"$f":"SUM(AS4,AW4,BA4,BE4,,BI4,BM4,BQ4,BU4,BY4,CC4)","v":0},{"$f":"B4+C4+D4+K4+L4+M4+T4+U4+V4+AC4+AD4+AE4","v":0},{"$f":"B3+C3+D3+K5+L5+M5+T7+U7+V7+AC6+AD6+AE6","v":0},{"$f":"(AL4-AM4)","v":0},{"$f":"AI4+(SUM(AJ4:AK4,AN4)/1000)","v":0},null,{"$f":"IF(AR4>1,3,0)","v":0},{"$f":"SUMPRODUCT(--((OFFSET($A$1,MATCH($AG4,$A$3:$A$7,0)+1,1,,3)-OFFSET($A$1,MATCH($AG4,$A$3:$A$7,0),1,,3))>=2))","v":0},{"$f":"COUNTA(B4:D4)-AR4","v":0},null,{"$f":"IF(AV4>1,3,0)","v":0},null,{"$f":"COUNTA(E4:G4)-AV4","v":0},null,{"$f":"IF(AZ4>1,3,0)","v":0},null,{"$f":"COUNTA(H4:J4)-AZ4","v":0},null,{"$f":"IF(BD4>1,3,0)","v":0},{"$f":"SUMPRODUCT(--((OFFSET($A$1,MATCH($AG4,$A$3:$A$7,0)+1,10,,3)-OFFSET($A$1,MATCH($AG4,$A$3:$A$7,0)+2,10,,3))>=2))","v":0},{"$f":"COUNTA(K4:M4)-BD4","v":0},null,{"$f":"IF(BH4>1,3,0)","v":0},null,{"$f":"COUNTA(N4:P4)-BH4","v":0},null,{"$f":"IF(BL4>1,3,0)","v":0},null,{"$f":"COUNTA(Q4:S4)-BL4","v":0},null,{"$f":"IF(BP4>1,3,0)","v":0},{"$f":"SUMPRODUCT(--((OFFSET($A$1,MATCH($AG4,$A$3:$A$7,0)+1,19,,3)-OFFSET($A$1,MATCH($AG4,$A$3:$A$7,0)+3,19,,3))>=2))","v":0},{"$f":"COUNTA(T4:V4)-BP4","v":0},null,{"$f":"IF(BT4>1,3,0)","v":0},null,{"$f":"COUNTA(W4:Y4)-BT4","v":0},null,{"$f":"IF(BX4>1,3,0)","v":0},null,{"$f":"COUNTA(Z4:AB4)-BX4","v":0},null,{"$f":"IF(CB4>1,3,0)","v":0},{"$f":"SUMPRODUCT(--((OFFSET($A$1,MATCH($AG4,$A$3:$A$7,0)+1,28,,3)-OFFSET($A$1,MATCH($AG4,$A$3:$A$7,0)+3,28,,3))>=2))","v":0},{"$f":"COUNTA(AC4:AE4)-CB4","v":0}]
[3,null,null,null,null,null,null,null,null,null,null,null,null,null,null,null,null,null,null,null,null,null,null,null,null,null,null,null,null,null,null,null,3,1,0,0,0,{"$f":"E5+F5+G5+K5+L5+M5+Q5+R5+S5+Z5+AA5+AB5","v":0},{"$f":"E6+F6+G6+K4+L4+M4+Q3+R3+S3+Z7+AA7+AB7","v":0},{"$f":"(AL5-AM5)","v":0},0,null,0,null,{"$f":"COUNTA(B5:D5)-AR5","v":0},null,0,{"$f":"SUMPRODUCT(--((OFFSET($A$1,MATCH($AG5,$A$3:$A$7,0)+1,4,,3)-OFFSET($A$1,MATCH($AG5,$A$3:$A$7,0)+2,4,,3))>=2))","v":0},0,null,0,null,0,null,0,{"$f":"SUMPRODUCT(--((OFFSET($A$1,MATCH($AG5,$A$3:$A$7,0)+1,10,,3)-OFFSET($A$1,MATCH($AG5,$A$3:$A$7,0),10,,3))>=2))","v":0},0,null,0,null,0,null,0,{"$f":"SUMPRODUCT(--((OFFSET($A$1,MATCH($AG5,$A$3:$A$7,0)+1,16,,3)-OFFSET($A$1,MATCH($AG5,$A$3:$A$7,0)-1,16,,3))>=2))","v":0},0,null,0,null,0,null,0,null,0,null,0,{"$f":"SUMPRODUCT(--((OFFSET($A$1,MATCH($AG5,$A$3:$A$7,0)+1,25,,3)-OFFSET($A$1,MATCH($AG5,$A$3:$A$7,0)+3,25,,3))>=2))","v":0},0,null,0,null,0]
[4,null,null,null,null,null,null,null,null,null,null,null,null,null,null,null,null,null,null,null,null,null,null,null,null,null,null,null,null,null,null,null,4,1,0,0,0,{"$f":"E6+F6+G6+N6+O6+P6+W6+X6+Y6+AC6+AD6+AE6","v":0},{"$f":"E5+F5+G5+N7+O7+P7+W3+X3+Y3+AC4+AD4+AE4","v":0},{"$f":"(AL6-AM6)","v":0},0,null,0,null,{"$f":"COUNTA(B6:D6)-AR6","v":0},null,{"$f":"IF(AV6>1,3,0)","v":0},{"$f":"SUMPRODUCT(--((OFFSET($A$1,MATCH($AG6,$A$3:$A$7,0)+1,4,,3)-OFFSET($A$1,MATCH($AG6,$A$3:$A$7,0),4,,3))>=2))","v":0},0,null,0,null,0,null,0,null,0,null,0,{"$f":"SUMPRODUCT(--((OFFSET($A$1,MATCH($AG6,$A$3:$A$7,0)+1,13,,3)-OFFSET($A$1,MATCH($AG6,$A$3:$A$7,0)+2,13,,3))>=2))","v":0},0,null,0,null,0,null,0,null,0,null,0,{"$f":"SUMPRODUCT(--((OFFSET($A$1,MATCH($AG6,$A$3:$A$7,0)+1,22,,3)-OFFSET($A$1,MATCH($AG6,$A$3:$A$7,0)-2,22,,3))>=2))","v":0},0,null,0,null,0,null,0,{"$f":"SUMPRODUCT(--((OFFSET($A$1,MATCH($AG6,$A$3:$A$7,0)+1,28,,3)-OFFSET($A$1,MATCH($AG6,$A$3:$A$7,0)-1,28,,3))>=2))","v":0},0]
[5,null,null,null,null,null,null,null,null,null,null,null,null,null,null,null,null,null,null,null,null,null,null,null,null,null,null,null,null,null,null,null,5,1,0,0,0,{"$f":"H7+I7+J7+N7+O7+P7+T7+U7+V7+Z7+AA7+AB7","v":0},{"$f":"H3+I3+J3+N6+O6+P6+T4+U4+V4+Z5+AA5+AB5","v":0},{"$f":"(AL7-AM7)","v":0},{"$f":"AI7+(SUM(AJ7:AK7,AN7)/1000)","v":0},null,{"$f":"IF(AR7>1,3,0)","v":0},null,{"$f":"COUNTA(B7:D7)-AR7","v":0},null,{"$f":"IF(AV7>1,3,0)","v":0},null,0,null,{"$f":"IF(AZ7>1,3,0)","v":0},{"$f":"SUMPRODUCT(--((OFFSET($A$1,MATCH($AG7,$A$3:$A$7,0)+1,7,,3)-OFFSET($A$1,MATCH($AG7,$A$3:$A$7,0)-3,7,,3))>=2))","v":0},0,null,0,null,0,null,0,{"$f":"SUMPRODUCT(--((OFFSET($A$1,MATCH($AG7,$A$3:$A$7,0)+1,13,,3)-OFFSET($A$1,MATCH($AG7,$A$3:$A$7,0),13,,3))>=2))","v":0},0,null,0,null,0,null,0,{"$f":"SUMPRODUCT(--((OFFSET($A$1,MATCH($AG7,$A$3:$A$7,0)+1,19,,3)-OFFSET($A$1,MATCH($AG7,$A$3:$A$7,0)-2,19,,3))>=2))","v":0},0,null,0,null,0,null,0,{"$f":"SUMPRODUCT(--((OFFSET($A$1,MATCH($AG7,$A$3:$A$7,0)+1,25,,3)-OFFSET($A$1,MATCH($AG7,$A$3:$A$7,0)-1,25,,3))>=2))","v":0},0,null,0,null,0]