{"text_format":"1","workbook":"xlsx","n_sheets":7,"sheets":["Variable","Modèle","Liste des entrées","Tarte aux oignons de Roscoff","La pomme de Jeanne",">!<$\"#,.¸¸¸¨¨¨=+_","Feuil3"],"not_rendered":{"charts":0,"images":0,"macros":1,"external_links":1,"defined_names":2,"comments":0,"pivot_tables":0},"unopened":[],"bounds":{"document_bytes":16777216,"sheet_cells":100000,"rows_first":2000,"rows_last":500,"rows_between":2000,"halvings":0,"cell_chars":16384,"cell_head_chars":4096},"cells_cut":0,"cells_raw":0,"read":"whole","date_system":"1900"}

{"sheet":"Variable","index":0,"n_rows":4,"n_cols":121,"rows_kept":4,"cut":false,"hidden":false,"merged":[]}
["Nombre de portion",1,2,3,4,5,6,7,8,9,10,11,12,13,14,15,16,17,18,19,20,21,22,23,24,25,26,27,28,29,30,31,32,33,34,35,36,37,38,39,40,41,42,43,44,45,46,47,48,49,50,51,52,53,54,55,56,57,58,59,60,61,62,63,64,65,66,67,68,69,70,71,72,73,74,75,76,77,78,79,80,81,82,83,84,85,86,87,88,89,90,91,92,93,94,95,96,97,98,99,100,101,102,103,104,105,106,107,108,109,110,111,112,113,114,115,116,117,118,119,120]
["Assaisonnement",1.4999999999999999E-2,1.7500000000000002E-2,0.02,2.2499999999999999E-2,2.5000000000000001E-2,2.75E-2,0.03]
["Coefficient",1,1.5,2,2.5,3,3.5,4,4.5,5]
["TVA ",5.5E-2,0.1]

{"sheet":"Modèle","index":1,"n_rows":35,"n_cols":8,"rows_kept":35,"cut":false,"hidden":false,"merged":[]}
[null,"Titre"]
[null,null,null,null,"Champ modifiable en bleu"]
[]
[null,"APERÇU :"]
[]
[null,"ÉQUIPAGE :",null,null,null,null,"Estimation pour "]
[null,null,"Poids en g","P.U.H.T","P.T.H.T",null,40]
[null,null,null,null,{"$f":"\"Prix HT pour \" & LEFT(B7,1) &\" personnes\"","v":"Prix HT pour  personnes"},{"$f":"SUM(E10:E17)","v":{"$error":"#VALUE!"}},{"$f":"\"Prix HT pour \" & G7 &\" personnes\"","v":"Prix HT pour 40 personnes"},{"$f":"SUM(E10:E17)*G7","v":{"$error":"#VALUE!"}}]
[null,"CAMBUSE :"]
[{"$f":"IF(ISNA(VLOOKUP(B10,[1]Feuil1!$A:$A,1,0)),\"NR\",\"\")","v":"NR"},null,null,{"$f":"IF(A10=\"NR\",\"\",VLOOKUP(B10,[1]Feuil1!$A:$B,2))","v":""},{"$f":"(D10/1000)*C10","v":{"$error":"#VALUE!"}},null,{"$f":"(C10*$G$7)/LEFT($B$7,1)","v":{"$error":"#VALUE!"}}]
[{"$f":"IF(ISNA(VLOOKUP(B11,[1]Feuil1!$A:$A,1,0)),\"NR\",\"\")","v":"NR"},null,null,{"$f":"IF(A11=\"NR\",\"\",VLOOKUP(B11,[1]Feuil1!$A:$B,2))","v":""},{"$error":"#VALUE!"},null,{"$error":"#VALUE!"}]
[{"$f":"IF(ISNA(VLOOKUP(B12,[1]Feuil1!$A:$A,1,0)),\"NR\",\"\")","v":"NR"},null,null,{"$f":"IF(A12=\"NR\",\"\",VLOOKUP(B12,[1]Feuil1!$A:$B,2))","v":""},{"$error":"#VALUE!"},null,{"$error":"#VALUE!"}]
[{"$f":"IF(ISNA(VLOOKUP(B13,[1]Feuil1!$A:$A,1,0)),\"NR\",\"\")","v":"NR"},null,null,{"$f":"IF(A13=\"NR\",\"\",VLOOKUP(B13,[1]Feuil1!$A:$B,2))","v":""},{"$error":"#VALUE!"},null,{"$error":"#VALUE!"}]
[{"$f":"IF(ISNA(VLOOKUP(B14,[1]Feuil1!$A:$A,1,0)),\"NR\",\"\")","v":"NR"},null,null,{"$f":"IF(A14=\"NR\",\"\",VLOOKUP(B14,[1]Feuil1!$A:$B,2))","v":""},{"$error":"#VALUE!"},null,{"$error":"#VALUE!"}]
[{"$f":"IF(ISNA(VLOOKUP(B15,[1]Feuil1!$A:$A,1,0)),\"NR\",\"\")","v":"NR"},null,null,{"$f":"IF(A15=\"NR\",\"\",VLOOKUP(B15,[1]Feuil1!$A:$B,2))","v":""},{"$error":"#VALUE!"},null,{"$error":"#VALUE!"}]
[{"$f":"IF(ISNA(VLOOKUP(B16,[1]Feuil1!$A:$A,1,0)),\"NR\",\"\")","v":"NR"},null,null,{"$f":"IF(A16=\"NR\",\"\",VLOOKUP(B16,[1]Feuil1!$A:$B,2))","v":""},{"$error":"#VALUE!"},null,{"$error":"#VALUE!"}]
[]
[null,"MANŒUVRE :"]
[]
[]
[]
[]
[]
[]
[]
[]
[]
[null,"QUART :"]
[]
[null,null,null,null,"Prix HT par portion",{"$f":"SUM(E10:E17)/LEFT(B7,1)","v":{"$error":"#VALUE!"}}]
[null,"BOISSON : ",null,null,"Assaisonnement",0.02]
[null,null,null,null,"Coefficient",4]
[null,null,null,null,"Prix de vente HT par portion",{"$f":"(F30+(F30*F31))*F32","v":{"$error":"#VALUE!"}}]
[null,null,null,null,"TVA ",5.5E-2]
[null,null,null,null,"Prix de vente TTC par portion",{"$f":"F33+(F33*F34)","v":{"$error":"#VALUE!"}}]

{"sheet":"Liste des entrées","index":2,"n_rows":527,"n_cols":6,"rows_kept":527,"cut":false,"hidden":false,"merged":[]}
["Adresse onglet","Nom classeur","Nom onglet",null,"Liste des entrées","Prix Portions"]
[{"$f":"TRANSPOSE(Liste_des_entrées)","v":"[1-Entrées.xlsm]Variable"},{"$f":"LEFT(A2,FIND(\"]\",A2))","v":"[1-Entrées.xlsm]"},{"$f":"IFERROR(\"'\"&RIGHT(A2,LEN(A2)-FIND(\"]\",A2))&\"'\",\"\")","v":"'Variable'"},null,{"$f":"IFERROR(HYPERLINK(B2&C2&\"!A1\",SUBSTITUTE(C2,\"'\",\"\")),\"\")","v":"Variable"}]
["[1-Entrées.xlsm]Modèle",{"$f":"LEFT(A3,FIND(\"]\",A3))","v":"[1-Entrées.xlsm]"},{"$f":"IFERROR(\"'\"&RIGHT(A3,LEN(A3)-FIND(\"]\",A3))&\"'\",\"\")","v":"'Modèle'"},null,{"$f":"IFERROR(HYPERLINK(B3&C3&\"!A1\",SUBSTITUTE(C3,\"'\",\"\")),\"\")","v":"Modèle"}]
["[1-Entrées.xlsm]Liste des entrées","[1-Entrées.xlsm]","'Liste des entrées'",null,"Liste des entrées"]
["[1-Entrées.xlsm]Tarte aux oignons de Roscoff","[1-Entrées.xlsm]","'Tarte aux oignons de Roscoff'",null,"Tarte aux oignons de Roscoff"]
["[1-Entrées.xlsm]La pomme de Jeanne","[1-Entrées.xlsm]","'La pomme de Jeanne'",null,"La pomme de Jeanne"]
["[1-Entrées.xlsm]Feuil2","[1-Entrées.xlsm]","'Feuil2'",null,"Feuil2"]
["[1-Entrées.xlsm]Feuil3","[1-Entrées.xlsm]","'Feuil3'",null,"Feuil3"]
[{"$error":"#N/A"},{"$error":"#N/A"},"",null,""]
[{"$error":"#N/A"},{"$error":"#N/A"},"",null,""]
[{"$error":"#N/A"},{"$error":"#N/A"},"",null,""]
[{"$error":"#N/A"},{"$error":"#N/A"},"",null,""]
[{"$error":"#N/A"},{"$error":"#N/A"},"",null,""]
[{"$error":"#N/A"},{"$error":"#N/A"},"",null,""]
[{"$error":"#N/A"},{"$error":"#N/A"},"",null,""]
[{"$error":"#N/A"},{"$error":"#N/A"},"",null,""]
[{"$error":"#N/A"},{"$error":"#N/A"},"",null,""]
[{"$error":"#N/A"},{"$error":"#N/A"},"",null,""]
[{"$error":"#N/A"},{"$error":"#N/A"},"",null,""]
[{"$error":"#N/A"},{"$error":"#N/A"},"",null,""]
[{"$error":"#N/A"},{"$error":"#N/A"},"",null,""]
[{"$error":"#N/A"},{"$error":"#N/A"},"",null,""]
[{"$error":"#N/A"},{"$error":"#N/A"},"",null,""]
[{"$error":"#N/A"},{"$error":"#N/A"},"",null,""]
[{"$error":"#N/A"},{"$error":"#N/A"},"",null,""]
[{"$error":"#N/A"},{"$error":"#N/A"},"",null,""]
[{"$error":"#N/A"},{"$error":"#N/A"},"",null,""]
[{"$error":"#N/A"},{"$error":"#N/A"},"",null,""]
[{"$error":"#N/A"},{"$error":"#N/A"},"",null,""]
[{"$error":"#N/A"},{"$error":"#N/A"},"",null,""]
[{"$error":"#N/A"},{"$error":"#N/A"},"",null,""]
[{"$error":"#N/A"},{"$error":"#N/A"},"",null,""]
[{"$error":"#N/A"},{"$error":"#N/A"},"",null,""]
[{"$error":"#N/A"},{"$error":"#N/A"},"",null,""]
[{"$error":"#N/A"},{"$error":"#N/A"},"",null,""]
[{"$error":"#N/A"},{"$error":"#N/A"},"",null,""]
[{"$error":"#N/A"},{"$error":"#N/A"},"",null,""]
[{"$error":"#N/A"},{"$error":"#N/A"},"",null,""]
[{"$error":"#N/A"},{"$error":"#N/A"},"",null,""]
[{"$error":"#N/A"},{"$error":"#N/A"},"",null,""]
[{"$error":"#N/A"},{"$error":"#N/A"},"",null,""]
[{"$error":"#N/A"},{"$error":"#N/A"},"",null,""]
[{"$error":"#N/A"},{"$error":"#N/A"},"",null,""]
[{"$error":"#N/A"},{"$error":"#N/A"},"",null,""]
[{"$error":"#N/A"},{"$error":"#N/A"},"",null,""]
[{"$error":"#N/A"},{"$error":"#N/A"},"",null,""]
[{"$error":"#N/A"},{"$error":"#N/A"},"",null,""]
[{"$error":"#N/A"},{"$error":"#N/A"},"",null,""]
[{"$error":"#N/A"},{"$error":"#N/A"},"",null,""]
[{"$error":"#N/A"},{"$error":"#N/A"},"",null,""]
[{"$error":"#N/A"},{"$error":"#N/A"},"",null,""]
[{"$error":"#N/A"},{"$error":"#N/A"},"",null,""]
[{"$error":"#N/A"},{"$error":"#N/A"},"",null,""]
[{"$error":"#N/A"},{"$error":"#N/A"},"",null,""]
[{"$error":"#N/A"},{"$error":"#N/A"},"",null,""]
[{"$error":"#N/A"},{"$error":"#N/A"},"",null,""]
[{"$error":"#N/A"},{"$error":"#N/A"},"",null,""]
[{"$error":"#N/A"},{"$error":"#N/A"},"",null,""]
[{"$error":"#N/A"},{"$error":"#N/A"},"",null,""]
[{"$error":"#N/A"},{"$error":"#N/A"},"",null,""]
[{"$error":"#N/A"},{"$error":"#N/A"},"",null,""]
[{"$error":"#N/A"},{"$error":"#N/A"},"",null,""]
[{"$error":"#N/A"},{"$error":"#N/A"},"",null,""]
[{"$error":"#N/A"},{"$error":"#N/A"},"",null,""]
[{"$error":"#N/A"},{"$error":"#N/A"},"",null,""]
[{"$error":"#N/A"},{"$error":"#N/A"},"",null,""]
[{"$error":"#N/A"},{"$f":"LEFT(A67,FIND(\"]\",A67))","v":{"$error":"#N/A"}},{"$f":"IFERROR(\"'\"&RIGHT(A67,LEN(A67)-FIND(\"]\",A67))&\"'\",\"\")","v":""},null,{"$f":"IFERROR(HYPERLINK(B67&C67&\"!A1\",SUBSTITUTE(C67,\"'\",\"\")),\"\")","v":""}]
[{"$error":"#N/A"},{"$error":"#N/A"},"",null,""]
[{"$error":"#N/A"},{"$error":"#N/A"},"",null,""]
[{"$error":"#N/A"},{"$error":"#N/A"},"",null,""]
[{"$error":"#N/A"},{"$error":"#N/A"},"",null,""]
[{"$error":"#N/A"},{"$error":"#N/A"},"",null,""]
[{"$error":"#N/A"},{"$error":"#N/A"},"",null,""]
[{"$error":"#N/A"},{"$error":"#N/A"},"",null,""]
[{"$error":"#N/A"},{"$error":"#N/A"},"",null,""]
[{"$error":"#N/A"},{"$error":"#N/A"},"",null,""]
[{"$error":"#N/A"},{"$error":"#N/A"},"",null,""]
[{"$error":"#N/A"},{"$error":"#N/A"},"",null,""]
[{"$error":"#N/A"},{"$error":"#N/A"},"",null,""]
[{"$error":"#N/A"},{"$error":"#N/A"},"",null,""]
[{"$error":"#N/A"},{"$error":"#N/A"},"",null,""]
[{"$error":"#N/A"},{"$error":"#N/A"},"",null,""]
[{"$error":"#N/A"},{"$error":"#N/A"},"",null,""]
[{"$error":"#N/A"},{"$error":"#N/A"},"",null,""]
[{"$error":"#N/A"},{"$error":"#N/A"},"",null,""]
[{"$error":"#N/A"},{"$error":"#N/A"},"",null,""]
[{"$error":"#N/A"},{"$error":"#N/A"},"",null,""]
[{"$error":"#N/A"},{"$error":"#N/A"},"",null,""]
[{"$error":"#N/A"},{"$error":"#N/A"},"",null,""]
[{"$error":"#N/A"},{"$error":"#N/A"},"",null,""]
[{"$error":"#N/A"},{"$error":"#N/A"},"",null,""]
[{"$error":"#N/A"},{"$error":"#N/A"},"",null,""]
[{"$error":"#N/A"},{"$error":"#N/A"},"",null,""]
[{"$error":"#N/A"},{"$error":"#N/A"},"",null,""]
[{"$error":"#N/A"},{"$error":"#N/A"},"",null,""]
[{"$error":"#N/A"},{"$error":"#N/A"},"",null,""]
[{"$error":"#N/A"},{"$error":"#N/A"},"",null,""]
[{"$error":"#N/A"},{"$error":"#N/A"},"",null,""]
[{"$error":"#N/A"},{"$error":"#N/A"},"",null,""]
[{"$error":"#N/A"},{"$error":"#N/A"},"",null,""]
[{"$error":"#N/A"},{"$error":"#N/A"},"",null,""]
[{"$error":"#N/A"},{"$error":"#N/A"},"",null,""]
[{"$error":"#N/A"},{"$error":"#N/A"},"",null,""]
[{"$error":"#N/A"},{"$error":"#N/A"},"",null,""]
[{"$error":"#N/A"},{"$error":"#N/A"},"",null,""]
[{"$error":"#N/A"},{"$error":"#N/A"},"",null,""]
[{"$error":"#N/A"},{"$error":"#N/A"},"",null,""]
[{"$error":"#N/A"},{"$error":"#N/A"},"",null,""]
[{"$error":"#N/A"},{"$error":"#N/A"},"",null,""]
[{"$error":"#N/A"},{"$error":"#N/A"},"",null,""]
[{"$error":"#N/A"},{"$error":"#N/A"},"",null,""]
[{"$error":"#N/A"},{"$error":"#N/A"},"",null,""]
[{"$error":"#N/A"},{"$error":"#N/A"},"",null,""]
[{"$error":"#N/A"},{"$error":"#N/A"},"",null,""]
[{"$error":"#N/A"},{"$error":"#N/A"},"",null,""]
[{"$error":"#N/A"},{"$error":"#N/A"},"",null,""]
[{"$error":"#N/A"},{"$error":"#N/A"},"",null,""]
[{"$error":"#N/A"},{"$error":"#N/A"},"",null,""]
[{"$error":"#N/A"},{"$error":"#N/A"},"",null,""]
[{"$error":"#N/A"},{"$error":"#N/A"},"",null,""]
[{"$error":"#N/A"},{"$error":"#N/A"},"",null,""]
[{"$error":"#N/A"},{"$error":"#N/A"},"",null,""]
[{"$error":"#N/A"},{"$error":"#N/A"},"",null,""]
[{"$error":"#N/A"},{"$error":"#N/A"},"",null,""]
[{"$error":"#N/A"},{"$error":"#N/A"},"",null,""]
[{"$error":"#N/A"},{"$error":"#N/A"},"",null,""]
[{"$error":"#N/A"},{"$error":"#N/A"},"",null,""]
[{"$error":"#N/A"},{"$error":"#N/A"},"",null,""]
[{"$error":"#N/A"},{"$error":"#N/A"},"",null,""]
[{"$error":"#N/A"},{"$error":"#N/A"},"",null,""]
[{"$error":"#N/A"},{"$f":"LEFT(A131,FIND(\"]\",A131))","v":{"$error":"#N/A"}},{"$f":"IFERROR(\"'\"&RIGHT(A131,LEN(A131)-FIND(\"]\",A131))&\"'\",\"\")","v":""},null,{"$f":"IFERROR(HYPERLINK(B131&C131&\"!A1\",SUBSTITUTE(C131,\"'\",\"\")),\"\")","v":""}]
[{"$error":"#N/A"},{"$error":"#N/A"},"",null,""]
[{"$error":"#N/A"},{"$error":"#N/A"},"",null,""]
[{"$error":"#N/A"},{"$error":"#N/A"},"",null,""]
[{"$error":"#N/A"},{"$error":"#N/A"},"",null,""]
[{"$error":"#N/A"},{"$error":"#N/A"},"",null,""]
[{"$error":"#N/A"},{"$error":"#N/A"},"",null,""]
[{"$error":"#N/A"},{"$error":"#N/A"},"",null,""]
[{"$error":"#N/A"},{"$error":"#N/A"},"",null,""]
[{"$error":"#N/A"},{"$error":"#N/A"},"",null,""]
[{"$error":"#N/A"},{"$error":"#N/A"},"",null,""]
[{"$error":"#N/A"},{"$error":"#N/A"},"",null,""]
[{"$error":"#N/A"},{"$error":"#N/A"},"",null,""]
[{"$error":"#N/A"},{"$error":"#N/A"},"",null,""]
[{"$error":"#N/A"},{"$error":"#N/A"},"",null,""]
[{"$error":"#N/A"},{"$error":"#N/A"},"",null,""]
[{"$error":"#N/A"},{"$error":"#N/A"},"",null,""]
[{"$error":"#N/A"},{"$error":"#N/A"},"",null,""]
[{"$error":"#N/A"},{"$error":"#N/A"},"",null,""]
[{"$error":"#N/A"},{"$error":"#N/A"},"",null,""]
[{"$error":"#N/A"},{"$error":"#N/A"},"",null,""]
[{"$error":"#N/A"},{"$error":"#N/A"},"",null,""]
[{"$error":"#N/A"},{"$error":"#N/A"},"",null,""]
[{"$error":"#N/A"},{"$error":"#N/A"},"",null,""]
[{"$error":"#N/A"},{"$error":"#N/A"},"",null,""]
[{"$error":"#N/A"},{"$error":"#N/A"},"",null,""]
[{"$error":"#N/A"},{"$error":"#N/A"},"",null,""]
[{"$error":"#N/A"},{"$error":"#N/A"},"",null,""]
[{"$error":"#N/A"},{"$error":"#N/A"},"",null,""]
[{"$error":"#N/A"},{"$error":"#N/A"},"",null,""]
[{"$error":"#N/A"},{"$error":"#N/A"},"",null,""]
[{"$error":"#N/A"},{"$error":"#N/A"},"",null,""]
[{"$error":"#N/A"},{"$error":"#N/A"},"",null,""]
[{"$error":"#N/A"},{"$error":"#N/A"},"",null,""]
[{"$error":"#N/A"},{"$error":"#N/A"},"",null,""]
[{"$error":"#N/A"},{"$error":"#N/A"},"",null,""]
[{"$error":"#N/A"},{"$error":"#N/A"},"",null,""]
[{"$error":"#N/A"},{"$error":"#N/A"},"",null,""]
[{"$error":"#N/A"},{"$error":"#N/A"},"",null,""]
[{"$error":"#N/A"},{"$error":"#N/A"},"",null,""]
[{"$error":"#N/A"},{"$error":"#N/A"},"",null,""]
[{"$error":"#N/A"},{"$error":"#N/A"},"",null,""]
[{"$error":"#N/A"},{"$error":"#N/A"},"",null,""]
[{"$error":"#N/A"},{"$error":"#N/A"},"",null,""]
[{"$error":"#N/A"},{"$error":"#N/A"},"",null,""]
[{"$error":"#N/A"},{"$error":"#N/A"},"",null,""]
[{"$error":"#N/A"},{"$error":"#N/A"},"",null,""]
[{"$error":"#N/A"},{"$error":"#N/A"},"",null,""]
[{"$error":"#N/A"},{"$error":"#N/A"},"",null,""]
[{"$error":"#N/A"},{"$error":"#N/A"},"",null,""]
[{"$error":"#N/A"},{"$error":"#N/A"},"",null,""]
[{"$error":"#N/A"},{"$error":"#N/A"},"",null,""]
[{"$error":"#N/A"},{"$error":"#N/A"},"",null,""]
[{"$error":"#N/A"},{"$error":"#N/A"},"",null,""]
[{"$error":"#N/A"},{"$error":"#N/A"},"",null,""]
[{"$error":"#N/A"},{"$error":"#N/A"},"",null,""]
[{"$error":"#N/A"},{"$error":"#N/A"},"",null,""]
[{"$error":"#N/A"},{"$error":"#N/A"},"",null,""]
[{"$error":"#N/A"},{"$error":"#N/A"},"",null,""]
[{"$error":"#N/A"},{"$error":"#N/A"},"",null,""]
[{"$error":"#N/A"},{"$error":"#N/A"},"",null,""]
[{"$error":"#N/A"},{"$error":"#N/A"},"",null,""]
[{"$error":"#N/A"},{"$error":"#N/A"},"",null,""]
[{"$error":"#N/A"},{"$error":"#N/A"},"",null,""]
[{"$error":"#N/A"},{"$f":"LEFT(A195,FIND(\"]\",A195))","v":{"$error":"#N/A"}},{"$f":"IFERROR(\"'\"&RIGHT(A195,LEN(A195)-FIND(\"]\",A195))&\"'\",\"\")","v":""},null,{"$f":"IFERROR(HYPERLINK(B195&C195&\"!A1\",SUBSTITUTE(C195,\"'\",\"\")),\"\")","v":""}]
[{"$error":"#N/A"},{"$error":"#N/A"},"",null,""]
[{"$error":"#N/A"},{"$error":"#N/A"},"",null,""]
[{"$error":"#N/A"},{"$error":"#N/A"},"",null,""]
[{"$error":"#N/A"},{"$error":"#N/A"},"",null,""]
[{"$error":"#N/A"},{"$error":"#N/A"},"",null,""]
{"$rows_left_out":328}
{"sheet":"Tarte aux oignons de Roscoff","index":3,"n_rows":35,"n_cols":8,"rows_kept":35,"cut":false,"hidden":false,"merged":[]}
[null,"Tarte aux oignons de Roscoff"]
[null,null,null,null,"Champ modifiable en bleu"]
[]
[null,"APERÇU :"]
[]
[null,"ÉQUIPAGE :",null,null,null,null,"Estimation pour "]
[null,"4 matelots","Poids en g","P.U.H.T","P.T.H.T",null,40]
[null,null,null,null,{"$f":"\"Prix HT pour \" & LEFT(B7,1) &\" personnes\"","v":"Prix HT pour 4 personnes"},{"$f":"SUM(E10:E17)","v":{"$error":"#N/A"}},{"$f":"\"Prix HT pour \" & G7 &\" personnes\"","v":"Prix HT pour 40 personnes"},{"$f":"SUM(E10:E17)*G7","v":{"$error":"#N/A"}}]
[null,"CAMBUSE :"]
[{"$f":"IF(ISNA(VLOOKUP(B10,[1]Feuil1!$A:$A,1,0)),\"Non Référencé\",\"\")","v":""},"Pâte brisée",250,{"$f":"VLOOKUP(B10,[1]Feuil1!$A$1:$B$18,2,0)","v":1},{"$f":"(D10/1000)*C10","v":0.25},null,{"$f":"(C10*$G$7)/LEFT($B$7,1)","v":2500}]
[{"$f":"IF(ISNA(VLOOKUP(B11,[1]Feuil1!$A:$A,1,0)),\"Non Référencé\",\"\")","v":""},"Oignons de Roscoff",800,{"$f":"VLOOKUP(B11,[1]Feuil1!$A$1:$B$18,2,0)","v":2},1.6,null,8000]
[{"$f":"IF(ISNA(VLOOKUP(B12,[1]Feuil1!$A:$A,1,0)),\"Non Référencé\",\"\")","v":""},"Crème fraîche 30%",45,{"$f":"VLOOKUP(B12,[1]Feuil1!$A$1:$B$18,2,0)","v":3},0.13500000000000001,null,450]
[{"$f":"IF(ISNA(VLOOKUP(B13,[1]Feuil1!$A:$A,1,0)),\"NR\",\"\")","v":"NR"},"Farine T45",30,{"$f":"VLOOKUP(B13,[1]Feuil1!$A$1:$B$18,2,0)","v":{"$error":"#N/A"}},{"$error":"#N/A"},null,300]
[{"$f":"IF(ISNA(VLOOKUP(B14,[1]Feuil1!$A:$A,1,0)),\"NR\",\"\")","v":"NR"},"Fromage râpé",100,{"$f":"VLOOKUP(B14,[1]Feuil1!$A$1:$B$18,2,0)","v":{"$error":"#N/A"}},{"$error":"#N/A"},null,1000]
[{"$f":"IF(ISNA(VLOOKUP(B15,[1]Feuil1!$A:$A,1,0)),\"Non Référencé\",\"\")","v":""},"Œufs",150,{"$f":"VLOOKUP(B15,[1]Feuil1!$A$1:$B$18,2,0)","v":6},0.9,null,1500]
[{"$f":"IF(ISNA(VLOOKUP(B16,[1]Feuil1!$A:$A,1,0)),\"Non Référencé\",\"\")","v":""},"Beurre demi-sel",30,{"$f":"VLOOKUP(B16,[1]Feuil1!$A$1:$B$18,2,0)","v":5},0.15,null,300]
[{"$f":"IF(ISNA(VLOOKUP(B17,[1]Feuil1!$A:$A,1,0)),\"Non Référencé\",\"\")","v":""},"Lardons",200,{"$f":"VLOOKUP(B17,[1]Feuil1!$A$1:$B$18,2,0)","v":8},{"$f":"(D17/1000)*C17","v":1.6},null,{"$f":"(C17*$G$7)/LEFT($B$7,1)","v":2000}]
[]
[null,"MANŒUVRE :"]
[null,"Commencez par éplucher puis émincer les oignons de Roscoff."]
[null,"Faites chauffer la poêle puis faites fondre le beurre demi-sel."]
[null,"Faites revenir les oignons à feu doux/moyen pendant un quart d'heure environ en les remuant régulièrement pour qu'ils ne colorent pas trop."]
[null,"Une fois les oignons cuits, passez-les dans la farine puis laissez refroidir."]
[null,"Préchauffez votre four à 200°C (thermostat 6/7)."]
[null,"Étalez la pâte brisée dans votre moule."]
[null,"Dans un saladier, mélangez les œufs, la crème fraîche, vos oignons de Roscoff et une pincée de sel et de poivre puis versez l'appareil dans votre moule à tarte."]
[null,"Saupoudrez de fromage râpé et enfournez pendant environ 35 minutes.…"]
[]
[null,"QUART :"]
[null,"55 minutes",null,null,"Prix HT par portion",{"$f":"SUM(E10:E17)/LEFT(B7,1)","v":{"$error":"#N/A"}}]
[null,null,null,null,"Assaisonnement",0.02]
[null,"BOISSON : ",null,null,"Coefficient",4]
[null,"Cidre",null,null,"Prix de vente HT par portion",{"$f":"(F30+(F30*F31))*F32","v":{"$error":"#N/A"}}]
[null,null,null,null,"TVA ",5.5E-2]
[null,null,null,null,"Prix de vente TTC par portion",{"$f":"F33+(F33*F34)","v":{"$error":"#N/A"}}]

{"sheet":"La pomme de Jeanne","index":4,"n_rows":35,"n_cols":8,"rows_kept":35,"cut":false,"hidden":false,"merged":[]}
[null,"La pomme de Jeanne"]
[null,null,null,null,"Champ modifiable en bleu"]
[]
[null,"APERÇU :"]
[]
[null,"ÉQUIPAGE :",null,null,null,null,"Estimation pour "]
[null,"4 matelots",null,"P.U.H.T","P.T.H.T",null,40]
[null,null,null,null,{"$f":"\"Prix HT pour \" & LEFT(B7,1) &\" personnes\"","v":"Prix HT pour 4 personnes"},{"$f":"SUM(E10:E17)","v":{"$error":"#VALUE!"}},{"$f":"\"Prix HT pour \" & G7 &\" personnes\"","v":"Prix HT pour 40 personnes"},{"$f":"SUM(E10:E17)*G7","v":{"$error":"#VALUE!"}}]
[null,"CAMBUSE :"]
[{"$f":"IF(ISNA(VLOOKUP(B10,[1]Feuil1!$A:$A,1,0)),\"NR\",\"\")","v":"NR"},"Pommes",600,{"$f":"IF(A10=\"NR\",\"\",VLOOKUP(B10,[1]Feuil1!$A:$B,2))","v":""},{"$f":"(D10/1000)*C10","v":{"$error":"#VALUE!"}},null,{"$f":"(C10*$G$7)/LEFT($B$7,1)","v":6000}]
[{"$f":"IF(ISNA(VLOOKUP(B11,[1]Feuil1!$A:$A,1,0)),\"NR\",\"\")","v":""},"Fromages de chèvre",120,{"$f":"IF(A11=\"NR\",\"\",VLOOKUP(B11,[1]Feuil1!$A:$B,2))","v":9.8000000000000007},1.1760000000000002,null,1200]
[{"$f":"IF(ISNA(VLOOKUP(B12,[1]Feuil1!$A:$A,1,0)),\"NR\",\"\")","v":""},"Lard en tranche",50,{"$f":"IF(A12=\"NR\",\"\",VLOOKUP(B12,[1]Feuil1!$A:$B,2))","v":10},0.5,null,500]
[{"$f":"IF(ISNA(VLOOKUP(B13,[1]Feuil1!$A:$A,1,0)),\"NR\",\"\")","v":""},"Jus de pomme",500,{"$f":"IF(A13=\"NR\",\"\",VLOOKUP(B13,[1]Feuil1!$A:$B,2))","v":1.5},0.75,null,5000]
[{"$f":"IF(ISNA(VLOOKUP(B14,[1]Feuil1!$A:$A,1,0)),\"NR\",\"\")","v":""},"Brochettes de bois de 10 cm",4,{"$f":"IF(A14=\"NR\",\"\",VLOOKUP(B14,[1]Feuil1!$A:$B,2))","v":2.5000000000000001E-2},1E-4,null,40]
[{"$f":"IF(ISNA(VLOOKUP(B15,[1]Feuil1!$A:$A,1,0)),\"NR\",\"\")","v":"NR"},"Salade",1,{"$f":"IF(A15=\"NR\",\"\",VLOOKUP(B15,[1]Feuil1!$A:$B,2))","v":""},{"$error":"#VALUE!"},null,10]
[{"$f":"IF(ISNA(VLOOKUP(B16,[1]Feuil1!$A:$A,1,0)),\"NR\",\"\")","v":""},"Noix",30,{"$f":"IF(A16=\"NR\",\"\",VLOOKUP(B16,[1]Feuil1!$A:$B,2))","v":4},0.12,null,300]
[]
[null,"MANŒUVRE :"]
[null,"Peler les pommes et mettre de côté les épluchures."]
[null,"Couper légèrement le fond de la pomme pour qu’elle est une bonne assise."]
[null,"A l’aide d’un petit couteau pointu pratiquer une incision à 1 cm du fond de la pomme pour couper le trognon."]
[null,"Utiliser un vide pomme pour dégager le trognon délicatement. Vous devez avoir un « puits » dans la pomme. Toujours à l’aide du vide-pomme enlever quelques morceaux en gardant une certaine épaisseur sur la circonférence du fruit."]
[null,"Remplir la pomme de fromage de chèvre légèrement fondu avec de la crème, barder la avec la poitrine fumée et maintenir le tout avec la brochette de bois."]
[null,"Mettre au four à 130° pendant 25 minutes."]
[null,"Mettre les épluchures, le trognon et les morceaux de pommes dans le jus de pommes et faire réduire puis passer au chinois et monter au beurre salé."]
[null,"Servir votre pomme sur un lit de salade assaisonnée de vinaigrette et des noix et arroser de sirop de pomme."]
[]
[null,"QUART :"]
[null,"45 minutes"]
[null,null,null,null,"Prix HT par portion",{"$f":"SUM(E10:E17)/LEFT(B7,1)","v":{"$error":"#VALUE!"}}]
[null,"BOISSON : ",null,null,"Assaisonnement",0.02]
[null,null,null,null,"Coefficient",4]
[null,null,null,null,"Prix de vente HT par portion",{"$f":"(F30+(F30*F31))*F32","v":{"$error":"#VALUE!"}}]
[null,null,null,null,"TVA ",5.5E-2]
[null,null,null,null,"Prix de vente TTC par portion",{"$f":"F33+(F33*F34)","v":{"$error":"#VALUE!"}}]

{"sheet":">!<$\"#,.¸¸¸¨¨¨=+_","index":5,"n_rows":0,"n_cols":0,"rows_kept":0,"cut":false,"hidden":false,"merged":[]}

{"sheet":"Feuil3","index":6,"n_rows":0,"n_cols":0,"rows_kept":0,"cut":false,"hidden":false,"merged":[]}