{"text_format":"1","workbook":"xlsx","n_sheets":3,"sheets":["SUIVI COMMANDES","OE & COMMANDE","EXPORT DONNES BRUTES"],"not_rendered":{"charts":0,"images":0,"macros":1,"external_links":0,"defined_names":3,"comments":0,"pivot_tables":0},"unopened":[],"bounds":{"document_bytes":16777216,"sheet_cells":100000,"rows_first":2000,"rows_last":500,"rows_between":2000,"halvings":0,"cell_chars":16384,"cell_head_chars":4096},"cells_cut":0,"cells_raw":0,"read":"whole","date_system":"1900"}

{"sheet":"SUIVI COMMANDES","index":0,"n_rows":191,"n_cols":5,"rows_kept":191,"cut":false,"hidden":false,"merged":[[76,0,77,0],[76,2,77,2],[76,3,77,3],[87,0,88,0],[87,3,88,3],[55,0,56,0],[55,2,56,2],[55,3,56,3],[98,2,101,2],[98,3,101,3],[89,0,90,0],[89,3,90,3],[146,0,147,0],[164,0,165,0],[91,0,92,0],[95,0,96,0],[98,0,101,0]]}
["n° ordre","Avec 0 en plus","N° commande","Date commande","Date paiement"]
["x",{"$f":"CONCATENATE(\"000\",A2)","v":"000x"},5531538573,"2020-12-11"]
["x",{"$f":"CONCATENATE(\"000\",A3)","v":"000x"},5531538569,"2020-12-11"]
["x","000x",5531538537,"2020-12-11"]
["x","000x",5531538511,"2020-12-11"]
["x","000x",5531538499,"2020-12-11"]
["x","000x",5330269756,"2021-01-05"]
["x","000x",5532031892,"2021-01-05"]
[53952902,"00053952902",5532037886,"2021-01-08"]
[54007544,"00054007544",5532036722,"2021-01-08"]
[54007107,"00054007107",5532036745,"2021-01-08"]
[53913441,"00053913441",5532036763,"2021-01-08","2021-02-02"]
[53912921,"00053912921",5532036790,"2021-01-08","2021-02-02"]
[53677333,"00053677333",5532037014,"2021-01-08"]
[53676362,"00053676362",5532037065,"2021-01-08"]
[54007482,"00054007482",5532037098,"2021-01-08"]
[54026899,"00054026899",5532037119,"2021-01-08","2021-01-19"]
[54026984,"00054026984",5532037142,"2021-01-08"]
[53364680,"00053364680",5532037378,"2021-01-08","2021-01-19"]
[54026128,"00054026128",5532037163,"2021-01-08"]
[53867491,"00053867491",5532037634,"2021-01-08"]
[53604599,"00053604599",5532037596,"2021-01-08"]
["x","000x",4330387865,"2021-01-12"]
["x","000x",5330270357,"2021-01-12"]
["x","000x",4830349723,"2021-01-12"]
["x","000x",4830350099,"2021-01-12"]
["x","000x",4830350100,"2021-01-12"]
["x","000x",5330270353,"2021-01-12"]
["00050621343","00000050621343",5532042062,"2021-01-12"]
["00050620908","00000050620908",5532042295,"2021-01-12"]
["x","000x",5330270576,"2021-01-13"]
["x","000x",4830350232,"2021-01-13"]
["x","000x",4830350290,"2021-01-13"]
["x","000x",5330270702,"2021-01-13"]
["x","000x",4830350431,"2021-01-14"]
["x","000x",4330388477,"2021-01-14","2021-02-08"]
["x","000x",4830351000,"2021-01-20"]
["x","000x",4830351001,"2021-01-20"]
[null,"000",5532051876,"2021-01-20","ANNULE"]
["x","000x",4030096996,"2021-01-20","2021-01-22"]
["x","000x",4830351489,"2021-01-25","2021-03-03"]
["x","000x",4830351565,"2021-01-25"]
["x","000x",4830351567,"2021-01-25"]
["x","000x",4830351635,"2021-01-26"]
["x","000x",5532073958,"2021-02-01"]
["x","000x",5532074004,"2021-02-01"]
["x","000x",5532074044,"2021-02-01"]
["x","000x",5532074070,"2021-02-01"]
["x","000x",5330272824,"2021-02-02","2021-02-02"]
["00054280421","00000054280421",5332075409,"2021-02-02"]
["00048751801","00000048751801",5532075676,"2021-02-02"]
["x","000x",4830352420,"2021-02-02"]
["x","000x",4830352480,"2021-02-03"]
["x","000x",4830352481,"2021-02-03"]
["54478307","00054478307",5532077525,"2021-02-02","2021-02-04"]
["54485068","00054485068",5532077545,"2021-02-02","2021-02-04"]
[null,"000",null,null,"2021-02-04"]
["54435424","00054435424",5532077561,"2021-01-30","2021-02-04"]
["52658277","00052658277",5532077954,"2021-01-15","2021-02-03"]
["51361391","00051361391",5532078280,"2021-01-15","2021-02-03"]
["x","000x",5532078612,"15/14/2021","2021-02-04"]
["x","000x",5532078741,"2021-02-03","2021-02-04"]
["53284138","00053284138",5532081556,"2021-02-04","2021-02-07"]
["x","000x",4330393942,"2021-02-08"]
["x","000x",4330393947,"2021-02-08"]
["x","000x",4330393962,"2021-02-08"]
["x",{"$f":"CONCATENATE(\"000\",A67)","v":"000x"},5330273750,"2021-02-10"]
["50586321","00050586321",5532088874,"2021-02-10","2021-02-10"]
["54243973 ","00054243973 ",5532095208,"2021-02-15","2021-02-16"]
["X","000X",5532096423,"2021-02-05","2021-03-03"]
["x","000x",5532098040,"2021-02-02","2021-02-16"]
["54787033","00054787033",5532104184,"2021-02-19"]
["X","000X",5532107718,"2021-02-23"]
["X","000X",5532102300,"2021-02-23"]
["X","000X",5330275449,"2021-03-01","2021-03-01"]
["X","000X",4330397551,"2021-03-01","2021-03-11"]
[53785778,"00053785778",5532118769,"2021-03-04","2021-03-04"]
[null,"000",null,null,"2021-03-04"]
["X","000X",4830354918,"2021-02-25","2021-03-05"]
["X","000X",4830355618,"2021-03-08","2021-03-08"]
["X","000X",5330276403,"2021-03-09","2021-03-09"]
["X","000X",4830356252,"2021-03-11","2021-03-12"]
["X","000X",4830356253,"2021-03-11","2021-03-12"]
["X","000X",4830356254,"2021-03-11","2021-03-12"]
["X","000X",4830356256,"2021-03-11","2021-03-12"]
["X","000X",4830356257,"2021-03-11","2021-03-12"]
["X","000X",4830356464,"2021-03-15","2021-03-15"]
["54080397","00054080397",5532136701,"2021-03-15","2021-03-15"]
[null,"000",5532138037,null,"2021-03-15"]
["53520875","00053520875",5532136768,"2021-03-15","2021-03-15"]
[null,"000",5532138064,null,"2021-03-15"]
["54872837","00054872837",5532137555,"2021-03-15","2021-03-15"]
[null,"000",5532138092,"2021-03-15","2021-03-15"]
["53453918","00053453918",5532138216,"2021-03-15","2021-03-15"]
["53089185","00053089185",5532138337,"2021-03-15","2021-05-07"]
["55096736","00055096736",5532139358,"2021-03-16","2021-03-16"]
[null,"000",5532139368,"2021-03-16","2021-03-16"]
["X","000X",5330277196,"2021-03-17"]
["53632654","00053632654",5532142060,"2021-03-17","2021-03-17"]
[null,"000",null,null,"2021-03-17"]
[null,"000",null,null,"2021-03-17"]
[null,"000",null,null,"2021-03-17"]
["X","000X",5330277697,"2021-03-22"]
["X","000X",5532150890,"2021-03-23"]
["X","000X",4830357381,"2021-03-23"]
["55256984","00055256984",5532152718,"2021-03-23"]
["x","000x",4830357781,"2021-03-24"]
["x","000x",4830357784,"2021-03-24"]
["x","000x",4830357787,"2021-03-24"]
["x","000x",4830357928,"2021-03-30"]
["54873676","00054873676",5532162512,"2021-03-30","2021-03-30"]
["x","000x",4830357929,"2021-03-30"]
["x","000x",4830358025,"2021-03-30","2021-04-07"]
["x","000x",4830358032,"2021-03-30","2021-04-07"]
["x","000x",5532164022,"2021-03-30","2021-04-14"]
["x","000x",5532164053,"2021-03-30","2021-04-14"]
["x","000x",4830358034,"2021-03-30","2021-04-07"]
["x","000x",4830357997,"2021-03-30","2021-04-08"]
["x","000x",5532164437,"2021-04-02"]
["x","000x",4830358441,"2021-04-06","2021-04-06"]
["x","000x",4830358442,"2021-04-06","2021-04-06"]
["547885590","000547885590",5532171635,"2021-04-06","2021-04-07"]
["54818637","00054818637",5532171726,"2021-04-06","2021-04-20"]
["x","000x",5532171518,"2021-04-06"]
["55256984","00055256984",5532172877,"2021-04-06","2021-04-07"]
["53867491","00053867491",5532175810,"2021-04-07"]
["54358488","00054358488",5532175512,"2021-04-07"]
["53604599","00053604599",5532037596,"2021-04-09"]
[null,"000",5532179483,"2021-04-09"]
["x","000x",5330279220,"2021-04-09"]
["x",{"$f":"CONCATENATE(\"000\",A131)","v":"000x"},5330279480,"2021-04-09"]
["x","000x",5532176520,"2021-04-11"]
["54358213","00054358213",5532183925,"2021-04-13"]
["54358775","00054358775",5532184356,"2021-04-13"]
["55534122","00055534122",5532184431,"2021-04-13"]
["54639967","00054639967",5532184517,"2021-04-13"]
["55040220","00055040220",5532184535,"2021-04-13"]
["54997108","00054997108",5532183704,"2021-04-13"]
["x","000x",4830359238,"2021-04-13"]
["54784872","00054784872",5532185399,"2021-04-19"]
["X","000X",4830359393,"2021-04-14","2021-04-14"]
["55653925","00055653925",5532192048,"2021-04-19"]
["x","000x",4330406595,"2021-04-20"]
["X","000X",4830360140,"2021-04-20"]
["X","000X",5532197364,"2021-04-22"]
["X","000X",5532192775,"2021-04-22"]
["53604599","00053604599",5532037596,"2021-04-23"]
[null,"000",5532199478,"2021-04-23"]
[null,"000",5532199640,"2021-04-23"]
["X","000X",5532199731,"2021-04-23"]
["X","000X",5532200875,"2021-04-24"]
["X","000X",5532202012,"2021-04-26"]
["x","000x",5330280819,"2021-04-26"]
["x","000x",5330280822,"2021-04-26"]
["55701988","00055701988",5532204035,"2021-04-27"]
["55094758","00055094758",5532204185,"2021-04-27","2021-04-27"]
["55094758","00055094758",5532204202,"2021-04-27","2021-04-27"]
["55509197","00055509197",5532204662,"2021-04-27","2021-04-27"]
["55509197","00055509197",5532204683,"2021-04-27","2021-04-27"]
["55328151","00055328151",5532205064,"2021-04-27","2021-04-27"]
["55328151","00055328151",5532205089,"2021-04-27","2021-04-27"]
["55328151","00055328151",5532205111,"2021-04-27","2021-04-27"]
["X","000X",5532210536,"2021-04-29"]
["54530922","00054530922",5532210957,"2021-04-29","2021-05-03"]
["55630538","00055630538",5532200340,"2021-05-03"]
[null,"000",5532215520,"2021-05-03"]
["X","000X",4830361188,"2021-05-05"]
["X","000X",5330281599,"2021-05-05"]
["53525411","00053525411",5532221014,"2021-05-06","2021-05-10"]
["X","000X",4830361568,"2021-05-06"]
["x","000x",5532223409,"2021-05-07","2021-05-10"]
["x","000x",5532223470,"2021-05-07","2021-05-10"]
["x","000x",5532223497,"2021-05-07"]
["x","000x",5532223505,"2021-05-07"]
["x","000x",5532223518,"2021-05-07"]
["55819811","00055819811",5532223675,"2021-05-07"]
["x","000x",4830361568,"2021-05-06"]
["x","000x",5532224261,"2021-05-10","2021-05-10"]
["x","000x",5330281968,"2021-05-10"]
["x","000x",5532225329,"2021-05-10","2021-05-10"]
["x","000x",5532225358,"2021-05-10","2021-05-10"]
["x","000x",5532225396,"2021-05-10"]
["54354445","00054354445",5532224816,"2021-05-10","2021-05-10"]
["x","000x",4830362060,"2021-05-12"]
["x","000x",4830362066,"2021-05-12"]
["55630538","00055630538",5532200340,"2021-05-14"]
["59955801","00059955801",5532231406,"2021-05-14"]
["x","000x",5330282019,"2021-05-17"]
["x","000x",5330281998,"2021-05-17"]
["x","000x",5330282526,"2021-05-17"]
["55819811","00055819811",5532223675,"2021-05-17"]

{"sheet":"OE & COMMANDE","index":1,"n_rows":12,"n_cols":23,"rows_kept":12,"cut":false,"hidden":false,"merged":[[3,23,9,23],[3,15,3,22],[3,13,9,13],[3,1,3,12],[3,14,9,14],[4,22,5,22]]}
[]
[]
[]
[null,"INFORMATIONS ORDRE D'EXECUTION",null,null,null,null,null,null,null,null,null,null,null,null,null,"COMMANDE"]
[null,"n°ordre\nViens d'une autre feuille","Etat OE","Date de création ordre","n° de chantier","Etat chantier","Tot etat OE + etat chantier","SI 1 = rattaché un chantier ; SI 0 non rataché à un chantier","Objet des travaux","Commune","Entreprise prestataire","Date début des travaux","Date de fin des travaux",null,null,"n° commande\nSUIVI COMMANDE","etat","etat","Somme etat","Etat affaire","Etat OE","Nb OE","Etat commande"]
[]
[null,{"$f":"'EXPORT DONNES BRUTES'!A2","v":55955801},{"$f":"IF(B7=0,\"0\",\"1\")","v":"1"},{"$f":"'EXPORT DONNES BRUTES'!B2","v":"14/05/2021"},{"$f":"'EXPORT DONNES BRUTES'!#REF!","v":{"$error":"#REF!"}},{"$f":"IF(E7=0,\"0\",\"1\")","v":{"$error":"#REF!"}},{"$f":"F7+C7","v":{"$error":"#REF!"}},{"$f":"IF(G7=2,\"1\",\"0\")","v":{"$error":"#REF!"}},{"$f":"'EXPORT DONNES BRUTES'!#REF!","v":{"$error":"#REF!"}},{"$f":"'EXPORT DONNES BRUTES'!#REF!","v":{"$error":"#REF!"}},{"$f":"'EXPORT DONNES BRUTES'!#REF!","v":{"$error":"#REF!"}},{"$f":"'EXPORT DONNES BRUTES'!C2","v":"2021-05-14 00:00:00.0"},{"$f":"'EXPORT DONNES BRUTES'!D2","v":0},null,null,{"$f":"VLOOKUP(B7,'SUIVI COMMANDES'!B:C,2,FALSE)","v":{"$error":"#N/A"}},{"$f":"IF(ISNA(P7),\"0\",\"1\")","v":"0"},{"$f":"IF(#REF!>1,\"1\",\"0\")","v":{"$error":"#REF!"}},{"$f":"R7+Q7","v":{"$error":"#REF!"}},{"$f":"IF(I7=0,\"Pas d'affaire\",\"Affaire\")","v":{"$error":"#REF!"}},{"$f":"IF(T7=\"Affaire\", IF(ISBLANK(B7),\"SANS OE\",\"OE VALIDE\"),\"0\")","v":{"$error":"#REF!"}},{"$f":"IF(B7=0,\"0\",\"1\")","v":"1"},{"$f":"IF(U7=\"OE VALIDE\",IF(S7<1,\"OE SANS COMMANDE\",\"OE AVEC COMMANDE\"),\"0\")","v":{"$error":"#REF!"}}]
[null,{"$f":"'EXPORT DONNES BRUTES'!A3","v":55929652},{"$f":"IF(B8=0,\"0\",\"1\")","v":"1"},{"$f":"'EXPORT DONNES BRUTES'!B3","v":"11/05/2021"},{"$f":"'EXPORT DONNES BRUTES'!#REF!","v":{"$error":"#REF!"}},{"$f":"IF(E8=0,\"0\",\"1\")","v":{"$error":"#REF!"}},{"$f":"F8+C8","v":{"$error":"#REF!"}},{"$f":"IF(G8=2,\"1\",\"0\")","v":{"$error":"#REF!"}},{"$f":"'EXPORT DONNES BRUTES'!#REF!","v":{"$error":"#REF!"}},{"$f":"'EXPORT DONNES BRUTES'!#REF!","v":{"$error":"#REF!"}},{"$f":"'EXPORT DONNES BRUTES'!#REF!","v":{"$error":"#REF!"}},{"$f":"'EXPORT DONNES BRUTES'!C3","v":"2021-05-11 00:00:00.0"},{"$f":"'EXPORT DONNES BRUTES'!D3","v":"2021-05-14 00:00:00.0"},null,null,{"$f":"VLOOKUP(B8,'SUIVI COMMANDES'!B:C,2,FALSE)","v":{"$error":"#N/A"}},{"$f":"IF(ISNA(P8),\"0\",\"1\")","v":"0"},{"$f":"IF(#REF!>1,\"1\",\"0\")","v":{"$error":"#REF!"}},{"$f":"R8+Q8","v":{"$error":"#REF!"}},{"$f":"IF(I8=0,\"Pas d'affaire\",\"Affaire\")","v":{"$error":"#REF!"}},{"$f":"IF(T8=\"Affaire\", IF(ISBLANK(B8),\"SANS OE\",\"OE VALIDE\"),\"0\")","v":{"$error":"#REF!"}},{"$f":"IF(B8=0,\"0\",\"1\")","v":"1"},{"$f":"IF(U8=\"OE VALIDE\",IF(S8<1,\"OE SANS COMMANDE\",\"OE AVEC COMMANDE\"),\"0\")","v":{"$error":"#REF!"}}]
[null,{"$f":"'EXPORT DONNES BRUTES'!A4","v":55929302},"1",{"$f":"'EXPORT DONNES BRUTES'!B4","v":"11/05/2021"},{"$f":"'EXPORT DONNES BRUTES'!#REF!","v":{"$error":"#REF!"}},{"$error":"#REF!"},{"$f":"F9+C9","v":{"$error":"#REF!"}},{"$error":"#REF!"},{"$f":"'EXPORT DONNES BRUTES'!#REF!","v":{"$error":"#REF!"}},{"$f":"'EXPORT DONNES BRUTES'!#REF!","v":{"$error":"#REF!"}},{"$f":"'EXPORT DONNES BRUTES'!#REF!","v":{"$error":"#REF!"}},{"$f":"'EXPORT DONNES BRUTES'!C4","v":"2021-09-13 00:00:00.0"},{"$f":"'EXPORT DONNES BRUTES'!D4","v":"2021-09-21 00:00:00.0"},null,null,{"$f":"VLOOKUP(B9,'SUIVI COMMANDES'!B:C,2,FALSE)","v":{"$error":"#N/A"}},"0",{"$f":"IF(#REF!>1,\"1\",\"0\")","v":{"$error":"#REF!"}},{"$f":"R9+Q9","v":{"$error":"#REF!"}},{"$f":"IF(I9=0,\"Pas d'affaire\",\"Affaire\")","v":{"$error":"#REF!"}},{"$f":"IF(T9=\"Affaire\", IF(ISBLANK(B9),\"SANS OE\",\"OE VALIDE\"),\"0\")","v":{"$error":"#REF!"}},{"$f":"IF(B9=0,\"0\",\"1\")","v":"1"},{"$f":"IF(U9=\"OE VALIDE\",IF(S9<1,\"OE SANS COMMANDE\",\"OE AVEC COMMANDE\"),\"0\")","v":{"$error":"#REF!"}}]
[null,{"$f":"'EXPORT DONNES BRUTES'!A5","v":55922101},"1",{"$f":"'EXPORT DONNES BRUTES'!B5","v":"11/05/2021"},{"$f":"'EXPORT DONNES BRUTES'!#REF!","v":{"$error":"#REF!"}},{"$error":"#REF!"},{"$f":"F10+C10","v":{"$error":"#REF!"}},{"$error":"#REF!"},{"$f":"'EXPORT DONNES BRUTES'!#REF!","v":{"$error":"#REF!"}},{"$f":"'EXPORT DONNES BRUTES'!#REF!","v":{"$error":"#REF!"}},{"$f":"'EXPORT DONNES BRUTES'!#REF!","v":{"$error":"#REF!"}},{"$f":"'EXPORT DONNES BRUTES'!C5","v":"2021-05-11 00:00:00.0"},{"$f":"'EXPORT DONNES BRUTES'!D5","v":"2021-05-14 00:00:00.0"},null,null,{"$f":"VLOOKUP(B10,'SUIVI COMMANDES'!B:C,2,FALSE)","v":{"$error":"#N/A"}},"0",{"$f":"IF(#REF!>1,\"1\",\"0\")","v":{"$error":"#REF!"}},{"$f":"R10+Q10","v":{"$error":"#REF!"}},{"$f":"IF(I10=0,\"Pas d'affaire\",\"Affaire\")","v":{"$error":"#REF!"}},{"$f":"IF(T10=\"Affaire\", IF(ISBLANK(B10),\"SANS OE\",\"OE VALIDE\"),\"0\")","v":{"$error":"#REF!"}},{"$f":"IF(B10=0,\"0\",\"1\")","v":"1"},{"$f":"IF(U10=\"OE VALIDE\",IF(S10<1,\"OE SANS COMMANDE\",\"OE AVEC COMMANDE\"),\"0\")","v":{"$error":"#REF!"}}]
[null,null,null,null,null,null,null,null,null,null,null,null,null,null,null,"ici fonction recherche ne fonctionne pas"]
[null,null,null,null,null,null,null,null,null,null,null,null,null,null,null,"Le but est de retrouver le numéro de commande lié au n° d'ordre de cette ligne"]

{"sheet":"EXPORT DONNES BRUTES","index":2,"n_rows":75,"n_cols":6,"rows_kept":75,"cut":false,"hidden":true,"merged":[]}
["Identifiant","Date d'initialisation","Date de début","Date de fin","Montant","N° d'attachement"]
[55955801,"14/05/2021","2021-05-14 00:00:00.0"]
[55929652,"11/05/2021","2021-05-11 00:00:00.0","2021-05-14 00:00:00.0"]
[55929302,"11/05/2021","2021-09-13 00:00:00.0","2021-09-21 00:00:00.0"]
[55922101,"11/05/2021","2021-05-11 00:00:00.0","2021-05-14 00:00:00.0"]
[55923362,"11/05/2021","2021-05-11 00:00:00.0"]
[55915732,"10/05/2021","2021-05-11 00:00:00.0","2021-05-14 00:00:00.0"]
[55899722,"10/05/2021","2021-09-13 00:00:00.0","2021-09-21 00:00:00.0"]
[55879843,"07/05/2021","2021-05-07 00:00:00.0","2021-05-14 00:00:00.0"]
[55819811,"04/05/2021","2021-05-04 00:00:00.0"]
[55716152,"27/04/2021","2021-04-27 00:00:00.0"]
[55701988,"26/04/2021","2021-04-26 00:00:00.0","2021-06-25 00:00:00.0"]
[55653925,"22/04/2021","2021-04-22 00:00:00.0",null,0]
[55652806,"22/04/2021","2021-04-22 00:00:00.0"]
[55630538,"20/04/2021","2021-04-20 00:00:00.0",null,0]
[55623295,"20/04/2021","2021-04-20 00:00:00.0","2021-06-30 00:00:00.0"]
[55610294,"19/04/2021","2021-04-19 00:00:00.0","2021-05-31 00:00:00.0",0]
[55542460,"14/04/2021","2021-04-14 00:00:00.0"]
[55534122,"13/04/2021","2021-04-13 00:00:00.0",null,0]
[55521914,"13/04/2021","2021-04-13 00:00:00.0",null,0]
[55509197,"12/04/2021","2021-04-12 00:00:00.0",null,0]
["00055488684","09/04/2021","2021-04-09 00:00:00.0",null,0]
["00055437980","07/04/2021","2021-04-07 00:00:00.0","2021-04-07 00:00:00.0",0]
["00055384301","01/04/2021","2021-06-03 00:00:00.0","2021-06-11 00:00:00.0"]
["00055358639","30/03/2021","2021-03-30 00:00:00.0","2021-04-02 00:00:00.0"]
["00055328151","29/03/2021","2021-03-29 00:00:00.0"]
["00055291765","25/03/2021","2021-03-25 00:00:00.0"]
["00055256984","23/03/2021","2021-03-23 00:00:00.0",null,0]
["00055161475","17/03/2021","2021-03-17 00:00:00.0","2021-04-30 00:00:00.0",0]
["00055149010","16/03/2021","2021-03-16 00:00:00.0","2021-03-31 00:00:00.0",0]
["00055119194","15/03/2021","2021-03-15 00:00:00.0","2021-03-15 00:00:00.0",0]
["00055114880","14/03/2021","2021-03-14 00:00:00.0",null,0]
["00055098449","12/03/2021","2021-03-12 00:00:00.0",null,0]
["00055096736","12/03/2021","2021-03-15 00:00:00.0",null,0]
["00055094758","12/03/2021","2021-03-12 00:00:00.0","2021-03-13 00:00:00.0",0]
["00054997108","05/03/2021","2021-03-05 00:00:00.0","2021-03-06 00:00:00.0",0]
["00054945521","03/03/2021","2021-03-03 00:00:00.0",null,0]
["00054943681","02/03/2021","2021-03-02 00:00:00.0"]
["00054873676","25/02/2021","2021-02-25 00:00:00.0","2021-04-30 00:00:00.0",0]
["00054872837","25/02/2021","2021-02-25 00:00:00.0",null,0]
["00054823010","22/02/2021","2021-02-22 00:00:00.0","2021-07-31 00:00:00.0"]
["00054818637","22/02/2021","2021-02-22 00:00:00.0","2021-07-31 00:00:00.0",0]
["00054803950","22/02/2021","2021-05-06 00:00:00.0"]
["00054787033","19/02/2021","2021-02-19 00:00:00.0"]
["00054784872","19/02/2021","2021-02-26 00:00:00.0","2021-03-31 00:00:00.0",0]
["00054639967","10/02/2021","2021-02-10 00:00:00.0"]
["00054591387","08/02/2021","2021-02-08 00:00:00.0","2021-06-30 00:00:00.0"]
["00054565671","05/02/2021","2021-02-05 00:00:00.0","2021-02-15 00:00:00.0"]
["00054530922","04/02/2021","2021-02-04 00:00:00.0","2021-04-30 00:00:00.0",0]
["00054485496","02/02/2021","2021-02-02 00:00:00.0",null,0]
["00054485068","02/02/2021","2021-02-02 00:00:00.0","2021-02-28 00:00:00.0",0]
["00054484773","02/02/2021","2021-02-02 00:00:00.0",null,0]
["00054478307","02/02/2021","2021-02-02 00:00:00.0",null,0]
["00054475845","02/02/2021","2021-02-02 00:00:00.0","2021-02-28 00:00:00.0"]
["00054435424","29/01/2021","2021-01-29 00:00:00.0",null,0]
["00054416680","28/01/2021","2021-01-28 00:00:00.0","2021-05-31 00:00:00.0"]
["00054358775","26/01/2021","2021-01-26 00:00:00.0"]
["00054358488","26/01/2021","2021-01-26 00:00:00.0",null,0]
["00054358213","26/01/2021","2021-01-26 00:00:00.0"]
["00054354445","26/01/2021","2021-02-01 00:00:00.0","2021-02-28 00:00:00.0",1562.010009765625,"5532224816"]
["00054280421","21/01/2021","2021-01-21 00:00:00.0","2021-01-22 00:00:00.0"]
["00054253238","20/01/2021","2021-01-20 00:00:00.0",null,0]
["00054243973","20/01/2021","2021-01-20 00:00:00.0",null,0]
["00054149406","14/01/2021","2021-01-14 00:00:00.0",null,0]
["00054080397","11/01/2021","2021-01-11 00:00:00.0","2021-01-29 00:00:00.0",0]
["00054074442","11/01/2021","2021-01-12 00:00:00.0","2021-01-13 00:00:00.0"]
["00054026984","07/01/2021","2020-02-17 00:00:00.0",null,0]
["00054026899","07/01/2021","2020-02-17 00:00:00.0","2020-12-31 00:00:00.0",0]
["00054026128","07/01/2021","2020-06-04 00:00:00.0",null,0]
["00054007544","06/01/2021","2021-01-05 00:00:00.0",null,0]
["00054007482","06/01/2021","2020-09-17 00:00:00.0",null,0]
["00054007107","06/01/2021","2021-01-05 00:00:00.0",null,0]
["00053995585","06/01/2021","2021-01-06 00:00:00.0"]
["00053972926","05/01/2021","2021-01-05 00:00:00.0","2021-02-28 00:00:00.0"]
["00053952902","04/01/2021","2021-01-04 00:00:00.0","2021-01-30 00:00:00.0",0]