{"text_format":"1","workbook":"xlsx","n_sheets":4,"sheets":["Équipes","Horaires","Horaires (2)","Mode de fonctionnement"],"not_rendered":{"charts":0,"images":4,"macros":1,"external_links":0,"defined_names":15,"comments":4,"pivot_tables":0},"unopened":[],"bounds":{"document_bytes":16777216,"sheet_cells":100000,"rows_first":2000,"rows_last":500,"rows_between":2000,"halvings":0,"cell_chars":16384,"cell_head_chars":4096},"cells_cut":0,"cells_raw":0,"read":"whole","date_system":"1900"}

{"sheet":"Équipes","index":0,"n_rows":24,"n_cols":9,"rows_kept":24,"cut":false,"hidden":true,"merged":[[0,2,0,8],[24,5,24,6],[25,5,25,6],[26,5,26,6],[27,5,27,6],[23,5,23,8],[23,2,23,4],[1,0,1,8],[28,5,28,6],[29,5,29,6],[30,5,30,6],[24,7,24,8],[25,7,25,8],[26,7,26,8],[27,7,27,8],[28,7,28,8],[29,7,29,8],[30,7,30,8]]}
[null,null,"Ligue compétition mixte mardi de soir \nÉquipes"]
[{"$f":"Horaires!A2","v":"Saison 2021/22 Ronde-1: du 12 octobre au 24 janvier 2022 Compétition : Robin"}]
["Équipes",null,"Capitaines",null,"Troisièmes",null,"Deuxièmes",null,"Premiers"]
[{"$f":"IF($C4= \"\",\"\",\"A\"&ROW() -3)","v":"A1"},null,"Robert Cyr",null,"André Savard",null,"Robert Hamelin",null,"Jean Rémillard  *9"]
[{"$f":"IF($C5= \"\",\"\",\"A\"&ROW() -3)","v":"A2"},null,"Jacques Desharnais",null,"Michel Ayotte",null,"Luce Nepveu",null,"Jacques Gingras"]
["A3",null,"Roch Labelle",null,"Denis Pilote",null,"Danielle Beaudoin",null,"Jean Gadoury"]
["A4",null,"André Desjardins",null,"John Ellison",null,"Pierre Senécal",null,"Denis Cousineau"]
["A5",null,"Michel Beauchamp",null,"Yvon Grenier",null,"Michel Venditti  ",null,"Richard Turner"]
["A6",null,"Marcel Bréard",null,"Jean-Paul Roulier",null,"François Messier",null,"Pierre Lamontagne"]
["A7",null,"Pierre Pleau",null,"André Myre",null,"Alain Brunet",null,"Liette Grenier   "]
["A8",null,"Carol Belley",null,"Michel Jacques",null,"Roger Fortier",null,"Sylvain Brault  *12"]
["A9",null,"Gérald Meunier",null,"Jean Leclair",null,"Antonio Vicenzo",null,"Evelyne Henry"]
[]
[{"$f":"IF($C14= \"\",\"\",\"B\"&ROW() -13)","v":"B1"},null,"Marc Lambert",null,"Raymonde Jetté  ",null,"Michel Colin  ",null,"Sylvain Mercier   "]
[{"$f":"IF($C15= \"\",\"\",\"B\"&ROW() -13)","v":"B2"},null,"Barnabé",null,"Pierre Pleau    "]
["B3",null,"Barry Schreindorfer",null,"Richard Rousseau",null,"Jean Audet",null,"Lise O'Brien"]
["B4",null,"Robert Giguère",null,"Guy Messier ",null,"Gilles Béliveau",null,"Carmen Bourbeau  "]
["B5",null,"Robert Henry",null,"Robert Durivage",null,"Richard Lajeunesse",null,"Sylvie Bourdage"]
["B6",null,"Shirley Mc Whinnie",null,"Michel Legault",null,"Jean-Pierre Lacroix",null,"Peter Brunet"]
["B7",null,"Casagrande",null,"Roch Labelle"]
["B8",null,"Olivar Belley",null,"Louis Metcalfe  ",null,"Bernard Crevier",null,"Josette Vittecoq"]
["B9",null,"Jacques Richard",null,"Paul-Emile Bédard",null,"Claude Nadeau",null,"Robert Legrand"]
[]
[null,null,"Contraintes :",null,null,"Substituts :"]

{"sheet":"Horaires","index":1,"n_rows":85,"n_cols":11,"rows_kept":85,"cut":false,"hidden":false,"merged":[[0,0,0,10],[1,0,1,10]]}
["\nLigue compétition mixte mardi de soir \nHoraires\n"]
[{"$f":"\"Saison \"&YEAR(D3)&\"/\"&RIGHT(YEAR(D3)+1,2)& \" Ronde-\"&B3 & \": du \"&TEXT(A7,\"jj\") & \" \" & TEXT(A7,\"mmmm\") & \" au \" & TEXT(MAX(A3:A82),\"jj\") & \" \" &TEXT(MAX(A3:A82),\"mmmm\") & \" \" & YEAR(MAX(A3:A82))& \" Compétition : \"&C3","v":"Saison 2021/22 Ronde-1: du 12 octobre au 24 janvier 2022 Compétition : Robin"}]
[null,1,"Robin","2021-10-12"]
[]
["Date ","Heure","Équipes","Glace - 1","Points","Équipes","Glace - 2","Points","Équipes","Glace - 3","Points"]
[null,null,null,{"$f":"SUM(E7:E45,H7:H45,K7:K45)","v":0}]
["2021-10-12","19:00:00",null,{"$f":"IF(C7=\"\",\"\",VLOOKUP(C7,Équipes!$A:$C,3,FALSE))","v":""},null,null,{"$f":"IF(F7=\"\",\"\",VLOOKUP(F7,Équipes!$A:$C,3,FALSE))","v":""},null,null,{"$f":"IF(I7=\"\",\"\",VLOOKUP(I7,Équipes!$A:$C,3,FALSE))","v":""}]
[null,null,null,{"$f":"IF(C8=\"\",\"\",VLOOKUP(C8,Équipes!$A:$C,3,FALSE))","v":""},null,null,{"$f":"IF(F8=\"\",\"\",VLOOKUP(F8,Équipes!$A:$C,3,FALSE))","v":""},null,null,{"$f":"IF(I8=\"\",\"\",VLOOKUP(I8,Équipes!$A:$C,3,FALSE))","v":""}]
[null,"21:00:00",null,{"$f":"IF(C9=\"\",\"\",VLOOKUP(C9,Équipes!$A:$C,3,FALSE))","v":""},null,null,{"$f":"IF(F9=\"\",\"\",VLOOKUP(F9,Équipes!$A:$C,3,FALSE))","v":""},null,null,{"$f":"IF(I9=\"\",\"\",VLOOKUP(I9,Équipes!$A:$C,3,FALSE))","v":""}]
[null,null,null,{"$f":"IF(C10=\"\",\"\",VLOOKUP(C10,Équipes!$A:$C,3,FALSE))","v":""},null,null,{"$f":"IF(F10=\"\",\"\",VLOOKUP(F10,Équipes!$A:$C,3,FALSE))","v":""},null,null,{"$f":"IF(I10=\"\",\"\",VLOOKUP(I10,Équipes!$A:$C,3,FALSE))","v":""}]
[null,null,null,{"$f":"IF(C11=\"\",\"\",VLOOKUP(C11,Équipes!$A:$C,3,FALSE))","v":""},null,null,{"$f":"IF(F11=\"\",\"\",VLOOKUP(F11,Équipes!$A:$C,3,FALSE))","v":""},null,null,{"$f":"IF(I11=\"\",\"\",VLOOKUP(I11,Équipes!$A:$C,3,FALSE))","v":""}]
["2021-10-18","19:00:00",null,{"$f":"IF(C12=\"\",\"\",VLOOKUP(C12,Équipes!$A:$C,3,FALSE))","v":""},null,null,{"$f":"IF(F12=\"\",\"\",VLOOKUP(F12,Équipes!$A:$C,3,FALSE))","v":""},null,null,{"$f":"IF(I12=\"\",\"\",VLOOKUP(I12,Équipes!$A:$C,3,FALSE))","v":""}]
[null,null,null,{"$f":"IF(C13=\"\",\"\",VLOOKUP(C13,Équipes!$A:$C,3,FALSE))","v":""},null,null,{"$f":"IF(F13=\"\",\"\",VLOOKUP(F13,Équipes!$A:$C,3,FALSE))","v":""},null,null,{"$f":"IF(I13=\"\",\"\",VLOOKUP(I13,Équipes!$A:$C,3,FALSE))","v":""}]
[null,"21:00:00",null,{"$f":"IF(C14=\"\",\"\",VLOOKUP(C14,Équipes!$A:$C,3,FALSE))","v":""},null,null,{"$f":"IF(F14=\"\",\"\",VLOOKUP(F14,Équipes!$A:$C,3,FALSE))","v":""},null,null,{"$f":"IF(I14=\"\",\"\",VLOOKUP(I14,Équipes!$A:$C,3,FALSE))","v":""}]
[null,null,null,{"$f":"IF(C15=\"\",\"\",VLOOKUP(C15,Équipes!$A:$C,3,FALSE))","v":""},null,null,{"$f":"IF(F15=\"\",\"\",VLOOKUP(F15,Équipes!$A:$C,3,FALSE))","v":""},null,null,{"$f":"IF(I15=\"\",\"\",VLOOKUP(I15,Équipes!$A:$C,3,FALSE))","v":""}]
[null,null,null,{"$f":"IF(C16=\"\",\"\",VLOOKUP(C16,Équipes!$A:$C,3,FALSE))","v":""},null,null,{"$f":"IF(F16=\"\",\"\",VLOOKUP(F16,Équipes!$A:$C,3,FALSE))","v":""},null,null,{"$f":"IF(I16=\"\",\"\",VLOOKUP(I16,Équipes!$A:$C,3,FALSE))","v":""}]
["2021-10-26","19:00:00",null,{"$f":"IF(C17=\"\",\"\",VLOOKUP(C17,Équipes!$A:$C,3,FALSE))","v":""},null,null,{"$f":"IF(F17=\"\",\"\",VLOOKUP(F17,Équipes!$A:$C,3,FALSE))","v":""},null,null,{"$f":"IF(I17=\"\",\"\",VLOOKUP(I17,Équipes!$A:$C,3,FALSE))","v":""}]
[null,null,null,{"$f":"IF(C18=\"\",\"\",VLOOKUP(C18,Équipes!$A:$C,3,FALSE))","v":""},null,null,{"$f":"IF(F18=\"\",\"\",VLOOKUP(F18,Équipes!$A:$C,3,FALSE))","v":""},null,null,{"$f":"IF(I18=\"\",\"\",VLOOKUP(I18,Équipes!$A:$C,3,FALSE))","v":""}]
[null,"21:00:00",null,{"$f":"IF(C19=\"\",\"\",VLOOKUP(C19,Équipes!$A:$C,3,FALSE))","v":""},null,null,{"$f":"IF(F19=\"\",\"\",VLOOKUP(F19,Équipes!$A:$C,3,FALSE))","v":""},null,null,{"$f":"IF(I19=\"\",\"\",VLOOKUP(I19,Équipes!$A:$C,3,FALSE))","v":""}]
[null,null,null,{"$f":"IF(C20=\"\",\"\",VLOOKUP(C20,Équipes!$A:$C,3,FALSE))","v":""},null,null,{"$f":"IF(F20=\"\",\"\",VLOOKUP(F20,Équipes!$A:$C,3,FALSE))","v":""},null,null,{"$f":"IF(I20=\"\",\"\",VLOOKUP(I20,Équipes!$A:$C,3,FALSE))","v":""}]
[null,null,null,{"$f":"IF(C21=\"\",\"\",VLOOKUP(C21,Équipes!$A:$C,3,FALSE))","v":""},null,null,{"$f":"IF(F21=\"\",\"\",VLOOKUP(F21,Équipes!$A:$C,3,FALSE))","v":""},null,null,{"$f":"IF(I21=\"\",\"\",VLOOKUP(I21,Équipes!$A:$C,3,FALSE))","v":""}]
["2021-11-01","19:00:00",null,{"$f":"IF(C22=\"\",\"\",VLOOKUP(C22,Équipes!$A:$C,3,FALSE))","v":""},null,null,{"$f":"IF(F22=\"\",\"\",VLOOKUP(F22,Équipes!$A:$C,3,FALSE))","v":""},null,null,{"$f":"IF(I22=\"\",\"\",VLOOKUP(I22,Équipes!$A:$C,3,FALSE))","v":""}]
[null,null,null,{"$f":"IF(C23=\"\",\"\",VLOOKUP(C23,Équipes!$A:$C,3,FALSE))","v":""},null,null,{"$f":"IF(F23=\"\",\"\",VLOOKUP(F23,Équipes!$A:$C,3,FALSE))","v":""},null,null,{"$f":"IF(I23=\"\",\"\",VLOOKUP(I23,Équipes!$A:$C,3,FALSE))","v":""}]
[null,"21:00:00",null,{"$f":"IF(C24=\"\",\"\",VLOOKUP(C24,Équipes!$A:$C,3,FALSE))","v":""},null,null,{"$f":"IF(F24=\"\",\"\",VLOOKUP(F24,Équipes!$A:$C,3,FALSE))","v":""},null,null,{"$f":"IF(I24=\"\",\"\",VLOOKUP(I24,Équipes!$A:$C,3,FALSE))","v":""}]
[null,null,null,{"$f":"IF(C25=\"\",\"\",VLOOKUP(C25,Équipes!$A:$C,3,FALSE))","v":""},null,null,{"$f":"IF(F25=\"\",\"\",VLOOKUP(F25,Équipes!$A:$C,3,FALSE))","v":""},null,null,{"$f":"IF(I25=\"\",\"\",VLOOKUP(I25,Équipes!$A:$C,3,FALSE))","v":""}]
[null,null,null,{"$f":"IF(C26=\"\",\"\",VLOOKUP(C26,Équipes!$A:$C,3,FALSE))","v":""},null,null,{"$f":"IF(F26=\"\",\"\",VLOOKUP(F26,Équipes!$A:$C,3,FALSE))","v":""},null,null,{"$f":"IF(I26=\"\",\"\",VLOOKUP(I26,Équipes!$A:$C,3,FALSE))","v":""}]
["2021-11-09","19:00:00",null,{"$f":"IF(C27=\"\",\"\",VLOOKUP(C27,Équipes!$A:$C,3,FALSE))","v":""},null,null,{"$f":"IF(F27=\"\",\"\",VLOOKUP(F27,Équipes!$A:$C,3,FALSE))","v":""},null,null,{"$f":"IF(I27=\"\",\"\",VLOOKUP(I27,Équipes!$A:$C,3,FALSE))","v":""}]
[null,null,null,{"$f":"IF(C28=\"\",\"\",VLOOKUP(C28,Équipes!$A:$C,3,FALSE))","v":""},null,null,{"$f":"IF(F28=\"\",\"\",VLOOKUP(F28,Équipes!$A:$C,3,FALSE))","v":""},null,null,{"$f":"IF(I28=\"\",\"\",VLOOKUP(I28,Équipes!$A:$C,3,FALSE))","v":""}]
[null,"21:00:00",null,{"$f":"IF(C29=\"\",\"\",VLOOKUP(C29,Équipes!$A:$C,3,FALSE))","v":""},null,null,{"$f":"IF(F29=\"\",\"\",VLOOKUP(F29,Équipes!$A:$C,3,FALSE))","v":""},null,null,{"$f":"IF(I29=\"\",\"\",VLOOKUP(I29,Équipes!$A:$C,3,FALSE))","v":""}]
[null,null,null,{"$f":"IF(C30=\"\",\"\",VLOOKUP(C30,Équipes!$A:$C,3,FALSE))","v":""},null,null,{"$f":"IF(F30=\"\",\"\",VLOOKUP(F30,Équipes!$A:$C,3,FALSE))","v":""},null,null,{"$f":"IF(I30=\"\",\"\",VLOOKUP(I30,Équipes!$A:$C,3,FALSE))","v":""}]
[null,null,null,{"$f":"IF(C31=\"\",\"\",VLOOKUP(C31,Équipes!$A:$C,3,FALSE))","v":""},null,null,{"$f":"IF(F31=\"\",\"\",VLOOKUP(F31,Équipes!$A:$C,3,FALSE))","v":""},null,null,{"$f":"IF(I31=\"\",\"\",VLOOKUP(I31,Équipes!$A:$C,3,FALSE))","v":""}]
["2021-11-15","19:00:00",null,{"$f":"IF(C32=\"\",\"\",VLOOKUP(C32,Équipes!$A:$C,3,FALSE))","v":""},null,null,{"$f":"IF(F32=\"\",\"\",VLOOKUP(F32,Équipes!$A:$C,3,FALSE))","v":""},null,null,{"$f":"IF(I32=\"\",\"\",VLOOKUP(I32,Équipes!$A:$C,3,FALSE))","v":""}]
[null,null,null,{"$f":"IF(C33=\"\",\"\",VLOOKUP(C33,Équipes!$A:$C,3,FALSE))","v":""},null,null,{"$f":"IF(F33=\"\",\"\",VLOOKUP(F33,Équipes!$A:$C,3,FALSE))","v":""},null,null,{"$f":"IF(I33=\"\",\"\",VLOOKUP(I33,Équipes!$A:$C,3,FALSE))","v":""}]
[null,"21:00:00",null,{"$f":"IF(C34=\"\",\"\",VLOOKUP(C34,Équipes!$A:$C,3,FALSE))","v":""},null,null,{"$f":"IF(F34=\"\",\"\",VLOOKUP(F34,Équipes!$A:$C,3,FALSE))","v":""},null,null,{"$f":"IF(I34=\"\",\"\",VLOOKUP(I34,Équipes!$A:$C,3,FALSE))","v":""}]
[null,null,null,{"$f":"IF(C35=\"\",\"\",VLOOKUP(C35,Équipes!$A:$C,3,FALSE))","v":""},null,null,{"$f":"IF(F35=\"\",\"\",VLOOKUP(F35,Équipes!$A:$C,3,FALSE))","v":""},null,null,{"$f":"IF(I35=\"\",\"\",VLOOKUP(I35,Équipes!$A:$C,3,FALSE))","v":""}]
[null,null,null,{"$f":"IF(C36=\"\",\"\",VLOOKUP(C36,Équipes!$A:$C,3,FALSE))","v":""},null,null,{"$f":"IF(F36=\"\",\"\",VLOOKUP(F36,Équipes!$A:$C,3,FALSE))","v":""},null,null,{"$f":"IF(I36=\"\",\"\",VLOOKUP(I36,Équipes!$A:$C,3,FALSE))","v":""}]
["2021-11-23","19:00:00",null,{"$f":"IF(C37=\"\",\"\",VLOOKUP(C37,Équipes!$A:$C,3,FALSE))","v":""},null,null,{"$f":"IF(F37=\"\",\"\",VLOOKUP(F37,Équipes!$A:$C,3,FALSE))","v":""},null,null,{"$f":"IF(I37=\"\",\"\",VLOOKUP(I37,Équipes!$A:$C,3,FALSE))","v":""}]
[null,null,null,{"$f":"IF(C38=\"\",\"\",VLOOKUP(C38,Équipes!$A:$C,3,FALSE))","v":""},null,null,{"$f":"IF(F38=\"\",\"\",VLOOKUP(F38,Équipes!$A:$C,3,FALSE))","v":""},null,null,{"$f":"IF(I38=\"\",\"\",VLOOKUP(I38,Équipes!$A:$C,3,FALSE))","v":""}]
[null,"21:00:00",null,{"$f":"IF(C39=\"\",\"\",VLOOKUP(C39,Équipes!$A:$C,3,FALSE))","v":""},null,null,{"$f":"IF(F39=\"\",\"\",VLOOKUP(F39,Équipes!$A:$C,3,FALSE))","v":""},null,null,{"$f":"IF(I39=\"\",\"\",VLOOKUP(I39,Équipes!$A:$C,3,FALSE))","v":""}]
[null,null,null,{"$f":"IF(C40=\"\",\"\",VLOOKUP(C40,Équipes!$A:$C,3,FALSE))","v":""},null,null,{"$f":"IF(F40=\"\",\"\",VLOOKUP(F40,Équipes!$A:$C,3,FALSE))","v":""},null,null,{"$f":"IF(I40=\"\",\"\",VLOOKUP(I40,Équipes!$A:$C,3,FALSE))","v":""}]
{"$rows_left_out":46}
{"sheet":"Horaires (2)","index":2,"n_rows":69,"n_cols":11,"rows_kept":69,"cut":false,"hidden":false,"merged":[[0,0,0,10],[1,0,1,10]]}
["\nLigue compétition mixte mardi de soir \nHoraires\n"]
[{"$f":"\"Saison \"&YEAR(D3)&\"/\"&RIGHT(YEAR(D3)+1,2)& \" Ronde-\"&B3 & \": du \"&TEXT(A7,\"jj\") & \" \" & TEXT(A7,\"mmmm\") & \" au \" & TEXT(MAX(A3:A68),\"jj\") & \" \" &TEXT(MAX(A3:A68),\"mmmm\") & \" \" & YEAR(MAX(A3:A68))& \" Compétition : \"&C3","v":"Saison 2021/22 Ronde-1: du 12 octobre au 06 décembre 2021 Compétition : Robin"}]
[null,1,"Robin","2021-10-12"]
[]
["Date ","Heure","Équipes","Glace - 1","Points","Équipes","Glace - 2","Points","Équipes","Glace - 3","Points"]
[null,null,null,{"$f":"SUM(E7:E37,H7:H37,K7:K37)","v":0}]
["2021-10-12","19:00:00",null,{"$f":"IF(C7=\"\",\"\",VLOOKUP(C7,Équipes!$A:$C,3,FALSE))","v":""},null,null,{"$f":"IF(F7=\"\",\"\",VLOOKUP(F7,Équipes!$A:$C,3,FALSE))","v":""},null,null,{"$f":"IF(I7=\"\",\"\",VLOOKUP(I7,Équipes!$A:$C,3,FALSE))","v":""}]
[null,null,null,{"$f":"IF(C8=\"\",\"\",VLOOKUP(C8,Équipes!$A:$C,3,FALSE))","v":""},null,null,{"$f":"IF(F8=\"\",\"\",VLOOKUP(F8,Équipes!$A:$C,3,FALSE))","v":""},null,null,{"$f":"IF(I8=\"\",\"\",VLOOKUP(I8,Équipes!$A:$C,3,FALSE))","v":""}]
[null,"21:00:00",null,{"$f":"IF(C9=\"\",\"\",VLOOKUP(C9,Équipes!$A:$C,3,FALSE))","v":""},null,null,{"$f":"IF(F9=\"\",\"\",VLOOKUP(F9,Équipes!$A:$C,3,FALSE))","v":""},null,null,{"$f":"IF(I9=\"\",\"\",VLOOKUP(I9,Équipes!$A:$C,3,FALSE))","v":""}]
[null,null,null,{"$f":"IF(C10=\"\",\"\",VLOOKUP(C10,Équipes!$A:$C,3,FALSE))","v":""},null,null,{"$f":"IF(F10=\"\",\"\",VLOOKUP(F10,Équipes!$A:$C,3,FALSE))","v":""},null,null,{"$f":"IF(I10=\"\",\"\",VLOOKUP(I10,Équipes!$A:$C,3,FALSE))","v":""}]
[null,null,null,{"$f":"IF(C11=\"\",\"\",VLOOKUP(C11,Équipes!$A:$C,3,FALSE))","v":""},null,null,{"$f":"IF(F11=\"\",\"\",VLOOKUP(F11,Équipes!$A:$C,3,FALSE))","v":""},null,null,{"$f":"IF(I11=\"\",\"\",VLOOKUP(I11,Équipes!$A:$C,3,FALSE))","v":""}]
["2021-10-18","21:00:00",null,{"$f":"IF(C12=\"\",\"\",VLOOKUP(C12,Équipes!$A:$C,3,FALSE))","v":""},null,null,{"$f":"IF(F12=\"\",\"\",VLOOKUP(F12,Équipes!$A:$C,3,FALSE))","v":""},null,null,{"$f":"IF(I12=\"\",\"\",VLOOKUP(I12,Équipes!$A:$C,3,FALSE))","v":""}]
[null,null,null,{"$f":"IF(C13=\"\",\"\",VLOOKUP(C13,Équipes!$A:$C,3,FALSE))","v":""},null,null,{"$f":"IF(F13=\"\",\"\",VLOOKUP(F13,Équipes!$A:$C,3,FALSE))","v":""},null,null,{"$f":"IF(I13=\"\",\"\",VLOOKUP(I13,Équipes!$A:$C,3,FALSE))","v":""}]
[null,null,null,{"$f":"IF(C14=\"\",\"\",VLOOKUP(C14,Équipes!$A:$C,3,FALSE))","v":""},null,null,{"$f":"IF(F14=\"\",\"\",VLOOKUP(F14,Équipes!$A:$C,3,FALSE))","v":""},null,null,{"$f":"IF(I14=\"\",\"\",VLOOKUP(I14,Équipes!$A:$C,3,FALSE))","v":""}]
["2021-10-19","19:00:00",null,{"$f":"IF(C15=\"\",\"\",VLOOKUP(C15,Équipes!$A:$C,3,FALSE))","v":""},null,null,{"$f":"IF(F15=\"\",\"\",VLOOKUP(F15,Équipes!$A:$C,3,FALSE))","v":""},null,null,{"$f":"IF(I15=\"\",\"\",VLOOKUP(I15,Équipes!$A:$C,3,FALSE))","v":""}]
[null,null,null,{"$f":"IF(C16=\"\",\"\",VLOOKUP(C16,Équipes!$A:$C,3,FALSE))","v":""},null,null,{"$f":"IF(F16=\"\",\"\",VLOOKUP(F16,Équipes!$A:$C,3,FALSE))","v":""},null,null,{"$f":"IF(I16=\"\",\"\",VLOOKUP(I16,Équipes!$A:$C,3,FALSE))","v":""}]
[null,"21:00:00",null,{"$f":"IF(C17=\"\",\"\",VLOOKUP(C17,Équipes!$A:$C,3,FALSE))","v":""},null,null,{"$f":"IF(F17=\"\",\"\",VLOOKUP(F17,Équipes!$A:$C,3,FALSE))","v":""},null,null,{"$f":"IF(I17=\"\",\"\",VLOOKUP(I17,Équipes!$A:$C,3,FALSE))","v":""}]
[null,null,null,{"$f":"IF(C18=\"\",\"\",VLOOKUP(C18,Équipes!$A:$C,3,FALSE))","v":""},null,null,{"$f":"IF(F18=\"\",\"\",VLOOKUP(F18,Équipes!$A:$C,3,FALSE))","v":""},null,null,{"$f":"IF(I18=\"\",\"\",VLOOKUP(I18,Équipes!$A:$C,3,FALSE))","v":""}]
[null,null,null,{"$f":"IF(C19=\"\",\"\",VLOOKUP(C19,Équipes!$A:$C,3,FALSE))","v":""},null,null,{"$f":"IF(F19=\"\",\"\",VLOOKUP(F19,Équipes!$A:$C,3,FALSE))","v":""},null,null,{"$f":"IF(I19=\"\",\"\",VLOOKUP(I19,Équipes!$A:$C,3,FALSE))","v":""}]
["2021-10-25","21:00:00",null,{"$f":"IF(C20=\"\",\"\",VLOOKUP(C20,Équipes!$A:$C,3,FALSE))","v":""},null,null,{"$f":"IF(F20=\"\",\"\",VLOOKUP(F20,Équipes!$A:$C,3,FALSE))","v":""},null,null,{"$f":"IF(I20=\"\",\"\",VLOOKUP(I20,Équipes!$A:$C,3,FALSE))","v":""}]
[null,null,null,{"$f":"IF(C21=\"\",\"\",VLOOKUP(C21,Équipes!$A:$C,3,FALSE))","v":""},null,null,{"$f":"IF(F21=\"\",\"\",VLOOKUP(F21,Équipes!$A:$C,3,FALSE))","v":""},null,null,{"$f":"IF(I21=\"\",\"\",VLOOKUP(I21,Équipes!$A:$C,3,FALSE))","v":""}]
[null,null,null,{"$f":"IF(C22=\"\",\"\",VLOOKUP(C22,Équipes!$A:$C,3,FALSE))","v":""},null,null,{"$f":"IF(F22=\"\",\"\",VLOOKUP(F22,Équipes!$A:$C,3,FALSE))","v":""},null,null,{"$f":"IF(I22=\"\",\"\",VLOOKUP(I22,Équipes!$A:$C,3,FALSE))","v":""}]
["2021-10-26","19:00:00",null,{"$f":"IF(C23=\"\",\"\",VLOOKUP(C23,Équipes!$A:$C,3,FALSE))","v":""},null,null,{"$f":"IF(F23=\"\",\"\",VLOOKUP(F23,Équipes!$A:$C,3,FALSE))","v":""},null,null,{"$f":"IF(I23=\"\",\"\",VLOOKUP(I23,Équipes!$A:$C,3,FALSE))","v":""}]
[null,null,null,{"$f":"IF(C24=\"\",\"\",VLOOKUP(C24,Équipes!$A:$C,3,FALSE))","v":""},null,null,{"$f":"IF(F24=\"\",\"\",VLOOKUP(F24,Équipes!$A:$C,3,FALSE))","v":""},null,null,{"$f":"IF(I24=\"\",\"\",VLOOKUP(I24,Équipes!$A:$C,3,FALSE))","v":""}]
[null,"21:00:00",null,{"$f":"IF(C25=\"\",\"\",VLOOKUP(C25,Équipes!$A:$C,3,FALSE))","v":""},null,null,{"$f":"IF(F25=\"\",\"\",VLOOKUP(F25,Équipes!$A:$C,3,FALSE))","v":""},null,null,{"$f":"IF(I25=\"\",\"\",VLOOKUP(I25,Équipes!$A:$C,3,FALSE))","v":""}]
[null,null,null,{"$f":"IF(C26=\"\",\"\",VLOOKUP(C26,Équipes!$A:$C,3,FALSE))","v":""},null,null,{"$f":"IF(F26=\"\",\"\",VLOOKUP(F26,Équipes!$A:$C,3,FALSE))","v":""},null,null,{"$f":"IF(I26=\"\",\"\",VLOOKUP(I26,Équipes!$A:$C,3,FALSE))","v":""}]
[null,null,null,{"$f":"IF(C27=\"\",\"\",VLOOKUP(C27,Équipes!$A:$C,3,FALSE))","v":""},null,null,{"$f":"IF(F27=\"\",\"\",VLOOKUP(F27,Équipes!$A:$C,3,FALSE))","v":""},null,null,{"$f":"IF(I27=\"\",\"\",VLOOKUP(I27,Équipes!$A:$C,3,FALSE))","v":""}]
["2021-11-01","21:00:00",null,{"$f":"IF(C28=\"\",\"\",VLOOKUP(C28,Équipes!$A:$C,3,FALSE))","v":""},null,null,{"$f":"IF(F28=\"\",\"\",VLOOKUP(F28,Équipes!$A:$C,3,FALSE))","v":""},null,null,{"$f":"IF(I28=\"\",\"\",VLOOKUP(I28,Équipes!$A:$C,3,FALSE))","v":""}]
[null,null,null,{"$f":"IF(C29=\"\",\"\",VLOOKUP(C29,Équipes!$A:$C,3,FALSE))","v":""},null,null,{"$f":"IF(F29=\"\",\"\",VLOOKUP(F29,Équipes!$A:$C,3,FALSE))","v":""},null,null,{"$f":"IF(I29=\"\",\"\",VLOOKUP(I29,Équipes!$A:$C,3,FALSE))","v":""}]
[null,null,null,{"$f":"IF(C30=\"\",\"\",VLOOKUP(C30,Équipes!$A:$C,3,FALSE))","v":""},null,null,{"$f":"IF(F30=\"\",\"\",VLOOKUP(F30,Équipes!$A:$C,3,FALSE))","v":""},null,null,{"$f":"IF(I30=\"\",\"\",VLOOKUP(I30,Équipes!$A:$C,3,FALSE))","v":""}]
["2021-11-02","19:00:00",null,{"$f":"IF(C31=\"\",\"\",VLOOKUP(C31,Équipes!$A:$C,3,FALSE))","v":""},null,null,{"$f":"IF(F31=\"\",\"\",VLOOKUP(F31,Équipes!$A:$C,3,FALSE))","v":""},null,null,{"$f":"IF(I31=\"\",\"\",VLOOKUP(I31,Équipes!$A:$C,3,FALSE))","v":""}]
[null,null,null,{"$f":"IF(C32=\"\",\"\",VLOOKUP(C32,Équipes!$A:$C,3,FALSE))","v":""},null,null,{"$f":"IF(F32=\"\",\"\",VLOOKUP(F32,Équipes!$A:$C,3,FALSE))","v":""},null,null,{"$f":"IF(I32=\"\",\"\",VLOOKUP(I32,Équipes!$A:$C,3,FALSE))","v":""}]
[null,"21:00:00",null,{"$f":"IF(C33=\"\",\"\",VLOOKUP(C33,Équipes!$A:$C,3,FALSE))","v":""},null,null,{"$f":"IF(F33=\"\",\"\",VLOOKUP(F33,Équipes!$A:$C,3,FALSE))","v":""},null,null,{"$f":"IF(I33=\"\",\"\",VLOOKUP(I33,Équipes!$A:$C,3,FALSE))","v":""}]
[null,null,null,{"$f":"IF(C34=\"\",\"\",VLOOKUP(C34,Équipes!$A:$C,3,FALSE))","v":""},null,null,{"$f":"IF(F34=\"\",\"\",VLOOKUP(F34,Équipes!$A:$C,3,FALSE))","v":""},null,null,{"$f":"IF(I34=\"\",\"\",VLOOKUP(I34,Équipes!$A:$C,3,FALSE))","v":""}]
[null,null,null,{"$f":"IF(C35=\"\",\"\",VLOOKUP(C35,Équipes!$A:$C,3,FALSE))","v":""},null,null,{"$f":"IF(F35=\"\",\"\",VLOOKUP(F35,Équipes!$A:$C,3,FALSE))","v":""},null,null,{"$f":"IF(I35=\"\",\"\",VLOOKUP(I35,Équipes!$A:$C,3,FALSE))","v":""}]
["2021-11-08","21:00:00",null,{"$f":"IF(C36=\"\",\"\",VLOOKUP(C36,Équipes!$A:$C,3,FALSE))","v":""},null,null,{"$f":"IF(F36=\"\",\"\",VLOOKUP(F36,Équipes!$A:$C,3,FALSE))","v":""},null,null,{"$f":"IF(I36=\"\",\"\",VLOOKUP(I36,Équipes!$A:$C,3,FALSE))","v":""}]
[null,null,null,{"$f":"IF(C37=\"\",\"\",VLOOKUP(C37,Équipes!$A:$C,3,FALSE))","v":""},null,null,{"$f":"IF(F37=\"\",\"\",VLOOKUP(F37,Équipes!$A:$C,3,FALSE))","v":""},null,null,{"$f":"IF(I37=\"\",\"\",VLOOKUP(I37,Équipes!$A:$C,3,FALSE))","v":""}]
[]
["2021-11-09","19:00:00",null,{"$f":"IF(C39=\"\",\"\",VLOOKUP(C39,Équipes!$A:$C,3,FALSE))","v":""},null,null,{"$f":"IF(F39=\"\",\"\",VLOOKUP(F39,Équipes!$A:$C,3,FALSE))","v":""},null,null,{"$f":"IF(I39=\"\",\"\",VLOOKUP(I39,Équipes!$A:$C,3,FALSE))","v":""}]
[null,null,null,{"$f":"IF(C40=\"\",\"\",VLOOKUP(C40,Équipes!$A:$C,3,FALSE))","v":""},null,null,{"$f":"IF(F40=\"\",\"\",VLOOKUP(F40,Équipes!$A:$C,3,FALSE))","v":""},null,null,{"$f":"IF(I40=\"\",\"\",VLOOKUP(I40,Équipes!$A:$C,3,FALSE))","v":""}]
{"$rows_left_out":30}
{"sheet":"Mode de fonctionnement","index":3,"n_rows":195,"n_cols":5,"rows_kept":195,"cut":false,"hidden":true,"merged":[[128,0,128,8],[126,0,126,8],[19,0,19,8],[86,0,86,8],[54,0,54,8],[72,0,72,8],[74,0,74,8],[50,0,50,8],[61,0,61,8],[91,0,91,8],[93,0,93,8],[84,0,84,8],[124,0,124,8],[99,0,99,8],[97,0,97,8],[95,0,95,8],[194,0,194,8],[32,0,32,8],[21,0,21,8],[59,0,59,8],[186,0,186,8],[192,0,192,8],[115,0,115,8],[188,0,188,8],[38,0,38,8],[34,0,34,8],[109,0,109,8],[157,0,157,8],[121,0,121,8],[119,0,119,8],[144,0,144,8],[148,0,148,8],[130,0,130,8],[134,0,134,8],[138,0,138,8],[146,0,146,8],[29,0,29,8],[48,0,48,8],[52,0,52,8],[117,0,117,8],[107,0,107,8],[46,0,46,8],[101,0,101,8],[103,0,103,8],[78,0,78,8],[82,0,82,8],[136,0,136,8],[105,0,105,8],[0,0,0,8],[44,0,44,8],[36,0,36,8],[2,0,2,8],[120,0,120,8],[111,0,111,8],[113,0,113,8],[4,0,4,8],[25,0,25,8],[9,0,9,8],[11,0,11,8],[7,0,7,8],[27,0,27,8],[6,0,6,8],[15,0,15,8],[17,0,17,8],[154,0,154,8],[169,0,169,8],[173,0,173,8],[175,0,175,8],[171,0,171,8],[155,0,155,8],[161,0,161,8],[165,0,165,8],[167,0,167,8],[159,0,159,8],[163,0,163,8],[177,0,177,8],[182,0,182,8],[179,0,179,8],[184,0,184,8],[190,0,190,8],[42,0,42,8],[55,0,55,8],[64,0,64,8],[88,0,88,8],[80,0,80,8],[76,0,76,8],[70,0,70,8],[66,0,66,8],[151,0,151,8],[152,0,152,8],[132,0,132,8],[140,0,140,8],[142,0,142,8],[150,0,150,8]]}
["          Ligue compétition mixte mardi de soir \n        Mode de fonctionnement"]
[]
["1.  PRINCIPE GÉNÉRAL"]
[]
["      Une équipe doit obligatoirement être composée d’au moins quatre joueurs formés de deux       \n      hommes et 2 femmes. Le capitaine forme son équipe et les joueurs occuperont les positions en\n      respectant le principe de l'alternance des hommes et des femmes selon l’une des 2 possibilités \n      suivantes : "]
[]
["       * 1 homme, 1 femme,  1 homme, 1 femme "]
["       * 1 femme,  1 homme, 1 femme,  1 homme "]
[]
["      L’équipe complète doit être inscrite  et la cotisation payée au plus tard avant le début des \n      activités, à défaut de quoi elle ne pourra prendre part aux activités de la ligue. "]
[]
["      Seuls les joueurs – membre en règle - âgés de 16 ou plus en date du 1er septembre précédent le \n      début de la saison peuvent remplacer ou s’inscrire à cette ligue de soir à moins de dérogation\n      accordé par le conseil d’administration. "]
[]
["      Il est interdit à une personne non membre de participer à cette ligue. "]
[]
["      La ligue fonctionne selon l'une des deux formules suivantes :  \n       * Tournoi à la ronde (round robin)\n       * Ladder  "]
[]
["      La formule utilisée est déterminée en début d'année par le responsable et les équipes qui \n      composent la ligue."]
[]
["      Les deux formules sont décrites aux items 3 et 4 du présent document."]
[]
["2.  HORAIRE"]
[]
["      Mardi 19 h et 21 h, en alternance lundi soir ou autre, si nécessaire.   "]
[]
["      La règle du 1 h 50 pour jouer une partie en 2 heures s'applique et doit être respectée en tout\n      temps sauf si avis contraire du ou des responsables de la ligue. "]
[]
["      Une équipe qui ne peut commencer un match à l’heure prévue se verra pénaliser d’un bout et \n      un point en plus de la perte du marteau pour chaque 10 minutes de retard pour un maximum de \n      2 bouts soit 20 minutes. "]
[]
["      Toutefois une équipe qui étire une partie de façon intentionnelle pour préserver une victoire se \n      verra accorder 0 point. "]
[]
[]
["3.  FORMULE DE COMPÉTITION : tournoi à la ronde (round robin)"]
[]
["3.1 Classement des équipes "]
[]
["      Aucun classement requis avec la formule du tournoi à la ronde. Il peut y avoir des sections, \n      cela dépend du nombre d’équipes et la formule retenue. "]
[]
["3.2 Pointage en saison régulière"]
[]
{"$rows_left_out":155}