{"text_format":"1","workbook":"xlsx","n_sheets":7,"sheets":["Photos","Champions","Écuries","Pilotes","Bahrein","Italieim","Portugal"],"not_rendered":{"charts":0,"images":53,"macros":1,"external_links":1,"defined_names":19,"comments":0,"pivot_tables":0},"unopened":[],"bounds":{"document_bytes":16777216,"sheet_cells":100000,"rows_first":2000,"rows_last":500,"rows_between":2000,"halvings":0,"cell_chars":16384,"cell_head_chars":4096},"cells_cut":0,"cells_raw":0,"read":"whole","date_system":"1900"}

{"sheet":"Photos","index":0,"n_rows":23,"n_cols":8,"rows_kept":23,"cut":false,"hidden":false,"merged":[[1,5,1,7],[1,1,1,3]]}
[]
[null,"Photos Pilotes",null,null,null,"Photos F1"]
[null,"Noms",null,"Photos",null,"Noms",null,"Photos"]
[null,"HAMILTON Lewis",{"$f":"\"Photos!\"&ADDRESS(ROW(C4),COLUMN(D4))","v":"Photos!$D$4"},null,null,"MERCEDES",{"$f":"\"Photos!\"&ADDRESS(ROW(G4),COLUMN(H4))","v":"Photos!$H$4"}]
[null,"BOTTAS Valtteri","Photos!$D$5",null,null,"FERRARI","Photos!$H$5"]
[null,"LECLERC Charles","Photos!$D$6",null,null,"RED BULL RACING","Photos!$H$6"]
[null,"VETTEL Sebastian","Photos!$D$7",null,null,"ASTON MARTIN","Photos!$H$7"]
[null,"VERSTAPPEN Max","Photos!$D$8",null,null,"WILLIAMS","Photos!$H$8"]
[null,"PEREZ Sergio","Photos!$D$9",null,null,"ALPINE F1 TEAM","Photos!$H$9"]
[null,"STROLL Lance","Photos!$D$10",null,null,"ALPHA TAURI","Photos!$H$10"]
[null,"RUSSELL George","Photos!$D$11",null,null,"HASS","Photos!$H$11"]
[null,"LATIFI Nichola","Photos!$D$12",null,null,"Mc LAREN","Photos!$H$12"]
[null,"RICCIARDO Daniel","Photos!$D$13",null,null,"ALFA ROMÉO","Photos!$H$13"]
[null,"OCON Sebastian","Photos!$D$14"]
[null,"TSUNODA Yoki","Photos!$D$15"]
[null,"GASLY Pierre","Photos!$D$16"]
[null,"SCHUMACHER Mick","Photos!$D$17"]
[null,"MAZEPIN Nikita","Photos!$D$18"]
[null,"NORRIS Lando","Photos!$D$19"]
[null,"SAINZ.Jr Carlos","Photos!$D$20"]
[null,"RAÏKKÖNEN Kimi","Photos!$D$21"]
[null,"GIOVINAZZI Antonio ","Photos!$D$22"]
[null,"ALONSO Fernando","Photos!$D$23"]

{"sheet":"Champions","index":1,"n_rows":22,"n_cols":10,"rows_kept":22,"cut":false,"hidden":false,"merged":[[1,2,1,10],[15,2,15,10],[17,5,17,7],[18,5,18,7],[3,5,3,7],[4,5,4,7],[6,1,6,3],[7,1,7,3],[6,9,6,11],[7,9,7,11],[5,5,10,7],[8,1,13,3],[8,9,13,11],[20,1,20,3],[21,1,21,3],[20,9,20,11],[21,9,21,11],[22,1,26,3],[19,5,23,7],[22,9,26,11]]}
[]
[null,null,"CHAMPIONNAT PILOTES 2021"]
[]
[null,null,null,null,null,"CHAMPION 2021"]
[null,null,null,null,null,{"$f":"IF(Pilotes!G5=1,Pilotes!B5,\"\")","v":"HAMILTON Lewis"}]
[]
[null,"DEUXIÈME",null,null,null,null,null,null,null,"TROIXIÈME"]
[null,{"$f":"IF(Pilotes!G6=2,Pilotes!B6,\"\")","v":"VERSTAPPEN Max"},null,null,null,null,null,null,null,{"$f":"IF(Pilotes!G7=3,Pilotes!B7,\"\")","v":"NORRIS Lando"}]
[]
[]
[]
[]
[]
[]
[]
[null,null,"CHAMPIONNAT CONSTRUCTEURS 2021"]
[]
[null,null,null,null,null,"CHAMPION 2019"]
[null,null,null,null,null,{"$f":"IF(Écuries!F4=1,Écuries!B4,\"\")","v":"MERCEDES"}]
[]
[null,"DEUXIÈME",null,null,null,null,null,null,null,"TROIXIÈME"]
[null,{"$f":"IF(Écuries!F5=2,Écuries!B5,\"\")","v":"RED BULL RACING"},null,null,null,null,null,null,null,{"$f":"IF(Écuries!F6=3,Écuries!B6,\"\")","v":"Mc LAREN"}]

{"sheet":"Écuries","index":2,"n_rows":13,"n_cols":6,"rows_kept":13,"cut":false,"hidden":false,"merged":[[0,1,0,5]]}
[]
[]
[null,"ÉCURIES","POINTS","Écart/premier","Écart/précédent","RANG"]
[null,"MERCEDES",{"$f":"SUM(Bahrein:Portugal!$G$5:$G$7)","v":60},null,null,{"$f":"IF(C4=\"\",0,(RANK(C4,$C$4:$C$13)))+COUNTIF(C$4:C4,C4)-1","v":1}]
[null,"RED BULL RACING",{"$f":"SUM(Bahrein:Portugal!$G$11:$G$13)","v":53},{"$f":"C5-C4","v":-7},{"$f":"C5-C4","v":-7},{"$f":"IF(C5=\"\",0,(RANK(C5,$C$4:$C$13)))+COUNTIF(C$4:C5,C5)-1","v":2}]
[null,"Mc LAREN",{"$f":"SUM(Bahrein:Portugal!$G$29:$G$31)","v":41},{"$f":"C6-C4","v":-19},{"$f":"C6-C5","v":-12},{"$f":"IF(C6=\"\",0,(RANK(C6,$C$4:$C$13)))+COUNTIF(C$4:C6,C6)-1","v":3}]
[null,"FERRARI",{"$f":"SUM(Bahrein:Portugal!$G$8:$G$10)","v":34},{"$f":"C7-C4","v":-26},-7,{"$f":"IF(C7=\"\",0,(RANK(C7,$C$4:$C$13)))+COUNTIF(C$4:C7,C7)-1","v":4}]
[null,"ALPHA TAURI",{"$f":"SUM(Bahrein:Portugal!$G$23:$G$25)","v":2},{"$f":"C8-C4","v":-58},-32,{"$f":"IF(C8=\"\",0,(RANK(C8,$C$4:$C$13)))+COUNTIF(C$4:C8,C8)-1","v":6}]
[null,"ASTON MARTIN",{"$f":"SUM(Bahrein:Portugal!$G$14:$G$16)","v":7},{"$f":"C9-C4","v":-53},5,{"$f":"IF(C9=\"\",0,(RANK(C9,$C$4:$C$13)))+COUNTIF(C$4:C9,C9)-1","v":5}]
[null,"WILLIAMS",{"$f":"SUM(Bahrein:Portugal!$G$17:$G$19)","v":0},{"$f":"C10-C4","v":-60},-7,{"$f":"IF(C10=\"\",0,(RANK(C10,$C$4:$C$13)))+COUNTIF(C$4:C10,C10)-1","v":9}]
[null,"HASS",{"$f":"SUM(Bahrein:Portugal!$G$26:$G$28)","v":0},{"$f":"C11-C4","v":-60},0,{"$f":"IF(C11=\"\",0,(RANK(C11,$C$4:$C$13)))+COUNTIF(C$4:C11,C11)-1","v":10}]
[null,"ALPINE F1 TEAM",{"$f":"SUM(Bahrein:Portugal!$G$20:$G$22)","v":1},{"$f":"C12-C4","v":-59},1,{"$f":"IF(C12=\"\",0,(RANK(C12,$C$4:$C$13)))+COUNTIF(C$4:C12,C12)-1","v":8}]
[null,"ALFA ROMÉO",{"$f":"SUM(Bahrein:Portugal!$G$32:$G$34)","v":2},{"$f":"C13-C4","v":-58},1,{"$f":"IF(C13=\"\",0,(RANK(C13,$C$4:$C$13)))+COUNTIF(C$4:C13,C13)-1","v":7}]

{"sheet":"Pilotes","index":3,"n_rows":29,"n_cols":11,"rows_kept":29,"cut":false,"hidden":false,"merged":[[2,9,3,9],[0,0,0,7],[2,1,3,1],[2,2,3,2],[2,6,3,6],[2,3,3,3],[2,4,3,4],[2,5,3,5]]}
[]
[]
[null,"PILOTES","Points","Écart-premier","Écart/précédent","Pôle Position","Place",2,null,"Courses"]
[null,null,{"$f":"IFERROR(SUM(#REF!,[1]Bahreïn!F33),\"\")","v":""},null,null,null,{"$f":"IF(C4=0,\"\",(RANK(C4,C1:C4)))","v":{"$error":"#VALUE!"}},"Pos.saison","%",{"$f":"IF(F4=0,\"\",(RANK(F4,F1:F4)))","v":""}]
[null,"HAMILTON Lewis",{"$f":"SUM(Bahrein:Portugal!$G$5)","v":44},null,null,{"$f":"CalculPool(B5)","v":{"$error":"#VALUE!"}},{"$f":"IF(C5=\"\",0,(RANK(C5,$C$5:$C$23)))","v":1},{"$f":"CalculPosition(B5)","v":{"$error":"#VALUE!"}},{"$f":"H5/23","v":{"$error":"#VALUE!"}},"Australie","Italieim"]
[null,"VERSTAPPEN Max",{"$f":"SUM(Bahrein:Portugal!$G$11)","v":43},{"$f":"C6-C5","v":-1},{"$f":"C6-C5","v":-1},{"$f":"CalculPool(B6)","v":{"$error":"#VALUE!"}},2,{"$f":"CalculPosition(B6)","v":{"$error":"#VALUE!"}},{"$f":"H6/23","v":{"$error":"#VALUE!"}},"AbuDhabi","Bahrein"]
[null,"NORRIS Lando",{"$f":"SUM(Bahrein:Portugal!$G$29)","v":27},{"$f":"C7-C5","v":-17},{"$f":"C7-C6","v":-16},{"$error":"#VALUE!"},3,{"$error":"#VALUE!"},{"$error":"#VALUE!"},"Arabie Saoudite"]
[null,"LECLERC Charles",{"$f":"SUM(Bahrein:Portugal!$G$9)","v":20},{"$f":"C8-C5","v":-24},-7,{"$f":"CalculPool(B8)","v":{"$error":"#VALUE!"}},4,{"$error":"#VALUE!"},{"$error":"#VALUE!"},"Autriche"]
[null,"BOTTAS Valtteri",{"$f":"SUM(Bahrein:Portugal!$G$6)","v":16},{"$f":"C9-C5","v":-28},-4,{"$error":"#VALUE!"},5,{"$error":"#VALUE!"},{"$error":"#VALUE!"},"Azerbaïdjan"]
[null,"RICCIARDO Daniel",{"$f":"SUM(Bahrein:Portugal!$G$30)","v":14},{"$f":"C10-C5","v":-30},-2,{"$error":"#VALUE!"},6,{"$error":"#VALUE!"},{"$error":"#VALUE!"},"Bahrein"]
[null,"SAINZ.Jr Carlos",{"$f":"SUM(Bahrein:Portugal!$G$8)","v":14},{"$f":"C11-C5","v":-30},0,{"$error":"#VALUE!"},6,{"$error":"#VALUE!"},{"$error":"#VALUE!"},"Belgique"]
[null,"PEREZ Sergio",{"$f":"SUM(Bahrein:Portugal!$G$12)","v":10},{"$f":"C12-C5","v":-34},-4,{"$error":"#VALUE!"},8,{"$error":"#VALUE!"},{"$error":"#VALUE!"},"Brésil"]
[null,"STROLL Lance",{"$f":"SUM(Bahrein:Portugal!$G$15)","v":7},{"$f":"C13-C5","v":-37},-3,{"$error":"#VALUE!"},9,{"$error":"#VALUE!"},{"$error":"#VALUE!"},"Canada"]
[null,"TSUNODA Yoki",{"$f":"SUM(Bahrein:Portugal!$G$23)","v":2},{"$f":"C14-C5","v":-42},-5,{"$error":"#VALUE!"},10,{"$error":"#VALUE!"},{"$error":"#VALUE!"},"Espagne"]
[null,"RAÏKKÖNEN Kimi",{"$f":"SUM(Bahrein:Portugal!$G$32)","v":2},{"$f":"C15-C5","v":-42},0,{"$error":"#VALUE!"},10,{"$error":"#VALUE!"},{"$error":"#VALUE!"},"France"]
[null,"OCON Sebastian",{"$f":"SUM(Bahrein:Portugal!$G$21)","v":1},{"$f":"C16-C5","v":-43},{"$f":"C16-C15","v":-1},{"$error":"#VALUE!"},12,{"$error":"#VALUE!"},{"$error":"#VALUE!"},"GB"]
[null,"RUSSELL George",{"$f":"SUM(Bahrein:Portugal!$G$17)","v":0},{"$f":"C17-C5","v":-44},-1,{"$f":"CalculPool(B17)","v":{"$error":"#VALUE!"}},13,{"$error":"#VALUE!"},{"$error":"#VALUE!"},"Hongrie"]
[null,"LATIFI Nichola",{"$f":"SUM(Bahrein:Portugal!$G$18)","v":0},{"$f":"C18-C5","v":-44},0,{"$error":"#VALUE!"},13,{"$error":"#VALUE!"},{"$error":"#VALUE!"},"Italie"]
[null,"GASLY Pierre",{"$f":"SUM(Bahrein:Portugal!$G$24)","v":0},{"$f":"C19-C5","v":-44},0,{"$error":"#VALUE!"},13,{"$error":"#VALUE!"},{"$error":"#VALUE!"},"Italieim"]
[null,"VETTEL Sebastian",{"$f":"SUM(Bahrein:Portugal!$G$14)","v":0},{"$f":"C20-C5","v":-44},0,{"$error":"#VALUE!"},13,{"$error":"#VALUE!"},{"$error":"#VALUE!"},"Japon"]
[null,"MAZEPIN Nikita",{"$f":"SUM(Bahrein:Portugal!$G$26)","v":0},{"$f":"C21-C5","v":-44},0,{"$error":"#VALUE!"},13,{"$error":"#VALUE!"},{"$error":"#VALUE!"},"Mexique"]
[null,"ALONSO Fernando",{"$f":"SUM(Bahrein:Portugal!$G$20)","v":0},{"$f":"C22-C5","v":-44},0,{"$error":"#VALUE!"},13,{"$error":"#VALUE!"},{"$error":"#VALUE!"},"Monaco"]
[null,"SCHUMACHER Mick",{"$f":"SUM(Bahrein:Portugal!$G$27)","v":0},{"$f":"C23-C5","v":-44},0,{"$error":"#VALUE!"},13,{"$error":"#VALUE!"},{"$error":"#VALUE!"},"Pays-Bas"]
[null,"GIOVINAZZI Antonio",{"$f":"SUM(Bahrein:Portugal!$G$33)","v":0},{"$f":"C24-C5","v":-44},{"$f":"C24-C23","v":0},{"$error":"#VALUE!"},13,{"$error":"#VALUE!"},{"$f":"H24/23","v":{"$error":"#VALUE!"}},"Russie"]
[null,null,null,null,null,null,null,null,null,"Sakhir"]
[null,null,null,null,null,null,null,null,null,"Singapour"]
[null,null,null,null,null,null,null,null,null,"Turquie"]
[null,null,null,null,null,null,null,null,null,"USA"]
[null,null,null,null,null,null,null,null,null,"Portugal"]

{"sheet":"Bahrein","index":4,"n_rows":61,"n_cols":11,"rows_kept":61,"cut":false,"hidden":false,"merged":[[0,0,1,13],[2,1,3,1],[2,2,3,2],[2,3,3,3],[2,5,3,5],[2,6,3,6],[2,4,3,4],[2,0,3,0],[2,8,2,10],[4,1,6,1],[4,2,6,2],[7,1,9,1],[7,2,9,2],[10,1,12,1],[10,2,12,2],[13,1,15,1],[13,2,15,2],[16,1,18,1],[16,2,18,2],[19,1,21,1],[19,2,21,2],[38,1,38,3],[31,1,33,1],[31,2,33,2],[22,1,24,1],[22,2,24,2],[25,1,27,1],[25,2,27,2],[28,1,30,1],[28,2,30,2]]}
["SAKHIR - 28 MARS 2021"]
[]
["PILOTES","ECURIES","VOITURES",null,"Pôle","Pt tour","Points",null,"CLASSEMENT"]
[null,null,null,null,null,null,null,null,"ÉCURIES","POINTS","RANG"]
["HAMILTON Lewis","MERCEDES",null,1,null,null,{"$f":"IFERROR(CHOOSE(D5,25,18,15,12,10,8,6,4,2,1)+(F5=1),0)","v":25},null,"MERCEDES",{"$f":"SUM($G$5:$G$7)","v":41},{"$f":"IF(J5=\"\",0,(RANK(J5,$J$5:$J$14)))+COUNTIF(J$5:J5,J5)-1","v":1}]
["BOTTAS Valtteri",null,null,3,null,1,{"$f":"IFERROR(CHOOSE(D6,25,18,15,12,10,8,6,4,2,1)+(F6=1),0)","v":16},null,"RED BULL RACING",{"$f":"SUM($G$11:$G$13)","v":28},{"$f":"IF(J6=\"\",0,(RANK(J6,$J$5:$J$14)))+COUNTIF(J$5:J6,J6)-1","v":2}]
[null,null,null,null,null,null,0,null,"Mc LAREN",{"$f":"SUM($G$29:$G$31)","v":18},{"$f":"IF(J7=\"\",0,(RANK(J7,$J$5:$J$14)))+COUNTIF(J$5:J7,J7)-1","v":3}]
["SAINZ.Jr Carlos","FERRARI",null,8,null,null,4,null,"FERRARI",{"$f":"SUM($G$8:$G$10)","v":12},{"$f":"IF(J8=\"\",0,(RANK(J8,$J$5:$J$14)))+COUNTIF(J$5:J8,J8)-1","v":4}]
["LECLERC Charles",null,null,6,null,null,8,null,"ALPHA TAURI",{"$f":"SUM($G$23:$G$25)","v":2},{"$f":"IF(J9=\"\",0,(RANK(J9,$J$5:$J$14)))+COUNTIF(J$5:J9,J9)-1","v":5}]
[null,null,null,null,null,null,0,null,"ASTON MARTIN",{"$f":"SUM($G$14:$G$16)","v":1},{"$f":"IF(J10=\"\",0,(RANK(J10,$J$5:$J$14)))+COUNTIF(J$5:J10,J10)-1","v":6}]
["VERSTAPPEN Max","RED BULL RACING",null,2,1,null,18,null,"WILLIAMS",{"$f":"SUM($G$17:$G$19)","v":0},{"$f":"IF(J11=\"\",0,(RANK(J11,$J$5:$J$14)))+COUNTIF(J$5:J11,J11)-1","v":7}]
["PEREZ Sergio",null,null,5,null,null,10,null,"HAAS",{"$f":"SUM($G$26:$G$28)","v":0},{"$f":"IF(J12=\"\",0,(RANK(J12,$J$5:$J$14)))+COUNTIF(J$5:J12,J12)-1","v":8}]
[null,null,null,null,null,null,0,null,"ALFA ROMÉO",{"$f":"SUM($G$32:$G$34)","v":0},{"$f":"IF(J13=\"\",0,(RANK(J13,$J$5:$J$14)))+COUNTIF(J$5:J13,J13)-1","v":9}]
["VETTEL Sebastian","ASTON MARTIN",null,15,null,null,0,null,"ALPINE F1 TEAM",{"$f":"SUM($G$20:$G$22)","v":0},{"$f":"IF(J14=\"\",0,(RANK(J14,$J$5:$J$14)))+COUNTIF(J$5:J14,J14)-1","v":10}]
["STROLL Lance",null,null,10,null,null,1]
[null,null,null,null,null,null,0]
["RUSSEL George","WILLIAMS",null,14,null,null,0]
["LATIFI Nichola",null,null,"OUT",null,null,0]
[null,null,null,null,null,null,0]
["ALONSO Fernando","ALPINE F1 TEAM",null,"OUT",null,null,0]
["OCON Sebastian",null,null,13,null,null,0]
[null,null,null,null,null,null,0]
["TSUNODA Yoki","ALPHA TAURI",null,9,null,null,2]
["GASLY Pierre",null,null,"OUT",null,null,0]
[null,null,null,null,null,null,0]
["MAZEPIN Nikita","HAAS",null,"OUT",null,null,0]
["SCHUMACHER Nick",null,null,16,null,null,0]
[null,null,null,null,null,null,0]
["NORRIS Lando","Mc LAREN",null,4,null,null,12]
["RICCIARDO Daniel",null,null,7,null,null,6]
[null,null,null,null,null,null,0]
["RAÏKKÖNEN Kimi","ALFA ROMÉO",null,11,null,null,0]
["GIOVINAZZI Antonio",null,null,12,null,null,0]
[null,null,null,null,null,null,0]
[]
[]
[]
[]
[null,"CLASSEMENT PROVISOIRE"]
[]
[null,"Noms","Points","Classe"]
[null,"HAMILTON Lewis",{"$f":"$G$5","v":25},{"$f":"IF(C42=\"\",0,(RANK(C42,$C$42:$C$61)))+COUNTIF(C$42:C42,C42)-1","v":1}]
[null,"VERSTAPPEN Max",{"$f":"$G$11","v":18},{"$f":"IF(C43=\"\",0,(RANK(C43,$C$42:$C$61)))+COUNTIF(C$42:C43,C43)-1","v":2}]
[null,"BOTTAS Valtteri",{"$f":"$G$6","v":16},{"$f":"IF(C44=\"\",0,(RANK(C44,$C$42:$C$61)))+COUNTIF(C$42:C44,C44)-1","v":3}]
[null,"NORRIS Lando",{"$f":"$G$29","v":12},{"$f":"IF(C45=\"\",0,(RANK(C45,$C$42:$C$61)))+COUNTIF(C$42:C45,C45)-1","v":4}]
[null,"PEREZ Sergio",{"$f":"$G$12","v":10},{"$f":"IF(C46=\"\",0,(RANK(C46,$C$42:$C$61)))+COUNTIF(C$42:C46,C46)-1","v":5}]
[null,"LECLERC Charles",{"$f":"$G$9","v":8},{"$f":"IF(C47=\"\",0,(RANK(C47,$C$42:$C$61)))+COUNTIF(C$42:C47,C47)-1","v":6}]
[null,"RICCIARDO Daniel",{"$f":"$G$30","v":6},{"$f":"IF(C48=\"\",0,(RANK(C48,$C$42:$C$61)))+COUNTIF(C$42:C48,C48)-1","v":7}]
[null,"SAINZ.Jr Carlos",{"$f":"$G$8","v":4},{"$f":"IF(C49=\"\",0,(RANK(C49,$C$42:$C$61)))+COUNTIF(C$42:C49,C49)-1","v":8}]
[null,"TSUNODA Yoki",{"$f":"$G$23","v":2},{"$f":"IF(C50=\"\",0,(RANK(C50,$C$42:$C$61)))+COUNTIF(C$42:C50,C50)-1","v":9}]
[null,"STROLL Lance",{"$f":"$G$15","v":1},{"$f":"IF(C51=\"\",0,(RANK(C51,$C$42:$C$61)))+COUNTIF(C$42:C51,C51)-1","v":10}]
[null,"GASLY Pierre",{"$f":"$G$24","v":0},{"$f":"IF(C52=\"\",0,(RANK(C52,$C$42:$C$61)))+COUNTIF(C$42:C52,C52)-1","v":11}]
[null,"GIOVINAZZI Antonio",{"$f":"$G$33","v":0},{"$f":"IF(C53=\"\",0,(RANK(C53,$C$42:$C$61)))+COUNTIF(C$42:C53,C53)-1","v":12}]
[null,"VETTEL Sebastian",{"$f":"$G$14","v":0},{"$f":"IF(C54=\"\",0,(RANK(C54,$C$42:$C$61)))+COUNTIF(C$42:C54,C54)-1","v":13}]
[null,"RUSSEL George",{"$f":"$G$17","v":0},{"$f":"IF(C55=\"\",0,(RANK(C55,$C$42:$C$61)))+COUNTIF(C$42:C55,C55)-1","v":14}]
[null,"LATIFI Nichola",{"$f":"$G$18","v":0},{"$f":"IF(C56=\"\",0,(RANK(C56,$C$42:$C$61)))+COUNTIF(C$42:C56,C56)-1","v":15}]
[null,"ALONSO Fernando",{"$f":"$G$20","v":0},{"$f":"IF(C57=\"\",0,(RANK(C57,$C$42:$C$61)))+COUNTIF(C$42:C57,C57)-1","v":16}]
[null,"OCON Sebastian",{"$f":"$G$21","v":0},{"$f":"IF(C58=\"\",0,(RANK(C58,$C$42:$C$61)))+COUNTIF(C$42:C58,C58)-1","v":17}]
[null,"MAZEPIN Nikita",{"$f":"$G$26","v":0},{"$f":"IF(C59=\"\",0,(RANK(C59,$C$42:$C$61)))+COUNTIF(C$42:C59,C59)-1","v":18}]
[null,"SCHUMACHER Nick",{"$f":"$G$27","v":0},{"$f":"IF(C60=\"\",0,(RANK(C60,$C$42:$C$61)))+COUNTIF(C$42:C60,C60)-1","v":19}]
[null,"RAÏKKÖNEN Kimi",{"$f":"$G$32","v":0},{"$f":"IF(C61=\"\",0,(RANK(C61,$C$42:$C$61)))+COUNTIF(C$42:C61,C61)-1","v":20}]

{"sheet":"Italieim","index":5,"n_rows":59,"n_cols":13,"rows_kept":59,"cut":false,"hidden":false,"merged":[[36,1,36,3],[0,0,1,13],[2,0,3,0],[2,1,3,1],[2,2,3,2],[2,3,3,3],[2,4,3,4],[2,5,3,5],[2,6,3,6],[2,8,2,12],[4,1,6,1],[4,2,6,2],[7,1,9,1],[7,2,9,2],[10,1,12,1],[10,2,12,2],[31,1,33,1],[31,2,33,2],[22,1,24,1],[22,2,24,2],[25,1,27,1],[25,2,27,2],[28,1,30,1],[28,2,30,2],[13,1,15,1],[13,2,15,2],[16,1,18,1],[16,2,18,2],[19,1,21,1],[19,2,21,2]]}
["IMOLA - 18 AVRIL 2021"]
[]
["PILOTES","ECURIES","VOITURES","Finish","Pôle","Pt tour","Points",null,"CLASSEMENT"]
[null,null,null,null,null,null,null,null,"ÉCURIES","POINTS","RANG","TOTAL","PONCTUEL"]
["HAMILTON Lewis","MERCEDES",null,2,1,1,{"$f":"IFERROR(CHOOSE(D5,25,18,15,12,10,8,6,4,2,1)+(F5=1),\"\")","v":19},null,"WILLIAMS",{"$f":"SUM($G$17:$G$19)","v":0},{"$f":"IF(J5=\"\",0,(RANK(J5,$J$5:$J$14)))+COUNTIF(J$5:J5,J5)-1","v":7},{"$f":"SUMIF(Bahrein!$I$5:$I$14,Italieim!$I5,Bahrein!$J$5:$J$14)+$J5","v":0},{"$f":"IF(L5=\"\",0,(RANK(L5,$L$5:$L$14)))+COUNTIF(L$5:L5,L5)-1","v":9}]
["BOTTAS Valtteri",null,null,"OUT",null,null,{"$f":"IFERROR(CHOOSE(D6,25,18,15,12,10,8,6,4,2,1)+(F6=1),\"\")","v":""},null,"ALFA ROMÉO",{"$f":"SUM($G$32:$G$34)","v":2},{"$f":"IF(J6=\"\",0,(RANK(J6,$J$5:$J$14)))+COUNTIF(J$5:J6,J6)-1","v":5},{"$f":"SUMIF(Bahrein!$I$5:$I$14,Italieim!$I6,Bahrein!$J$5:$J$14)+$J6","v":2},{"$f":"IF(L6=\"\",0,(RANK(L6,$L$5:$L$14)))+COUNTIF(L$5:L6,L6)-1","v":6}]
[null,null,null,null,null,null,"",null,"ALPHA TAURI",{"$f":"SUM($G$23:$G$25)","v":0},{"$f":"IF(J7=\"\",0,(RANK(J7,$J$5:$J$14)))+COUNTIF(J$5:J7,J7)-1","v":8},{"$f":"SUMIF(Bahrein!$I$5:$I$14,Italieim!$I7,Bahrein!$J$5:$J$14)+$J7","v":2},{"$f":"IF(L7=\"\",0,(RANK(L7,$L$5:$L$14)))+COUNTIF(L$5:L7,L7)-1","v":7}]
["SAINZ.Jr Carlos","FERRARI",null,5,null,null,10,null,"RED BULL RACING",{"$f":"SUM($G$11:$G$13)","v":25},{"$f":"IF(J8=\"\",0,(RANK(J8,$J$5:$J$14)))+COUNTIF(J$5:J8,J8)-1","v":1},{"$f":"SUMIF(Bahrein!$I$5:$I$14,Italieim!$I8,Bahrein!$J$5:$J$14)+$J8","v":53},{"$f":"IF(L8=\"\",0,(RANK(L8,$L$5:$L$14)))+COUNTIF(L$5:L8,L8)-1","v":2}]
["LECLERC Charles",null,null,4,null,null,12,null,"HAAS",{"$f":"SUM($G$26:$G$28)","v":0},{"$f":"IF(J9=\"\",0,(RANK(J9,$J$5:$J$14)))+COUNTIF(J$5:J9,J9)-1","v":9},{"$f":"SUMIF(Bahrein!$I$5:$I$14,Italieim!$I9,Bahrein!$J$5:$J$14)+$J9","v":0},{"$f":"IF(L9=\"\",0,(RANK(L9,$L$5:$L$14)))+COUNTIF(L$5:L9,L9)-1","v":10}]
[null,null,null,null,null,null,"",null,"Mc LAREN",{"$f":"SUM($G$26:$G$28)","v":0},{"$f":"IF(J10=\"\",0,(RANK(J10,$J$5:$J$14)))+COUNTIF(J$5:J10,J10)-1","v":10},{"$f":"SUMIF(Bahrein!$I$5:$I$14,Italieim!$I10,Bahrein!$J$5:$J$14)+$J10","v":18},{"$f":"IF(L10=\"\",0,(RANK(L10,$L$5:$L$14)))+COUNTIF(L$5:L10,L10)-1","v":4}]
["VERSTAPPEN Max","RED BULL RACING",null,1,null,null,25,null,"ASTON MARTIN",{"$f":"SUM($G$14:$G$16)","v":6},{"$f":"IF(J11=\"\",0,(RANK(J11,$J$5:$J$14)))+COUNTIF(J$5:J11,J11)-1","v":4},{"$f":"SUMIF(Bahrein!$I$5:$I$14,Italieim!$I11,Bahrein!$J$5:$J$14)+$J11","v":7},{"$f":"IF(L11=\"\",0,(RANK(L11,$L$5:$L$14)))+COUNTIF(L$5:L11,L11)-1","v":5}]
["PEREZ Sergio",null,null,12,null,null,"",null,"FERRARI",{"$f":"SUM($G$8:$G$10)","v":22},{"$f":"IF(J12=\"\",0,(RANK(J12,$J$5:$J$14)))+COUNTIF(J$5:J12,J12)-1","v":2},{"$f":"SUMIF(Bahrein!$I$5:$I$14,Italieim!$I12,Bahrein!$J$5:$J$14)+$J12","v":34},{"$f":"IF(L12=\"\",0,(RANK(L12,$L$5:$L$14)))+COUNTIF(L$5:L12,L12)-1","v":3}]
[null,null,null,null,null,null,"",null,"MERCEDES",{"$f":"SUM($G$5:$G$7)","v":19},{"$f":"IF(J13=\"\",0,(RANK(J13,$J$5:$J$14)))+COUNTIF(J$5:J13,J13)-1","v":3},{"$f":"SUMIF(Bahrein!$I$5:$I$14,Italieim!$I13,Bahrein!$J$5:$J$14)+$J13","v":60},{"$f":"IF(L13=\"\",0,(RANK(L13,$L$5:$L$14)))+COUNTIF(L$5:L13,L13)-1","v":1}]
["VETTEL Sebastian","ASTON MARTIN",null,"OUT",null,null,"",null,"ALPINE F1 TEAM",{"$f":"SUM($G$20:$G$22)","v":1},{"$f":"IF(J14=\"\",0,(RANK(J14,$J$5:$J$14)))+COUNTIF(J$5:J14,J14)-1","v":6},{"$f":"SUMIF(Bahrein!$I$5:$I$14,Italieim!$I14,Bahrein!$J$5:$J$14)+$J14","v":1},{"$f":"IF(L14=\"\",0,(RANK(L14,$L$5:$L$14)))+COUNTIF(L$5:L14,L14)-1","v":8}]
["STROLL Lance",null,null,7,null,null,6]
[null,null,null,null,null,null,""]
["RUSSEL George","WILLIAMS",null,"OUT",null,null,""]
["LATIFI Nichola",null,null,"OUT",null,null,""]
[null,null,null,null,null,null,""]
["ALONSO Fernando","ALPINE F1 TEAM",null,11,null,null,""]
["OCON Sebastian",null,null,10,null,null,1]
[null,null,null,null,null,null,""]
["TSUNODA Yoki","ALPHA TAURI",null,13,null,null,""]
["GASLY Pierre",null,null,null,null,null,""]
[null,null,null,null,null,null,""]
["MAZEPIN Nikita","HAAS",null,17,null,null,""]
["SCHUMACHER Nick",null,null,16,null,null,""]
[null,null,null,null,null,null,""]
["NORRIS Lando","Mc LAREN",null,3,null,null,15]
["RICCIARDO Daniel",null,null,6,null,null,8]
[null,null,null,null,null,null,""]
["RAÏKKÖNEN Kimi","ALFA ROMÉO",null,9,null,null,2]
["GIOVINAZZI Antonio",null,null,14,null,null,""]
[null,null,null,null,null,null,""]
[]
[]
[null,"CLASSEMENT PROVISOIRE"]
[]
[null,"Noms","Points","Classe"]
[null,"HAMILTON Lewis",{"$f":"SUM(Bahrein:Italieim!$G$5:$G$5)","v":44},{"$f":"IF(C40=\"\",0,(RANK(C40,$C$40:$C$59)))+COUNTIF(C$40:C40,C40)-1","v":1}]
[null,"VERSTAPPEN Max",{"$f":"SUM(Bahrein:Italieim!$G$11:$G$11)","v":43},{"$f":"IF(C41=\"\",0,(RANK(C41,$C$40:$C$59)))+COUNTIF(C$40:C41,C41)-1","v":2}]
[null,"NORRIS Lando",{"$f":"SUM(Bahrein:Italieim!$G$29:$G$29)","v":27},{"$f":"IF(C42=\"\",0,(RANK(C42,$C$40:$C$59)))+COUNTIF(C$40:C42,C42)-1","v":3}]
[null,"LECLERC Charles",{"$f":"SUM(Bahrein:Italieim!$G$9:$G$9)","v":20},{"$f":"IF(C43=\"\",0,(RANK(C43,$C$40:$C$59)))+COUNTIF(C$40:C43,C43)-1","v":4}]
[null,"BOTTAS Valtteri",{"$f":"SUM(Bahrein:Italieim!$G$6:$G$6)","v":16},{"$f":"IF(C44=\"\",0,(RANK(C44,$C$40:$C$59)))+COUNTIF(C$40:C44,C44)-1","v":5}]
[null,"RICCIARDO Daniel",{"$f":"SUM(Bahrein:Italieim!$G$30:$G$30)","v":14},{"$f":"IF(C45=\"\",0,(RANK(C45,$C$40:$C$59)))+COUNTIF(C$40:C45,C45)-1","v":6}]
[null,"SAINZ.Jr Carlos",{"$f":"SUM(Bahrein:Italieim!$G$8:$G$8)","v":14},{"$f":"IF(C46=\"\",0,(RANK(C46,$C$40:$C$59)))+COUNTIF(C$40:C46,C46)-1","v":7}]
[null,"PEREZ Sergio",{"$f":"SUM(Bahrein:Italieim!$G$12:$G$12)","v":10},{"$f":"IF(C47=\"\",0,(RANK(C47,$C$40:$C$59)))+COUNTIF(C$40:C47,C47)-1","v":8}]
[null,"STROLL Lance",{"$f":"SUM(Bahrein:Italieim!$G$15:$G$15)","v":7},{"$f":"IF(C48=\"\",0,(RANK(C48,$C$40:$C$59)))+COUNTIF(C$40:C48,C48)-1","v":9}]
[null,"TSUNODA Yoki",{"$f":"SUM(Bahrein:Italieim!$G$23:$G$23)","v":2},{"$f":"IF(C49=\"\",0,(RANK(C49,$C$40:$C$59)))+COUNTIF(C$40:C49,C49)-1","v":10}]
[null,"RAÏKKÖNEN Kimi",{"$f":"SUM(Bahrein:Italieim!$G$32:$G$32)","v":2},{"$f":"IF(C50=\"\",0,(RANK(C50,$C$40:$C$59)))+COUNTIF(C$40:C50,C50)-1","v":11}]
[null,"OCON Sebastian",{"$f":"SUM(Bahrein:Italieim!$G$21:$G$21)","v":1},{"$f":"IF(C51=\"\",0,(RANK(C51,$C$40:$C$59)))+COUNTIF(C$40:C51,C51)-1","v":12}]
[null,"GIOVINAZZI Antonio",{"$f":"SUM(Bahrein:Italieim!$G$33:$G$33)","v":0},{"$f":"IF(C52=\"\",0,(RANK(C52,$C$40:$C$59)))+COUNTIF(C$40:C52,C52)-1","v":13}]
[null,"GASLY Pierre",{"$f":"SUM(Bahrein:Italieim!$G$24:$G$24)","v":0},{"$f":"IF(C53=\"\",0,(RANK(C53,$C$40:$C$59)))+COUNTIF(C$40:C53,C53)-1","v":14}]
[null,"VETTEL Sebastian",{"$f":"SUM(Bahrein:Italieim!$G$14:$G$14)","v":0},{"$f":"IF(C54=\"\",0,(RANK(C54,$C$40:$C$59)))+COUNTIF(C$40:C54,C54)-1","v":15}]
[null,"RUSSEL George",{"$f":"SUM(Bahrein:Italieim!$G$17:$G$17)","v":0},{"$f":"IF(C55=\"\",0,(RANK(C55,$C$40:$C$59)))+COUNTIF(C$40:C55,C55)-1","v":16}]
[null,"LATIFI Nichola",{"$f":"SUM(Bahrein:Italieim!$G$18:$G$18)","v":0},{"$f":"IF(C56=\"\",0,(RANK(C56,$C$40:$C$59)))+COUNTIF(C$40:C56,C56)-1","v":17}]
[null,"ALONSO Fernando",{"$f":"SUM(Bahrein:Italieim!$G$20:$G$20)","v":0},{"$f":"IF(C57=\"\",0,(RANK(C57,$C$40:$C$59)))+COUNTIF(C$40:C57,C57)-1","v":18}]
[null,"MAZEPIN Nikita",{"$f":"SUM(Bahrein:Italieim!$G$26:$G$26)","v":0},{"$f":"IF(C58=\"\",0,(RANK(C58,$C$40:$C$59)))+COUNTIF(C$40:C58,C58)-1","v":19}]
[null,"SCHUMACHER Nick",{"$f":"SUM(Bahrein:Italieim!$G$27:$G$27)","v":0},{"$f":"IF(C59=\"\",0,(RANK(C59,$C$40:$C$59)))+COUNTIF(C$40:C59,C59)-1","v":20}]

{"sheet":"Portugal","index":6,"n_rows":59,"n_cols":13,"rows_kept":59,"cut":false,"hidden":false,"merged":[[4,1,6,1],[4,2,6,2],[7,1,9,1],[7,2,9,2],[10,1,12,1],[10,2,12,2],[2,8,2,12],[0,0,1,13],[2,1,3,1],[2,2,3,2],[2,3,3,3],[2,5,3,5],[2,6,3,6],[2,4,3,4],[2,0,3,0],[13,1,15,1],[13,2,15,2],[16,1,18,1],[16,2,18,2],[19,1,21,1],[19,2,21,2],[36,1,36,3],[31,1,33,1],[31,2,33,2],[22,1,24,1],[22,2,24,2],[25,1,27,1],[25,2,27,2],[28,1,30,1],[28,2,30,2]]}
["PORTIMAO - 2 MAI 2021"]
[]
["PILOTES","ECURIES","VOITURES","Finish","Pôle","Pt tour","Points",null,"CLASSEMENT"]
[null,null,null,null,null,null,null,null,"ÉCURIES","POINTS","RANG","TOTAL","PONCTUEL"]
["HAMILTON Lewis","MERCEDES",null,null,null,null,{"$f":"IFERROR(CHOOSE(D5,25,18,15,12,10,8,6,4,2,1)+(F5=1),\"\")","v":""},null,"MERCEDES",{"$f":"SUM($G$5:$G$7)","v":0},{"$f":"IF(J5=\"\",0,(RANK(J5,$J$5:$J$14)))+COUNTIF(J$5:J5,J5)-1","v":1},{"$f":"SUMIF(Italieim!$I$5:$I$14,Portugal!$I5,Italieim!$L$5:$L$14)+$J$512","v":60},{"$f":"IF(L5=\"\",0,(RANK(L5,$L$5:$L$14)))+COUNTIF(L$5:L5,L5)-1","v":1}]
["BOTTAS Valtteri",null,null,null,null,null,{"$f":"IFERROR(CHOOSE(D6,25,18,15,12,10,8,6,4,2,1)+(F6=1),\"\")","v":""},null,"HAAS",{"$f":"SUM($G$26:$G$28)","v":0},{"$f":"IF(J6=\"\",0,(RANK(J6,$J$5:$J$14)))+COUNTIF(J$5:J6,J6)-1","v":2},{"$f":"SUMIF(Italieim!$I$5:$I$14,Portugal!$I6,Italieim!$L$5:$L$14)+$J$512","v":0},{"$f":"IF(L6=\"\",0,(RANK(L6,$L$5:$L$14)))+COUNTIF(L$5:L6,L6)-1","v":9}]
[null,null,null,null,null,null,"",null,"ALPINE F1 TEAM",{"$f":"SUM($G$20:$G$22)","v":0},{"$f":"IF(J7=\"\",0,(RANK(J7,$J$5:$J$14)))+COUNTIF(J$5:J7,J7)-1","v":3},{"$f":"SUMIF(Italieim!$I$5:$I$14,Portugal!$I7,Italieim!$L$5:$L$14)+$J$512","v":1},{"$f":"IF(L7=\"\",0,(RANK(L7,$L$5:$L$14)))+COUNTIF(L$5:L7,L7)-1","v":8}]
["SAINZ.Jr Carlos","FERRARI",null,null,null,null,"",null,"ALPHA TAURI",{"$f":"SUM($G$23:$G$25)","v":0},{"$f":"IF(J8=\"\",0,(RANK(J8,$J$5:$J$14)))+COUNTIF(J$5:J8,J8)-1","v":4},{"$f":"SUMIF(Italieim!$I$5:$I$14,Portugal!$I8,Italieim!$L$5:$L$14)+$J$512","v":2},{"$f":"IF(L8=\"\",0,(RANK(L8,$L$5:$L$14)))+COUNTIF(L$5:L8,L8)-1","v":6}]
["LECLERC Charles",null,null,null,null,null,"",null,"Mc LAREN",{"$f":"SUM($G$29:$G$31)","v":0},{"$f":"IF(J9=\"\",0,(RANK(J9,$J$5:$J$14)))+COUNTIF(J$5:J9,J9)-1","v":5},{"$f":"SUMIF(Italieim!$I$5:$I$14,Portugal!$I9,Italieim!$L$5:$L$14)+$J$512","v":18},{"$f":"IF(L9=\"\",0,(RANK(L9,$L$5:$L$14)))+COUNTIF(L$5:L9,L9)-1","v":4}]
[null,null,null,null,null,null,"",null,"FERRARI",{"$f":"SUM($G$8:$G$10)","v":0},{"$f":"IF(J10=\"\",0,(RANK(J10,$J$5:$J$14)))+COUNTIF(J$5:J10,J10)-1","v":6},{"$f":"SUMIF(Italieim!$I$5:$I$14,Portugal!$I10,Italieim!$L$5:$L$14)+$J$512","v":34},{"$f":"IF(L10=\"\",0,(RANK(L10,$L$5:$L$14)))+COUNTIF(L$5:L10,L10)-1","v":3}]
["VERSTAPPEN Max","RED BULL RACING",null,null,null,null,"",null,"WILLIAMS",{"$f":"SUM($G$17:$G$19)","v":0},{"$f":"IF(J11=\"\",0,(RANK(J11,$J$5:$J$14)))+COUNTIF(J$5:J11,J11)-1","v":7},{"$f":"SUMIF(Italieim!$I$5:$I$14,Portugal!$I11,Italieim!$L$5:$L$14)+$J$512","v":0},{"$f":"IF(L11=\"\",0,(RANK(L11,$L$5:$L$14)))+COUNTIF(L$5:L11,L11)-1","v":10}]
["PEREZ Sergio",null,null,null,null,null,"",null,"ALFA ROMÉO",{"$f":"SUM($G$32:$G$34)","v":0},{"$f":"IF(J12=\"\",0,(RANK(J12,$J$5:$J$14)))+COUNTIF(J$5:J12,J12)-1","v":8},{"$f":"SUMIF(Italieim!$I$5:$I$14,Portugal!$I12,Italieim!$L$5:$L$14)+$J$512","v":2},{"$f":"IF(L12=\"\",0,(RANK(L12,$L$5:$L$14)))+COUNTIF(L$5:L12,L12)-1","v":7}]
[null,null,null,null,null,null,"",null,"RED BULL RACING",{"$f":"SUM($G$11:$G$13)","v":0},{"$f":"IF(J13=\"\",0,(RANK(J13,$J$5:$J$14)))+COUNTIF(J$5:J13,J13)-1","v":9},{"$f":"SUMIF(Italieim!$I$5:$I$14,Portugal!$I13,Italieim!$L$5:$L$14)+$J$512","v":53},{"$f":"IF(L13=\"\",0,(RANK(L13,$L$5:$L$14)))+COUNTIF(L$5:L13,L13)-1","v":2}]
["VETTEL Sebastian","ASTON MARTIN",null,null,null,null,"",null,"ASTON MARTIN",{"$f":"SUM($G$14:$G$16)","v":0},{"$f":"IF(J14=\"\",0,(RANK(J14,$J$5:$J$14)))+COUNTIF(J$5:J14,J14)-1","v":10},{"$f":"SUMIF(Italieim!$I$5:$I$14,Portugal!$I14,Italieim!$L$5:$L$14)+$J$512","v":7},{"$f":"IF(L14=\"\",0,(RANK(L14,$L$5:$L$14)))+COUNTIF(L$5:L14,L14)-1","v":5}]
["STROLL Lance",null,null,null,null,null,""]
[null,null,null,null,null,null,""]
["RUSSEL George","WILLIAMS",null,null,null,null,""]
["LATIFI Nichola",null,null,null,null,null,""]
[null,null,null,null,null,null,""]
["ALONSO Fernando","ALPINE F1 TEAM",null,null,null,null,""]
["OCON Sebastian",null,null,null,null,null,""]
[null,null,null,null,null,null,""]
["TSUNODA Yoki","ALPHA TAURI",null,null,null,null,""]
["GASLY Pierre",null,null,null,null,null,""]
[null,null,null,null,null,null,""]
["MAZEPIN Nikita","HAAS",null,null,null,null,""]
["SCHUMACHER Nick",null,null,null,null,null,""]
[null,null,null,null,null,null,""]
["NORRIS Lando","Mc LAREN",null,null,null,null,""]
["RICCIARDO Daniel",null,null,null,null,null,""]
[null,null,null,null,null,null,""]
["RAÏKKÖNEN Kimi","ALFA ROMÉO",null,null,null,null,""]
["GIOVINAZZI Antonio",null,null,null,null,null,""]
[null,null,null,null,null,null,""]
[]
[]
[null,"CLASSEMENT PROVISOIRE"]
[]
[null,"Noms","Points","Classe"]
[null,"HAMILTON Lewis",{"$f":"SUM(Bahrein:Portugal!$G$5:$G$5)","v":44},{"$f":"IF(C40=\"\",0,(RANK(C40,$C$40:$C$59)))+COUNTIF(C$40:C40,C40)-1","v":1}]
[null,"VERSTAPPEN Max",{"$f":"SUM(Bahrein:Portugal!$G$11:$G$11)","v":43},{"$f":"IF(C41=\"\",0,(RANK(C41,$C$40:$C$59)))+COUNTIF(C$40:C41,C41)-1","v":2}]
[null,"NORRIS Lando",{"$f":"SUM(Bahrein:Portugal!$G$29:$G$29)","v":27},{"$f":"IF(C42=\"\",0,(RANK(C42,$C$40:$C$59)))+COUNTIF(C$40:C42,C42)-1","v":3}]
[null,"LECLERC Charles",{"$f":"SUM(Bahrein:Portugal!$G$9:$G$9)","v":20},{"$f":"IF(C43=\"\",0,(RANK(C43,$C$40:$C$59)))+COUNTIF(C$40:C43,C43)-1","v":4}]
[null,"BOTTAS Valtteri",{"$f":"SUM(Bahrein:Portugal!$G$6:$G$6)","v":16},{"$f":"IF(C44=\"\",0,(RANK(C44,$C$40:$C$59)))+COUNTIF(C$40:C44,C44)-1","v":5}]
[null,"RICCIARDO Daniel",{"$f":"SUM(Bahrein:Portugal!$G$30:$G$30)","v":14},{"$f":"IF(C45=\"\",0,(RANK(C45,$C$40:$C$59)))+COUNTIF(C$40:C45,C45)-1","v":6}]
[null,"SAINZ.Jr Carlos",{"$f":"SUM(Bahrein:Portugal!$G$8:$G$8)","v":14},{"$f":"IF(C46=\"\",0,(RANK(C46,$C$40:$C$59)))+COUNTIF(C$40:C46,C46)-1","v":7}]
[null,"PEREZ Sergio",{"$f":"SUM(Bahrein:Portugal!$G$12:$G$12)","v":10},{"$f":"IF(C47=\"\",0,(RANK(C47,$C$40:$C$59)))+COUNTIF(C$40:C47,C47)-1","v":8}]
[null,"STROLL Lance",{"$f":"SUM(Bahrein:Portugal!$G$15:$G$15)","v":7},{"$f":"IF(C48=\"\",0,(RANK(C48,$C$40:$C$59)))+COUNTIF(C$40:C48,C48)-1","v":9}]
[null,"TSUNODA Yoki",{"$f":"SUM(Bahrein:Portugal!$G$23:$G$23)","v":2},{"$f":"IF(C49=\"\",0,(RANK(C49,$C$40:$C$59)))+COUNTIF(C$40:C49,C49)-1","v":10}]
[null,"RAÏKKÖNEN Kimi",{"$f":"SUM(Bahrein:Portugal!$G$32:$G$32)","v":2},{"$f":"IF(C50=\"\",0,(RANK(C50,$C$40:$C$59)))+COUNTIF(C$40:C50,C50)-1","v":11}]
[null,"OCON Sebastian",{"$f":"SUM(Bahrein:Portugal!$G$21:$G$21)","v":1},{"$f":"IF(C51=\"\",0,(RANK(C51,$C$40:$C$59)))+COUNTIF(C$40:C51,C51)-1","v":12}]
[null,"GIOVINAZZI Antonio",{"$f":"SUM(Bahrein:Portugal!$G$33:$G$33)","v":0},{"$f":"IF(C52=\"\",0,(RANK(C52,$C$40:$C$59)))+COUNTIF(C$40:C52,C52)-1","v":13}]
[null,"GASLY Pierre",{"$f":"SUM(Bahrein:Portugal!$G$24:$G$24)","v":0},{"$f":"IF(C53=\"\",0,(RANK(C53,$C$40:$C$59)))+COUNTIF(C$40:C53,C53)-1","v":14}]
[null,"VETTEL Sebastian",{"$f":"SUM(Bahrein:Portugal!$G$14:$G$14)","v":0},{"$f":"IF(C54=\"\",0,(RANK(C54,$C$40:$C$59)))+COUNTIF(C$40:C54,C54)-1","v":15}]
[null,"RUSSEL George",{"$f":"SUM(Bahrein:Portugal!$G$17:$G$17)","v":0},{"$f":"IF(C55=\"\",0,(RANK(C55,$C$40:$C$59)))+COUNTIF(C$40:C55,C55)-1","v":16}]
[null,"LATIFI Nichola",{"$f":"SUM(Bahrein:Portugal!$G$18:$G$18)","v":0},{"$f":"IF(C56=\"\",0,(RANK(C56,$C$40:$C$59)))+COUNTIF(C$40:C56,C56)-1","v":17}]
[null,"ALONSO Fernando",{"$f":"SUM(Bahrein:Portugal!$G$20:$G$20)","v":0},{"$f":"IF(C57=\"\",0,(RANK(C57,$C$40:$C$59)))+COUNTIF(C$40:C57,C57)-1","v":18}]
[null,"MAZEPIN Nikita",{"$f":"SUM(Bahrein:Portugal!$G$26:$G$26)","v":0},{"$f":"IF(C58=\"\",0,(RANK(C58,$C$40:$C$59)))+COUNTIF(C$40:C58,C58)-1","v":19}]
[null,"SCHUMACHER Nick",{"$f":"SUM(Bahrein:Portugal!$G$27:$G$27)","v":0},{"$f":"IF(C59=\"\",0,(RANK(C59,$C$40:$C$59)))+COUNTIF(C$40:C59,C59)-1","v":20}]