{"text_format":"1","workbook":"xlsx","n_sheets":3,"sheets":["DATA","RESULTAT","ESRI_MAPINFO_SHEET"],"not_rendered":{"charts":0,"images":0,"macros":1,"external_links":0,"defined_names":2,"comments":0,"pivot_tables":0},"unopened":[],"bounds":{"document_bytes":16777216,"sheet_cells":100000,"rows_first":2000,"rows_last":500,"rows_between":2000,"halvings":0,"cell_chars":16384,"cell_head_chars":4096},"cells_cut":0,"cells_raw":0,"read":"whole","date_system":"1900"}

{"sheet":"DATA","index":0,"n_rows":90,"n_cols":24,"rows_kept":90,"cut":false,"hidden":false,"merged":[]}
["Numéro de valeur",1,2,3,4,5,6,7,8,9,10,11,12,13,14,15,16,17,18,19,20,21,22,23]
["2021-01-01T06:00:00",11.610935211181641,4459410,1946800,3084170,731800,3795860,978090,5469610,0,"Pt Created",6987550,538200,5814650,8152020,2817330,15232900,774490,6232820,101820,0,777540.75,588932.875,752907]
["2021-01-02T06:00:00",11.610419273376465,4459410,1986500,3084640,731800,3797110,978470,5473600,1862920,"Pt Created",6991390,538330,5816140,8155950,2818500,15242400,774850,6238000,103840,0,778773.25,588932.875,752907]
["2021-01-03T06:00:00",11.609903335571289,4459410,2026700,3085090,731800,3798700,979000,5477830,1864140,"Pt Created",6995440,538470,5817800,8159330,2819850,15251300,775200,6243190,106150,0,779364.5625,588932.875,752907]
["2021-01-04T06:00:00",11.609387397766113,4459410,2068900,3085560,731800,3800280,979520,5482050,1865480,"Pt Created",6999960,538610,5820030,8162570,2822000,15261000,775620,6248390,108470,0,780121.4375,589256.4375,752907]
["2021-01-05T06:00:00",11.608870506286621,4459530,2122000,3088480,732900,3801820,979940,5485950,1866720,"Pt Created",7004060,538750,5826340,8167700,2824180,15273600,776200,6253860,110760,0,782816.5625,590979.125,753036]
["2021-01-06T06:00:00",11.608354568481445,4459530,2174000,3091050,732900,3803460,980410,5489610,1868130,"Pt Created",7008450,538900,5832390,8172520,2826380,15286600,776940,6259200,113060,0,783319.1875,591313.75,753036]
["2021-01-07T06:00:00",11.60783863067627,4459530,2225600,3093550,735400,3805250,980920,5494120,1869570,"Pt Created",7012600,539040,5837680,8177450,2828710,15300000,777740,6264730,115430,0,784307.5,592663.5,753295]
["2021-01-08T06:00:00",11.607322692871094,4459530,2273100,3095920,743600,3807120,981400,5498120,1871020,"Pt Created",7017270,539180,5843310,8182510,2831070,15313700,778570,6270640,117860,0,784307.5,592663.5,754045]
["2021-01-09T06:00:00",11.606806755065918,4459530,2323200,3097860,747500,3809040,981860,5501830,1872450,"Pt Created",7021610,539330,5849070,8187010,2832580,15326000,779180,0,120270,0,786604.25,592663.5,754398]
["2021-01-10T06:00:00",11.606289863586426,4459530,2366100,3099460,747500,3810600,982320,5505290,1873620,"Pt Created",7026200,539470,5854260,8190000,2833640,15334500,779520,6280690,122670,0,787214.5625,592663.5,754398]
["2021-01-11T06:00:00",11.60577392578125,4459530,2411800,3101140,747500,3812270,982820,5508710,1874900,"Pt Created",7030420,539610,5859640,8193050,2835760,15344200,779950,6285430,125030,0,787886.375,592663.5,754398]
["2021-01-12T06:00:00",11.605257987976074,4459530,2468000,3103720,749300,3814200,983370,5513190,1876390,"Pt Created",7035240,539750,5865380,8198570,2838620,15358500,780530,6291810,127480,0,789710.3125,594009.125,754588]
["2021-01-13T06:00:00",11.604742050170898,4459530,2522400,3105960,749300,3816080,983870,5516620,1877770,"Pt Created",7039470,539890,5869549,8203860,2841150,15370800,781110,6297260,129840,0,791879.375,594567.0625,754588]
["2021-01-14T06:00:00",11.604226112365723,4459530,2568900,0,749300,3817460,984280,5521240,1878920,"Pt Created",7043720,540010,5873584.5,8208390,2843140,15380500,781570,6301440,131820,0,792473.0625,594567.0625,754588]
["2021-01-15T06:00:00",11.603710174560547,4459530,2613900,3109080,749300,3818950,984670,5525240,1879980,"Pt Created",7047650,540140,5877620,8212990,2844960,15390100,782010,6305640,133640,0,793030.5625,594567.0625,754588]
["2021-01-16T06:00:00",11.603193283081055,4459530,2659100,3110580,749300,3820340,985070,5529770,1881120,"Pt Created",7051720,540260,5881655.5,8217280,2846250,15399800,782620,6310070,135590,0,793272.875,594567.0625,754588]
["2021-01-17T06:00:00",11.602677345275879,4459530,2699700,3112230,749300,3821780,985470,5533870,1882180,"Pt Created",7055790,540390,5885691,8220400,2847320,15407200,783080,0,137810,0,793272.875,594567.0625,754588]
["2021-01-18T06:00:00",11.602161407470703,4459530,2740800,3113710,749300,3823280,985880,5537320,1883270,"Pt Created",7059660,540520,5889726,8223320,2849370,15414700,783530,6317910,139830,0,793966.875,594567.0625,754588]
["2021-01-19T06:00:00",11.601645469665527,4459530,2792100,3115620,749300,3824960,986280,5540300,1884570,"Pt Created",7063790,540660,5893761.5,8228200,2851780,15427100,784690,6323200,142110,0,794993.25,594567.0625,754588]
["2021-01-20T06:00:00",11.601129531860352,4459530,2836400,3117030,749300,3826640,986640,5542450,1885580,"Pt Created",7067660,540790,5897797,8232560,2853710,15437100,785510,6327560,144150,0,795746.9375,594868.5625,754588]
["2021-01-21T06:00:00",11.600612640380859,4459530,2876000,3118660,749300,3827920,986910,5545080,1886480,"Pt Created",7071440,540900,5901832.5,8236480,2855170,15445600,786080,6330890,145750,0,796322.375,594868.5625,754588]
["2021-01-22T06:00:00",11.600096702575684,4459530,2910700,3120020,749300,3829150,987160,5546990,1887140,"Pt Created",7074720,541010,5905868,8240070,2856380,15453300,786540,6333900,147150,0,796404.875,594868.5625,754588]
["2021-01-23T06:00:00",11.599580764770508,4459530,2949100,3121720,749300,3830470,987530,5549340,1888160,"Pt Created",7078250,541130,5909903,8243920,2857440,15461500,787150,6337610,148800,0,796404.875,594868.5625,754588]
["2021-01-24T06:00:00",11.599064826965332,4459530,2983100,3123500,749300,3831810,987870,5551720,1889080,"Pt Created",7081890,541260,5913938.5,8246460,2858160,15467300,787570,6340820,150600,0,796404.875,594868.5625,754588]
["2021-01-25T06:00:00",11.598548889160156,4459530,3019700,3125190,749300,3833190,988220,5554080,1890070,"Pt Created",7085660,541390,5917974,8249170,2859790,15474000,788150,6344220,152440,0,796404.875,594868.5625,754588]
["2021-01-26T06:00:00",11.598031997680664,4459530,3065000,3126990,749300,3834690,988590,5556490,1891270,"Pt Created",7089380,541510,5922009.5,8253890,2861820,15485100,789210,6348840,154400,0,796404.875,594868.5625,754588]
["2021-01-27T06:00:00",11.597516059875488,4459530,3109600,3128890,749300,3836550,988930,5557860,1892420,"Pt Created",7093290,541640,5926045,8258510,2863970,15496000,790110,6353540,156520,0,796404.875,594998,754588]
["2021-01-28T06:00:00",11.597000122070313,4459530,3145800,3129990,749300,3837730,989220,5560000,1893280,"Pt Created",7096880,541770,5930080.5,8262240,2865510,15504300,790490,6356900,158170,0,796404.875,594998,754588]
["2021-01-29T06:00:00",11.596774101257324,4459530,3176900,3130910,749300,3838710,989450,5561810,1894020,"Pt Created",7100040,541880,5934115.5,8265780,2866640,15510900,790850,6359520,159410,0,796404.875,594998,754588]
["2021-01-30T06:00:00",11.596548080444336,4459530,3203500,3131750,749300,3839520,989650,5563010,1894600,"Pt Created",7102920,541990,5938151,8268820,2867320,15516100,791140,6361710,160590,0,796404.875,594998,754588]
["2021-01-31T06:00:00",11.596323013305664,4459530,3229900,3133090,749300,3840430,989930,5564030,1895300,"Pt Created",7105980,542110,5942186.5,8271170,2867940,15520300,791520,6364070,161960,0,796404.875,594998,754588]
["2021-02-01T06:00:00",11.596096992492676,4459530,3257500,3134280,749300,3841400,990180,5565010,1896040,"Pt Created",7109090,542220,5946222,8273600,2869140,15524900,791900,6366340,163300,0,796404.875,594998,754588]
["2021-02-02T06:00:00",11.595870971679688,4459530,3291400,3135400,749300,3842360,990470,5565990,1896810,"Pt Created",7112240,542340,5950257.5,8277590,2870520,15532700,792540,6369510,164680,0,796404.875,594998,754588]
["2021-02-03T06:00:00",11.595644950866699,4459530,3316500,3136150,749300,3843210,990630,5566740,1897260,"Pt Created",7114860,542450,5954293,8280730,2871390,15537100,792810,6371690,165780,0,796404.875,594998,754588]
["2021-02-04T06:00:00",11.595419883728027,4459530,3340800,3136920,749300,3844090,990800,5567600,1897710,"Pt Created",7117330,542560,5958328,8283450,2872320,15541200,793240,6373860,166870,0,796404.875,594998,754588]
["2021-02-05T06:00:00",11.595193862915039,4459530,3371100,3137990,749300,3844980,990960,5568470,1898391.625,"Pt Created",7119820,542670,5962363.5,8285986,2873171.5,15545571,793552.125,6375874.5,167844.328125,0,798780.5,597208.1875,754588]
["2021-02-06T06:00:00",11.594967842102051,4459530,3394800,3139180,749300,3845910,991120,5569300,1898951.625,"Pt Created",7122350,542780,5966399,8288387.5,2873967.75,15549401,793830.375,6377699.5,168786.828125,0,801345.375,599675.4375,754588]
["2021-02-07T06:00:00",11.594741821289063,4459540,3402400,3140050,749300,3846410,991260,5569850,1899511.625,"Pt Created",7124060,542820,5970434.5,8290788.5,2874764,15553231,794108.5625,6379524,169729.328125,0,803910.25,602142.625,754588]
["2021-02-08T06:00:00",11.594515800476074,4459920,3420600,3140200,756000,3847210,991460,5570750,1900071.625,"Pt Created",7126380,542920,5974470,8293190,2875560.25,15557061,794386.8125,6381349,170671.828125,0,806475.125,604609.875,755222]
["2021-02-09T06:00:00",11.594290733337402,4459920,3460500,3141990,756000,3848270,991740,5571890,1900930,"Pt Created",7129770,543040,5978350,8296990,2877160,15564800,795050,0,172160,0,809300.75,604918.25,755222]
["2021-02-10T06:00:00",11.594064712524414,4459920,3494400,3143490,756000,3849180,991970,5572890,1901830,"Pt Created",7132940,543150,5981710,8300560,2878720,15572200,795610,6388210,173620,0,809777.625,604918.25,755222]
["2021-02-11T06:00:00",11.593838691711426,4459920,3531800,3145100,756000,3850230,992230,5574120,1902720,"Pt Created",7136280,543260,5985340,8304550,2880540,15580800,796220,6392040,175240,0,810236.75,604918.25,755222]
["2021-02-12T06:00:00",11.593612670898438,4459920,3563200,3146200,756000,3851200,992450,5575130,1903530,"Pt Created",7139290,543380,5988600,8308070,2882020,15587200,796620,6395240,176650,0,810594.5,604918.25,755222]
["2021-02-13T06:00:00",11.593387603759766,4459920,3595600,3147680,756000,3852120,992700,5576210,1904480,"Pt Created",7142460,543500,5991710,8311600,2883060,15593900,797190,6398590,178150,0,811401.0625,605501.875,755222]
["2021-02-14T06:00:00",11.593161582946777,4459920,3628400,3149650,756000,3853190,993060,5578010,1905360,"Pt Created",7145960,543620,5995150,8314170,2883840,15599400,797880,6402050,179960,0,811723.5625,605501.875,755222]
["2021-02-15T06:00:00",11.592935562133789,4459920,3665700,3151780,756000,3854430,993380,5579350,1906300,"Pt Created",7149750,543750,5999390,8317430,2885770,15605800,798720,6405880,181970,0,812065.3125,605501.875,755222]
["2021-02-16T06:00:00",11.592709541320801,4459920,3703600,3153680,756000,3855410,993660,5580420,1907250,"Pt Created",7153430,543880,6003220,8321550,2887660,15614200,799390,6409930,183800,0,812188.375,605501.875,755222]
["2021-02-17T06:00:00",11.592484474182129,4459920,3727700,3155260,756000,3856300,993880,5581320,1908020,"Pt Created",7156670,544000,0,8322970,2888380,15619700,799560,6413220,185320,0,812188.375,607064.875,755222]
["2021-02-18T06:00:00",11.592258453369141,4459920,3746800,3156330,756000,3857080,994060,5582240,1908520,"Pt Created",7159470,544110,6005480,8323100,2888860,15622800,799600,6415920,186580,0,816897.4375,611991.3125,755222]
["2021-02-19T06:00:00",11.592032432556152,4459920,3766100,3157570,756000,3857860,994230,5583160,1909170,"Pt Created",7162270,544220,6006510,8323180,2889310,15626900,799640,6418550,187800,0,823345.3125,619118.0625,755222]
["2021-02-20T06:00:00",11.591806411743164,4459960,3787300,3158800,756400,3858630,994410,5584080,1909700,"Pt Created",7165010,544340,6007520,8323250,2889740,15630100,799680,6420840,188970,0,831477.125,625276.3125,755289]
["2021-02-21T06:00:00",11.591580390930176,4459960,3803900,3160220,756400,3859460,994590,5584990,1910120,"Pt Created",7167730,544450,6008550,8323320,2890120,15632400,799720,6422600,190170,0,838284.5,633197.1875,755289]
["2021-02-22T06:00:00",11.591355323791504,4459960,3822700,3161720,756400,3860280,994740,5585890,1910630,"Pt Created",7170470,544570,6009610,8323400,2890570,15635100,799760,6424340,191300,0,845864.125,640164.625,755289]
["2021-02-23T06:00:00",11.591129302978516,4459960,3843100,3163080,756400,3861170,994910,5586810,1911270,"Pt Created",7173250,544690,6010660,8323470,2891040,15639300,799790,6427010,192450,0,853228.5625,647638.125,755289]
["2021-02-24T06:00:00",11.590903282165527,4459960,3858700,3164370,756400,3861970,995060,5587580,1911690,"Pt Created",7175750,544800,6011630,8323540,2891470,15642500,799830,6429110,193440,0,859418.5,656217.25,755289]
["2021-02-25T06:00:00",11.590677261352539,4459960,3881800,3165470,756400,3862750,995220,5588490,1912200,"Pt Created",7178180,544900,6012620,8325370,2892460,15646100,799870,6431480,194520,0,868350.8125,663808.3125,755289]
["2021-02-26T06:00:00",11.590452194213867,4459960,3906300,3166930,756400,3863800,995400,5589520,1912780,"Pt Created",7180730,545010,6013670,8327840,2893800,15650400,799910,6434270,195760,0,876388.0625,671872.75,755289]
["2021-02-27T06:00:00",11.590226173400879,4459960,3930600,3168100,756400,3864680,995560,5590650,1913470,"Pt Created",7183490,545120,6014710,8330790,2894710,15654500,800130,6437080,197100,0,881938.5,678323.1875,755289]
["2021-02-28T06:00:00",11.590000152587891,4459960,3952900,3169470,756400,3865620,995750,5591670,1914120,"Pt Created",7186320,545240,6015760,8333140,2895350,15657900,800340,6439320,198490,0,889436.6875,686729.625,755289]
["2021-03-01T06:00:00",11.590000152587891,4459960,3978100,3170730,756400,3866490,995920,5592580,1914700,"Pt Created",7189110,0,6017190,8335560,2896620,15661300,800540,6441390,199810,0,898274.375,694041.5,755289]
["2021-03-02T06:00:00",11.590000152587891,4459960,4007100,3171700,756400,3867330,996080,5593450,1915230,"Pt Created",7191820,545470,6021300,8339270,2897910,15667000,800800,6444050,201030,0,901632.3125,697812.9375,755289]
["2021-03-03T06:00:00",11.590000152587891,4459960,4037500,3173110,756400,3868140,996220,5594260,1915990,"Pt Created",7194540,545580,6025120,8343210,2899200,15673000,801070,6446710,202210,112736.90625,906954.9375,702775.6875,755289]
["2021-03-04T06:00:00",11.590000152587891,4459960,4067900,3173880,756400,3869010,996380,5595210,1916700,"Pt Created",7197310,545690,6028670,8347110,2900560,15679300,801590,6449400,203420,235722.625,912270.0625,708189.625,755289]
["2021-03-05T06:00:00",11.590000152587891,4459960,4094100,3174720,756400,3869720,996530,5596150,1917280,"Pt Created",7199820,545800,6031830,8350430,2901750,15683900,801990,6451980,204580,358708.34375,917585.25,713603.5625,755289]
["2021-03-06T06:00:00",11.590000152587891,4459960,4117900,3175590,756400,3870490,996710,5597200,1917850,"Pt Created",7202260,545930,6034490,8353150,2902540,15687700,802360,6454530,205830,481694.0625,922900.375,719017.5,755289]
["2021-03-07T06:00:00",11.590000152587891,4459960,4142800,3176450,756400,3871250,996910,5598300,1918470,"Pt Created",7204940,546050,6037410,8355230,2903150,15690800,802650,6456720,207210,604679.8125,928215.5625,724431.375,755289]
["2021-03-08T06:00:00",11.590000152587891,4459960,4168600,3177310,756400,3872040,997100,5599300,1919170,"Pt Created",7207720,546170,6040830,8357260,2904420,15695000,802970,6459040,208570,721280,933317.0625,729619.75,755289]
["2021-03-09T06:00:00",11.590000152587891,4459960,4198800,3178120,756400,3872930,997290,5600300,1919960,"Pt Created",7210490,546300,6044210,8360290,2905850,15701500,803430,6462160,209900,721630,935914.1875,732086.6875,755289]
["2021-03-10T06:00:00",11.590000152587891,4459960,4234900,3179490,756400,3873980,997550,5601660,1920950,"Pt Created",7213540,546430,6047960,8363970,2907810,15709200,804060,6466070,211510,721980,936652.9375,732587.6875,755289]
["2021-03-11T06:00:00",11.590000152587891,4459960,4267500,3180550,756400,3874940,997770,5603030,1921720,"Pt Created",7216660,546560,6051460,8367340,2909720,15714900,804530,6469790,213220,722320,939318,735057.6875,755289]
["2021-03-12T06:00:00",11.590000152587891,4459960,4287500,3181560,756400,3875650,997900,5603880,1922120,"Pt Created",7219150,546670,6054160,8369800,2910550,15718800,804720,6471950,214300,722590,944174.4375,742374.75,755289]
["2021-03-13T06:00:00",11.590000152587891,4459960,4317100,3182540,756700,3876590,998080,5604930,1922770,"Pt Created",7221730,546790,6056890,8372750,2911330,15723800,805050,6474500,215540,722880,951225.8125,747243.9375,755326]
["2021-03-14T06:00:00",11.590000152587891,4459960,4337200,3183550,756700,3877390,998250,5605980,1923240,"Pt Created",7224370,546910,6059530,8374840,2911890,15726300,805300,6476360,216780,723170,956860.75,754461.4375,755326]
["2021-03-15T06:00:00",11.590000152587891,4459960,4367800,3184840,756700,3878360,998450,5607040,1924020,"Pt Created",7227370,547040,6063110,8377260,2913420,15731100,805790,6479060,218220,723480,963068.4375,759225.6875,755326]
["2021-03-16T06:00:00",11.590000152587891,4459960,4404000,3186040,756700,3879320,998720,5608110,1924990,"Pt Created",7230640,547170,6066970,8381190,2915120,15739600,806360,0,219750,723870,963540.4375,759225.6875,755326]
["2021-03-17T06:00:00",11.590000152587891,4459960,4435800,3187090,756700,3880330,998910,5609010,1925900,"Pt Created",7233780,547290,6070470,8384700,2916560,15746800,806770,6485870,221130,724230,965643.25,761649.375,755326]
["2021-03-18T06:00:00",11.590000152587891,4459960,4472300,3188510,756700,3881330,999140,5610710,1926780,"Pt Created",7236920,547420,6074060,8388740,2918310,15754800,807300,6489430,222570,724600,966515,761649.375,755326]
["2021-03-19T06:00:00",11.590000152587891,4459960,4511600,3189700,756700,3882420,999400,5612660,1927850,"Pt Created",7240290,547550,6077990,8393200,2920220,15763700,807880,6493520,224250,724980,966983.25,761649.375,755326]
["2021-03-20T06:00:00",11.590000152587891,4459960,4553000,3191710,756700,3883500,999740,5614920,1929070,"Pt Created",7243970,547700,6081720,8397600,2921590,15772400,808690,6498140,226240,725430,967499.875,761649.375,755326]
["2021-03-21T06:00:00",11.590000152587891,4459960,4586000,3193470,756700,3884550,1000020,5616920,1929960,"Pt Created",7247600,547830,6085260,8400660,2922420,15777300,809270,6501620,228240,725860,968463.0625,762388.625,755326]
["2021-03-22T06:00:00",11.590000152587891,4460010,4614700,3194990,757700,3885550,1000260,5618600,1930870,"Pt Created",7251160,547970,6089200,8403320,2924060,15782300,809860,6504770,230020,726290,968795.4375,764453.4375,755442]
["2021-03-23T06:00:00",11.590000152587891,4460010,4654300,3196380,757700,3886470,1000500,5620160,1931810,"Pt Created",7254580,548100,6093010,8407520,2925830,15790400,810350,6508440,231640,726680,971623.625,764995.875,755442]
["2021-03-24T06:00:00",11.590000152587891,4460010,4685900,3197450,757700,3887330,1000730,5621280,1932630,"Pt Created",7257780,548220,6096500,8411030,2927550,15795700,810770,6511920,233220,727040,974309.5,767475.125,755442]
["2021-03-25T06:00:00",11.590000152587891,4460010,4715200,3198330,757700,3888070,1000900,5628230,1933140,"Pt Created",7260500,548340,6099390,8413700,2928730,15797600,811020,6514550,234490,727350,977034.5,770028.3125,755442]
["2021-03-26T06:00:00",11.590000152587891,4460020,4745500,3199360,758500,3888900,1001090,5634030,1933840,"Pt Created",7263130,548450,6102110,8417150,2930040,15801200,811320,6517280,235730,727620,979667.25,772569.8125,755524]
["2021-03-27T06:00:00",11.590000152587891,4460020,4765200,3200140,758500,3889610,1001220,5637020,1934230,"Pt Created",7265430,548560,6103490,8419520,2930590,15803900,811460,6519160,236760,727870,985113.625,779916.1875,755524]
["2021-03-28T06:00:00",11.590000152587891,4460020,4787800,3200930,758500,3890270,1001380,5639440,1934530,"Pt Created",7267660,548680,6105290,8421400,2931150,15806100,811680,6521050,237920,728130,991655.875,784815.75,755524]
["2021-03-29T06:00:00",11.590000152587891,4460020,4804700,3201620,758500,3890960,1001520,5641490,1934790,"Pt Created",7269820,548790,6107290,8423140,2931800,15808400,811880,6522750,238990,728380,996492,792164.5,755524]
["2021-03-30T06:00:00",11.590000152587891,4460020,4828200,3202430,758500,3891650,1001640,5643950,1935150,"Pt Created",7271870,548900,6109170,8425470,2932320,15811200,812050,6524510,239850,728590,1003903.6875,797834.1875,755524]

{"sheet":"RESULTAT","index":1,"n_rows":24,"n_cols":10,"rows_kept":24,"cut":false,"hidden":false,"merged":[[0,1,0,4],[0,5,0,6]]}
["2021-01-01T06:00:00","JOUR",null,null,null,"2021-01-01T06:00:00"]
["",null,null,null,"Méthode INDEX EQUIV","Méthode NOM + DECALER"]
["",null,null,2,2,2]
["",null,null,null,{"$f":"\"Compteur \"&E3","v":"Compteur 2"},{"$f":"\"Compteur \"&F3","v":"Compteur 2"}]
[null,null,"pré-calcul Equiv"]
[null,"Nature de la donnée",{"$f":"C7-1","v":1},"avec pré-calcul","Calculée MWh","Calculée MWh","avec pré-calcul",null,"pré-calcul Decaler"]
[null,{"$f":"F1","v":"2021-01-01T06:00:00"},{"$f":"MATCH(B7+1,DATA!$A$2:$A$90,0)","v":2},{"$f":"IFERROR(((INDEX(DATA!$B$2:$X$90,C7,D$3+1))-(INDEX(DATA!$B$2:$X$90,C7-1,D$3+1)))/1000,\"-\")","v":39.700000000000003},{"$f":"IFERROR(((INDEX(DATA!$B$2:$X$90,MATCH(B7+1,DATA!$A$2:$A$90,0),E$3+1))-(INDEX(DATA!$B$2:$X$90,MATCH(B7,DATA!$A$2:$A$90,0),E$3+1)))/1000,\"-\")","v":39.700000000000003},{"$f":"(OFFSET(DATA!$A$1,$F$1-$A$1+2,$F$3+1,7,1)-OFFSET(DATA!$A$1,$F$1-$A$1+1,$F$3+1,7,1))/1000","v":39.700000000000003},{"$f":"(OFFSET(DATA!$A$1,$J$8,$J$9,7,1)-OFFSET(DATA!$A$1,$J$7,$J$9,7,1))/$I$10","v":39.700000000000003},null,"=$F$1-$A$1+1",{"$f":"$F$1-$A$1+1","v":1}]
[null,{"$f":"B7+1","v":"2021-01-02T06:00:00"},{"$f":"C7+1","v":3},{"$f":"IFERROR(((INDEX(DATA!$B$2:$X$90,C8,D$3+1))-(INDEX(DATA!$B$2:$X$90,C8-1,D$3+1)))/1000,\"-\")","v":40.200000000000003},{"$f":"IFERROR(((INDEX(DATA!$B$2:$X$90,MATCH(B8+1,DATA!$A$2:$A$90,0),E$3+1))-(INDEX(DATA!$B$2:$X$90,MATCH(B8,DATA!$A$2:$A$90,0),E$3+1)))/1000,\"-\")","v":40.200000000000003},40.200000000000003,40.200000000000003,null,"=$F$1-$A$1+2",{"$f":"$F$1-$A$1+2","v":2}]
[null,"2021-01-03T06:00:00",4,{"$f":"IFERROR(((INDEX(DATA!$B$2:$X$90,C9,D$3+1))-(INDEX(DATA!$B$2:$X$90,C9-1,D$3+1)))/1000,\"-\")","v":42.2},{"$f":"IFERROR(((INDEX(DATA!$B$2:$X$90,MATCH(B9+1,DATA!$A$2:$A$90,0),E$3+1))-(INDEX(DATA!$B$2:$X$90,MATCH(B9,DATA!$A$2:$A$90,0),E$3+1)))/1000,\"-\")","v":42.2},42.2,42.2,null,"=$F$3+1",{"$f":"$F$3+1","v":3}]
[null,"2021-01-04T06:00:00",5,{"$f":"IFERROR(((INDEX(DATA!$B$2:$X$90,C10,D$3+1))-(INDEX(DATA!$B$2:$X$90,C10-1,D$3+1)))/1000,\"-\")","v":53.1},{"$f":"IFERROR(((INDEX(DATA!$B$2:$X$90,MATCH(B10+1,DATA!$A$2:$A$90,0),E$3+1))-(INDEX(DATA!$B$2:$X$90,MATCH(B10,DATA!$A$2:$A$90,0),E$3+1)))/1000,\"-\")","v":53.1},53.1,53.1,null,1000]
[null,"2021-01-05T06:00:00",6,{"$f":"IFERROR(((INDEX(DATA!$B$2:$X$90,C11,D$3+1))-(INDEX(DATA!$B$2:$X$90,C11-1,D$3+1)))/1000,\"-\")","v":52},{"$f":"IFERROR(((INDEX(DATA!$B$2:$X$90,MATCH(B11+1,DATA!$A$2:$A$90,0),E$3+1))-(INDEX(DATA!$B$2:$X$90,MATCH(B11,DATA!$A$2:$A$90,0),E$3+1)))/1000,\"-\")","v":52},52,52]
[null,"2021-01-06T06:00:00",7,{"$f":"IFERROR(((INDEX(DATA!$B$2:$X$90,C12,D$3+1))-(INDEX(DATA!$B$2:$X$90,C12-1,D$3+1)))/1000,\"-\")","v":51.6},{"$f":"IFERROR(((INDEX(DATA!$B$2:$X$90,MATCH(B12+1,DATA!$A$2:$A$90,0),E$3+1))-(INDEX(DATA!$B$2:$X$90,MATCH(B12,DATA!$A$2:$A$90,0),E$3+1)))/1000,\"-\")","v":51.6},51.6,51.6]
[null,"2021-01-07T06:00:00",8,{"$f":"IFERROR(((INDEX(DATA!$B$2:$X$90,C13,D$3+1))-(INDEX(DATA!$B$2:$X$90,C13-1,D$3+1)))/1000,\"-\")","v":47.5},{"$f":"IFERROR(((INDEX(DATA!$B$2:$X$90,MATCH(B13+1,DATA!$A$2:$A$90,0),E$3+1))-(INDEX(DATA!$B$2:$X$90,MATCH(B13,DATA!$A$2:$A$90,0),E$3+1)))/1000,\"-\")","v":47.5},47.5,47.5]
[]
[]
[]
[null,null,null,"F1","F2","F3","F4",null,"ecart max"]
[null,null,"t pour 1000 colonnes",6.130859375,5.810546875,5.625,5.490234375,null,{"$f":"MAX(D18:G18)-MIN(D18:G18)","v":0.640625}]
[null,null,null,6.0234375,5.6640625,5.603515625,5.580078125,null,{"$f":"MAX(D19:G19)-MIN(D19:G19)","v":0.443359375}]
[4.556640625,null,null,6.00390625,5.658203125,5.5390625,5.61328125,null,0.46484375]
[null,null,null,null,null,null,null,null,0]
[null,null,null,null,null,null,null,null,{"$f":"MAX(D22:G22)-MIN(D22:G22)","v":0}]
[null,null,null,null,null,null,null,null,0]
[null,null,null,null,null,null,null,null,0]

{"sheet":"ESRI_MAPINFO_SHEET","index":2,"n_rows":0,"n_cols":0,"rows_kept":0,"cut":false,"hidden":true,"merged":[]}