{"text_format":"1","workbook":"xlsx","n_sheets":5,"sheets":["Référentiels","Accueil produits","BD produits","Création produit","Modification produit"],"not_rendered":{"charts":0,"images":3,"macros":1,"external_links":0,"defined_names":36,"comments":0,"pivot_tables":0},"unopened":[],"bounds":{"document_bytes":16777216,"sheet_cells":100000,"rows_first":2000,"rows_last":500,"rows_between":2000,"halvings":0,"cell_chars":16384,"cell_head_chars":4096},"cells_cut":0,"cells_raw":0,"read":"whole","date_system":"1900"}

{"sheet":"Référentiels","index":0,"n_rows":35,"n_cols":43,"rows_kept":35,"cut":false,"hidden":false,"merged":[]}
["Catégorie","Destination ","Nature",null,"Jour",null,"Code DMR","Nom DMR",null,"Code DS","Nom DS",null,"Code DWE","Nom DWE",null,"Code LMR","Nom LMR",null,"Code LSLM","Nom LSLM",null,"Code LSMJ","Nom LSMJ",null,"Code LSV","Nom LSV",null,"Code LWED","Nom LWED",null,"Code LWES","Nom LWES",null,"Code VMR","Nom VMR",null,"Code VS","Nom VS",null,"Code VMWE","Nom VMWE",null,"Conditionnement"]
["DMR","Aliments midi retraite","Aliments midi retraite dessert",null,"Dimanche midi",null,"DMR01","Pomme",null,"DS01","Pomme",null,"DWE01","Ananas",null,"LMR01","Asperges",null,"LSLM01","Cassoulet",null,"LSMJ01","Macédoine de légumes",null,"LSV01","Asperges",null,"LWED01","Asperges",null,"LWES01","Pâtes à la sauce tomates",null,"VMR01","Rôti d'agneau",null,"VS01","Bifteck haché de bœuf",null,"VMWE01","Agneau",null,"1 bocal ou 1 boîte pour 1 repas"]
["DS","Aliments journaliers","Aliments journaliers dessert",null,"Dimanche midi et soir",null,null,null,null,null,null,null,"DWE02","Autres fruits",null,"LMR02","Avocat",null,"LSLM02","Choucroute",null,"LSMJ02","Petits pois",null,"LSV02","Avocat",null,"LWED02","Chips",null,"LWES02","Pâtes au beurre",null,"VMR02","Rôti de bœuf",null,"VS02","Bifteck haché de cheval",null,"VMWE02","Bœuf",null,"1 boîte de 6 œufs. 3 œufs par repas"]
["DWE","Aliments weekend","Aliments weekend desserts",null,"Dimanche soir",null,null,null,null,null,null,null,"DWE03","Avocats",null,"LMR03","Carottes",null,"LSLM03","Chou-fleur",null,"LSMJ03","Petits pois et jeunes carottes",null,"LSV03","Betterave rouge",null,"LWED03","Frites",null,"LWES03","Pâtes au fromage râpé",null,"VMR03","Rôti de cheval",null,"VS03","Bifteck haché de veau",null,"VMWE03","Cheval",null,"1 boîte ou 1 pot pour 1 repas"]
["LMR","Aliments midi retraite","Aliments midi retraite légumes",null,"Lundi à dimanche soirs",null,null,null,null,null,null,null,"DWE04","Bananes",null,"LMR04","Céleri",null,"LSLM04","Choux de Bruxelles",null,"LSMJ04","Ratatouille",null,"LSV04","Carottes",null,"LWED04","Haricots verts",null,null,null,null,"VMR04","Rôti de porc",null,"VS04","Bouchée à la reine",null,"VMWE04","Dinde",null,"1 boîte pour 1 repas"]
["LSLM","Aliments journaliers","Aliments journaliers légumes lundi mardi",null,"Lundi à vendredi midis",null,null,null,null,null,null,null,"DWE05","Clémentines",null,"LMR05","Champignons",null,"LSLM05","Couscous",null,"LSMJ05","Raviolis",null,"LSV05","Céleri",null,null,null,null,null,null,null,"VMR05","Rôti de veau",null,"VS05","Boudin",null,"VMWE05","Poisson",null,"1 boîte pour 2 repas"]
["LSMJ","Aliments journaliers","Aliments journaliers légumes mercredi jeudi",null,"Lundi à vendredi soirs",null,null,null,null,null,null,null,"DWE06","Crème",null,"LMR06","Concombre",null,"LSLM06","Endives",null,"LSMJ06","Tomates pelées",null,"LSV06","Champignons",null,null,null,null,null,null,null,null,null,null,"VS06","Cervelas",null,"VMWE06","Porc",null,"1 botte ou 1 sachet pour 1 repas"]
["LSV","Aliments journaliers","Aliments journaliers légumes vendredi",null,"Lundi  et mardi soirs",null,null,null,null,null,null,null,"DWE07","Dattes",null,"LMR07","Couscous",null,"LSLM07","Haricots verts",null,null,null,null,"LSV07","Concombre",null,null,null,null,null,null,null,null,null,null,"VS07","Cœur",null,"VMWE07","Veau",null,"1 botte ou 1 sachet pour 2 repas"]
["LWED","Aliments weekend","Aliments weekend légumes dimanche",null,"Mercredi et jeudi soirs",null,null,null,null,null,null,null,"DWE08","Figues",null,"LMR08","Maïs",null,"LSLM08","Maïs",null,null,null,null,"LSV08","Radis",null,null,null,null,null,null,null,null,null,null,"VS08","Croque-monsieur",null,null,null,null,"1 morceau de 400 grammes (Leclerc) pour 3 repas"]
["LWES","Aliments weekend","Aliments weekend légumes samedi",null,"Samedi et dimanche midis",null,null,null,null,null,null,null,"DWE09","Fromage blanc",null,"LMR09","Pâtes à la sauce tomates",null,"LSLM09","Paella",null,null,null,null,"LSV09","Salade",null,null,null,null,null,null,null,null,null,null,"VS09","Foie",null,null,null,null,"1 morceau de 500 grammes pour 5 repas"]
["VMR","Aliments midi retraite","Aliments midi retraite viandes",null,"Samedi et dimanche midis et soirs",null,null,null,null,null,null,null,"DWE10","Fruits au sirop",null,"LMR10","Pâtes au beurre",null,"LSLM10","Poireau",null,null,null,null,"LSV10","Salsifis",null,null,null,null,null,null,null,null,null,null,"VS10","Fromage de tête",null,null,null,null,"1 pack de 4 pots pour le weekend. 1 pot par repas"]
["VMWE","Aliments weekend","Aliments weekend viandes",null,"Samedi midi et soir",null,null,null,null,null,null,null,"DWE11","Fruits de saison",null,"LMR11","Poireau",null,"LSLM11","Pomme de terre",null,null,null,null,"LSV11","Tomates",null,null,null,null,null,null,null,null,null,null,"VS11","Jambon",null,null,null,null,"1 pack de 6 pots (ou 12 pots) : 3 pots par repas"]
["VS","Aliments journaliers","Aliments journaliers viandes",null,"Vendredi soir",null,null,null,null,null,null,null,"DWE12","Gâteau de riz",null,"LMR12","Pomme de terre",null,"LSLM12","Purée",null,null,null,null,null,null,null,null,null,null,null,null,null,null,null,null,"VS12","Jambonneau",null,null,null,null,"1 paquet pour 1 repas"]
[null,null,null,null,null,null,null,null,null,null,null,null,"DWE13","Gâteau de semoule",null,"LMR13","Purée",null,"LSLM13","Quenelles",null,null,null,null,null,null,null,null,null,null,null,null,null,null,null,null,"VS13","Mortadelle",null,null,null,null,"1 paquet pour 2 repas"]
[null,null,null,null,null,null,null,null,null,null,null,null,"DWE14","Gâteaux samedi dimanche",null,"LMR14","Radis",null,"LSLM14","Riz",null,null,null,null,null,null,null,null,null,null,null,null,null,null,null,null,"VS14","Œufs",null,null,null,null,"1 paquet pour 2 repas : 1 ou 2 saucisses par repas"]
[null,null,null,null,null,null,null,null,null,null,null,null,"DWE15","Mousse au chocolat",null,"LMR15","Riz",null,null,null,null,null,null,null,null,null,null,null,null,null,null,null,null,null,null,null,"VS15","Pizza",null,null,null,null,"1 paquet pour 4 repas"]
[null,null,null,null,null,null,null,null,null,null,null,null,"DWE16","Oranges",null,"LMR16","Salade",null,null,null,null,null,null,null,null,null,null,null,null,null,null,null,null,null,null,null,"VS16","Poisson",null,null,null,null,"1 paquet pour 5 repas (betteraves rouges)"]
[null,null,null,null,null,null,null,null,null,null,null,null,"DWE17","Petits suisses",null,"LMR17","Tomates",null,null,null,null,null,null,null,null,null,null,null,null,null,null,null,null,null,null,null,"VS17","Quiche lorraine",null,null,null,null,"1 sachet de 1500 grammes, 2000 grammes ou 3000 grammes : 1 pomme pour 1 repas"]
[null,null,null,null,null,null,null,null,null,null,null,null,"DWE18","Pruneaux",null,null,null,null,null,null,null,null,null,null,null,null,null,null,null,null,null,null,null,null,null,null,"VS18","Roulade à la pistache",null,null,null,null,"1 sachet pour 2 repas"]
[null,null,null,null,null,null,null,null,null,null,null,null,"DWE19","Riz au lait",null,null,null,null,null,null,null,null,null,null,null,null,null,null,null,null,null,null,null,null,null,null,"VS19","Roulé au fromage",null,null,null,null,"1 sachet pour 4 repas"]
[null,null,null,null,null,null,null,null,null,null,null,null,"DWE20","Tapioca",null,null,null,null,null,null,null,null,null,null,null,null,null,null,null,null,null,null,null,null,null,null,"VS20","Salami",null,null,null,null,"1 tranche pour 1 repas"]
[null,null,null,null,null,null,null,null,null,null,null,null,"DWE21","Yaourts",null,null,null,null,null,null,null,null,null,null,null,null,null,null,null,null,null,null,null,null,null,null,"VS21","Saucisses",null,null,null,null,"1 tranche pour 2 repas"]
[null,null,null,null,null,null,null,null,null,null,null,null,null,null,null,null,null,null,null,null,null,null,null,null,null,null,null,null,null,null,null,null,null,null,null,null,"VS22","Saucisson",null,null,null,null,"125 grammes pour 1 repas"]
[null,null,null,null,null,null,null,null,null,null,null,null,null,null,null,null,null,null,null,null,null,null,null,null,null,null,null,null,null,null,null,null,null,null,null,null,"VS23","Tête persillée",null,null,null,null,"20 frites pour 1 repas"]
[null,null,null,null,null,null,null,null,null,null,null,null,null,null,null,null,null,null,null,null,null,null,null,null,null,null,null,null,null,null,null,null,null,null,null,null,"VS24","Tête roulée",null,null,null,null,"25 grammes pour 1 repas"]
[null,null,null,null,null,null,null,null,null,null,null,null,null,null,null,null,null,null,null,null,null,null,null,null,null,null,null,null,null,null,null,null,null,null,null,null,"VS25","Thon",null,null,null,null,"3 tranches pour 1 repas"]
[null,null,null,null,null,null,null,null,null,null,null,null,null,null,null,null,null,null,null,null,null,null,null,null,null,null,null,null,null,null,null,null,null,null,null,null,"VS26","Viande cassoulet",null,null,null,null,"5 cuillères pour 1 repas"]
[null,null,null,null,null,null,null,null,null,null,null,null,null,null,null,null,null,null,null,null,null,null,null,null,null,null,null,null,null,null,null,null,null,null,null,null,"VS27","Viande choucroute",null,null,null,null,"Unité : 1 branche pour 1 repas"]
[null,null,null,null,null,null,null,null,null,null,null,null,null,null,null,null,null,null,null,null,null,null,null,null,null,null,null,null,null,null,null,null,null,null,null,null,"VS28","Viande paella",null,null,null,null,"Unité : 1 morceau pour 1 repas"]
[null,null,null,null,null,null,null,null,null,null,null,null,null,null,null,null,null,null,null,null,null,null,null,null,null,null,null,null,null,null,null,null,null,null,null,null,null,null,null,null,null,null,"Unité : 1 pour 1 repas"]
[null,null,null,null,null,null,null,null,null,null,null,null,null,null,null,null,null,null,null,null,null,null,null,null,null,null,null,null,null,null,null,null,null,null,null,null,null,null,null,null,null,null,"Unité : 1 pour 2 repas"]
[null,null,null,null,null,null,null,null,null,null,null,null,null,null,null,null,null,null,null,null,null,null,null,null,null,null,null,null,null,null,null,null,null,null,null,null,null,null,null,null,null,null,"Unité : 1 pour 4 repas"]
[null,null,null,null,null,null,null,null,null,null,null,null,null,null,null,null,null,null,null,null,null,null,null,null,null,null,null,null,null,null,null,null,null,null,null,null,null,null,null,null,null,null,"Unité : 1 tête par repas (pack de 3 têtes)"]
[null,null,null,null,null,null,null,null,null,null,null,null,null,null,null,null,null,null,null,null,null,null,null,null,null,null,null,null,null,null,null,null,null,null,null,null,null,null,null,null,null,null,"Unité : 2 à 4 pour 1 repas"]
[null,null,null,null,null,null,null,null,null,null,null,null,null,null,null,null,null,null,null,null,null,null,null,null,null,null,null,null,null,null,null,null,null,null,null,null,null,null,null,null,null,null,"Unité : 2 pour 1 repas"]

{"sheet":"Accueil produits","index":1,"n_rows":93,"n_cols":36,"rows_kept":93,"cut":false,"hidden":false,"merged":[]}
["Accueil produits",null,null,null,null,null,null,null,null,"Open","Save",null,null,null,null,null,null,null,null,null,null,null,null,null,null,null,null,null,null,null,null,null,null,"Open","Save","Save"]
[null,null,null,null,null,null,null,null,null,"2021-02-25T16:47:49"]
[null,null,null,null,null,null,null,null,null,"2021-02-25T17:04:42","2021-02-25T16:47:57",null,null,null,null,null,null,null,null,null,null,null,null,null,null,null,null,null,null,null,null,null,null,null,null,"2021-02-08T21:15:54"]
[null,null,null,null,null,null,null,null,null,"2021-02-25T17:11:29","2021-02-25T17:06:46",null,null,null,null,null,null,null,null,null,null,null,null,null,null,null,null,null,null,null,null,null,null,null,null,"2021-02-08T21:18:44"]
[null,null,null,null,null,null,null,null,null,"2021-03-15T15:18:20","2021-02-25T21:28:34",null,null,null,null,null,null,null,null,null,null,null,null,null,null,null,null,null,null,null,null,null,null,null,"2021-02-08T21:19:00"]
[null,null,null,null,null,null,null,null,null,"2021-03-18T11:44:03","2021-02-25T21:33:54"]
[null,null,null,null,null,null,null,null,null,null,"2021-03-15T15:48:59",null,null,null,null,null,null,null,null,null,null,null,null,null,null,null,null,null,null,null,null,null,null,null,null,"2021-02-08T21:23:39"]
[null,null,null,null,null,null,null,null,null,null,"2021-03-18T12:13:46",null,null,null,null,null,null,null,null,null,null,null,null,null,null,null,null,null,null,null,null,null,null,null,"2021-02-08T21:40:32"]
[null,null,null,null,null,null,null,null,null,null,null,null,null,null,null,null,null,null,null,null,null,null,null,null,null,null,null,null,null,null,null,null,null,null,null,"2021-02-08T21:48:56"]
[null,null,null,null,null,null,null,null,null,null,null,null,null,null,null,null,null,null,null,null,null,null,null,null,null,null,null,null,null,null,null,null,null,null,"2021-02-08T21:50:05"]
[null,null,null,null,null,null,null,null,null,null,null,null,null,null,null,null,null,null,null,null,null,null,null,null,null,null,null,null,null,null,null,null,null,null,null,"2021-02-08T22:13:59"]
[null,null,null,null,null,null,null,null,null,null,null,null,null,null,null,null,null,null,null,null,null,null,null,null,null,null,null,null,null,null,null,null,null,null,null,"2021-02-08T22:24:15"]
[null,null,null,null,null,null,null,null,null,null,null,null,null,null,null,null,null,null,null,null,null,null,null,null,null,null,null,null,null,null,null,null,null,null,null,"2021-02-08T22:26:55"]
[null,null,null,null,null,null,null,null,null,null,null,null,null,null,null,null,null,null,null,null,null,null,null,null,null,null,null,null,null,null,null,null,null,null,"2021-02-09T21:00:49"]
[null,null,null,null,null,null,null,null,null,null,null,null,null,null,null,null,null,null,null,null,null,null,null,null,null,null,null,null,null,null,null,null,null,null,null,"2021-02-09T21:37:59"]
[null,null,null,null,null,null,null,null,null,null,null,null,null,null,null,null,null,null,null,null,null,null,null,null,null,null,null,null,null,null,null,null,null,null,null,"2021-02-09T21:38:51"]
[null,null,null,null,null,null,null,null,null,null,null,null,null,null,null,null,null,null,null,null,null,null,null,null,null,null,null,null,null,null,null,null,null,null,null,"2021-02-09T22:01:49"]
[null,null,null,null,null,null,null,null,null,null,null,null,null,null,null,null,null,null,null,null,null,null,null,null,null,null,null,null,null,null,null,null,null,null,"2021-02-10T14:25:54"]
[null,null,null,null,null,null,null,null,null,null,null,null,null,null,null,null,null,null,null,null,null,null,null,null,null,null,null,null,null,null,null,null,null,null,null,"2021-02-10T14:36:46"]
[null,null,null,null,null,null,null,null,null,null,null,null,null,null,null,null,null,null,null,null,null,null,null,null,null,null,null,null,null,null,null,null,null,null,null,"2021-02-10T14:45:35"]
[null,null,null,null,null,null,null,null,null,null,null,null,null,null,null,null,null,null,null,null,null,null,null,null,null,null,null,null,null,null,null,null,null,null,null,"2021-02-10T15:04:31"]
[null,null,null,null,null,null,null,null,null,null,null,null,null,null,null,null,null,null,null,null,null,null,null,null,null,null,null,null,null,null,null,null,null,null,null,"2021-02-10T18:47:43"]
[null,null,null,null,null,null,null,null,null,null,null,null,null,null,null,null,null,null,null,null,null,null,null,null,null,null,null,null,null,null,null,null,null,null,null,"2021-02-10T21:08:16"]
[null,null,null,null,null,null,null,null,null,null,null,null,null,null,null,null,null,null,null,null,null,null,null,null,null,null,null,null,null,null,null,null,null,null,null,"2021-02-10T21:12:42"]
[null,null,null,null,null,null,null,null,null,null,null,null,null,null,null,null,null,null,null,null,null,null,null,null,null,null,null,null,null,null,null,null,null,null,"2021-02-10T21:35:35"]
[null,null,null,null,null,null,null,null,null,null,null,null,null,null,null,null,null,null,null,null,null,null,null,null,null,null,null,null,null,null,null,null,null,null,null,"2021-02-10T21:38:06"]
[null,null,null,null,null,null,null,null,null,null,null,null,null,null,null,null,null,null,null,null,null,null,null,null,null,null,null,null,null,null,null,null,null,null,null,"2021-02-10T21:44:00"]
[null,null,null,null,null,null,null,null,null,null,null,null,null,null,null,null,null,null,null,null,null,null,null,null,null,null,null,null,null,null,null,null,null,null,null,"2021-02-10T21:50:03"]
[null,null,null,null,null,null,null,null,null,null,null,null,null,null,null,null,null,null,null,null,null,null,null,null,null,null,null,null,null,null,null,null,null,null,null,"2021-02-11T09:26:55"]
[null,null,null,null,null,null,null,null,null,null,null,null,null,null,null,null,null,null,null,null,null,null,null,null,null,null,null,null,null,null,null,null,null,null,"2021-02-11T10:30:57"]
[null,null,null,null,null,null,null,null,null,null,null,null,null,null,null,null,null,null,null,null,null,null,null,null,null,null,null,null,null,null,null,null,null,null,null,"2021-02-11T10:31:48"]
[null,null,null,null,null,null,null,null,null,null,null,null,null,null,null,null,null,null,null,null,null,null,null,null,null,null,null,null,null,null,null,null,null,null,null,"2021-02-11T10:35:34"]
[null,null,null,null,null,null,null,null,null,null,null,null,null,null,null,null,null,null,null,null,null,null,null,null,null,null,null,null,null,null,null,null,null,null,"2021-02-11T14:56:40"]
[null,null,null,null,null,null,null,null,null,null,null,null,null,null,null,null,null,null,null,null,null,null,null,null,null,null,null,null,null,null,null,null,null,null,null,"2021-02-11T15:04:10"]
[null,null,null,null,null,null,null,null,null,null,null,null,null,null,null,null,null,null,null,null,null,null,null,null,null,null,null,null,null,null,null,null,null,null,null,"2021-02-11T15:08:25"]
[null,null,null,null,null,null,null,null,null,null,null,null,null,null,null,null,null,null,null,null,null,null,null,null,null,null,null,null,null,null,null,null,null,null,null,"2021-02-11T15:20:00"]
[null,null,null,null,null,null,null,null,null,null,null,null,null,null,null,null,null,null,null,null,null,null,null,null,null,null,null,null,null,null,null,null,null,null,null,"2021-02-11T15:28:21"]
[null,null,null,null,null,null,null,null,null,null,null,null,null,null,null,null,null,null,null,null,null,null,null,null,null,null,null,null,null,null,null,null,null,null,null,"2021-02-11T15:33:40"]
[null,null,null,null,null,null,null,null,null,null,null,null,null,null,null,null,null,null,null,null,null,null,null,null,null,null,null,null,null,null,null,null,null,null,"2021-02-11T15:35:04"]
[null,null,null,null,null,null,null,null,null,null,null,null,null,null,null,null,null,null,null,null,null,null,null,null,null,null,null,null,null,null,null,null,null,null,null,"2021-02-11T15:44:58"]
[null,null,null,null,null,null,null,null,null,null,null,null,null,null,null,null,null,null,null,null,null,null,null,null,null,null,null,null,null,null,null,null,null,null,"2021-02-11T15:57:53"]
[null,null,null,null,null,null,null,null,null,null,null,null,null,null,null,null,null,null,null,null,null,null,null,null,null,null,null,null,null,null,null,null,null,null,null,"2021-02-11T16:35:03"]
[null,null,null,null,null,null,null,null,null,null,null,null,null,null,null,null,null,null,null,null,null,null,null,null,null,null,null,null,null,null,null,null,null,null,null,"2021-02-11T18:59:13"]
[null,null,null,null,null,null,null,null,null,null,null,null,null,null,null,null,null,null,null,null,null,null,null,null,null,null,null,null,null,null,null,null,null,null,null,"2021-02-11T18:59:30"]
[null,null,null,null,null,null,null,null,null,null,null,null,null,null,null,null,null,null,null,null,null,null,null,null,null,null,null,null,null,null,null,null,null,null,null,"2021-02-11T21:11:55"]
[null,null,null,null,null,null,null,null,null,null,null,null,null,null,null,null,null,null,null,null,null,null,null,null,null,null,null,null,null,null,null,null,null,null,null,"2021-02-11T21:18:13"]
[null,null,null,null,null,null,null,null,null,null,null,null,null,null,null,null,null,null,null,null,null,null,null,null,null,null,null,null,null,null,null,null,null,null,"2021-02-11T21:32:29"]
[null,null,null,null,null,null,null,null,null,null,null,null,null,null,null,null,null,null,null,null,null,null,null,null,null,null,null,null,null,null,null,null,null,null,null,"2021-02-11T21:48:34"]
[null,null,null,null,null,null,null,null,null,null,null,null,null,null,null,null,null,null,null,null,null,null,null,null,null,null,null,null,null,null,null,null,null,null,null,"2021-02-11T21:49:29"]
[null,null,null,null,null,null,null,null,null,null,null,null,null,null,null,null,null,null,null,null,null,null,null,null,null,null,null,null,null,null,null,null,null,null,null,"2021-02-11T21:51:20"]
[null,null,null,null,null,null,null,null,null,null,null,null,null,null,null,null,null,null,null,null,null,null,null,null,null,null,null,null,null,null,null,null,null,null,"2021-02-12T21:27:57"]
[null,null,null,null,null,null,null,null,null,null,null,null,null,null,null,null,null,null,null,null,null,null,null,null,null,null,null,null,null,null,null,null,null,null,null,"2021-02-12T21:29:27"]
[null,null,null,null,null,null,null,null,null,null,null,null,null,null,null,null,null,null,null,null,null,null,null,null,null,null,null,null,null,null,null,null,null,null,null,"2021-02-12T21:30:42"]
[null,null,null,null,null,null,null,null,null,null,null,null,null,null,null,null,null,null,null,null,null,null,null,null,null,null,null,null,null,null,null,null,null,null,"2021-02-12T21:31:57"]
[null,null,null,null,null,null,null,null,null,null,null,null,null,null,null,null,null,null,null,null,null,null,null,null,null,null,null,null,null,null,null,null,null,null,null,"2021-02-12T21:50:58"]
[null,null,null,null,null,null,null,null,null,null,null,null,null,null,null,null,null,null,null,null,null,null,null,null,null,null,null,null,null,null,null,null,null,null,null,"2021-02-12T21:51:50"]
[null,null,null,null,null,null,null,null,null,null,null,null,null,null,null,null,null,null,null,null,null,null,null,null,null,null,null,null,null,null,null,null,null,null,null,"2021-02-12T21:52:48"]
[null,null,null,null,null,null,null,null,null,null,null,null,null,null,null,null,null,null,null,null,null,null,null,null,null,null,null,null,null,null,null,null,null,null,null,"2021-02-12T21:59:28"]
[null,null,null,null,null,null,null,null,null,null,null,null,null,null,null,null,null,null,null,null,null,null,null,null,null,null,null,null,null,null,null,null,null,null,"2021-02-13T20:48:04"]
[null,null,null,null,null,null,null,null,null,null,null,null,null,null,null,null,null,null,null,null,null,null,null,null,null,null,null,null,null,null,null,null,null,null,null,"2021-02-13T20:49:08"]
[null,null,null,null,null,null,null,null,null,null,null,null,null,null,null,null,null,null,null,null,null,null,null,null,null,null,null,null,null,null,null,null,null,null,null,"2021-02-13T20:49:45"]
[null,null,null,null,null,null,null,null,null,null,null,null,null,null,null,null,null,null,null,null,null,null,null,null,null,null,null,null,null,null,null,null,null,null,null,"2021-02-13T21:25:01"]
[null,null,null,null,null,null,null,null,null,null,null,null,null,null,null,null,null,null,null,null,null,null,null,null,null,null,null,null,null,null,null,null,null,null,null,"2021-02-13T21:25:12"]
[null,null,null,null,null,null,null,null,null,null,null,null,null,null,null,null,null,null,null,null,null,null,null,null,null,null,null,null,null,null,null,null,null,null,"2021-02-15T10:06:35"]
[null,null,null,null,null,null,null,null,null,null,null,null,null,null,null,null,null,null,null,null,null,null,null,null,null,null,null,null,null,null,null,null,null,null,null,"2021-02-15T10:21:12"]
[null,null,null,null,null,null,null,null,null,null,null,null,null,null,null,null,null,null,null,null,null,null,null,null,null,null,null,null,null,null,null,null,null,null,"2021-02-15T10:43:53"]
[null,null,null,null,null,null,null,null,null,null,null,null,null,null,null,null,null,null,null,null,null,null,null,null,null,null,null,null,null,null,null,null,null,null,null,"2021-02-15T10:46:02"]
[null,null,null,null,null,null,null,null,null,null,null,null,null,null,null,null,null,null,null,null,null,null,null,null,null,null,null,null,null,null,null,null,null,null,null,"2021-02-15T10:47:49"]
[null,null,null,null,null,null,null,null,null,null,null,null,null,null,null,null,null,null,null,null,null,null,null,null,null,null,null,null,null,null,null,null,null,null,null,"2021-02-15T10:48:09"]
[null,null,null,null,null,null,null,null,null,null,null,null,null,null,null,null,null,null,null,null,null,null,null,null,null,null,null,null,null,null,null,null,null,null,null,"2021-02-15T10:50:42"]
[null,null,null,null,null,null,null,null,null,null,null,null,null,null,null,null,null,null,null,null,null,null,null,null,null,null,null,null,null,null,null,null,null,null,"2021-02-15T10:50:54"]
[null,null,null,null,null,null,null,null,null,null,null,null,null,null,null,null,null,null,null,null,null,null,null,null,null,null,null,null,null,null,null,null,null,null,null,"2021-02-15T11:22:24"]
[null,null,null,null,null,null,null,null,null,null,null,null,null,null,null,null,null,null,null,null,null,null,null,null,null,null,null,null,null,null,null,null,null,null,"2021-02-15T11:37:10"]
[null,null,null,null,null,null,null,null,null,null,null,null,null,null,null,null,null,null,null,null,null,null,null,null,null,null,null,null,null,null,null,null,null,null,null,"2021-02-15T11:48:32"]
[null,null,null,null,null,null,null,null,null,null,null,null,null,null,null,null,null,null,null,null,null,null,null,null,null,null,null,null,null,null,null,null,null,null,null,"2021-02-15T11:54:55"]
[null,null,null,null,null,null,null,null,null,null,null,null,null,null,null,null,null,null,null,null,null,null,null,null,null,null,null,null,null,null,null,null,null,null,"2021-02-15T12:05:13"]
[null,null,null,null,null,null,null,null,null,null,null,null,null,null,null,null,null,null,null,null,null,null,null,null,null,null,null,null,null,null,null,null,null,null,null,"2021-02-15T12:07:38"]
[null,null,null,null,null,null,null,null,null,null,null,null,null,null,null,null,null,null,null,null,null,null,null,null,null,null,null,null,null,null,null,null,null,null,null,"2021-02-15T12:20:54"]
[null,null,null,null,null,null,null,null,null,null,null,null,null,null,null,null,null,null,null,null,null,null,null,null,null,null,null,null,null,null,null,null,null,null,"2021-02-15T14:09:09"]
[null,null,null,null,null,null,null,null,null,null,null,null,null,null,null,null,null,null,null,null,null,null,null,null,null,null,null,null,null,null,null,null,null,null,null,"2021-02-15T14:13:48"]
[null,null,null,null,null,null,null,null,null,null,null,null,null,null,null,null,null,null,null,null,null,null,null,null,null,null,null,null,null,null,null,null,null,null,"2021-02-15T14:51:37"]
[null,null,null,null,null,null,null,null,null,null,null,null,null,null,null,null,null,null,null,null,null,null,null,null,null,null,null,null,null,null,null,null,null,null,"2021-02-15T14:57:57"]
[null,null,null,null,null,null,null,null,null,null,null,null,null,null,null,null,null,null,null,null,null,null,null,null,null,null,null,null,null,null,null,null,null,null,"2021-02-15T14:59:38"]
[null,null,null,null,null,null,null,null,null,null,null,null,null,null,null,null,null,null,null,null,null,null,null,null,null,null,null,null,null,null,null,null,null,null,"2021-02-15T15:01:41"]
[null,null,null,null,null,null,null,null,null,null,null,null,null,null,null,null,null,null,null,null,null,null,null,null,null,null,null,null,null,null,null,null,null,null,"2021-02-15T15:07:42"]
[null,null,null,null,null,null,null,null,null,null,null,null,null,null,null,null,null,null,null,null,null,null,null,null,null,null,null,null,null,null,null,null,null,"2021-02-15T15:17:59"]
[null,null,null,null,null,null,null,null,null,null,null,null,null,null,null,null,null,null,null,null,null,null,null,null,null,null,null,null,null,null,null,null,null,null,"2021-02-15T15:19:12"]
[null,null,null,null,null,null,null,null,null,null,null,null,null,null,null,null,null,null,null,null,null,null,null,null,null,null,null,null,null,null,null,null,null,null,"2021-02-15T15:23:59"]
[null,null,null,null,null,null,null,null,null,null,null,null,null,null,null,null,null,null,null,null,null,null,null,null,null,null,null,null,null,null,null,null,null,"2021-02-15T15:29:44"]
[null,null,null,null,null,null,null,null,null,null,null,null,null,null,null,null,null,null,null,null,null,null,null,null,null,null,null,null,null,null,null,null,null,null,"2021-02-15T15:31:46"]
[null,null,null,null,null,null,null,null,null,null,null,null,null,null,null,null,null,null,null,null,null,null,null,null,null,null,null,null,null,null,null,null,null,"2021-02-16T15:00:16"]
[null,null,null,null,null,null,null,null,null,null,null,null,null,null,null,null,null,null,null,null,null,null,null,null,null,null,null,null,null,null,null,null,null,null,"2021-02-16T15:00:53"]
[null,null,null,null,null,null,null,null,null,null,null,null,null,null,null,null,null,null,null,null,null,null,null,null,null,null,null,null,null,null,null,null,null,"2021-02-18T10:31:36"]

{"sheet":"BD produits","index":2,"n_rows":119,"n_cols":8,"rows_kept":119,"cut":false,"hidden":false,"merged":[]}
["Catégorie","Code produit","Produit","Jour","Conditionnement","Quantité","À modifier","Date création"]
["DMR","DMR01","Pomme","Lundi à vendredi midis","1 sachet de 1500 grammes, 2000 grammes ou 3000 grammes : 1 pomme pour 1 repas",1,"Oui","2021-02-01"]
["DS","DS01","Pomme","lundi à vendredi soirs","1 sachet de 1500 grammes, 2000 grammes ou 3000 grammes : 1 pomme pour 1 repas",1,"Oui","2021-02-01"]
["DWE","DWE01","Ananas","Samedi et dimanche midis et soirs","Unité : 1 pour 4 repas",0.5,"Oui","2021-02-01"]
["DWE","DWE02","Autres fruits","Samedi et dimanche midis et soirs","Unité : 2 à 4 pour 1 repas",8,"Oui","2021-02-01"]
["DWE","DWE03","Avocats","Samedi et dimanche midis et soirs","Unité : 1 pour 1 repas",2,"Oui","2021-02-01"]
["DWE","DWE04","Bananes","Samedi et dimanche midis et soirs","Unité : 1 pour 1 repas",2,"Oui","2021-02-01"]
["DWE","DWE05","Clémentines","Samedi et dimanche midis et soirs","Unité : 2 à 4 pour 1 repas",8,"Oui","2021-02-01"]
["DWE","DWE06","Crème","Samedi et dimanche midis et soirs","1 pack de 4 pots pour le weekend. 1 pot par repas",2,"Oui","2021-02-01"]
["DWE","DWE07","Dattes","Samedi et dimanche midis et soirs","1 paquet pour 4 repas",0.5,"Oui","2021-02-01"]
["DWE","DWE08","Figues","Samedi et dimanche midis et soirs","1 paquet pour 4 repas",0.5,"Oui","2021-02-01"]
["DWE","DWE09","Fromage blanc","Samedi et dimanche midis et soirs","1 pack de 4 pots pour le weekend. 1 pot par repas",2,"Oui","2021-02-01"]
["DWE","DWE10","Fruits au sirop","Samedi et dimanche midis et soirs","1 boîte pour 2 repas",1,"Oui","2021-02-01"]
["DWE","DWE11","Fruits de saison","Samedi et dimanche midis et soirs","Unité : 2 à 4 pour 1 repas",8,"Oui","2021-02-01"]
["DWE","DWE12","Gâteau de riz","Samedi et dimanche midis et soirs","1 pack de 4 pots pour le weekend. 1 pot par repas",2,"Oui","2021-02-01"]
["DWE","DWE13","Gâteau de semoule","Samedi et dimanche midis et soirs","1 pack de 4 pots pour le weekend. 1 pot par repas",2,"Oui","2021-02-01"]
["DWE","DWE14","Gâteaux samedi dimanche","Samedi et dimanche midis et soirs","1 paquet pour 2 repas",2,"Oui","2021-02-01"]
["DWE","DWE15","Mousse au chocolat","Samedi et dimanche midis et soirs","1 pack de 4 pots pour le weekend. 1 pot par repas",2,"Oui","2021-02-01"]
["DWE","DWE16","Oranges","Samedi et dimanche midis et soirs","Unité : 1 pour 1 repas",2,"Oui","2021-02-01"]
["DWE","DWE17","Petits suisses","Samedi et dimanche midis et soirs","1 pack de 6 pots (ou 12 pots) : 3 pots par repas",6,"Oui","2021-02-01"]
["DWE","DWE18","Pruneaux","Samedi et dimanche midis et soirs","1 paquet pour 4 repas",0.5,"Oui","2021-02-01"]
["DWE","DWE19","Riz au lait","Samedi et dimanche midis et soirs","1 pack de 4 pots pour le weekend. 1 pot par repas",2,"Oui","2021-02-01"]
["DWE","DWE20","Tapioca","Samedi et dimanche midis et soirs","125 grammes pour 1 repas",100,"Oui","2021-02-01"]
["DWE","DWE21","Yaourts","Samedi et dimanche midis et soirs","1 pack de 4 pots pour le weekend. 1 pot par repas",2,"Oui","2021-02-01"]
["LMR","LMR01","Asperges","Lundi à vendredi midis","1 bocal ou 1 boîte pour 1 repas",1,"Oui","2021-02-01"]
["LMR","LMR02","Avocat","Lundi à vendredi midis","Unité : 1 pour 1 repas",1,"Oui","2021-02-01"]
["LMR","LMR03","Carottes","Lundi à vendredi midis","Unité : 2 pour 1 repas",2,"Oui","2021-02-01"]
["LMR","LMR04","Céleri","Lundi à vendredi midis","Unité : 1 branche pour 1 repas",1,"Oui","2021-02-01"]
["LMR","LMR05","Champignons","Lundi à vendredi midis","1 boîte pour 1 repas",1,"Oui","2021-02-01"]
["LMR","LMR06","Concombre","Lundi à vendredi midis","Unité : 1 pour 1 repas",1,"Oui","2021-02-01"]
["LMR","LMR07","Couscous","Lundi à vendredi midis","25 grammes pour 1 repas",25,"Oui","2021-02-01"]
["LMR","LMR08","Maïs","Lundi à vendredi midis","1 boîte pour 2 repas",0.5,"Oui","2021-02-01"]
["LMR","LMR09","Pâtes à la sauce tomates","Lundi à vendredi midis","5 cuillères pour 1 repas",5,"Oui","2021-02-01"]
["LMR","LMR10","Pâtes au beurre","Lundi à vendredi midis","5 cuillères pour 1 repas",5,"Oui","2021-02-01"]
["LMR","LMR11","Poireau","Lundi à vendredi midis","Unité : 1 pour 1 repas",1,"Oui","2021-02-01"]
["LMR","LMR12","Pomme de terre","Lundi à vendredi midis","Unité : 1 pour 1 repas",1,"Oui","2021-02-01"]
["LMR","LMR13","Purée","Lundi à vendredi midis","25 grammes pour 1 repas",25,"Oui","2021-02-01"]
["LMR","LMR14","Radis","Lundi à vendredi midis","1 botte ou 1 sachet pour 2 repas",0.5,"Oui","2021-02-01"]
["LMR","LMR15","Riz","Lundi à vendredi midis","25 grammes pour 1 repas",25,"Oui","2021-02-01"]
["LMR","LMR16","Salade","Lundi à vendredi midis","Unité : 1 tête par repas (pack de 3 têtes)",1,"Oui","2021-02-01"]
["LMR","LMR17","Tomates","Lundi à vendredi midis","Unité : 2 pour 1 repas",2,"Oui","2021-02-01"]
["LSLM","LSLM01","Cassoulet","Lundi et mardi soirs","1 boîte pour 2 repas",0.5,"Oui","2021-02-01"]
["LSLM","LSLM02","Choucroute","Lundi et mardi soirs","1 boîte pour 2 repas",0.5,"Oui","2021-02-01"]
["LSLM","LSLM03","Chou-fleur","Lundi et mardi soirs","Unité : 1 pour 2 repas",0.5,"Oui","2021-02-01"]
["LSLM","LSLM04","Choux de Bruxelles","Lundi et mardi soirs","1 boîte pour 2 repas",0.5,"Oui","2021-02-01"]
["LSLM","LSLM05","Couscous","Lundi et mardi soirs","25 grammes pour 1 repas",25,"Oui","2021-02-01"]
["LSLM","LSLM06","Endives","Lundi et mardi soirs","1 boîte pour 2 repas",0.5,"Oui","2021-02-01"]
["LSLM","LSLM07","Haricots verts","Lundi et mardi soirs","1 boîte pour 2 repas",0.5,"Oui","2021-02-01"]
["LSLM","LSLM08","Maïs","Lundi et mardi soirs","1 boîte pour 2 repas",0.5,"Oui","2021-02-01"]
["LSLM","LSLM09","Paella","Lundi et mardi soirs","1 paquet pour 2 repas",0.5,"Oui","2021-02-01"]
["LSLM","LSLM10","Poireau","Lundi et mardi soirs","Unité : 1 pour 1 repas",1,"Oui","2021-02-01"]
["LSLM","LSLM11","Pomme de terre","Lundi et mardi soirs","Unité : 1 pour 1 repas",1,"Oui","2021-02-01"]
["LSLM","LSLM12","Purée","Lundi et mardi soirs","25 grammes pour 1 repas",25,"Oui","2021-02-01"]
["LSLM","LSLM13","Quenelles","Lundi et mardi soirs","1 boîte pour 2 repas",0.5,"Oui","2021-02-01"]
["LSLM","LSLM14","Riz","Lundi et mardi soirs","25 grammes pour 1 repas",25,"Oui","2021-02-01"]
["LSMJ","LSMJ01","Macédoine de légumes","Mercredi et jeudi soirs","1 boîte pour 2 repas",0.5,"Oui","2021-02-01"]
["LSMJ","LSMJ02","Petits pois","Mercredi et jeudi soirs","1 boîte pour 2 repas",0.5,"Oui","2021-02-01"]
["LSMJ","LSMJ03","Petits pois et jeunes carottes","Mercredi et jeudi soirs","1 boîte pour 2 repas",0.5,"Oui","2021-02-01"]
["LSMJ","LSMJ04","Ratatouille","Mercredi et jeudi soirs","1 boîte pour 2 repas",0.5,"Oui","2021-02-01"]
["LSMJ","LSMJ05","Raviolis","Mercredi et jeudi soirs","1 boîte pour 2 repas",0.5,"Oui","2021-02-01"]
["LSMJ","LSMJ06","Tomates pelées","Mercredi et jeudi soirs","1 boîte pour 2 repas",0.5,"Oui","2021-02-01"]
["LSV","LSV01","Asperges","Vendredi soir","1 bocal ou 1 boîte pour 1 repas",1,"Oui","2021-02-01"]
["LSV","LSV02","Avocat","Vendredi soir","Unité : 1 pour 1 repas",1,"Oui","2021-02-01"]
["LSV","LSV03","Betterave rouge","Vendredi soir","1 paquet pour 5 repas (betteraves rouges)",1,"Oui","2021-02-01"]
["LSV","LSV04","Carottes","Vendredi soir","Unité : 2 pour 1 repas",2,"Oui","2021-02-01"]
["LSV","LSV05","Céleri","Vendredi soir","Unité : 1 branche pour 1 repas",1,"Oui","2021-02-01"]
["LSV","LSV06","Champignons","Vendredi soir","1 boîte pour 1 repas",1,"Oui","2021-02-01"]
["LSV","LSV07","Concombre","Vendredi soir","Unité : 1 pour 1 repas",1,"Oui","2021-02-01"]
["LSV","LSV08","Radis","Vendredi soir","1 botte ou 1 sachet pour 1 repas",1,"Oui","2021-02-01"]
["LSV","LSV09","Salade","Vendredi soir","Unité : 1 tête par repas (pack de 3 têtes)",1,"Oui","2021-02-01"]
["LSV","LSV10","Salsifis","Vendredi soir","1 boîte pour 1 repas",1,"Oui","2021-02-01"]
["LSV","LSV11","Tomates ","Vendredi soir","Unité : 2 pour 1 repas",2,"Oui","2021-02-01"]
["LWED","LWED01","Asperges","Dimanche soir","1 boîte pour 1 repas",1,"Oui","2021-02-01"]
["LWED","LWED02","Chips","Dimanche midi et soir","1 sachet pour 2 repas",1,"Oui","2021-02-01"]
["LWED","LWED03","Frites","Dimanche midi","20 frites pour 1 repas",20,"Oui","2021-02-01"]
["LWED","LWED04","Haricots verts","Dimanche midi et soir","1 boîte pour 2 repas",1,"Oui","2021-02-01"]
["LWES","LWES01","Pâtes à la sauce tomates","Samedi midi et soir","5 cuillères pour 1 repas",10,"Oui","2021-02-01"]
["LWES","LWES02","Pâtes au beurre","Samedi midi et soir","5 cuillères pour 1 repas",10,"Oui","2021-02-01"]
["LWES","LWES03","Pâtes au fromage râpé","Samedi midi et soir","5 cuillères pour 1 repas",10,"Oui","2021-02-01"]
["VMR","VMR01","Rôti d'agneau","Lundi à vendredi midis","1 morceau de 500 grammes pour 5 repas",100,"Oui","2021-02-01"]
["VMR","VMR02","Rôti de bœuf","Lundi à vendredi midis","1 morceau de 500 grammes pour 5 repas",100,"Oui","2021-02-01"]
["VMR","VMR03","Rôti de cheval","Lundi à vendredi midis","1 morceau de 500 grammes pour 5 repas",100,"Oui","2021-02-01"]
["VMR","VMR04","Rôti de porc","Lundi à vendredi midis","1 morceau de 500 grammes pour 5 repas",100,"Oui","2021-02-01"]
["VMR","VMR05","Rôti de veau","Lundi à vendredi midis","1 morceau de 500 grammes pour 5 repas",100,"Oui","2021-02-01"]
["VS","VS01","Bifteck haché de bœuf","Lundi à dimanche soirs","1 paquet pour 2 repas",1,"Oui","2021-02-01"]
["VS","VS02","Bifteck haché de cheval","Lundi à dimanche soirs","1 paquet pour 2 repas",125,"Oui","2021-02-01"]
["VS","VS03","Bifteck haché de veau","Lundi à dimanche soirs","1 paquet pour 2 repas",1,"Oui","2021-02-01"]
["VS","VS04","Bouchée à la reine","Lundi à dimanche soirs","1 boîte pour 2 repas",1,"Oui","2021-02-01"]
["VS","VS05","Boudin","Lundi à dimanche soirs","1 paquet pour 2 repas",0.5,"Oui","2021-02-01"]
["VS","VS06","Cervelas","Lundi à dimanche soirs","1 paquet pour 2 repas",0.5,"Oui","2021-02-01"]
["VS","VS07","Cœur","Lundi à dimanche soirs","1 paquet pour 2 repas",1,"Oui","2021-02-01"]
["VS","VS08","Croque-monsieur","Lundi à dimanche soirs","1 boîte pour 2 repas",1,"Oui","2021-02-01"]
["VS","VS09","Foie","Lundi à dimanche soirs","1 paquet pour 2 repas",1,"Oui","2021-02-01"]
["VS","VS10","Fromage de tête","Lundi à dimanche soirs","1 tranche pour 2 repas",0.5,"Oui","2021-02-01"]
["VS","VS11","Jambon","Lundi à dimanche soirs","1 paquet pour 2 repas",0.5,"Oui","2021-02-01"]
["VS","VS12","Jambonneau","Lundi à dimanche soirs","1 paquet pour 2 repas",0.5,"Oui","2021-02-01"]
["VS","VS13","Mortadelle","Lundi à dimanche soirs","1 paquet pour 2 repas",0.5,"Oui","2021-02-01"]
["VS","VS14","Œufs","Lundi à dimanche soirs","1 boîte de 6 œufs. 3 œufs par repas",3,"Oui","2021-02-01"]
["VS","VS15","Pizza","Lundi à dimanche soirs","1 paquet pour 2 repas",0.5,"Oui","2021-02-01"]
["VS","VS16","Poisson","Lundi à dimanche soirs","Unité : 1 pour 1 repas",1,"Oui","2021-02-01"]
["VS","VS17","Quiche lorraine","Lundi à dimanche soirs","1 boîte pour 2 repas",1,"Oui","2021-02-01"]
["VS","VS18","Roulade à la pistache","Lundi à dimanche soirs","3 tranches pour 1 repas",3,"Oui","2021-02-01"]
["VS","VS19","Roulé au fromage","Lundi à dimanche soirs","1 boîte pour 2 repas",1,"Oui","2021-02-01"]
["VS","VS20","Salami","Lundi à dimanche soirs","1 paquet pour 2 repas",0.5,"Oui","2021-02-01"]
["VS","VS21","Saucisses","Lundi à dimanche soirs","1 paquet pour 2 repas : 1 ou 2 saucisses par repas",0.5,"Oui","2021-02-01"]
["VS","VS22","Saucisson","Lundi à dimanche soirs","1 morceau de 400 grammes (Leclerc) pour 3 repas",5,"Oui","2021-02-01"]
["VS","VS23","Tête persillée","Lundi à dimanche soirs","1 tranche pour 2 repas",0.5,"Oui","2021-02-01"]
["VS","VS24","Tête roulée","Lundi à dimanche soirs","3 tranches pour 1 repas",3,"Oui","2021-02-01"]
["VS","VS25","Thon","Lundi à dimanche soirs","1 boîte pour 1 repas",1,"Oui","2021-02-01"]
["VS","VS26","Viande cassoulet","Lundi et mardi soirs","1 boîte pour 2 repas",0.5,"Oui","2021-02-01"]
["VS","VS27","Viande choucroute","Lundi et mardi soirs","1 boîte pour 2 repas",0.5,"Oui","2021-02-01"]
["VS","VS28","Viande paella","Lundi et mardi soirs","1 boîte pour 2 repas",0.5,"Oui","2021-02-01"]
["VWE","VWE01","Agneau","Samedi et dimanche midis","1 tranche pour 1 repas",1,"Oui","2021-02-01"]
["VWE","VWE02","Bœuf","Samedi et dimanche midis","1 tranche pour 1 repas",1,"Oui","2021-02-01"]
["VWE","VWE03","Cheval","Samedi et dimanche midis","1 tranche pour 1 repas",1,"Oui","2021-02-01"]
["VWE","VWE04","Dinde","Samedi et dimanche midis","1 tranche pour 1 repas",1,"Oui","2021-02-01"]
["VWE","VWE05","Poisson","Samedi et dimanche midis","Unité : 1 pour 1 repas",1,"Oui","2021-02-01"]
["VWE","VWE06","Porc","Samedi et dimanche midis","1 tranche pour 1 repas",1,"Oui","2021-02-01"]
["VWE","VWE07","Veau","Samedi et dimanche midis","1 tranche pour 1 repas",1,"Oui","2021-02-01"]

{"sheet":"Création produit","index":3,"n_rows":12,"n_cols":5,"rows_kept":12,"cut":false,"hidden":false,"merged":[]}
["Création produit"]
[]
["Catégorie","DMR",null,"Légende de couleurs"]
["Nature",{"$f":"IFERROR(VLOOKUP(CelCPCatégorie,TabCA[],3,FALSE),\"\")","v":"Aliments midi retraite dessert"},null,"jaune","à renseigner"]
["Code produit","DMR01",null,"gris","formule, ne pas modifier"]
["Nom produit",{"$f":"IFERROR(VLOOKUP(CelCPCodeProduit,INDIRECT(\"Tab\"&CelCPCatégorie),2,FALSE),\"\")","v":"Pomme"}]
["Conditionnement"]
["Jour"]
["Quantité par jour"]
["Destination",{"$f":"IFERROR(VLOOKUP(CelCPCatégorie,TabCA[],2,FALSE),\"\")","v":"Aliments midi retraite"}]
["A modifier","Oui"]
["Date création",{"$f":"TODAY()","v":"2021-03-18"}]

{"sheet":"Modification produit","index":4,"n_rows":12,"n_cols":5,"rows_kept":12,"cut":false,"hidden":false,"merged":[]}
["Modification produit"]
[]
["Catégorie","DMR",null,"Légende de couleurs"]
["Nature",{"$f":"IFERROR(VLOOKUP(CelMPCatégorie,TabCA[],3,FALSE),\"\")","v":"Aliments midi retraite dessert"},null,"jaune","à renseigner"]
["Code produit","DMR01",null,"gris","formule, ne pas modifier"]
["Nom produit",{"$f":"IFERROR(VLOOKUP(CelMPCodeProduit,INDIRECT(\"Tab\"&CelMPCatégorie),2,FALSE),\"\")","v":"Pomme"}]
["Conditionnement","1 sachet de 1500 grammes, 2000 grammes ou 3000 grammes : 1 pomme pour 1 repas"]
["Jour","Lundi à vendredi midis"]
["Quantité par jour",1]
["Destination",{"$f":"IFERROR(VLOOKUP(CelMPCatégorie,TabCA[],2,FALSE),\"\")","v":"Aliments midi retraite"}]
["A modifier","Oui"]
["Date modification","2021-02-01"]