{"text_format":"1","workbook":"xlsx","n_sheets":6,"sheets":["Random","Heure Arrivée Camion","LTRU","Regroupement","Reg Camion","Conso moyen"],"not_rendered":{"charts":0,"images":0,"macros":1,"external_links":2,"defined_names":1,"comments":2,"pivot_tables":0},"unopened":[],"bounds":{"document_bytes":16777216,"sheet_cells":100000,"rows_first":2000,"rows_last":500,"rows_between":2000,"halvings":0,"cell_chars":16384,"cell_head_chars":4096},"cells_cut":0,"cells_raw":0,"read":"whole","date_system":"1900"}

{"sheet":"Random","index":0,"n_rows":7,"n_cols":9,"rows_kept":7,"cut":false,"hidden":false,"merged":[]}
["11:01:17","Nombre Kits","Nombre Regroupements"]
[null,{"$f":"MAX('Reg Camion'!C:C)","v":16},{"$f":"MAX('Reg Camion'!D:D)-1","v":0},null,null,{"$f":"NOW()","v":"2021-04-29T19:46:24.150"},{"$f":"INT(F2)","v":"2021-04-29"}]
[null,null,null,null,null,"Heure Actuelle",{"$f":"F2-G2","v":"19:46:24.150"},null,"00:30:00"]
[null,null,null,null,null,"Heure Prochain Camion",{"$f":"IF(G3<'Heure Arrivée Camion'!C3,'Heure Arrivée Camion'!C3,IF(G3<'Heure Arrivée Camion'!C4,'Heure Arrivée Camion'!C4,IF(G3<'Heure Arrivée Camion'!C5,'Heure Arrivée Camion'!C5,IF(G3<'Heure Arrivée Camion'!C6,'Heure Arrivée Camion'!C6,IF(G3<'Heure Arrivée Camion'!C7,'Heure Arrivée Camion'!C7,IF(G3<'Heure Arrivée Camion'!C8,'Heure Arrivée Camion'!C8,IF(G3<'Heure Arrivée Camion'!C9,'Heure Arrivée Camion'!C9,IF(G3<'Heure Arrivée Camion'!C10,'Heure Arrivée Camion'!C10,IF(G3<'Heure Arrivée Camion'!C11,'Heure Arrivée Camion'!C11,IF(G3<'Heure Arrivée Camion'!C12,'Heure Arrivée Camion'!C12,\"Demain à 06:05\"))))))))))","v":"20:15:00"},"Heure Reintialisation","19:43:00"]
[]
[null,"Regroupements à controler"]
[null,{"$f":"INDEX('Reg Camion'!B:B,MATCH('Reg Camion'!F2,'Reg Camion'!D:D,0))","v":{"$error":"#NUM!"}}]

{"sheet":"Heure Arrivée Camion","index":1,"n_rows":12,"n_cols":4,"rows_kept":12,"cut":false,"hidden":false,"merged":[]}
[]
[null,"Numero Camion Logi","Camion Logistiport","Intervalle"]
[null,1,"06:05:00"]
[null,2,"07:35:00",{"$f":"C4-C3","v":"01:30:00"}]
[null,3,"09:05:00",{"$f":"C5-C4","v":"01:30:00"}]
[null,4,"11:00:00","01:55:00"]
[null,5,"12:30:00","01:30:00"]
[null,6,"13:50:00","01:20:00"]
[null,7,"15:20:00","01:30:00"]
[null,8,"16:50:00","01:30:00"]
[null,9,"18:45:00","01:55:00"]
[null,10,"20:15:00","01:30:00"]

{"sheet":"LTRU","index":2,"n_rows":17,"n_cols":10,"rows_kept":17,"cut":false,"hidden":false,"merged":[]}
["A","A","A","A","A","A","A","A","A","A"]
["A","A","A","A","A","A","A","A","A","A"]
["A","A","A","A","A","A","A","A","A","A"]
["A","A","A","A","A","A","A","A","A","A"]
["A","A","A","A","A","A","A","A","A","A"]
["A","A","A","A","A","A","A","A","A","A"]
["A","A","A","A","A","A","A","A","A","A"]
["A","A","A","A","A","A","A","A","A","A"]
["A","A","A","A","A","A","A","A","A","A"]
["A","A","A","A","A","A","A","A","A","A"]
["A","A","A","A","A","A","A","A","A","A"]
["A","A","A","A","A","A","A","A","A","A"]
["A","A","A","A","A","A","A","A","A","A"]
["A","A","A","A","A","A","A","A","A","A"]
["A","A","A","A","A","A","A","A","A","A"]
["A","A","A","A","A","A","A","A","A","A"]
["A","A","A","A","A","A","A","A","A","A"]

{"sheet":"Regroupement","index":3,"n_rows":397,"n_cols":38,"rows_kept":397,"cut":false,"hidden":false,"merged":[]}
["Tri Livrable","Tri Revue","Block","Station","N°LIVRABLE","Responsabilité PP","Priorité","Buffer / direct ligne","Format","Commentaire affichage ","Porte de livraison","Lieu de stockage 3PL","N° opération","N°OP oracle","PLL","Sequencement","n° livrable bis","Nom OP","H","Ref Kit B","Ref Kit C","Part Presentation M1","Part Presentation M2","Part Presentation M3","Mallette","Station Bis","Verif tracking","ref KIT à créer","doublons","Num PP ","NB","PP & nb","Num OP","DEPARTMENT","Department&OP","WIP ?","Recherche wip","2021-04-13"]
[289,1,"GENE2","G2","B4-R28","KPO","P1","Buffer","80X250","1 PAL + Joint",10,"Logistiport",13007,261,{"$f":"COUNTIF(M:M,M2)","v":1},"NA",{"$f":"E2","v":"B4-R28"},"Montage du joint des raidisseurs","KIT.13007A",null,null,"OK","OK","OK",null,{"$f":"D2","v":"G2"},{"$f":"VLOOKUP(S2,'[1]Extraction Tracking 2905'!D:D,1,FALSE)","v":"KIT.13007A"},null,{"$f":"COUNTIF(M:M,M2)","v":1},{"$f":"Q2","v":"B4-R28"},1,{"$f":"AD2&AE2","v":"B4-R281"},{"$f":"M2","v":13007},{"$f":"VLOOKUP(C2,[2]Feuil2!A:B,2,FALSE)","v":"BLKGEN2"},{"$f":"N2&AH2","v":"261BLKGEN2"},{"$f":"VLOOKUP(Regroupement!AI2,[2]Wip!AC:AC,1,FALSE)","v":"261BLKGEN2"},{"$f":"VLOOKUP(AI2,[2]Wip!AC:AC,1,FALSE)","v":"261BLKGEN2"}]
[291,2,"GENE2","G2","B4-R28","KPO","P1","Buffer","80X250","1 PAL + Joint",10,"Logistiport",13008,301,2,"NA",{"$f":"E3","v":"B4-R28"},"Montage des 4 raidisseurs","KIT.13008A1",null,null,"OK","OK","OK","Mallette",{"$f":"D3","v":"G2"},{"$f":"VLOOKUP(S3,'[1]Extraction Tracking 2905'!D:D,1,FALSE)","v":"KIT.13008A1"},null,2,"B4-R28",2,"B4-R282",13008,{"$f":"VLOOKUP(C3,[2]Feuil2!A:B,2,FALSE)","v":"BLKGEN2"},{"$f":"N3&AH3","v":"301BLKGEN2"},{"$f":"VLOOKUP(Regroupement!AI3,[2]Wip!AC:AC,1,FALSE)","v":"301BLKGEN2"},{"$f":"VLOOKUP(AI3,[2]Wip!AC:AC,1,FALSE)","v":"301BLKGEN2"}]
[292,3,"GENE2","G2","B4-R29","Support fournisseur",null,"Direct ligne",null,"Stiffeners",2,"Tamaris",13008,302,2,"NA","B4-R29","Montage des 4 raidisseurs","KIT.13008A2",null,null,"Support fournisseur","Support fournisseur","Support fournisseur","Mallette","G2",{"$f":"VLOOKUP(S4,'[1]Extraction Tracking 2905'!D:D,1,FALSE)","v":"KIT.13008A2"},null,2,"B4-R29",{"$f":"IF(AD4=AD3,AE3+1,1)","v":1},"B4-R291",13008,{"$f":"VLOOKUP(C4,[2]Feuil2!A:B,2,FALSE)","v":"BLKGEN2"},"302BLKGEN2",{"$f":"VLOOKUP(Regroupement!AI4,[2]Wip!AC:AC,1,FALSE)","v":"302BLKGEN2"},{"$f":"VLOOKUP(AI4,[2]Wip!AC:AC,1,FALSE)","v":"302BLKGEN2"}]
[293,4,"GENE2","G2","B4-R30","KPO","P1","Buffer","80X120","1 PAL + Balais",10,"Logistiport",11045,161,1,"NA","B4-R30","Montage des balais extérieurs","KIT.11045A",null,null,"OK","OK","OK","Mallette","G2",{"$f":"VLOOKUP(S5,'[1]Extraction Tracking 2905'!D:D,1,FALSE)","v":"KIT.11045A"},null,1,"B4-R30",1,"B4-R301",11045,{"$f":"VLOOKUP(C5,[2]Feuil2!A:B,2,FALSE)","v":"BLKGEN2"},"161BLKGEN2",{"$f":"VLOOKUP(Regroupement!AI5,[2]Wip!AC:AC,1,FALSE)","v":"161BLKGEN2"},{"$f":"VLOOKUP(AI5,[2]Wip!AC:AC,1,FALSE)","v":"161BLKGEN2"}]
[295,5,"GENE2","G2","B4-R30","KPO",null,"Buffer","80X120",null,10,"Logistiport",13006,221,1,"NA",{"$f":"E6","v":"B4-R30"},"Connexion électrique boite HT","Mallette13006",null,null,"OK","OK","OK","Mallette Uniquement",{"$f":"D6","v":"G2"},{"$f":"VLOOKUP(S6,'[1]Extraction Tracking 2905'!D:D,1,FALSE)","v":{"$error":"#N/A"}},null,1,"B4-R30",2,"B4-R302",13006,{"$f":"VLOOKUP(C6,[2]Feuil2!A:B,2,FALSE)","v":"BLKGEN2"},"221BLKGEN2",{"$f":"VLOOKUP(Regroupement!AI6,[2]Wip!AC:AC,1,FALSE)","v":"221BLKGEN2"},{"$f":"VLOOKUP(AI6,[2]Wip!AC:AC,1,FALSE)","v":"221BLKGEN2"}]
[287,6,"GENE2","G2","B4-R30","KPO",null,"Buffer","80X120",null,10,"Logistiport",13028,351,1,"NA",{"$f":"E7","v":"B4-R30"},"Montage des bouteilles sur roulement","KIT.13028A",null,null,"OK","OK","OK","Mallette",{"$f":"D7","v":"G2"},{"$f":"VLOOKUP(S7,'[1]Extraction Tracking 2905'!D:D,1,FALSE)","v":"KIT.13028A"},null,1,"B4-R30",3,"B4-R303",13028,{"$f":"VLOOKUP(C7,[2]Feuil2!A:B,2,FALSE)","v":"BLKGEN2"},"351BLKGEN2",{"$f":"VLOOKUP(Regroupement!AI7,[2]Wip!AC:AC,1,FALSE)","v":"351BLKGEN2"},{"$f":"VLOOKUP(AI7,[2]Wip!AC:AC,1,FALSE)","v":"351BLKGEN2"}]
[null,7,"GENE2","G2","B4-R30","KPO",null,"Buffer","80X120",null,10,"Logistiport",13026,121,1,"NA",{"$f":"E8","v":"B4-R30"},"Serrage du roulement sur le stator","KIT.13026A",null,null,"OK","OK","OK","Mallette",{"$f":"D8","v":"G2"},{"$f":"VLOOKUP(S8,'[1]Extraction Tracking 2905'!D:D,1,FALSE)","v":{"$error":"#N/A"}},null,1,"B4-R30",4,"B4-R304",13026,{"$f":"VLOOKUP(C8,[2]Feuil2!A:B,2,FALSE)","v":"BLKGEN2"},"121BLKGEN2",{"$f":"VLOOKUP(Regroupement!AI8,[2]Wip!AC:AC,1,FALSE)","v":"121BLKGEN2"},{"$f":"VLOOKUP(AI8,[2]Wip!AC:AC,1,FALSE)","v":"121BLKGEN2"}]
[296,8,"GENE2","G2","B4-R31","KPO",null,"Buffer","80X120",null,10,"Logistiport",13004,311,1,"NA","B4-R31","Réglage des capteurs axiaux et locking pin et montage de la PT100 roulement","KIT.13004A",null,null,"OK","OK","OK","Mallette","G2",{"$f":"VLOOKUP(S9,'[1]Extraction Tracking 2905'!D:D,1,FALSE)","v":"KIT.13004A"},null,1,"B4-R31",1,"B4-R311",13004,{"$f":"VLOOKUP(C9,[2]Feuil2!A:B,2,FALSE)","v":"BLKGEN2"},"311BLKGEN2",{"$f":"VLOOKUP(Regroupement!AI9,[2]Wip!AC:AC,1,FALSE)","v":"311BLKGEN2"},{"$f":"VLOOKUP(AI9,[2]Wip!AC:AC,1,FALSE)","v":"311BLKGEN2"}]
[297,9,"GENE2","G2","B4-R31","KPO",null,"Buffer","80X120",null,10,"Logistiport",13012,241,1,"NA","B4-R31","Montage porte trou d'homme","KIT.13012A",null,null,"OK","OK","OK","Mallette","G2",{"$f":"VLOOKUP(S10,'[1]Extraction Tracking 2905'!D:D,1,FALSE)","v":"KIT.13012A"},null,1,"B4-R31",2,"B4-R312",13012,{"$f":"VLOOKUP(C10,[2]Feuil2!A:B,2,FALSE)","v":"BLKGEN2"},"241BLKGEN2",{"$f":"VLOOKUP(Regroupement!AI10,[2]Wip!AC:AC,1,FALSE)","v":"241BLKGEN2"},{"$f":"VLOOKUP(AI10,[2]Wip!AC:AC,1,FALSE)","v":"241BLKGEN2"}]
[298,10,"GENE2","G2","B4-R31","KPO",null,"Buffer","80X120",null,10,"Logistiport",13013,511,2,"NA","B4-R31","Montage des 4 parties du donuts ext","KIT.13013A1",null,null,"OK","OK","OK","Mallette","G2",{"$f":"VLOOKUP(S11,'[1]Extraction Tracking 2905'!D:D,1,FALSE)","v":"KIT.13013A1"},null,2,"B4-R31",3,"B4-R313",13013,{"$f":"VLOOKUP(C11,[2]Feuil2!A:B,2,FALSE)","v":"BLKGEN2"},"511BLKGEN2",{"$f":"VLOOKUP(Regroupement!AI11,[2]Wip!AC:AC,1,FALSE)","v":"511BLKGEN2"},{"$f":"VLOOKUP(AI11,[2]Wip!AC:AC,1,FALSE)","v":"511BLKGEN2"}]
[299,11,"GENE2","G2","B4-R32","Support fournisseur",null,"Direct ligne",null,"Donuts",2,"Chantenay",13013,512,2,"NA","B4-R32","Montage des 4 parties du donuts ext","KIT.13013A2",null,null,"Support fournisseur","Support fournisseur","Support fournisseur","Mallette","G2",{"$f":"VLOOKUP(S12,'[1]Extraction Tracking 2905'!D:D,1,FALSE)","v":"KIT.13013A2"},null,2,"B4-R32",1,"B4-R321",13013,{"$f":"VLOOKUP(C12,[2]Feuil2!A:B,2,FALSE)","v":"BLKGEN2"},"512BLKGEN2",{"$f":"VLOOKUP(Regroupement!AI12,[2]Wip!AC:AC,1,FALSE)","v":"512BLKGEN2"},{"$f":"VLOOKUP(AI12,[2]Wip!AC:AC,1,FALSE)","v":"512BLKGEN2"}]
[300,12,"GENE2","G2","B4-R33","KPO","P1","Buffer","80X120","1 PAL + Balais",10,"Logistiport",13009,171,1,"NA","B4-R33","Montage des tôles entrefer","KIT.13009A",null,null,"OK","OK","OK","Mallette","G2",{"$f":"VLOOKUP(S13,'[1]Extraction Tracking 2905'!D:D,1,FALSE)","v":"KIT.13009A"},null,1,"B4-R33",1,"B4-R331",13009,{"$f":"VLOOKUP(C13,[2]Feuil2!A:B,2,FALSE)","v":"BLKGEN2"},"171BLKGEN2",{"$f":"VLOOKUP(Regroupement!AI13,[2]Wip!AC:AC,1,FALSE)","v":"171BLKGEN2"},{"$f":"VLOOKUP(AI13,[2]Wip!AC:AC,1,FALSE)","v":"171BLKGEN2"}]
[301,13,"GENE2","G2","B4-R33","KPO","P1","Buffer","80X120","1 PAL + Balais",10,"Logistiport",13010,201,1,"NA","B4-R33","Montage de trappes raidisseurs","KIT.13010A",null,null,"OK","OK","OK","Mallette","G2",{"$f":"VLOOKUP(S14,'[1]Extraction Tracking 2905'!D:D,1,FALSE)","v":"KIT.13010A"},null,1,"B4-R33",2,"B4-R332",13010,{"$f":"VLOOKUP(C14,[2]Feuil2!A:B,2,FALSE)","v":"BLKGEN2"},"201BLKGEN2",{"$f":"VLOOKUP(Regroupement!AI14,[2]Wip!AC:AC,1,FALSE)","v":"201BLKGEN2"},{"$f":"VLOOKUP(AI14,[2]Wip!AC:AC,1,FALSE)","v":"201BLKGEN2"}]
[302,14,"GENE2","G2","B4-R33","KPO","P1","Buffer","80X120","1 PAL + Balais",10,"Logistiport",13011,231,1,"NA","B4-R33","Montage des balais sur les raidisseurs","KIT.13011A",null,null,"OK","OK","OK","Mallette","G2",{"$f":"VLOOKUP(S15,'[1]Extraction Tracking 2905'!D:D,1,FALSE)","v":"KIT.13011A"},null,1,"B4-R33",3,"B4-R333",13011,{"$f":"VLOOKUP(C15,[2]Feuil2!A:B,2,FALSE)","v":"BLKGEN2"},"231BLKGEN2",{"$f":"VLOOKUP(Regroupement!AI15,[2]Wip!AC:AC,1,FALSE)","v":"231BLKGEN2"},{"$f":"VLOOKUP(AI15,[2]Wip!AC:AC,1,FALSE)","v":"231BLKGEN2"}]
[305,15,"GENE2","G3","B4-R35","KPO",null,"Buffer",null,null,10,"Logistiport",13015,1201,1,"NA","B4-R35","Montage RIPWIRE sur donut's extérieurs","KIT.13015A",null,null,"OK","OK","OK","Mallette","G3",{"$f":"VLOOKUP(S16,'[1]Extraction Tracking 2905'!D:D,1,FALSE)","v":"KIT.13015A"},null,1,"B4-R35",1,"B4-R351",13015,{"$f":"VLOOKUP(C16,[2]Feuil2!A:B,2,FALSE)","v":"BLKGEN2"},"1201BLKGEN2",{"$f":"VLOOKUP(Regroupement!AI16,[2]Wip!AC:AC,1,FALSE)","v":"1201BLKGEN2"},{"$f":"VLOOKUP(AI16,[2]Wip!AC:AC,1,FALSE)","v":"1201BLKGEN2"}]
[306,16,"GENE2","G3","B4-R35","KPO",null,"Buffer",null,null,10,"Logistiport",13017,1301,1,"NA","B4-R35","Montage des ceintures","KIT.13017A",null,null,"OK","OK","OK",null,"G3",{"$f":"VLOOKUP(S17,'[1]Extraction Tracking 2905'!D:D,1,FALSE)","v":"KIT.13017A"},null,1,"B4-R35",2,"B4-R352",13017,{"$f":"VLOOKUP(C17,[2]Feuil2!A:B,2,FALSE)","v":"BLKGEN2"},"1301BLKGEN2",{"$f":"VLOOKUP(Regroupement!AI17,[2]Wip!AC:AC,1,FALSE)","v":"1301BLKGEN2"},{"$f":"VLOOKUP(AI17,[2]Wip!AC:AC,1,FALSE)","v":"1301BLKGEN2"}]
[308,17,"GENE2","G3","B4-R35","KPO",null,"Buffer",null,null,10,"Logistiport",13023,1211,1,"NA","B4-R35","Montage des tresses de masse","KIT.13023A",null,null,"OK","OK","OK","Mallette","G3",{"$f":"VLOOKUP(S18,'[1]Extraction Tracking 2905'!D:D,1,FALSE)","v":"KIT.13023A"},null,1,"B4-R35",3,"B4-R353",13023,{"$f":"VLOOKUP(C18,[2]Feuil2!A:B,2,FALSE)","v":"BLKGEN2"},"1211BLKGEN2",{"$f":"VLOOKUP(Regroupement!AI18,[2]Wip!AC:AC,1,FALSE)","v":"1211BLKGEN2"},{"$f":"VLOOKUP(AI18,[2]Wip!AC:AC,1,FALSE)","v":"1211BLKGEN2"}]
[309,18,"GENE2","G3","B4-R35","KPO",null,"Buffer",null,null,10,"Logistiport",15006,1231,1,"NA","B4-R35","Etanchéité des donuts","KIT.15006A",null,null,"OK","OK","OK",null,"G3",{"$f":"VLOOKUP(S19,'[1]Extraction Tracking 2905'!D:D,1,FALSE)","v":"KIT.15006A"},null,1,"B4-R35",4,"B4-R354",15006,{"$f":"VLOOKUP(C19,[2]Feuil2!A:B,2,FALSE)","v":"BLKGEN2"},"1231BLKGEN2",{"$f":"VLOOKUP(Regroupement!AI19,[2]Wip!AC:AC,1,FALSE)","v":"1231BLKGEN2"},{"$f":"VLOOKUP(AI19,[2]Wip!AC:AC,1,FALSE)","v":"1231BLKGEN2"}]
[null,19,"GENE2","G3","B4-R35","KPO","P1","Buffer","80X250","1 PAL + Joint",10,"Logistiport",13021,1141,1,"NA",{"$f":"E20","v":"B4-R35"},"Reprise spray et silicone","KIT.13021A",null,null,"OK","OK","OK",null,{"$f":"D20","v":"G3"},{"$f":"VLOOKUP(S20,'[1]Extraction Tracking 2905'!D:D,1,FALSE)","v":{"$error":"#N/A"}},null,1,"B4-R35",5,"B4-R355",13021,{"$f":"VLOOKUP(C20,[2]Feuil2!A:B,2,FALSE)","v":"BLKGEN2"},"1141BLKGEN2",{"$f":"VLOOKUP(Regroupement!AI20,[2]Wip!AC:AC,1,FALSE)","v":"1141BLKGEN2"},{"$f":"VLOOKUP(AI20,[2]Wip!AC:AC,1,FALSE)","v":"1141BLKGEN2"}]
[290,20,"GENE2","G3","B4-R35","KPO","P1","Buffer","80X250","1 PAL + Joint",10,"Logistiport",15005,1151,1,"NA",{"$f":"E21","v":"B4-R35"},"Etanchéité raidisseur","KIT.15005A",null,null,"OK","OK","OK",null,{"$f":"D21","v":"G3"},{"$f":"VLOOKUP(S21,'[1]Extraction Tracking 2905'!D:D,1,FALSE)","v":"KIT.15005A"},null,1,"B4-R35",6,"B4-R356",15005,{"$f":"VLOOKUP(C21,[2]Feuil2!A:B,2,FALSE)","v":"BLKGEN2"},"1151BLKGEN2",{"$f":"VLOOKUP(Regroupement!AI21,[2]Wip!AC:AC,1,FALSE)","v":"1151BLKGEN2"},{"$f":"VLOOKUP(AI21,[2]Wip!AC:AC,1,FALSE)","v":"1151BLKGEN2"}]
[310,21,"GENE2","G3","B4-R36","KPO","P1","Buffer","3X80X120","PAL 1/3",10,"Logistiport",13014,1131,2,"NA","B4-R36","Montage des 22 portières donuts","KIT.13014A1",null,null,"OK","OK","OK","Mallette","G3",{"$f":"VLOOKUP(S22,'[1]Extraction Tracking 2905'!D:D,1,FALSE)","v":"KIT.13014A1"},null,2,"B4-R36",1,"B4-R361",13014,{"$f":"VLOOKUP(C22,[2]Feuil2!A:B,2,FALSE)","v":"BLKGEN2"},"1131BLKGEN2",{"$f":"VLOOKUP(Regroupement!AI22,[2]Wip!AC:AC,1,FALSE)","v":"1131BLKGEN2"},{"$f":"VLOOKUP(AI22,[2]Wip!AC:AC,1,FALSE)","v":"1131BLKGEN2"}]
[311,22,"GENE2","G3","B4-R37","Idea","P1","Buffer",null,"Plaque IP 68",2,"Logistiport",13014,1132,2,"NA","B4-R37","Montage des 22 portières donuts","KIT.13014A2",null,null,"OK","OK","OK","Mallette","G3",{"$f":"VLOOKUP(S23,'[1]Extraction Tracking 2905'!D:D,1,FALSE)","v":"KIT.13014A2"},null,2,"B4-R37",1,"B4-R371",13014,{"$f":"VLOOKUP(C23,[2]Feuil2!A:B,2,FALSE)","v":"BLKGEN2"},"1132BLKGEN2",{"$f":"VLOOKUP(Regroupement!AI23,[2]Wip!AC:AC,1,FALSE)","v":"1132BLKGEN2"},{"$f":"VLOOKUP(AI23,[2]Wip!AC:AC,1,FALSE)","v":"1132BLKGEN2"}]
[null,23,"GENE2","G3","B4-R38","KPO",null,"Buffer",null,null,10,"Logistiport",15004,3141,1,"NA","B4-R38","Etanchéité bouchon plot stator","KIT.15004A",null,null,"OK","OK","OK",null,"G3",{"$f":"VLOOKUP(S24,'[1]Extraction Tracking 2905'!D:D,1,FALSE)","v":"KIT.15004A"},null,1,"B4-R38",1,"B4-R381",15004,{"$f":"VLOOKUP(C24,[2]Feuil2!A:B,2,FALSE)","v":"BLKGEN2"},"3141BLKGEN2",{"$f":"VLOOKUP(Regroupement!AI24,[2]Wip!AC:AC,1,FALSE)","v":{"$error":"#N/A"}},{"$f":"VLOOKUP(AI24,[2]Wip!AC:AC,1,FALSE)","v":{"$error":"#N/A"}}]
[313,24,"GENE2","G5","B4-R39","Support fournisseur",null,"Buffer",null,null,10,"Logistiport",30260,3401,1,"NA","B4-R39","Serrage union BI-Stator, placer des bouchons dans les trous des pions.","KIT.30260A",null,null,"OK","OK","OK",null,"G5",{"$f":"\"KIT\"&M25&\"A\"","v":"KIT30260A"},null,1,"B4-R39",1,"B4-R391",30260,{"$f":"VLOOKUP(C25,[2]Feuil2!A:B,2,FALSE)","v":"BLKGEN2"},"3401BLKGEN2",{"$f":"VLOOKUP(Regroupement!AI25,[2]Wip!AC:AC,1,FALSE)","v":"3401BLKGEN2"},{"$f":"VLOOKUP(AI25,[2]Wip!AC:AC,1,FALSE)","v":"3401BLKGEN2"}]
[315,25,"GENE2","G5","B4-R40","KPO",null,"Buffer",null,null,10,"Logistiport",94427,2701,1,"NA","B4-R40","Montage des pions de centrage sur le stator du générateur","KIT.94427A",null,null,"OK","OK","OK",null,"G5",{"$f":"VLOOKUP(S26,'[1]Extraction Tracking 2905'!D:D,1,FALSE)","v":{"$error":"#N/A"}},null,1,"B4-R40",1,"B4-R401",94427,{"$f":"VLOOKUP(C26,[2]Feuil2!A:B,2,FALSE)","v":"BLKGEN2"},"2701BLKGEN2",{"$f":"VLOOKUP(Regroupement!AI26,[2]Wip!AC:AC,1,FALSE)","v":"2701BLKGEN2"},{"$f":"VLOOKUP(AI26,[2]Wip!AC:AC,1,FALSE)","v":"2701BLKGEN2"}]
[null,26,"GENE2","G5","B4-R40","KPO",null,"Buffer",null,null,10,"Logistiport",15003,3701,1,"NA","B4-R40","Fixation de la plaque signaletique pour machine europeenne","KIT.15003A",null,null,"OK","OK","OK","Mallette","G5",{"$f":"VLOOKUP(S27,'[1]Extraction Tracking 2905'!D:D,1,FALSE)","v":"KIT.15003A"},null,1,"B4-R40",2,"B4-R402",15003,{"$f":"VLOOKUP(C27,[2]Feuil2!A:B,2,FALSE)","v":"BLKGEN2"},"3701BLKGEN2",{"$f":"VLOOKUP(Regroupement!AI27,[2]Wip!AC:AC,1,FALSE)","v":"3701BLKGEN2"},{"$f":"VLOOKUP(AI27,[2]Wip!AC:AC,1,FALSE)","v":"3701BLKGEN2"}]
[null,27,"GENE2","G5","B4-R40","KPO",null,"Buffer",null,null,10,"Logistiport",15002,3151,1,"NA",{"$f":"E28","v":"B4-R40"},"Demontage des blocs ceintures","KIT.15002A",null,null,"OK","OK","OK",null,{"$f":"D28","v":"G5"},null,null,1,"B4-R40",3,"B4-R403",15002,{"$f":"VLOOKUP(C28,[2]Feuil2!A:B,2,FALSE)","v":"BLKGEN2"},"3151BLKGEN2",{"$f":"VLOOKUP(Regroupement!AI28,[2]Wip!AC:AC,1,FALSE)","v":"3151BLKGEN2"},{"$f":"VLOOKUP(AI28,[2]Wip!AC:AC,1,FALSE)","v":"3151BLKGEN2"}]
[null,28,"GENE2","G5","MOD BI",null,null,null,null,null,1,"TGO",30222,3111,1,"NA",{"$f":"E29","v":"MOD BI"},"Premontage bati intermediaire_Levage du BI prepare sur la nouvelle embase de transport",null,null,null,"OK","OK","OK","Mallette Uniquement",{"$f":"D29","v":"G5"},null,null,1,"MOD BI",1,"MOD BI1",30222,{"$f":"VLOOKUP(C29,[2]Feuil2!A:B,2,FALSE)","v":"BLKGEN2"},"3111BLKGEN2",{"$f":"VLOOKUP(Regroupement!AI29,[2]Wip!AC:AC,1,FALSE)","v":"3111BLKGEN2"},{"$f":"VLOOKUP(AI29,[2]Wip!AC:AC,1,FALSE)","v":"3111BLKGEN2"}]
[319,29,"GENE2","G5","B4-R41","KPO","P1","Buffer","120X200",null,10,"Logistiport",30700,3811,1,"NA","B4-R41","Montage de la plateforme supériéur du bâti intermediaire","KIT.30700A",null,null,"OK","OK","OK","Mallette","G5",{"$f":"VLOOKUP(S30,'[1]Extraction Tracking 2905'!D:D,1,FALSE)","v":"KIT.30700A"},null,1,"B4-R41",1,"B4-R411",30700,{"$f":"VLOOKUP(C30,[2]Feuil2!A:B,2,FALSE)","v":"BLKGEN2"},"3811BLKGEN2",{"$f":"VLOOKUP(Regroupement!AI30,[2]Wip!AC:AC,1,FALSE)","v":"3811BLKGEN2"},{"$f":"VLOOKUP(AI30,[2]Wip!AC:AC,1,FALSE)","v":"3811BLKGEN2"}]
{"$rows_left_out":368}
{"sheet":"Reg Camion","index":4,"n_rows":49,"n_cols":6,"rows_kept":49,"cut":false,"hidden":false,"merged":[]}
["Kit","Reg","Numéro Kit Camion","Numéro Regroupement Camion",null,"Aléatoire"]
[{"$f":"IF(LTRU!D2=\"\",\"FIN\",LTRU!D2)","v":"A"},{"$f":"IF(A2=\"FIN\",\"0\",INDEX(Regroupement!E:E,MATCH(A2,LTRU!D:D,0)))","v":"N°LIVRABLE"},1,1,null,{"$f":"RANDBETWEEN(1,Random!C2)","v":{"$error":"#NUM!"}}]
[{"$f":"IF(LTRU!D3=\"\",\"FIN\",LTRU!D3)","v":"A"},{"$f":"IF(A3=\"FIN\",\"0\",INDEX(Regroupement!E:E,MATCH(A3,LTRU!D:D,0)))","v":"N°LIVRABLE"},{"$f":"IF(A3<>\"FIN\",C2+1,0)","v":2},{"$f":"IF(A3=\"FIN\",\"0\",IF(B3=B2,D2,D2+1))","v":1}]
[{"$f":"IF(LTRU!D4=\"\",\"FIN\",LTRU!D4)","v":"A"},{"$f":"IF(A4=\"FIN\",\"0\",INDEX(Regroupement!E:E,MATCH(A4,LTRU!D:D,0)))","v":"N°LIVRABLE"},{"$f":"IF(A4<>\"FIN\",C3+1,0)","v":3},1]
[{"$f":"IF(LTRU!D5=\"\",\"FIN\",LTRU!D5)","v":"A"},{"$f":"IF(A5=\"FIN\",\"0\",INDEX(Regroupement!E:E,MATCH(A5,LTRU!D:D,0)))","v":"N°LIVRABLE"},4,1]
[{"$f":"IF(LTRU!D6=\"\",\"FIN\",LTRU!D6)","v":"A"},{"$f":"IF(A6=\"FIN\",\"0\",INDEX(Regroupement!E:E,MATCH(A6,LTRU!D:D,0)))","v":"N°LIVRABLE"},5,1]
[{"$f":"IF(LTRU!D7=\"\",\"FIN\",LTRU!D7)","v":"A"},{"$f":"IF(A7=\"FIN\",\"0\",INDEX(Regroupement!E:E,MATCH(A7,LTRU!D:D,0)))","v":"N°LIVRABLE"},6,1]
[{"$f":"IF(LTRU!D8=\"\",\"FIN\",LTRU!D8)","v":"A"},{"$f":"IF(A8=\"FIN\",\"0\",INDEX(Regroupement!E:E,MATCH(A8,LTRU!D:D,0)))","v":"N°LIVRABLE"},7,1]
[{"$f":"IF(LTRU!D9=\"\",\"FIN\",LTRU!D9)","v":"A"},{"$f":"IF(A9=\"FIN\",\"0\",INDEX(Regroupement!E:E,MATCH(A9,LTRU!D:D,0)))","v":"N°LIVRABLE"},8,1]
[{"$f":"IF(LTRU!D10=\"\",\"FIN\",LTRU!D10)","v":"A"},{"$f":"IF(A10=\"FIN\",\"0\",INDEX(Regroupement!E:E,MATCH(A10,LTRU!D:D,0)))","v":"N°LIVRABLE"},9,1]
[{"$f":"IF(LTRU!D11=\"\",\"FIN\",LTRU!D11)","v":"A"},{"$f":"IF(A11=\"FIN\",\"0\",INDEX(Regroupement!E:E,MATCH(A11,LTRU!D:D,0)))","v":"N°LIVRABLE"},10,1]
[{"$f":"IF(LTRU!D12=\"\",\"FIN\",LTRU!D12)","v":"A"},{"$f":"IF(A12=\"FIN\",\"0\",INDEX(Regroupement!E:E,MATCH(A12,LTRU!D:D,0)))","v":"N°LIVRABLE"},11,1]
[{"$f":"IF(LTRU!D13=\"\",\"FIN\",LTRU!D13)","v":"A"},{"$f":"IF(A13=\"FIN\",\"0\",INDEX(Regroupement!E:E,MATCH(A13,LTRU!D:D,0)))","v":"N°LIVRABLE"},12,1]
[{"$f":"IF(LTRU!D14=\"\",\"FIN\",LTRU!D14)","v":"A"},{"$f":"IF(A14=\"FIN\",\"0\",INDEX(Regroupement!E:E,MATCH(A14,LTRU!D:D,0)))","v":"N°LIVRABLE"},13,1]
[{"$f":"IF(LTRU!D15=\"\",\"FIN\",LTRU!D15)","v":"A"},{"$f":"IF(A15=\"FIN\",\"0\",INDEX(Regroupement!E:E,MATCH(A15,LTRU!D:D,0)))","v":"N°LIVRABLE"},14,1]
[{"$f":"IF(LTRU!D16=\"\",\"FIN\",LTRU!D16)","v":"A"},{"$f":"IF(A16=\"FIN\",\"0\",INDEX(Regroupement!E:E,MATCH(A16,LTRU!D:D,0)))","v":"N°LIVRABLE"},15,1]
[{"$f":"IF(LTRU!D17=\"\",\"FIN\",LTRU!D17)","v":"A"},{"$f":"IF(A17=\"FIN\",\"0\",INDEX(Regroupement!E:E,MATCH(A17,LTRU!D:D,0)))","v":"N°LIVRABLE"},16,1]
[{"$f":"IF(LTRU!D18=\"\",\"FIN\",LTRU!D18)","v":"FIN"},{"$f":"IF(A18=\"FIN\",\"0\",INDEX(Regroupement!E:E,MATCH(A18,LTRU!D:D,0)))","v":"0"},0,"0"]
[{"$f":"IF(LTRU!D19=\"\",\"FIN\",LTRU!D19)","v":"FIN"},{"$f":"IF(A19=\"FIN\",\"0\",INDEX(Regroupement!E:E,MATCH(A19,LTRU!D:D,0)))","v":"0"},0,"0"]
[{"$f":"IF(LTRU!D20=\"\",\"FIN\",LTRU!D20)","v":"FIN"},{"$f":"IF(A20=\"FIN\",\"0\",INDEX(Regroupement!E:E,MATCH(A20,LTRU!D:D,0)))","v":"0"},0,"0"]
[{"$f":"IF(LTRU!D21=\"\",\"FIN\",LTRU!D21)","v":"FIN"},{"$f":"IF(A21=\"FIN\",\"0\",INDEX(Regroupement!E:E,MATCH(A21,LTRU!D:D,0)))","v":"0"},0,"0"]
[{"$f":"IF(LTRU!D22=\"\",\"FIN\",LTRU!D22)","v":"FIN"},{"$f":"IF(A22=\"FIN\",\"0\",INDEX(Regroupement!E:E,MATCH(A22,LTRU!D:D,0)))","v":"0"},0,"0"]
[{"$f":"IF(LTRU!D23=\"\",\"FIN\",LTRU!D23)","v":"FIN"},{"$f":"IF(A23=\"FIN\",\"0\",INDEX(Regroupement!E:E,MATCH(A23,LTRU!D:D,0)))","v":"0"},0,"0"]
[{"$f":"IF(LTRU!D24=\"\",\"FIN\",LTRU!D24)","v":"FIN"},{"$f":"IF(A24=\"FIN\",\"0\",INDEX(Regroupement!E:E,MATCH(A24,LTRU!D:D,0)))","v":"0"},0,"0"]
[{"$f":"IF(LTRU!D25=\"\",\"FIN\",LTRU!D25)","v":"FIN"},{"$f":"IF(A25=\"FIN\",\"0\",INDEX(Regroupement!E:E,MATCH(A25,LTRU!D:D,0)))","v":"0"},0,{"$f":"IF(A25=\"FIN\",\"0\",IF(B25=B24,D24,D24+1))","v":"0"}]
[{"$f":"IF(LTRU!D26=\"\",\"FIN\",LTRU!D26)","v":"FIN"},{"$f":"IF(A26=\"FIN\",\"0\",INDEX(Regroupement!E:E,MATCH(A26,LTRU!D:D,0)))","v":"0"},0,{"$f":"IF(A26=\"FIN\",\"0\",IF(B26=B25,D25,D25+1))","v":"0"}]
[{"$f":"IF(LTRU!D27=\"\",\"FIN\",LTRU!D27)","v":"FIN"},{"$f":"IF(A27=\"FIN\",\"0\",INDEX(Regroupement!E:E,MATCH(A27,LTRU!D:D,0)))","v":"0"},0,"0"]
[{"$f":"IF(LTRU!D28=\"\",\"FIN\",LTRU!D28)","v":"FIN"},{"$f":"IF(A28=\"FIN\",\"0\",INDEX(Regroupement!E:E,MATCH(A28,LTRU!D:D,0)))","v":"0"},0,"0"]
[{"$f":"IF(LTRU!D29=\"\",\"FIN\",LTRU!D29)","v":"FIN"},{"$f":"IF(A29=\"FIN\",\"0\",INDEX(Regroupement!E:E,MATCH(A29,LTRU!D:D,0)))","v":"0"},0,"0"]
[{"$f":"IF(LTRU!D30=\"\",\"FIN\",LTRU!D30)","v":"FIN"},{"$f":"IF(A30=\"FIN\",\"0\",INDEX(Regroupement!E:E,MATCH(A30,LTRU!D:D,0)))","v":"0"},0,"0"]
{"$rows_left_out":20}
{"sheet":"Conso moyen","index":5,"n_rows":17,"n_cols":7,"rows_kept":17,"cut":false,"hidden":false,"merged":[[1,3,2,3],[1,4,2,4],[3,2,5,2],[3,3,5,3],[3,4,5,4],[9,2,10,2],[9,0,10,0],[1,0,2,0],[3,0,5,0],[1,2,2,2]]}
["Regroupement","OP seq","Temps Phys","Temps Info","Temps Total","Commentaires"]
["ML-R37,5",26520,"01:25:00"]
[null,25760]
["ML-R51",45225,"04:17:00",null,null,"104W1345P060"]
[null,80325,null,null,null,"51 phys 52 conso"]
[null,80323,null,null,null,"Compter x2"]
["ML-R38",40167,"00:53:00"]
["ML-R17","35055A","14:48:00",null,null,"447W1835P002","50 et non 53 conso"]
["ML.R18",35112,"03:44:00"]
["B1-06",25190,"13:20:00"]
[null,25200]
[]
[]
[]
[]
["Moyenne / kit",null,{"$f":"SUM(C2:C11)/10","v":"03:50:42"}]
["Moyenne / regroupement",null,{"$f":"SUM(C2:C11)/6","v":"06:24:30"}]