{"text_format":"1","workbook":"xlsx","n_sheets":6,"sheets":["Random","Heure Arrivée Camion","LTRU","Regroupement","Reg Camion","Conso moyen"],"not_rendered":{"charts":0,"images":0,"macros":1,"external_links":2,"defined_names":1,"comments":2,"pivot_tables":0},"unopened":[],"bounds":{"document_bytes":16777216,"sheet_cells":100000,"rows_first":2000,"rows_last":500,"rows_between":2000,"halvings":0,"cell_chars":16384,"cell_head_chars":4096},"cells_cut":0,"cells_raw":0,"read":"whole","date_system":"1900"}

{"sheet":"Random","index":0,"n_rows":7,"n_cols":9,"rows_kept":7,"cut":false,"hidden":false,"merged":[]}
["11:01:17","Nombre Kits","Nombre Regroupements"]
[null,{"$f":"MAX('Reg Camion'!C:C)","v":16},{"$f":"MAX('Reg Camion'!D:D)-1","v":0},null,null,{"$f":"NOW()","v":"2021-04-29T19:46:24.150"},{"$f":"INT(F2)","v":"2021-04-29"}]
[null,null,null,null,null,"Heure Actuelle",{"$f":"F2-G2","v":"19:46:24.150"},null,"00:30:00"]
[null,null,null,null,null,"Heure Prochain Camion",{"$f":"IF(G3<'Heure Arrivée Camion'!C3,'Heure Arrivée Camion'!C3,IF(G3<'Heure Arrivée Camion'!C4,'Heure Arrivée Camion'!C4,IF(G3<'Heure Arrivée Camion'!C5,'Heure Arrivée Camion'!C5,IF(G3<'Heure Arrivée Camion'!C6,'Heure Arrivée Camion'!C6,IF(G3<'Heure Arrivée Camion'!C7,'Heure Arrivée Camion'!C7,IF(G3<'Heure Arrivée Camion'!C8,'Heure Arrivée Camion'!C8,IF(G3<'Heure Arrivée Camion'!C9,'Heure Arrivée Camion'!C9,IF(G3<'Heure Arrivée Camion'!C10,'Heure Arrivée Camion'!C10,IF(G3<'Heure Arrivée Camion'!C11,'Heure Arrivée Camion'!C11,IF(G3<'Heure Arrivée Camion'!C12,'Heure Arrivée Camion'!C12,\"Demain à 06:05\"))))))))))","v":"20:15:00"},"Heure Reintialisation","19:43:00"]
[]
[null,"Regroupements à controler"]
[null,{"$f":"INDEX('Reg Camion'!B:B,MATCH('Reg Camion'!F2,'Reg Camion'!D:D,0))","v":{"$error":"#NUM!"}}]

{"sheet":"Heure Arrivée Camion","index":1,"n_rows":12,"n_cols":4,"rows_kept":12,"cut":false,"hidden":false,"merged":[]}
[]
[null,"Numero Camion Logi","Camion Logistiport","Intervalle"]
[null,1,"06:05:00"]
[null,2,"07:35:00",{"$f":"C4-C3","v":"01:30:00"}]
[null,3,"09:05:00",{"$f":"C5-C4","v":"01:30:00"}]
[null,4,"11:00:00","01:55:00"]
[null,5,"12:30:00","01:30:00"]
[null,6,"13:50:00","01:20:00"]
[null,7,"15:20:00","01:30:00"]
[null,8,"16:50:00","01:30:00"]
[null,9,"18:45:00","01:55:00"]
[null,10,"20:15:00","01:30:00"]

{"sheet":"LTRU","index":2,"n_rows":17,"n_cols":10,"rows_kept":17,"cut":false,"hidden":false,"merged":[]}
["A","A","A","A","A","A","A","A","A","A"]
["A","A","A","A","A","A","A","A","A","A"]
["A","A","A","A","A","A","A","A","A","A"]
["A","A","A","A","A","A","A","A","A","A"]
["A","A","A","A","A","A","A","A","A","A"]
["A","A","A","A","A","A","A","A","A","A"]
["A","A","A","A","A","A","A","A","A","A"]
["A","A","A","A","A","A","A","A","A","A"]
["A","A","A","A","A","A","A","A","A","A"]
["A","A","A","A","A","A","A","A","A","A"]
["A","A","A","A","A","A","A","A","A","A"]
["A","A","A","A","A","A","A","A","A","A"]
["A","A","A","A","A","A","A","A","A","A"]
["A","A","A","A","A","A","A","A","A","A"]
["A","A","A","A","A","A","A","A","A","A"]
["A","A","A","A","A","A","A","A","A","A"]
["A","A","A","A","A","A","A","A","A","A"]

{"sheet":"Regroupement","index":3,"n_rows":397,"n_cols":38,"rows_kept":397,"cut":false,"hidden":false,"merged":[]}
["Tri Livrable","Tri Revue","Block","Station","N°LIVRABLE","Responsabilité PP","Priorité","Buffer / direct ligne","Format","Commentaire affichage ","Porte de livraison","Lieu de stockage 3PL","N° opération","N°OP oracle","PLL","Sequencement","n° livrable bis","Nom OP","H","Ref Kit B","Ref Kit C","Part Presentation M1","Part Presentation M2","Part Presentation M3","Mallette","Station Bis","Verif tracking","ref KIT à créer","doublons","Num PP ","NB","PP & nb","Num OP","DEPARTMENT","Department&OP","WIP ?","Recherche wip","2021-04-13"]
[289,1,"GENE2","G2","B4-R28","KPO","P1","Buffer","80X250","1 PAL + Joint",10,"Logistiport",13007,261,{"$f":"COUNTIF(M:M,M2)","v":1},"NA",{"$f":"E2","v":"B4-R28"},"Montage du joint des raidisseurs","KIT.13007A",null,null,"OK","OK","OK",null,{"$f":"D2","v":"G2"},{"$f":"VLOOKUP(S2,'[1]Extraction Tracking 2905'!D:D,1,FALSE)","v":"KIT.13007A"},null,{"$f":"COUNTIF(M:M,M2)","v":1},{"$f":"Q2","v":"B4-R28"},1,{"$f":"AD2&AE2","v":"B4-R281"},{"$f":"M2","v":13007},{"$f":"VLOOKUP(C2,[2]Feuil2!A:B,2,FALSE)","v":"BLKGEN2"},{"$f":"N2&AH2","v":"261BLKGEN2"},{"$f":"VLOOKUP(Regroupement!AI2,[2]Wip!AC:AC,1,FALSE)","v":"261BLKGEN2"},{"$f":"VLOOKUP(AI2,[2]Wip!AC:AC,1,FALSE)","v":"261BLKGEN2"}]
[291,2,"GENE2","G2","B4-R28","KPO","P1","Buffer","80X250","1 PAL + Joint",10,"Logistiport",13008,301,2,"NA",{"$f":"E3","v":"B4-R28"},"Montage des 4 raidisseurs","KIT.13008A1",null,null,"OK","OK","OK","Mallette",{"$f":"D3","v":"G2"},{"$f":"VLOOKUP(S3,'[1]Extraction Tracking 2905'!D:D,1,FALSE)","v":"KIT.13008A1"},null,2,"B4-R28",2,"B4-R282",13008,{"$f":"VLOOKUP(C3,[2]Feuil2!A:B,2,FALSE)","v":"BLKGEN2"},{"$f":"N3&AH3","v":"301BLKGEN2"},{"$f":"VLOOKUP(Regroupement!AI3,[2]Wip!AC:AC,1,FALSE)","v":"301BLKGEN2"},{"$f":"VLOOKUP(AI3,[2]Wip!AC:AC,1,FALSE)","v":"301BLKGEN2"}]
[292,3,"GENE2","G2","B4-R29","Support fournisseur",null,"Direct ligne",null,"Stiffeners",2,"Tamaris",13008,302,2,"NA","B4-R29","Montage des 4 raidisseurs","KIT.13008A2",null,null,"Support fournisseur","Support fournisseur","Support fournisseur","Mallette","G2",{"$f":"VLOOKUP(S4,'[1]Extraction Tracking 2905'!D:D,1,FALSE)","v":"KIT.13008A2"},null,2,"B4-R29",{"$f":"IF(AD4=AD3,AE3+1,1)","v":1},"B4-R291",13008,{"$f":"VLOOKUP(C4,[2]Feuil2!A:B,2,FALSE)","v":"BLKGEN2"},"302BLKGEN2",{"$f":"VLOOKUP(Regroupement!AI4,[2]Wip!AC:AC,1,FALSE)","v":"302BLKGEN2"},{"$f":"VLOOKUP(AI4,[2]Wip!AC:AC,1,FALSE)","v":"302BLKGEN2"}]
[293,4,"GENE2","G2","B4-R30","KPO","P1","Buffer","80X120","1 PAL + Balais",10,"Logistiport",11045,161,1,"NA","B4-R30","Montage des balais extérieurs","KIT.11045A",null,null,"OK","OK","OK","Mallette","G2",{"$f":"VLOOKUP(S5,'[1]Extraction Tracking 2905'!D:D,1,FALSE)","v":"KIT.11045A"},null,1,"B4-R30",1,"B4-R301",11045,{"$f":"VLOOKUP(C5,[2]Feuil2!A:B,2,FALSE)","v":"BLKGEN2"},"161BLKGEN2",{"$f":"VLOOKUP(Regroupement!AI5,[2]Wip!AC:AC,1,FALSE)","v":"161BLKGEN2"},{"$f":"VLOOKUP(AI5,[2]Wip!AC:AC,1,FALSE)","v":"161BLKGEN2"}]
[295,5,"GENE2","G2","B4-R30","KPO",null,"Buffer","80X120",null,10,"Logistiport",13006,221,1,"NA",{"$f":"E6","v":"B4-R30"},"Connexion électrique boite HT","Mallette13006",null,null,"OK","OK","OK","Mallette Uniquement",{"$f":"D6","v":"G2"},{"$f":"VLOOKUP(S6,'[1]Extraction Tracking 2905'!D:D,1,FALSE)","v":{"$error":"#N/A"}},null,1,"B4-R30",2,"B4-R302",13006,{"$f":"VLOOKUP(C6,[2]Feuil2!A:B,2,FALSE)","v":"BLKGEN2"},"221BLKGEN2",{"$f":"VLOOKUP(Regroupement!AI6,[2]Wip!AC:AC,1,FALSE)","v":"221BLKGEN2"},{"$f":"VLOOKUP(AI6,[2]Wip!AC:AC,1,FALSE)","v":"221BLKGEN2"}]
[287,6,"GENE2","G2","B4-R30","KPO",null,"Buffer","80X120",null,10,"Logistiport",13028,351,1,"NA",{"$f":"E7","v":"B4-R30"},"Montage des bouteilles sur roulement","KIT.13028A",null,null,"OK","OK","OK","Mallette",{"$f":"D7","v":"G2"},{"$f":"VLOOKUP(S7,'[1]Extraction Tracking 2905'!D:D,1,FALSE)","v":"KIT.13028A"},null,1,"B4-R30",3,"B4-R303",13028,{"$f":"VLOOKUP(C7,[2]Feuil2!A:B,2,FALSE)","v":"BLKGEN2"},"351BLKGEN2",{"$f":"VLOOKUP(Regroupement!AI7,[2]Wip!AC:AC,1,FALSE)","v":"351BLKGEN2"},{"$f":"VLOOKUP(AI7,[2]Wip!AC:AC,1,FALSE)","v":"351BLKGEN2"}]
[null,7,"GENE2","G2","B4-R30","KPO",null,"Buffer","80X120",null,10,"Logistiport",13026,121,1,"NA",{"$f":"E8","v":"B4-R30"},"Serrage du roulement sur le stator","KIT.13026A",null,null,"OK","OK","OK","Mallette",{"$f":"D8","v":"G2"},{"$f":"VLOOKUP(S8,'[1]Extraction Tracking 2905'!D:D,1,FALSE)","v":{"$error":"#N/A"}},null,1,"B4-R30",4,"B4-R304",13026,{"$f":"VLOOKUP(C8,[2]Feuil2!A:B,2,FALSE)","v":"BLKGEN2"},"121BLKGEN2",{"$f":"VLOOKUP(Regroupement!AI8,[2]Wip!AC:AC,1,FALSE)","v":"121BLKGEN2"},{"$f":"VLOOKUP(AI8,[2]Wip!AC:AC,1,FALSE)","v":"121BLKGEN2"}]
[296,8,"GENE2","G2","B4-R31","KPO",null,"Buffer","80X120",null,10,"Logistiport",13004,311,1,"NA","B4-R31","Réglage des capteurs axiaux et locking pin et montage de la PT100 roulement","KIT.13004A",null,null,"OK","OK","OK","Mallette","G2",{"$f":"VLOOKUP(S9,'[1]Extraction Tracking 2905'!D:D,1,FALSE)","v":"KIT.13004A"},null,1,"B4-R31",1,"B4-R311",13004,{"$f":"VLOOKUP(C9,[2]Feuil2!A:B,2,FALSE)","v":"BLKGEN2"},"311BLKGEN2",{"$f":"VLOOKUP(Regroupement!AI9,[2]Wip!AC:AC,1,FALSE)","v":"311BLKGEN2"},{"$f":"VLOOKUP(AI9,[2]Wip!AC:AC,1,FALSE)","v":"311BLKGEN2"}]
[297,9,"GENE2","G2","B4-R31","KPO",null,"Buffer","80X120",null,10,"Logistiport",13012,241,1,"NA","B4-R31","Montage porte trou d'homme","KIT.13012A",null,null,"OK","OK","OK","Mallette","G2",{"$f":"VLOOKUP(S10,'[1]Extraction Tracking 2905'!D:D,1,FALSE)","v":"KIT.13012A"},null,1,"B4-R31",2,"B4-R312",13012,{"$f":"VLOOKUP(C10,[2]Feuil2!A:B,2,FALSE)","v":"BLKGEN2"},"241BLKGEN2",{"$f":"VLOOKUP(Regroupement!AI10,[2]Wip!AC:AC,1,FALSE)","v":"241BLKGEN2"},{"$f":"VLOOKUP(AI10,[2]Wip!AC:AC,1,FALSE)","v":"241BLKGEN2"}]
[298,10,"GENE2","G2","B4-R31","KPO",null,"Buffer","80X120",null,10,"Logistiport",13013,511,2,"NA","B4-R31","Montage des 4 parties du donuts ext","KIT.13013A1",null,null,"OK","OK","OK","Mallette","G2",{"$f":"VLOOKUP(S11,'[1]Extraction Tracking 2905'!D:D,1,FALSE)","v":"KIT.13013A1"},null,2,"B4-R31",3,"B4-R313",13013,{"$f":"VLOOKUP(C11,[2]Feuil2!A:B,2,FALSE)","v":"BLKGEN2"},"511BLKGEN2",{"$f":"VLOOKUP(Regroupement!AI11,[2]Wip!AC:AC,1,FALSE)","v":"511BLKGEN2"},{"$f":"VLOOKUP(AI11,[2]Wip!AC:AC,1,FALSE)","v":"511BLKGEN2"}]
[299,11,"GENE2","G2","B4-R32","Support fournisseur",null,"Direct ligne",null,"Donuts",2,"Chantenay",13013,512,2,"NA","B4-R32","Montage des 4 parties du donuts ext","KIT.13013A2",null,null,"Support fournisseur","Support fournisseur","Support fournisseur","Mallette","G2",{"$f":"VLOOKUP(S12,'[1]Extraction Tracking 2905'!D:D,1,FALSE)","v":"KIT.13013A2"},null,2,"B4-R32",1,"B4-R321",13013,{"$f":"VLOOKUP(C12,[2]Feuil2!A:B,2,FALSE)","v":"BLKGEN2"},"512BLKGEN2",{"$f":"VLOOKUP(Regroupement!AI12,[2]Wip!AC:AC,1,FALSE)","v":"512BLKGEN2"},{"$f":"VLOOKUP(AI12,[2]Wip!AC:AC,1,FALSE)","v":"512BLKGEN2"}]
[300,12,"GENE2","G2","B4-R33","KPO","P1","Buffer","80X120","1 PAL + Balais",10,"Logistiport",13009,171,1,"NA","B4-R33","Montage des tôles entrefer","KIT.13009A",null,null,"OK","OK","OK","Mallette","G2",{"$f":"VLOOKUP(S13,'[1]Extraction Tracking 2905'!D:D,1,FALSE)","v":"KIT.13009A"},null,1,"B4-R33",1,"B4-R331",13009,{"$f":"VLOOKUP(C13,[2]Feuil2!A:B,2,FALSE)","v":"BLKGEN2"},"171BLKGEN2",{"$f":"VLOOKUP(Regroupement!AI13,[2]Wip!AC:AC,1,FALSE)","v":"171BLKGEN2"},{"$f":"VLOOKUP(AI13,[2]Wip!AC:AC,1,FALSE)","v":"171BLKGEN2"}]
[301,13,"GENE2","G2","B4-R33","KPO","P1","Buffer","80X120","1 PAL + Balais",10,"Logistiport",13010,201,1,"NA","B4-R33","Montage de trappes raidisseurs","KIT.13010A",null,null,"OK","OK","OK","Mallette","G2",{"$f":"VLOOKUP(S14,'[1]Extraction Tracking 2905'!D:D,1,FALSE)","v":"KIT.13010A"},null,1,"B4-R33",2,"B4-R332",13010,{"$f":"VLOOKUP(C14,[2]Feuil2!A:B,2,FALSE)","v":"BLKGEN2"},"201BLKGEN2",{"$f":"VLOOKUP(Regroupement!AI14,[2]Wip!AC:AC,1,FALSE)","v":"201BLKGEN2"},{"$f":"VLOOKUP(AI14,[2]Wip!AC:AC,1,FALSE)","v":"201BLKGEN2"}]
[302,14,"GENE2","G2","B4-R33","KPO","P1","Buffer","80X120","1 PAL + Balais",10,"Logistiport",13011,231,1,"NA","B4-R33","Montage des balais sur les raidisseurs","KIT.13011A",null,null,"OK","OK","OK","Mallette","G2",{"$f":"VLOOKUP(S15,'[1]Extraction Tracking 2905'!D:D,1,FALSE)","v":"KIT.13011A"},null,1,"B4-R33",3,"B4-R333",13011,{"$f":"VLOOKUP(C15,[2]Feuil2!A:B,2,FALSE)","v":"BLKGEN2"},"231BLKGEN2",{"$f":"VLOOKUP(Regroupement!AI15,[2]Wip!AC:AC,1,FALSE)","v":"231BLKGEN2"},{"$f":"VLOOKUP(AI15,[2]Wip!AC:AC,1,FALSE)","v":"231BLKGEN2"}]
[305,15,"GENE2","G3","B4-R35","KPO",null,"Buffer",null,null,10,"Logistiport",13015,1201,1,"NA","B4-R35","Montage RIPWIRE sur donut's extérieurs","KIT.13015A",null,null,"OK","OK","OK","Mallette","G3",{"$f":"VLOOKUP(S16,'[1]Extraction Tracking 2905'!D:D,1,FALSE)","v":"KIT.13015A"},null,1,"B4-R35",1,"B4-R351",13015,{"$f":"VLOOKUP(C16,[2]Feuil2!A:B,2,FALSE)","v":"BLKGEN2"},"1201BLKGEN2",{"$f":"VLOOKUP(Regroupement!AI16,[2]Wip!AC:AC,1,FALSE)","v":"1201BLKGEN2"},{"$f":"VLOOKUP(AI16,[2]Wip!AC:AC,1,FALSE)","v":"1201BLKGEN2"}]
[306,16,"GENE2","G3","B4-R35","KPO",null,"Buffer",null,null,10,"Logistiport",13017,1301,1,"NA","B4-R35","Montage des ceintures","KIT.13017A",null,null,"OK","OK","OK",null,"G3",{"$f":"VLOOKUP(S17,'[1]Extraction Tracking 2905'!D:D,1,FALSE)","v":"KIT.13017A"},null,1,"B4-R35",2,"B4-R352",13017,{"$f":"VLOOKUP(C17,[2]Feuil2!A:B,2,FALSE)","v":"BLKGEN2"},"1301BLKGEN2",{"$f":"VLOOKUP(Regroupement!AI17,[2]Wip!AC:AC,1,FALSE)","v":"1301BLKGEN2"},{"$f":"VLOOKUP(AI17,[2]Wip!AC:AC,1,FALSE)","v":"1301BLKGEN2"}]
[308,17,"GENE2","G3","B4-R35","KPO",null,"Buffer",null,null,10,"Logistiport",13023,1211,1,"NA","B4-R35","Montage des tresses de masse","KIT.13023A",null,null,"OK","OK","OK","Mallette","G3",{"$f":"VLOOKUP(S18,'[1]Extraction Tracking 2905'!D:D,1,FALSE)","v":"KIT.13023A"},null,1,"B4-R35",3,"B4-R353",13023,{"$f":"VLOOKUP(C18,[2]Feuil2!A:B,2,FALSE)","v":"BLKGEN2"},"1211BLKGEN2",{"$f":"VLOOKUP(Regroupement!AI18,[2]Wip!AC:AC,1,FALSE)","v":"1211BLKGEN2"},{"$f":"VLOOKUP(AI18,[2]Wip!AC:AC,1,FALSE)","v":"1211BLKGEN2"}]
[309,18,"GENE2","G3","B4-R35","KPO",null,"Buffer",null,null,10,"Logistiport",15006,1231,1,"NA","B4-R35","Etanchéité des donuts","KIT.15006A",null,null,"OK","OK","OK",null,"G3",{"$f":"VLOOKUP(S19,'[1]Extraction Tracking 2905'!D:D,1,FALSE)","v":"KIT.15006A"},null,1,"B4-R35",4,"B4-R354",15006,{"$f":"VLOOKUP(C19,[2]Feuil2!A:B,2,FALSE)","v":"BLKGEN2"},"1231BLKGEN2",{"$f":"VLOOKUP(Regroupement!AI19,[2]Wip!AC:AC,1,FALSE)","v":"1231BLKGEN2"},{"$f":"VLOOKUP(AI19,[2]Wip!AC:AC,1,FALSE)","v":"1231BLKGEN2"}]
[null,19,"GENE2","G3","B4-R35","KPO","P1","Buffer","80X250","1 PAL + Joint",10,"Logistiport",13021,1141,1,"NA",{"$f":"E20","v":"B4-R35"},"Reprise spray et silicone","KIT.13021A",null,null,"OK","OK","OK",null,{"$f":"D20","v":"G3"},{"$f":"VLOOKUP(S20,'[1]Extraction Tracking 2905'!D:D,1,FALSE)","v":{"$error":"#N/A"}},null,1,"B4-R35",5,"B4-R355",13021,{"$f":"VLOOKUP(C20,[2]Feuil2!A:B,2,FALSE)","v":"BLKGEN2"},"1141BLKGEN2",{"$f":"VLOOKUP(Regroupement!AI20,[2]Wip!AC:AC,1,FALSE)","v":"1141BLKGEN2"},{"$f":"VLOOKUP(AI20,[2]Wip!AC:AC,1,FALSE)","v":"1141BLKGEN2"}]
[290,20,"GENE2","G3","B4-R35","KPO","P1","Buffer","80X250","1 PAL + Joint",10,"Logistiport",15005,1151,1,"NA",{"$f":"E21","v":"B4-R35"},"Etanchéité raidisseur","KIT.15005A",null,null,"OK","OK","OK",null,{"$f":"D21","v":"G3"},{"$f":"VLOOKUP(S21,'[1]Extraction Tracking 2905'!D:D,1,FALSE)","v":"KIT.15005A"},null,1,"B4-R35",6,"B4-R356",15005,{"$f":"VLOOKUP(C21,[2]Feuil2!A:B,2,FALSE)","v":"BLKGEN2"},"1151BLKGEN2",{"$f":"VLOOKUP(Regroupement!AI21,[2]Wip!AC:AC,1,FALSE)","v":"1151BLKGEN2"},{"$f":"VLOOKUP(AI21,[2]Wip!AC:AC,1,FALSE)","v":"1151BLKGEN2"}]
[310,21,"GENE2","G3","B4-R36","KPO","P1","Buffer","3X80X120","PAL 1/3",10,"Logistiport",13014,1131,2,"NA","B4-R36","Montage des 22 portières donuts","KIT.13014A1",null,null,"OK","OK","OK","Mallette","G3",{"$f":"VLOOKUP(S22,'[1]Extraction Tracking 2905'!D:D,1,FALSE)","v":"KIT.13014A1"},null,2,"B4-R36",1,"B4-R361",13014,{"$f":"VLOOKUP(C22,[2]Feuil2!A:B,2,FALSE)","v":"BLKGEN2"},"1131BLKGEN2",{"$f":"VLOOKUP(Regroupement!AI22,[2]Wip!AC:AC,1,FALSE)","v":"1131BLKGEN2"},{"$f":"VLOOKUP(AI22,[2]Wip!AC:AC,1,FALSE)","v":"1131BLKGEN2"}]
[311,22,"GENE2","G3","B4-R37","Idea","P1","Buffer",null,"Plaque IP 68",2,"Logistiport",13014,1132,2,"NA","B4-R37","Montage des 22 portières donuts","KIT.13014A2",null,null,"OK","OK","OK","Mallette","G3",{"$f":"VLOOKUP(S23,'[1]Extraction Tracking 2905'!D:D,1,FALSE)","v":"KIT.13014A2"},null,2,"B4-R37",1,"B4-R371",13014,{"$f":"VLOOKUP(C23,[2]Feuil2!A:B,2,FALSE)","v":"BLKGEN2"},"1132BLKGEN2",{"$f":"VLOOKUP(Regroupement!AI23,[2]Wip!AC:AC,1,FALSE)","v":"1132BLKGEN2"},{"$f":"VLOOKUP(AI23,[2]Wip!AC:AC,1,FALSE)","v":"1132BLKGEN2"}]
[null,23,"GENE2","G3","B4-R38","KPO",null,"Buffer",null,null,10,"Logistiport",15004,3141,1,"NA","B4-R38","Etanchéité bouchon plot stator","KIT.15004A",null,null,"OK","OK","OK",null,"G3",{"$f":"VLOOKUP(S24,'[1]Extraction Tracking 2905'!D:D,1,FALSE)","v":"KIT.15004A"},null,1,"B4-R38",1,"B4-R381",15004,{"$f":"VLOOKUP(C24,[2]Feuil2!A:B,2,FALSE)","v":"BLKGEN2"},"3141BLKGEN2",{"$f":"VLOOKUP(Regroupement!AI24,[2]Wip!AC:AC,1,FALSE)","v":{"$error":"#N/A"}},{"$f":"VLOOKUP(AI24,[2]Wip!AC:AC,1,FALSE)","v":{"$error":"#N/A"}}]
[313,24,"GENE2","G5","B4-R39","Support fournisseur",null,"Buffer",null,null,10,"Logistiport",30260,3401,1,"NA","B4-R39","Serrage union BI-Stator, placer des bouchons dans les trous des pions.","KIT.30260A",null,null,"OK","OK","OK",null,"G5",{"$f":"\"KIT\"&M25&\"A\"","v":"KIT30260A"},null,1,"B4-R39",1,"B4-R391",30260,{"$f":"VLOOKUP(C25,[2]Feuil2!A:B,2,FALSE)","v":"BLKGEN2"},"3401BLKGEN2",{"$f":"VLOOKUP(Regroupement!AI25,[2]Wip!AC:AC,1,FALSE)","v":"3401BLKGEN2"},{"$f":"VLOOKUP(AI25,[2]Wip!AC:AC,1,FALSE)","v":"3401BLKGEN2"}]
[315,25,"GENE2","G5","B4-R40","KPO",null,"Buffer",null,null,10,"Logistiport",94427,2701,1,"NA","B4-R40","Montage des pions de centrage sur le stator du générateur","KIT.94427A",null,null,"OK","OK","OK",null,"G5",{"$f":"VLOOKUP(S26,'[1]Extraction Tracking 2905'!D:D,1,FALSE)","v":{"$error":"#N/A"}},null,1,"B4-R40",1,"B4-R401",94427,{"$f":"VLOOKUP(C26,[2]Feuil2!A:B,2,FALSE)","v":"BLKGEN2"},"2701BLKGEN2",{"$f":"VLOOKUP(Regroupement!AI26,[2]Wip!AC:AC,1,FALSE)","v":"2701BLKGEN2"},{"$f":"VLOOKUP(AI26,[2]Wip!AC:AC,1,FALSE)","v":"2701BLKGEN2"}]
[null,26,"GENE2","G5","B4-R40","KPO",null,"Buffer",null,null,10,"Logistiport",15003,3701,1,"NA","B4-R40","Fixation de la plaque signaletique pour machine europeenne","KIT.15003A",null,null,"OK","OK","OK","Mallette","G5",{"$f":"VLOOKUP(S27,'[1]Extraction Tracking 2905'!D:D,1,FALSE)","v":"KIT.15003A"},null,1,"B4-R40",2,"B4-R402",15003,{"$f":"VLOOKUP(C27,[2]Feuil2!A:B,2,FALSE)","v":"BLKGEN2"},"3701BLKGEN2",{"$f":"VLOOKUP(Regroupement!AI27,[2]Wip!AC:AC,1,FALSE)","v":"3701BLKGEN2"},{"$f":"VLOOKUP(AI27,[2]Wip!AC:AC,1,FALSE)","v":"3701BLKGEN2"}]
[null,27,"GENE2","G5","B4-R40","KPO",null,"Buffer",null,null,10,"Logistiport",15002,3151,1,"NA",{"$f":"E28","v":"B4-R40"},"Demontage des blocs ceintures","KIT.15002A",null,null,"OK","OK","OK",null,{"$f":"D28","v":"G5"},null,null,1,"B4-R40",3,"B4-R403",15002,{"$f":"VLOOKUP(C28,[2]Feuil2!A:B,2,FALSE)","v":"BLKGEN2"},"3151BLKGEN2",{"$f":"VLOOKUP(Regroupement!AI28,[2]Wip!AC:AC,1,FALSE)","v":"3151BLKGEN2"},{"$f":"VLOOKUP(AI28,[2]Wip!AC:AC,1,FALSE)","v":"3151BLKGEN2"}]
[null,28,"GENE2","G5","MOD BI",null,null,null,null,null,1,"TGO",30222,3111,1,"NA",{"$f":"E29","v":"MOD BI"},"Premontage bati intermediaire_Levage du BI prepare sur la nouvelle embase de transport",null,null,null,"OK","OK","OK","Mallette Uniquement",{"$f":"D29","v":"G5"},null,null,1,"MOD BI",1,"MOD BI1",30222,{"$f":"VLOOKUP(C29,[2]Feuil2!A:B,2,FALSE)","v":"BLKGEN2"},"3111BLKGEN2",{"$f":"VLOOKUP(Regroupement!AI29,[2]Wip!AC:AC,1,FALSE)","v":"3111BLKGEN2"},{"$f":"VLOOKUP(AI29,[2]Wip!AC:AC,1,FALSE)","v":"3111BLKGEN2"}]
[319,29,"GENE2","G5","B4-R41","KPO","P1","Buffer","120X200",null,10,"Logistiport",30700,3811,1,"NA","B4-R41","Montage de la plateforme supériéur du bâti intermediaire","KIT.30700A",null,null,"OK","OK","OK","Mallette","G5",{"$f":"VLOOKUP(S30,'[1]Extraction Tracking 2905'!D:D,1,FALSE)","v":"KIT.30700A"},null,1,"B4-R41",1,"B4-R411",30700,{"$f":"VLOOKUP(C30,[2]Feuil2!A:B,2,FALSE)","v":"BLKGEN2"},"3811BLKGEN2",{"$f":"VLOOKUP(Regroupement!AI30,[2]Wip!AC:AC,1,FALSE)","v":"3811BLKGEN2"},{"$f":"VLOOKUP(AI30,[2]Wip!AC:AC,1,FALSE)","v":"3811BLKGEN2"}]
[307,30,"GENE2","G5","B4-R41","KPO","P1","Buffer","120X200",null,10,"Logistiport",15009,3801,1,"NA",{"$f":"E31","v":"B4-R41"},"Prémontage des demis portières","KIT.15009A",null,null,"OK","OK","OK","Mallette",{"$f":"D31","v":"G5"},{"$f":"VLOOKUP(S31,'[1]Extraction Tracking 2905'!D:D,1,FALSE)","v":"KIT.15009A"},null,1,"B4-R41",2,"B4-R412",15009,{"$f":"VLOOKUP(C31,[2]Feuil2!A:B,2,FALSE)","v":"BLKGEN2"},"3801BLKGEN2",{"$f":"VLOOKUP(Regroupement!AI31,[2]Wip!AC:AC,1,FALSE)","v":"3801BLKGEN2"},{"$f":"VLOOKUP(AI31,[2]Wip!AC:AC,1,FALSE)","v":"3801BLKGEN2"}]
[null,31,"GENE2","G5","B4-R41","KPO","P1","Buffer","120X200",null,10,"Logistiport",15014,3155,1,"NA","B4-R41",null,"KIT.15014A",null,null,"OK","OK","OK","Mallette","G5",null,null,1,"B4-R41",3,"B4-R413",15014,{"$f":"VLOOKUP(C32,[2]Feuil2!A:B,2,FALSE)","v":"BLKGEN2"},"3155BLKGEN2",{"$f":"VLOOKUP(Regroupement!AI32,[2]Wip!AC:AC,1,FALSE)","v":"3155BLKGEN2"},{"$f":"VLOOKUP(AI32,[2]Wip!AC:AC,1,FALSE)","v":"3155BLKGEN2"}]
[256,32,"GENE","Prepa bearing","B4-R14","KPO","P1","Buffer","80X120",null,10,"Logistiport",11009,1551,1,"NA","B4-R14","Approvionnement des roulements en zone de stockage","KIT.11009A1",null,null,"OK","OK","OK","Mallette","Prepa bearing",{"$f":"VLOOKUP(S33,'[1]Extraction Tracking 2905'!D:D,1,FALSE)","v":"KIT.11009A1"},null,1,"B4-R14",1,"B4-R141",11009,{"$f":"VLOOKUP(C33,[2]Feuil2!A:B,2,FALSE)","v":"BLKGEN"},"1551BLKGEN",{"$f":"VLOOKUP(Regroupement!AI33,[2]Wip!AC:AC,1,FALSE)","v":"1551BLKGEN"},{"$f":"VLOOKUP(AI33,[2]Wip!AC:AC,1,FALSE)","v":"1551BLKGEN"}]
[257,33,"GENE","Prepa bearing","SUP PBG 40 B4-R14","KPO","P1","Buffer","80X120",null,10,"Logistiport","SUP 11010",1561,1,"NA","SUP PBG 40 B4-R14","Dépose du roulement avec plateforme + retrait de la plateforme","KIT.11010A",null,null,"OK","OK","OK","Mallette","Prepa bearing",{"$f":"VLOOKUP(S34,'[1]Extraction Tracking 2905'!D:D,1,FALSE)","v":"KIT.11010A"},null,1,"SUP PBG 40 B4-R14",1,"SUP PBG 40 B4-R141","SUP 11010",{"$f":"VLOOKUP(C34,[2]Feuil2!A:B,2,FALSE)","v":"BLKGEN"},"1561BLKGEN",{"$f":"VLOOKUP(Regroupement!AI34,[2]Wip!AC:AC,1,FALSE)","v":{"$error":"#N/A"}},{"$f":"VLOOKUP(AI34,[2]Wip!AC:AC,1,FALSE)","v":{"$error":"#N/A"}}]
[258,34,"GENE","Prepa bearing","B4-R15","Support fournisseur",null,"Direct ligne",null,"Roulement Generateur",2,"TGO","My Way 11009",1552,1,"NA","B4-R15","Approvionnement des roulements en zone de stockage","My way",null,null,"Support fournisseur","Support fournisseur","Support fournisseur","Mallette","Prepa bearing",{"$f":"VLOOKUP(S35,'[1]Extraction Tracking 2905'!D:D,1,FALSE)","v":{"$error":"#N/A"}},null,1,"B4-R15",1,"B4-R151","My Way 11009",{"$f":"VLOOKUP(C35,[2]Feuil2!A:B,2,FALSE)","v":"BLKGEN"},"1552BLKGEN",{"$f":"VLOOKUP(Regroupement!AI35,[2]Wip!AC:AC,1,FALSE)","v":"1552BLKGEN"},{"$f":"VLOOKUP(AI35,[2]Wip!AC:AC,1,FALSE)","v":"1552BLKGEN"}]
[260,35,"GENE","PREPA Cercles","B4-R17","KPO","P1","Buffer","80X120",null,10,"Logistiport",11039,1201,2,"NA","B4-R17","Préparation des cercles","KIT.11039A1",null,null,"OK","OK","OK","Mallette","PREPA Cercles",{"$f":"VLOOKUP(S36,'[1]Extraction Tracking 2905'!D:D,1,FALSE)","v":"KIT.11039A1"},null,2,"B4-R17",1,"B4-R171",11039,{"$f":"VLOOKUP(C36,[2]Feuil2!A:B,2,FALSE)","v":"BLKGEN"},"1201BLKGEN",{"$f":"VLOOKUP(Regroupement!AI36,[2]Wip!AC:AC,1,FALSE)","v":"1201BLKGEN"},{"$f":"VLOOKUP(AI36,[2]Wip!AC:AC,1,FALSE)","v":"1201BLKGEN"}]
[259,36,"GENE","PREPA Cercles","B4-R16","Support fournisseur",null,"Direct ligne",null,"Caisse cercles",2,"Chantenay",11039,1202,2,"NA",{"$f":"E37","v":"B4-R16"},"Préparation des cercles","KIT.11039A2",null,null,"Support fournisseur","Support fournisseur","Support fournisseur","Mallette",{"$f":"D37","v":"PREPA Cercles"},{"$f":"VLOOKUP(S37,'[1]Extraction Tracking 2905'!D:D,1,FALSE)","v":"KIT.11039A2"},null,2,"B4-R16",1,"B4-R161",11039,{"$f":"VLOOKUP(C37,[2]Feuil2!A:B,2,FALSE)","v":"BLKGEN"},"1202BLKGEN",{"$f":"VLOOKUP(Regroupement!AI37,[2]Wip!AC:AC,1,FALSE)","v":"1202BLKGEN"},{"$f":"VLOOKUP(AI37,[2]Wip!AC:AC,1,FALSE)","v":"1202BLKGEN"}]
[271,37,"GENE","R0","B4-R21","Support fournisseur",null,"Direct ligne",null,"Rotor",3,"TGO","My Way 12003",111,1,"NA","B4-R21","Entrée du multiwheeler","My way",null,null,"Support fournisseur","Support fournisseur","Support fournisseur",null,"R0",{"$f":"VLOOKUP(S38,'[1]Extraction Tracking 2905'!D:D,1,FALSE)","v":{"$error":"#N/A"}},null,1,"B4-R21",1,"B4-R211","My Way 12003",{"$f":"VLOOKUP(C38,[2]Feuil2!A:B,2,FALSE)","v":"BLKGEN"},"111BLKGEN",{"$f":"VLOOKUP(Regroupement!AI38,[2]Wip!AC:AC,1,FALSE)","v":"111BLKGEN"},{"$f":"VLOOKUP(AI38,[2]Wip!AC:AC,1,FALSE)","v":"111BLKGEN"}]
[272,38,"GENE","R0","B4-R22","KPO",null,"Buffer","80X120","1 PAL Part Presentation + 1 PAL T guide + 1 PAL bush",10,"Logistiport",12005,501,1,"NA","B4-R22","Installation des tés","KIT.12005A",null,null,"OK","OK","OK","Mallette","R0",{"$f":"VLOOKUP(S39,'[1]Extraction Tracking 2905'!D:D,1,FALSE)","v":"KIT.12005A"},null,1,"B4-R22",1,"B4-R221",12005,{"$f":"VLOOKUP(C39,[2]Feuil2!A:B,2,FALSE)","v":"BLKGEN"},"501BLKGEN",{"$f":"VLOOKUP(Regroupement!AI39,[2]Wip!AC:AC,1,FALSE)","v":"501BLKGEN"},{"$f":"VLOOKUP(AI39,[2]Wip!AC:AC,1,FALSE)","v":"501BLKGEN"}]
[273,39,"GENE","R0","B4-R22","KPO",null,"Buffer","80X120","2 PAL Part Presentation + 1 PAL T guide + 1 PAL bush",10,"Logistiport",12009,125,1,"NA","B4-R22","Montage des cibles locking pin","KIT.12009A",null,null,"OK","OK","OK","Mallette","R0",{"$f":"VLOOKUP(S40,'[1]Extraction Tracking 2905'!D:D,1,FALSE)","v":"KIT.12009A"},null,1,"B4-R22",2,"B4-R222",12009,{"$f":"VLOOKUP(C40,[2]Feuil2!A:B,2,FALSE)","v":"BLKGEN"},"125BLKGEN",{"$f":"VLOOKUP(Regroupement!AI40,[2]Wip!AC:AC,1,FALSE)","v":"125BLKGEN"},{"$f":"VLOOKUP(AI40,[2]Wip!AC:AC,1,FALSE)","v":"125BLKGEN"}]
[274,40,"GENE","R0","B4-R22","KPO",null,"Buffer","80X120","3 PAL Part Presentation + 1 PAL T guide + 1 PAL bush",10,"Logistiport",12007,151,1,"NA","B4-R22","Montage de la RCB et câblage","KIT.12007A",null,null,"OK","OK","OK","Mallette","R0",{"$f":"VLOOKUP(S41,'[1]Extraction Tracking 2905'!D:D,1,FALSE)","v":"KIT.12007A"},null,1,"B4-R22",3,"B4-R223",12007,{"$f":"VLOOKUP(C41,[2]Feuil2!A:B,2,FALSE)","v":"BLKGEN"},"151BLKGEN",{"$f":"VLOOKUP(Regroupement!AI41,[2]Wip!AC:AC,1,FALSE)","v":"151BLKGEN"},{"$f":"VLOOKUP(AI41,[2]Wip!AC:AC,1,FALSE)","v":"151BLKGEN"}]
[275,41,"GENE","R0","B4-R23","Support fournisseur",null,"Direct ligne",null,"Aimants 1/3",2,"Chantenay",12013,2132,3,"NA","B4-R23","Transvasement les aimants dans caisse outil","KIT.12013A2",null,null,"Support fournisseur","Support fournisseur","Support fournisseur","Mallette","R0",{"$f":"VLOOKUP(S42,'[1]Extraction Tracking 2905'!D:D,1,FALSE)","v":{"$error":"#N/A"}},null,3,"B4-R23",1,"B4-R231",12013,{"$f":"VLOOKUP(C42,[2]Feuil2!A:B,2,FALSE)","v":"BLKGEN"},"2132BLKGEN",{"$f":"VLOOKUP(Regroupement!AI42,[2]Wip!AC:AC,1,FALSE)","v":"2132BLKGEN"},{"$f":"VLOOKUP(AI42,[2]Wip!AC:AC,1,FALSE)","v":"2132BLKGEN"}]
[276,42,"GENE","R0","B4-R24","Support fournisseur",null,"Direct ligne",null,"Aimants 2/3",2,"Chantenay",12013,2133,3,"NA","B4-R24","Transvasement les aimants dans caisse outil","KIT.12013A3",null,null,"Support fournisseur","Support fournisseur","Support fournisseur","Mallette","R0",{"$f":"VLOOKUP(S43,'[1]Extraction Tracking 2905'!D:D,1,FALSE)","v":{"$error":"#N/A"}},null,3,"B4-R24",1,"B4-R241",12013,{"$f":"VLOOKUP(C43,[2]Feuil2!A:B,2,FALSE)","v":"BLKGEN"},"2133BLKGEN",{"$f":"VLOOKUP(Regroupement!AI43,[2]Wip!AC:AC,1,FALSE)","v":"2133BLKGEN"},{"$f":"VLOOKUP(AI43,[2]Wip!AC:AC,1,FALSE)","v":"2133BLKGEN"}]
[277,43,"GENE","R0","B4-R25","Support fournisseur",null,"Direct ligne",null,"Aimants 3/3",2,"Chantenay",12013,2134,3,"NA","B4-R25","Transvasement les aimants dans caisse outil","KIT.12013A4",null,null,"Support fournisseur","Support fournisseur","Support fournisseur","Mallette","R0",{"$f":"VLOOKUP(S44,'[1]Extraction Tracking 2905'!D:D,1,FALSE)","v":{"$error":"#N/A"}},null,3,"B4-R25",1,"B4-R251",12013,{"$f":"VLOOKUP(C44,[2]Feuil2!A:B,2,FALSE)","v":"BLKGEN"},"2134BLKGEN",{"$f":"VLOOKUP(Regroupement!AI44,[2]Wip!AC:AC,1,FALSE)","v":"2134BLKGEN"},{"$f":"VLOOKUP(AI44,[2]Wip!AC:AC,1,FALSE)","v":"2134BLKGEN"}]
[280,44,"GENE","R1","SUP B4-R26","KPO",null,"Buffer","80X120",null,10,"Logistiport","SUP 12013",2131,1,"NA","SUP B4-R26","Installation des aimants","KIT.12013A",null,null,"OK","OK","OK","Mallette","R1",{"$f":"VLOOKUP(S45,'[1]Extraction Tracking 2905'!D:D,1,FALSE)","v":"KIT.12013A"},null,1,"SUP B4-R26",1,"SUP B4-R261","SUP 12013",{"$f":"VLOOKUP(C45,[2]Feuil2!A:B,2,FALSE)","v":"BLKGEN"},"2131BLKGEN",{"$f":"VLOOKUP(Regroupement!AI45,[2]Wip!AC:AC,1,FALSE)","v":"2131BLKGEN"},{"$f":"VLOOKUP(AI45,[2]Wip!AC:AC,1,FALSE)","v":"2131BLKGEN"}]
[283,45,"GENE","R1","B4-R26","KPO",null,"Buffer","80X120",null,10,"Logistiport",12016,2411,1,"NA","B4-R26","Collage des PT100 sur aimant","KIT.12016A",null,null,"OK","OK","OK","Mallette","R1",{"$f":"VLOOKUP(S46,'[1]Extraction Tracking 2905'!D:D,1,FALSE)","v":"KIT.12016A"},null,1,"B4-R26",1,"B4-R261",12016,{"$f":"VLOOKUP(C46,[2]Feuil2!A:B,2,FALSE)","v":"BLKGEN"},"2411BLKGEN",{"$f":"VLOOKUP(Regroupement!AI46,[2]Wip!AC:AC,1,FALSE)","v":"2411BLKGEN"},{"$f":"VLOOKUP(AI46,[2]Wip!AC:AC,1,FALSE)","v":"2411BLKGEN"}]
[284,46,"GENE","R1","B4-R26","KPO",null,"Buffer","80X120",null,10,"Logistiport",12017,2511,1,"NA","B4-R26","Installation des capteurs airgap sur aimant","KIT.12017A",null,null,"OK","OK","OK","Mallette","R1",{"$f":"VLOOKUP(S47,'[1]Extraction Tracking 2905'!D:D,1,FALSE)","v":"KIT.12017A"},null,1,"B4-R26",2,"B4-R262",12017,{"$f":"VLOOKUP(C47,[2]Feuil2!A:B,2,FALSE)","v":"BLKGEN"},"2511BLKGEN",{"$f":"VLOOKUP(Regroupement!AI47,[2]Wip!AC:AC,1,FALSE)","v":"2511BLKGEN"},{"$f":"VLOOKUP(AI47,[2]Wip!AC:AC,1,FALSE)","v":"2511BLKGEN"}]
[null,47,"GENE","R1","B4-R26","KPO",null,"Buffer","80X120",null,10,"Logistiport",12015,2501,1,"NA","B4-R26","Mise en place des bouchons aimant et rotor","KIT.12015A",null,null,"OK","OK","OK",null,"R1",{"$f":"VLOOKUP(S48,'[1]Extraction Tracking 2905'!D:D,1,FALSE)","v":"KIT.12015A"},null,1,"B4-R26",3,"B4-R263",12015,{"$f":"VLOOKUP(C48,[2]Feuil2!A:B,2,FALSE)","v":"BLKGEN"},"2501BLKGEN",{"$f":"VLOOKUP(Regroupement!AI48,[2]Wip!AC:AC,1,FALSE)","v":"2501BLKGEN"},{"$f":"VLOOKUP(AI48,[2]Wip!AC:AC,1,FALSE)","v":"2501BLKGEN"}]
[null,48,"GENE","R1","B4-R26","KPO",null,"Buffer","80X120",null,10,"Logistiport",12006,2505,1,"NA","B4-R26","Montage des cibles locking pin_","KIT.12006A",null,null,"OK","OK","OK",null,"R1",{"$f":"VLOOKUP(S49,'[1]Extraction Tracking 2905'!D:D,1,FALSE)","v":"KIT.12006A"},null,1,"B4-R26",4,"B4-R264",12006,{"$f":"VLOOKUP(C49,[2]Feuil2!A:B,2,FALSE)","v":"BLKGEN"},"2505BLKGEN",{"$f":"VLOOKUP(Regroupement!AI49,[2]Wip!AC:AC,1,FALSE)","v":"2505BLKGEN"},{"$f":"VLOOKUP(AI49,[2]Wip!AC:AC,1,FALSE)","v":"2505BLKGEN"}]
[null,49,"GENE","R1","B4-R26","KPO",null,"Buffer","80X120",null,10,"Logistiport",12023,2561,1,"NA",{"$f":"E50","v":"B4-R26"},"Desserrage de l'outillage de levage et d'insertion_Modification suite rajout risques dans tableau E","KIT.12023A",null,null,"OK","OK","OK",null,{"$f":"D50","v":"R1"},{"$f":"VLOOKUP(S50,'[1]Extraction Tracking 2905'!D:D,1,FALSE)","v":"KIT.12023A"},null,1,"B4-R26",5,"B4-R265",12023,{"$f":"VLOOKUP(C50,[2]Feuil2!A:B,2,FALSE)","v":"BLKGEN"},"2561BLKGEN",{"$f":"VLOOKUP(Regroupement!AI50,[2]Wip!AC:AC,1,FALSE)","v":"2561BLKGEN"},{"$f":"VLOOKUP(AI50,[2]Wip!AC:AC,1,FALSE)","v":"2561BLKGEN"}]
[288,50,"GENE","R1","B4-R27","KPO","P1","Buffer","80X120",null,10,"Logistiport",12022,2551,1,"NA","B4-R27","Insertion du rotor dans le stator","KIT.12022A",null,null,"OK","OK","OK","Mallette","R1",{"$f":"VLOOKUP(S51,'[1]Extraction Tracking 2905'!D:D,1,FALSE)","v":"KIT.12022A"},null,1,"B4-R27",1,"B4-R271",12022,{"$f":"VLOOKUP(C51,[2]Feuil2!A:B,2,FALSE)","v":"BLKGEN"},"2551BLKGEN",{"$f":"VLOOKUP(Regroupement!AI51,[2]Wip!AC:AC,1,FALSE)","v":"2551BLKGEN"},{"$f":"VLOOKUP(AI51,[2]Wip!AC:AC,1,FALSE)","v":"2551BLKGEN"}]
[234,51,"GENE","S0","B4-R01","Support fournisseur",null,"Direct ligne",null,"Stator",4,"TGO","My Way 11004",1121,1,"NA","B4-R01","Entrée du multiwheeler","My way",null,null,"Support fournisseur","Support fournisseur","Support fournisseur",null,"S0",{"$f":"VLOOKUP(S52,'[1]Extraction Tracking 2905'!D:D,1,FALSE)","v":{"$error":"#N/A"}},null,1,"B4-R01",1,"B4-R011","My Way 11004",{"$f":"VLOOKUP(C52,[2]Feuil2!A:B,2,FALSE)","v":"BLKGEN"},"1121BLKGEN",{"$f":"VLOOKUP(Regroupement!AI52,[2]Wip!AC:AC,1,FALSE)","v":"1121BLKGEN"},{"$f":"VLOOKUP(AI52,[2]Wip!AC:AC,1,FALSE)","v":"1121BLKGEN"}]
[235,52,"GENE","S1","B4-R02","Idea","P1","Buffer",null,"1 pal PP + 1 PAL GAB",10,"Logistiport",11015,1401,1,"NA","B4-R02","Montage de la GAB","KIT.11015A",null,null,"OK","OK","OK","Mallette","S1",{"$f":"VLOOKUP(S53,'[1]Extraction Tracking 2905'!D:D,1,FALSE)","v":"KIT.11015A"},null,1,"B4-R02",1,"B4-R021",11015,{"$f":"VLOOKUP(C53,[2]Feuil2!A:B,2,FALSE)","v":"BLKGEN"},"1401BLKGEN",{"$f":"VLOOKUP(Regroupement!AI53,[2]Wip!AC:AC,1,FALSE)","v":"1401BLKGEN"},{"$f":"VLOOKUP(AI53,[2]Wip!AC:AC,1,FALSE)","v":"1401BLKGEN"}]
[237,53,"GENE","S1","B4-R03","KPO",null,"Buffer","80X121",null,10,"Logistiport",11017,1441,2,"NA","B4-R03","Fixation des hydros","KIT.11017A1",null,null,"OK","OK","OK","Mallette","S1",{"$f":"VLOOKUP(S54,'[1]Extraction Tracking 2905'!D:D,1,FALSE)","v":"KIT.11017A1"},null,2,"B4-R03",1,"B4-R031",11017,{"$f":"VLOOKUP(C54,[2]Feuil2!A:B,2,FALSE)","v":"BLKGEN"},"1441BLKGEN",{"$f":"VLOOKUP(Regroupement!AI54,[2]Wip!AC:AC,1,FALSE)","v":"1441BLKGEN"},{"$f":"VLOOKUP(AI54,[2]Wip!AC:AC,1,FALSE)","v":"1441BLKGEN"}]
[239,55,"GENE","S1","B4-R03","KPO",null,"Buffer","80X123",null,10,"Logistiport",11020,1541,2,"NA","B4-R03","Fixation de la boite HT","KIT.11020A1",null,null,"OK","OK","OK","Mallette","S1",{"$f":"VLOOKUP(S55,'[1]Extraction Tracking 2905'!D:D,1,FALSE)","v":"KIT.11020A1"},null,2,"B4-R03",2,"B4-R032",11020,{"$f":"VLOOKUP(C55,[2]Feuil2!A:B,2,FALSE)","v":"BLKGEN"},"1541BLKGEN",{"$f":"VLOOKUP(Regroupement!AI55,[2]Wip!AC:AC,1,FALSE)","v":"1541BLKGEN"},{"$f":"VLOOKUP(AI55,[2]Wip!AC:AC,1,FALSE)","v":"1541BLKGEN"}]
[240,56,"GENE","S1","B4-R03","KPO",null,"Buffer","80X124",null,10,"Logistiport",11021,1531,1,"NA","B4-R03","Montage des boitiers électrique","KIT.11021A",null,null,"OK","OK","OK","Mallette","S1",{"$f":"VLOOKUP(S56,'[1]Extraction Tracking 2905'!D:D,1,FALSE)","v":"KIT.11021A"},null,1,"B4-R03",3,"B4-R033",11021,{"$f":"VLOOKUP(C56,[2]Feuil2!A:B,2,FALSE)","v":"BLKGEN"},"1531BLKGEN",{"$f":"VLOOKUP(Regroupement!AI56,[2]Wip!AC:AC,1,FALSE)","v":"1531BLKGEN"},{"$f":"VLOOKUP(AI56,[2]Wip!AC:AC,1,FALSE)","v":"1531BLKGEN"}]
[241,57,"GENE","S1","B4-R03","KPO",null,"Buffer","80X125",null,10,"Logistiport",11034,1411,1,"NA","B4-R03","Montage de la plaque de fermeture maintenance","KIT.11034A",null,null,"OK","OK","OK","Mallette","S1",{"$f":"VLOOKUP(S57,'[1]Extraction Tracking 2905'!D:D,1,FALSE)","v":"KIT.11034A"},null,1,"B4-R03",4,"B4-R034",11034,{"$f":"VLOOKUP(C57,[2]Feuil2!A:B,2,FALSE)","v":"BLKGEN"},"1411BLKGEN",{"$f":"VLOOKUP(Regroupement!AI57,[2]Wip!AC:AC,1,FALSE)","v":"1411BLKGEN"},{"$f":"VLOOKUP(AI57,[2]Wip!AC:AC,1,FALSE)","v":"1411BLKGEN"}]
[null,58,"GENE","S1","B4-R03","KPO",null,"Buffer","80X120",null,10,"Logistiport",11040,1415,1,"NA","B4-R03","Montage de l ensembles de cercles","KIT.11040A",null,null,"OK","OK","OK","Mallette",null,null,null,1,"B4-R03",5,"B4-R035",11040,{"$f":"VLOOKUP(C58,[2]Feuil2!A:B,2,FALSE)","v":"BLKGEN"},"1415BLKGEN",{"$f":"VLOOKUP(Regroupement!AI58,[2]Wip!AC:AC,1,FALSE)","v":"1415BLKGEN"},{"$f":"VLOOKUP(AI58,[2]Wip!AC:AC,1,FALSE)","v":"1415BLKGEN"}]
[242,59,"GENE","S1","B4-R04","Support fournisseur",null,"Direct ligne",null,"Hydro",2,"Chantenay",11017,1442,2,"NA","B4-R04","Fixation des hydros","KIT.11017A2",null,null,"Support fournisseur","Support fournisseur","Support fournisseur","Mallette","S1",{"$f":"VLOOKUP(S59,'[1]Extraction Tracking 2905'!D:D,1,FALSE)","v":"KIT.11017A2"},null,2,"B4-R04",1,"B4-R041",11017,{"$f":"VLOOKUP(C59,[2]Feuil2!A:B,2,FALSE)","v":"BLKGEN"},"1442BLKGEN",{"$f":"VLOOKUP(Regroupement!AI59,[2]Wip!AC:AC,1,FALSE)","v":"1442BLKGEN"},{"$f":"VLOOKUP(AI59,[2]Wip!AC:AC,1,FALSE)","v":"1442BLKGEN"}]
[244,60,"GENE","S1","B4-R06","Support fournisseur",null,"Buffer Exterieur",null,"Boite HT",2,"Chantenay",11020,1542,2,"NA","B4-R06","Fixation de la boite HT","KIT.11020A2",null,null,"Support fournisseur","Support fournisseur","Support fournisseur","Mallette","S1",{"$f":"VLOOKUP(S60,'[1]Extraction Tracking 2905'!D:D,1,FALSE)","v":"KIT.11020A2"},null,2,"B4-R06",1,"B4-R061",11020,{"$f":"VLOOKUP(C60,[2]Feuil2!A:B,2,FALSE)","v":"BLKGEN"},"1542BLKGEN",{"$f":"VLOOKUP(Regroupement!AI60,[2]Wip!AC:AC,1,FALSE)","v":"1542BLKGEN"},{"$f":"VLOOKUP(AI60,[2]Wip!AC:AC,1,FALSE)","v":"1542BLKGEN"}]
[243,61,"GENE","S1","B4-R05","KPO",null,"Buffer",null,"Plaque support boite HT",7,"Logistiport",11019,1512,1,"NA","B4-R05","Montage de la plaque support boite HT","KIT.11019A2",null,null,"OK","OK","OK","Mallette","S1",{"$f":"VLOOKUP(S61,'[1]Extraction Tracking 2905'!D:D,1,FALSE)","v":"KIT.11019A2"},null,1,"B4-R05",1,"B4-R051",11019,{"$f":"VLOOKUP(C61,[2]Feuil2!A:B,2,FALSE)","v":"BLKGEN"},"1512BLKGEN",{"$f":"VLOOKUP(Regroupement!AI61,[2]Wip!AC:AC,1,FALSE)","v":"1512BLKGEN"},{"$f":"VLOOKUP(AI61,[2]Wip!AC:AC,1,FALSE)","v":"1512BLKGEN"}]
[245,62,"GENE","S1","B4-R07","KPO","P1","Buffer",null,"Tuyauterie cooling",10,"Logistiport",11018,1631,2,"NA","B4-R07","Fixation des tuyauteries","KIT.11018A1",null,null,"OK","OK","OK","Mallette","S1",{"$f":"VLOOKUP(S62,'[1]Extraction Tracking 2905'!D:D,1,FALSE)","v":"KIT.11018A1"},null,2,"B4-R07",1,"B4-R071",11018,{"$f":"VLOOKUP(C62,[2]Feuil2!A:B,2,FALSE)","v":"BLKGEN"},"1631BLKGEN",{"$f":"VLOOKUP(Regroupement!AI62,[2]Wip!AC:AC,1,FALSE)","v":"1631BLKGEN"},{"$f":"VLOOKUP(AI62,[2]Wip!AC:AC,1,FALSE)","v":"1631BLKGEN"}]
[246,63,"GENE","S1","B4-R07","KPO","P1","Buffer",null,"Tuyauterie cooling",10,"Logistiport",11018,1632,2,"NA","B4-R07","Fixation des tuyauteries","KIT.11018A2",null,null,"OK","OK","OK",null,"S1",{"$f":"VLOOKUP(S63,'[1]Extraction Tracking 2905'!D:D,1,FALSE)","v":"KIT.11018A2"},null,2,"B4-R07",2,"B4-R072",11018,{"$f":"VLOOKUP(C63,[2]Feuil2!A:B,2,FALSE)","v":"BLKGEN"},"1632BLKGEN",{"$f":"VLOOKUP(Regroupement!AI63,[2]Wip!AC:AC,1,FALSE)","v":"1632BLKGEN"},{"$f":"VLOOKUP(AI63,[2]Wip!AC:AC,1,FALSE)","v":"1632BLKGEN"}]
[247,64,"GENE","S1","B4-R09","KPO",null,"Buffer","80X120",null,10,"Logistiport",11005,1501,1,"NA","B4-R09","Installation des chemins de câble","KIT.11005A",null,null,"OK","OK","OK","Mallette","S1",{"$f":"VLOOKUP(S64,'[1]Extraction Tracking 2905'!D:D,1,FALSE)","v":"KIT.11005A"},null,1,"B4-R09",1,"B4-R091",11005,{"$f":"VLOOKUP(C64,[2]Feuil2!A:B,2,FALSE)","v":"BLKGEN"},"1501BLKGEN",{"$f":"VLOOKUP(Regroupement!AI64,[2]Wip!AC:AC,1,FALSE)","v":"1501BLKGEN"},{"$f":"VLOOKUP(AI64,[2]Wip!AC:AC,1,FALSE)","v":"1501BLKGEN"}]
[236,65,"GENE","S1","B4-R09","KPO",null,"Buffer","80X120",null,10,"Logistiport",11016,1431,1,"NA","B4-R09","Pose des joints sur la carcasse","KIT.11016A",null,null,"OK","OK","OK",null,"S1",{"$f":"VLOOKUP(S65,'[1]Extraction Tracking 2905'!D:D,1,FALSE)","v":"KIT.11016A"},null,1,"B4-R09",2,"B4-R092",11016,{"$f":"VLOOKUP(C65,[2]Feuil2!A:B,2,FALSE)","v":"BLKGEN"},"1431BLKGEN",{"$f":"VLOOKUP(Regroupement!AI65,[2]Wip!AC:AC,1,FALSE)","v":"1431BLKGEN"},{"$f":"VLOOKUP(AI65,[2]Wip!AC:AC,1,FALSE)","v":"1431BLKGEN"}]
[248,66,"GENE","S1","B4-R10","KPO","P1","Buffer","80X180",null,10,"Logistiport",11030,1421,{"$f":"COUNTIF(M:M,M66)","v":1},"NA","B4-R10","Préparation et montage des barres support clips et des capteurs NSI","KIT.11030A",null,null,"OK","OK","OK","Mallette","S1",{"$f":"VLOOKUP(S66,'[1]Extraction Tracking 2905'!D:D,1,FALSE)","v":"KIT.11030A"},null,{"$f":"COUNTIF(M:M,M66)","v":1},{"$f":"Q66","v":"B4-R10"},1,{"$f":"AD66&AE66","v":"B4-R101"},{"$f":"M66","v":11030},{"$f":"VLOOKUP(C66,[2]Feuil2!A:B,2,FALSE)","v":"BLKGEN"},"1421BLKGEN",{"$f":"VLOOKUP(Regroupement!AI66,[2]Wip!AC:AC,1,FALSE)","v":"1421BLKGEN"},{"$f":"VLOOKUP(AI66,[2]Wip!AC:AC,1,FALSE)","v":"1421BLKGEN"}]
[249,67,"GENE","S1","B4-R11","Idea","P1","Buffer","80X120",null,10,"Logistiport",11023,1611,1,"NA",{"$f":"E67","v":"B4-R11"},"Montage des donuts intérieurs","KIT.11023A",null,null,"OK","OK","OK","Mallette",{"$f":"D67","v":"S1"},{"$f":"VLOOKUP(S67,'[1]Extraction Tracking 2905'!D:D,1,FALSE)","v":"KIT.11023A"},null,1,"B4-R11",1,"B4-R111",11023,{"$f":"VLOOKUP(C67,[2]Feuil2!A:B,2,FALSE)","v":"BLKGEN"},{"$f":"N67&AH67","v":"1611BLKGEN"},{"$f":"VLOOKUP(Regroupement!AI67,[2]Wip!AC:AC,1,FALSE)","v":"1611BLKGEN"},{"$f":"VLOOKUP(AI67,[2]Wip!AC:AC,1,FALSE)","v":"1611BLKGEN"}]
[250,68,"GENE","S1","B4-R12","KPO",null,"Buffer","80X120","1 PAL Part Presentation + 1 PAL Sleeve + 1 PAL Locking Pin",10,"Logistiport",11024,1711,1,"NA","B4-R12","Fixation de la sleeve locking pin et locking pin","KIT.11024A",null,null,"OK","OK","OK","Mallette","S1",{"$f":"VLOOKUP(S68,'[1]Extraction Tracking 2905'!D:D,1,FALSE)","v":"KIT.11024A"},null,1,"B4-R12",{"$f":"IF(AD68=AD67,AE67+1,1)","v":1},"B4-R121",11024,{"$f":"VLOOKUP(C68,[2]Feuil2!A:B,2,FALSE)","v":"BLKGEN"},"1711BLKGEN",{"$f":"VLOOKUP(Regroupement!AI68,[2]Wip!AC:AC,1,FALSE)","v":"1711BLKGEN"},{"$f":"VLOOKUP(AI68,[2]Wip!AC:AC,1,FALSE)","v":"1711BLKGEN"}]
[252,69,"GENE","S1","B4-R12","KPO",null,"Buffer","80X120","1 PAL Part Presentation + 1 PAL Sleeve + 1 PAL Locking Pin",10,"Logistiport",11032,1721,1,"NA","B4-R12","Montage des balais intérieurs stator","KIT.11032A",null,null,"OK","OK","OK","Mallette","S1",{"$f":"VLOOKUP(S69,'[1]Extraction Tracking 2905'!D:D,1,FALSE)","v":"KIT.11032A"},null,1,"B4-R12",2,"B4-R122",11032,{"$f":"VLOOKUP(C69,[2]Feuil2!A:B,2,FALSE)","v":"BLKGEN"},"1721BLKGEN",{"$f":"VLOOKUP(Regroupement!AI69,[2]Wip!AC:AC,1,FALSE)","v":"1721BLKGEN"},{"$f":"VLOOKUP(AI69,[2]Wip!AC:AC,1,FALSE)","v":"1721BLKGEN"}]
[255,70,"GENE","S1","B4-R13","Idea","P1","Buffer","2X80X120","Pal 1/2",10,"Logistiport",11022,1621,1,"NA","B4-R13","Câblage boite auxiliaire","KIT.11022A",null,null,"OK","OK","OK","Mallette","S1",{"$f":"VLOOKUP(S70,'[1]Extraction Tracking 2905'!D:D,1,FALSE)","v":"KIT.11022A"},null,1,"B4-R13",1,"B4-R131",11022,{"$f":"VLOOKUP(C70,[2]Feuil2!A:B,2,FALSE)","v":"BLKGEN"},"1621BLKGEN",{"$f":"VLOOKUP(Regroupement!AI70,[2]Wip!AC:AC,1,FALSE)","v":"1621BLKGEN"},{"$f":"VLOOKUP(AI70,[2]Wip!AC:AC,1,FALSE)","v":"1621BLKGEN"}]
[261,71,"GENE","S2","B4-R18","KPO",null,"Buffer","80X120",null,10,"Logistiport",11028,4111,1,"NA","B4-R18","Installation des capteurs Airgap","KIT.11028A",null,null,"OK","OK","OK",null,"S2",{"$f":"VLOOKUP(S71,'[1]Extraction Tracking 2905'!D:D,1,FALSE)","v":"KIT.11028A"},null,1,"B4-R18",1,"B4-R181",11028,{"$f":"VLOOKUP(C71,[2]Feuil2!A:B,2,FALSE)","v":"BLKGEN"},"4111BLKGEN",{"$f":"VLOOKUP(Regroupement!AI71,[2]Wip!AC:AC,1,FALSE)","v":"4111BLKGEN"},{"$f":"VLOOKUP(AI71,[2]Wip!AC:AC,1,FALSE)","v":"4111BLKGEN"}]
[262,72,"GENE","S2","B4-R18","KPO",null,"Buffer","80X120",null,10,"Logistiport",11035,3301,1,"NA","B4-R18","Câblage des sondes plots","KIT.11035A",null,null,"OK","OK","OK","Mallette","S2",{"$f":"VLOOKUP(S72,'[1]Extraction Tracking 2905'!D:D,1,FALSE)","v":"KIT.11035A"},null,1,"B4-R18",2,"B4-R182",11035,{"$f":"VLOOKUP(C72,[2]Feuil2!A:B,2,FALSE)","v":"BLKGEN"},"3301BLKGEN",{"$f":"VLOOKUP(Regroupement!AI72,[2]Wip!AC:AC,1,FALSE)","v":"3301BLKGEN"},{"$f":"VLOOKUP(AI72,[2]Wip!AC:AC,1,FALSE)","v":"3301BLKGEN"}]
[264,73,"GENE","S2","B4-R18","KPO",null,"Buffer","80X120",null,10,"Logistiport",11036,3121,1,"NA","B4-R18","Câblage des capteurs","KIT.11036A",null,null,"OK","OK","OK","Mallette","S2",{"$f":"VLOOKUP(S73,'[1]Extraction Tracking 2905'!D:D,1,FALSE)","v":"KIT.11036A"},null,1,"B4-R18",3,"B4-R183",11036,{"$f":"VLOOKUP(C73,[2]Feuil2!A:B,2,FALSE)","v":"BLKGEN"},"3121BLKGEN",{"$f":"VLOOKUP(Regroupement!AI73,[2]Wip!AC:AC,1,FALSE)","v":"3121BLKGEN"},{"$f":"VLOOKUP(AI73,[2]Wip!AC:AC,1,FALSE)","v":"3121BLKGEN"}]
[null,74,"GENE","S2","B4-R18","KPO",null,"Buffer","80X120",null,10,"Logistiport",11048,3201,1,"NA","B4-R18","Montage du capteur de course du locking pin","KIT.11048A",null,null,"OK","OK","OK",null,null,{"$f":"VLOOKUP(S74,'[1]Extraction Tracking 2905'!D:D,1,FALSE)","v":"KIT.11048A"},null,1,"B4-R18",4,"B4-R184",11048,{"$f":"VLOOKUP(C74,[2]Feuil2!A:B,2,FALSE)","v":"BLKGEN"},"3201BLKGEN",{"$f":"VLOOKUP(Regroupement!AI74,[2]Wip!AC:AC,1,FALSE)","v":"3201BLKGEN"},{"$f":"VLOOKUP(AI74,[2]Wip!AC:AC,1,FALSE)","v":"3201BLKGEN"}]
[null,75,"GENE","S2","B4-R18","KPO",null,"Buffer","80X120",null,10,"Logistiport",11031,3450,1,"NA","B4-R18","Preparation du cablage Ripwire","KIT.11031A",null,null,"OK","OK","OK","Mallette",null,{"$f":"VLOOKUP(S75,'[1]Extraction Tracking 2905'!D:D,1,FALSE)","v":"KIT.11031A"},null,1,"B4-R18",5,"B4-R185",11031,{"$f":"VLOOKUP(C75,[2]Feuil2!A:B,2,FALSE)","v":"BLKGEN"},"3450BLKGEN",{"$f":"VLOOKUP(Regroupement!AI75,[2]Wip!AC:AC,1,FALSE)","v":"3450BLKGEN"},{"$f":"VLOOKUP(AI75,[2]Wip!AC:AC,1,FALSE)","v":"3450BLKGEN"}]
[265,76,"GENE","S2","B4-R20","Support fournisseur",null,"Direct ligne","80X120","Plos",7,"Chantenay",11026,3101,1,"NA","B4-R20","Montage des plots","KIT.11026A",null,null,"Support fournisseur","Support fournisseur","Support fournisseur",null,"S2",{"$f":"VLOOKUP(S76,'[1]Extraction Tracking 2905'!D:D,1,FALSE)","v":"KIT.11026A"},null,1,"B4-R20",1,"B4-R201",11026,{"$f":"VLOOKUP(C76,[2]Feuil2!A:B,2,FALSE)","v":"BLKGEN"},"3101BLKGEN",{"$f":"VLOOKUP(Regroupement!AI76,[2]Wip!AC:AC,1,FALSE)","v":"3101BLKGEN"},{"$f":"VLOOKUP(AI76,[2]Wip!AC:AC,1,FALSE)","v":"3101BLKGEN"}]
[266,77,"GENE","S2","B4-R19","KPO",null,"Buffer","80X120",null,10,"Logistiport",11037,4221,1,"NA","B4-R19","Nettoyage","KIT.11037A",null,null,"OK","OK","OK",null,"S2",{"$f":"VLOOKUP(S77,'[1]Extraction Tracking 2905'!D:D,1,FALSE)","v":"KIT.11037A"},null,1,"B4-R19",1,"B4-R191",11037,{"$f":"VLOOKUP(C77,[2]Feuil2!A:B,2,FALSE)","v":"BLKGEN"},"4221BLKGEN",{"$f":"VLOOKUP(Regroupement!AI77,[2]Wip!AC:AC,1,FALSE)","v":"4221BLKGEN"},{"$f":"VLOOKUP(AI77,[2]Wip!AC:AC,1,FALSE)","v":"4221BLKGEN"}]
[268,78,"GENE","S2","B4-R19","KPO",null,"Buffer","80X120",null,10,"Logistiport",11042,4201,1,"NA","B4-R19","Mise à longueur des câbles de plots et raccordement aux cercles","KIT.11042A",null,null,"OK","OK","OK","Mallette","S2",{"$f":"VLOOKUP(S78,'[1]Extraction Tracking 2905'!D:D,1,FALSE)","v":"KIT.11042A"},null,1,"B4-R19",2,"B4-R192",11042,{"$f":"VLOOKUP(C78,[2]Feuil2!A:B,2,FALSE)","v":"BLKGEN"},"4201BLKGEN",{"$f":"VLOOKUP(Regroupement!AI78,[2]Wip!AC:AC,1,FALSE)","v":"4201BLKGEN"},{"$f":"VLOOKUP(AI78,[2]Wip!AC:AC,1,FALSE)","v":"4201BLKGEN"}]
[269,79,"GENE","S2","B4-R19","KPO",null,"Buffer","80X120",null,10,"Logistiport",11043,4211,1,"NA","B4-R19","Montage support RIPWIRE sur plot","KIT.11043A",null,null,"OK","OK","OK","Mallette","S2",{"$f":"VLOOKUP(S79,'[1]Extraction Tracking 2905'!D:D,1,FALSE)","v":"KIT.11043A"},null,1,"B4-R19",3,"B4-R193",11043,{"$f":"VLOOKUP(C79,[2]Feuil2!A:B,2,FALSE)","v":"BLKGEN"},"4211BLKGEN",{"$f":"VLOOKUP(Regroupement!AI79,[2]Wip!AC:AC,1,FALSE)","v":"4211BLKGEN"},{"$f":"VLOOKUP(AI79,[2]Wip!AC:AC,1,FALSE)","v":"4211BLKGEN"}]
[251,80,"GENE","S2","B4-R19","KPO",null,"Buffer","80X120","1 PAL Part Presentation + 1 PAL Sleeve + 1 PAL Locking Pin",10,"Logistiport",11029,4205,1,"NA",{"$f":"E80","v":"B4-R19"},"Montage des bouteilles sur stator","KIT.11029A",null,null,"OK","OK","OK","Mallette",{"$f":"D80","v":"S2"},{"$f":"VLOOKUP(S80,'[1]Extraction Tracking 2905'!D:D,1,FALSE)","v":"KIT.11029A"},null,1,"B4-R19",4,"B4-R194",11029,{"$f":"VLOOKUP(C80,[2]Feuil2!A:B,2,FALSE)","v":"BLKGEN"},"4205BLKGEN",{"$f":"VLOOKUP(Regroupement!AI80,[2]Wip!AC:AC,1,FALSE)","v":"4205BLKGEN"},{"$f":"VLOOKUP(AI80,[2]Wip!AC:AC,1,FALSE)","v":"4205BLKGEN"}]
[1,81,"Block 1","3.01","B1-01","Support fournisseur",null,"Direct ligne",null,"Brake Disc",7,"TGO","My Way 25000",831,1,"NA","B1-01","Réception du disque de frein. Installation sur supports et préparation des surfaces","My way","KIT.25000B","KIT.25000C","Support fournisseur","Support fournisseur","Support fournisseur",null,"3.01",{"$f":"VLOOKUP(S81,'[1]Extraction Tracking 2905'!D:D,1,FALSE)","v":{"$error":"#N/A"}},"sup myw",1,"B1-01",1,"B1-011","My Way 25000",{"$f":"VLOOKUP(C81,[2]Feuil2!A:B,2,FALSE)","v":"BLK1-1"},"831BLK1-1",{"$f":"VLOOKUP(Regroupement!AI81,[2]Wip!AC:AC,1,FALSE)","v":"831BLK1-1"},{"$f":"VLOOKUP(AI81,[2]Wip!AC:AC,1,FALSE)","v":"831BLK1-1"}]
[2,82,"Block 1","3.01","B1-02","Support fournisseur",null,"Direct ligne",null,"YAW BEARING, HALIADE 150",7,"TGO","My Way 25030",851,1,"NA","B1-02","Premontage roulement yaw: Réception du roulement de yaw Installation sur supports sur disque de frein.","My way","KIT.25030B","KIT.25030C","Support fournisseur","Support fournisseur","Support fournisseur",null,"3.01",{"$f":"VLOOKUP(S82,'[1]Extraction Tracking 2905'!D:D,1,FALSE)","v":{"$error":"#N/A"}},"sup myw",1,"B1-02",1,"B1-021","My Way 25030",{"$f":"VLOOKUP(C82,[2]Feuil2!A:B,2,FALSE)","v":"BLK1-1"},"851BLK1-1",{"$f":"VLOOKUP(Regroupement!AI82,[2]Wip!AC:AC,1,FALSE)","v":"851BLK1-1"},{"$f":"VLOOKUP(AI82,[2]Wip!AC:AC,1,FALSE)","v":"851BLK1-1"}]
[4,83,"Block 1","3.01","B1-04","KPO","P2","Buffer","80X120",null,10,"Logistiport",25032,741,1,"NA","B1-04","Premontage roulement yaw: Montage des bouteilles de retour de graisse, des raccords d'injection et des tubes du système de lubrification","KIT.25032A","KIT.25032B","KIT.25032C","OK","OK","OK",null,"3.01",{"$f":"VLOOKUP(S83,'[1]Extraction Tracking 2905'!D:D,1,FALSE)","v":"KIT.25032A"},null,1,"B1-04",1,"B1-041",25032,{"$f":"VLOOKUP(C83,[2]Feuil2!A:B,2,FALSE)","v":"BLK1-1"},"741BLK1-1",{"$f":"VLOOKUP(Regroupement!AI83,[2]Wip!AC:AC,1,FALSE)","v":"741BLK1-1"},{"$f":"VLOOKUP(AI83,[2]Wip!AC:AC,1,FALSE)","v":"741BLK1-1"}]
[5,84,"Block 1","3.01","B1-05","#NA MALETTE UNIQUEMENT",null,null,"mallette Bulk uniquement",null,"NA","Usine",25090,861,1,"NA","B1-05","Liaison roulement - disque de frein",{"$f":"\"Mallette \"&M84","v":"Mallette 25090"},"KIT.25090B","KIT.25090C",null,null,null,"Mallette Uniquement","3.01",{"$f":"VLOOKUP(S84,'[1]Extraction Tracking 2905'!D:D,1,FALSE)","v":{"$error":"#N/A"}},null,1,"B1-05",1,"B1-051",25090,{"$f":"VLOOKUP(C84,[2]Feuil2!A:B,2,FALSE)","v":"BLK1-1"},"861BLK1-1",{"$f":"VLOOKUP(Regroupement!AI84,[2]Wip!AC:AC,1,FALSE)","v":"861BLK1-1"},{"$f":"VLOOKUP(AI84,[2]Wip!AC:AC,1,FALSE)","v":"861BLK1-1"}]
[6,85,"Block 1","3.10","B1-06","KPO","Visserie","Buffer","2X80X120","PAL 1/2",10,"Logistiport",25190,101,1,"NA","B1-06","LEVAGE_DU_BC_ET_MISE_EN_PLACE_SUR_LE_ROULEMENT_DE_YAW","KIT.25190A","KIT.25190B","KIT.25190C","OK","OK","OK",null,"3.10",{"$f":"VLOOKUP(S85,'[1]Extraction Tracking 2905'!D:D,1,FALSE)","v":"KIT.25190A"},null,1,"B1-06",1,"B1-061",25190,{"$f":"VLOOKUP(C85,[2]Feuil2!A:B,2,FALSE)","v":"BLK1-1"},"101BLK1-1",{"$f":"VLOOKUP(Regroupement!AI85,[2]Wip!AC:AC,1,FALSE)","v":"101BLK1-1"},{"$f":"VLOOKUP(AI85,[2]Wip!AC:AC,1,FALSE)","v":"101BLK1-1"}]
[7,86,"Block 1","3.10","B1-06","KPO","Visserie","Buffer","2X80X120","PAL 1/2",10,"Logistiport",25200,241,1,"NA","B1-06","VISSAGE_DE_L UNION_BC_ROULEMENT_YAW","KIT.25200A","KIT.25200B","KIT.25200C","OK","OK","OK",null,"3.10",{"$f":"VLOOKUP(S86,'[1]Extraction Tracking 2905'!D:D,1,FALSE)","v":"KIT.25200A"},null,1,"B1-06",2,"B1-062",25200,{"$f":"VLOOKUP(C86,[2]Feuil2!A:B,2,FALSE)","v":"BLK1-1"},"241BLK1-1",{"$f":"VLOOKUP(Regroupement!AI86,[2]Wip!AC:AC,1,FALSE)","v":"241BLK1-1"},{"$f":"VLOOKUP(AI86,[2]Wip!AC:AC,1,FALSE)","v":"241BLK1-1"}]
[8,87,"Block 1","3.10","B1-07","KPO","P1","Buffer","80X120",null,10,"Logistiport",25135,116,1,"NA","B1-07","Prémontage du bâti central: Montage des protections sols en bâti central.","KIT.25135A","KIT.25135B","KIT.25135C","OK","OK","OK","Mallette","3.10",{"$f":"VLOOKUP(S87,'[1]Extraction Tracking 2905'!D:D,1,FALSE)","v":"KIT.25135A"},null,1,"B1-07",1,"B1-071",25135,{"$f":"VLOOKUP(C87,[2]Feuil2!A:B,2,FALSE)","v":"BLK1-1"},"116BLK1-1",{"$f":"VLOOKUP(Regroupement!AI87,[2]Wip!AC:AC,1,FALSE)","v":"116BLK1-1"},{"$f":"VLOOKUP(AI87,[2]Wip!AC:AC,1,FALSE)","v":"116BLK1-1"}]
[9,88,"Block 1","3.10","B1-07","KPO","P1","Buffer","80X120",null,10,"Logistiport",25170,111,1,"NA","B1-07","Prémontage du bâti central: Montage du sol du BC.","KIT.25170A","KIT.25170B","KIT.25170C","OK","OK","OK","Mallette","3.10",{"$f":"VLOOKUP(S88,'[1]Extraction Tracking 2905'!D:D,1,FALSE)","v":"KIT.25170A"},null,1,"B1-07",2,"B1-072",25170,{"$f":"VLOOKUP(C88,[2]Feuil2!A:B,2,FALSE)","v":"BLK1-1"},"111BLK1-1",{"$f":"VLOOKUP(Regroupement!AI88,[2]Wip!AC:AC,1,FALSE)","v":"111BLK1-1"},{"$f":"VLOOKUP(AI88,[2]Wip!AC:AC,1,FALSE)","v":"111BLK1-1"}]
[10,89,"Block 1","3.10","B1-08","KPO",null,"Buffer","80X120",null,10,"Logistiport",25411,1471,1,"NA","B1-08","Montage des pignons de graissage de la couronne du Yaw. Réaliser les connexions hydrauliques entre les pignons et la pompe à graisse.","KIT.25411A","KIT.25411B","KIT.25411C","OK","OK","OK","Mallette","3.10",{"$f":"VLOOKUP(S89,'[1]Extraction Tracking 2905'!D:D,1,FALSE)","v":"KIT.25411A"},null,1,"B1-08",1,"B1-081",25411,{"$f":"VLOOKUP(C89,[2]Feuil2!A:B,2,FALSE)","v":"BLK1-1"},"1471BLK1-1",{"$f":"VLOOKUP(Regroupement!AI89,[2]Wip!AC:AC,1,FALSE)","v":"1471BLK1-1"},{"$f":"VLOOKUP(AI89,[2]Wip!AC:AC,1,FALSE)","v":"1471BLK1-1"}]
[11,90,"Block 1","3.10","B1-08","KPO",null,"Buffer","80X120",null,10,"Logistiport",25420,236,1,"NA","B1-08","Prémontage du bâti central: Montage de la pompe à graisse du roulement du Yaw sur la structure du sol.","KIT.25420A","KIT.25420B","KIT.25420C","OK","OK","OK","Mallette","3.10",{"$f":"VLOOKUP(S90,'[1]Extraction Tracking 2905'!D:D,1,FALSE)","v":"KIT.25420A"},null,1,"B1-08",2,"B1-082",25420,{"$f":"VLOOKUP(C90,[2]Feuil2!A:B,2,FALSE)","v":"BLK1-1"},"236BLK1-1",{"$f":"VLOOKUP(Regroupement!AI90,[2]Wip!AC:AC,1,FALSE)","v":"236BLK1-1"},{"$f":"VLOOKUP(AI90,[2]Wip!AC:AC,1,FALSE)","v":"236BLK1-1"}]
[12,91,"Block 1","3.10","B1-08","KPO",null,"Buffer","80X120",null,10,"Logistiport",25430,226,1,"NA","B1-08","Prémontage du bâti central: Montage de la pompe de lubrification du BC.","KIT.25430A","KIT.25430B","KIT.25430C","OK","OK","OK","Mallette","3.10",{"$f":"VLOOKUP(S91,'[1]Extraction Tracking 2905'!D:D,1,FALSE)","v":"KIT.25430A"},null,1,"B1-08",3,"B1-083",25430,{"$f":"VLOOKUP(C91,[2]Feuil2!A:B,2,FALSE)","v":"BLK1-1"},"226BLK1-1",{"$f":"VLOOKUP(Regroupement!AI91,[2]Wip!AC:AC,1,FALSE)","v":"226BLK1-1"},{"$f":"VLOOKUP(AI91,[2]Wip!AC:AC,1,FALSE)","v":"226BLK1-1"}]
[13,92,"Block 1","3.10","B1-08","KPO",null,"Buffer","80X120",null,10,"Logistiport",25431,231,1,"NA","B1-08","Prémontage du bâti central: Montage de la prise électrique et de la pompe sur le support de la pompe à graisse du roulement du yaw.","KIT.25431A","KIT.25431B","KIT.25431C","OK","OK","OK","Mallette","3.10",{"$f":"VLOOKUP(S92,'[1]Extraction Tracking 2905'!D:D,1,FALSE)","v":"KIT.25431A"},null,1,"B1-08",4,"B1-084",25431,{"$f":"VLOOKUP(C92,[2]Feuil2!A:B,2,FALSE)","v":"BLK1-1"},"231BLK1-1",{"$f":"VLOOKUP(Regroupement!AI92,[2]Wip!AC:AC,1,FALSE)","v":"231BLK1-1"},{"$f":"VLOOKUP(AI92,[2]Wip!AC:AC,1,FALSE)","v":"231BLK1-1"}]
[14,93,"Block 1","3.10","B1-08","KPO",null,"Buffer","80X120",null,10,"Logistiport",26130,721,1,"NA","B1-08","Montage des supports de capot inférieur du bâti central",{"$f":"\"Mallette \"&M93","v":"Mallette 26130"},"KIT.26130B","KIT.26130C","OK","OK","OK","Mallette Uniquement","3.10",{"$f":"VLOOKUP(S93,'[1]Extraction Tracking 2905'!D:D,1,FALSE)","v":{"$error":"#N/A"}},null,1,"B1-08",5,"B1-085",26130,{"$f":"VLOOKUP(C93,[2]Feuil2!A:B,2,FALSE)","v":"BLK1-1"},"721BLK1-1",{"$f":"VLOOKUP(Regroupement!AI93,[2]Wip!AC:AC,1,FALSE)","v":"721BLK1-1"},{"$f":"VLOOKUP(AI93,[2]Wip!AC:AC,1,FALSE)","v":"721BLK1-1"}]
[15,94,"Block 1","3.10","B1-08","KPO",null,"Buffer","80X120",null,10,"Logistiport",26131,641,1,"NA","B1-08","Pré-assemblage des supports de capot inférieur du bâti central","KIT.26131A","KIT.26131B","KIT.26131C","OK","OK","OK","Mallette","3.10",{"$f":"VLOOKUP(S94,'[1]Extraction Tracking 2905'!D:D,1,FALSE)","v":"KIT.26131A"},null,1,"B1-08",6,"B1-086",26131,{"$f":"VLOOKUP(C94,[2]Feuil2!A:B,2,FALSE)","v":"BLK1-1"},"641BLK1-1",{"$f":"VLOOKUP(Regroupement!AI94,[2]Wip!AC:AC,1,FALSE)","v":"641BLK1-1"},{"$f":"VLOOKUP(AI94,[2]Wip!AC:AC,1,FALSE)","v":"641BLK1-1"}]
[16,95,"Block 1","3.10","B1-08","KPO",null,"Buffer","80X120",null,10,"Logistiport",26334,631,1,"NA","B1-08","Prémontage du bâti central: Montage des injecteurs du système de lubrification du Yaw sur BC. Connexions hydrauliques entre injecteurs et pompe de graissage.","KIT.26334A","KIT.26334B","KIT.26334C","OK","OK","OK","Mallette","3.10",{"$f":"VLOOKUP(S95,'[1]Extraction Tracking 2905'!D:D,1,FALSE)","v":"KIT.26334A"},null,1,"B1-08",7,"B1-087",26334,{"$f":"VLOOKUP(C95,[2]Feuil2!A:B,2,FALSE)","v":"BLK1-1"},"631BLK1-1",{"$f":"VLOOKUP(Regroupement!AI95,[2]Wip!AC:AC,1,FALSE)","v":"631BLK1-1"},{"$f":"VLOOKUP(AI95,[2]Wip!AC:AC,1,FALSE)","v":"631BLK1-1"}]
[17,96,"Block 1","3.10","B1-09","KPO",null,"Buffer","3X80X120","PAL 1/3 (Pinces de frein)",10,"Logistiport",25370,401,1,"NA","B1-09","Mise en place des pinces de frein sur le BC (x8)","KIT.25370A","KIT.25370B","KIT.25370C","OK","OK","OK",null,"3.10",{"$f":"VLOOKUP(S96,'[1]Extraction Tracking 2905'!D:D,1,FALSE)","v":"KIT.25370A"},null,1,"B1-09",1,"B1-091",25370,{"$f":"VLOOKUP(C96,[2]Feuil2!A:B,2,FALSE)","v":"BLK1-1"},"401BLK1-1",{"$f":"VLOOKUP(Regroupement!AI96,[2]Wip!AC:AC,1,FALSE)","v":"401BLK1-1"},{"$f":"VLOOKUP(AI96,[2]Wip!AC:AC,1,FALSE)","v":"401BLK1-1"}]
[18,97,"Block 1","3.10","B1-09","KPO",null,"Buffer","3X80X120","PAL 1/3 (Pinces de frein)",10,"Logistiport",25371,421,1,"NA","B1-09","Connexions hydrauliques entre les pinces de frein et la centrale hydraulique.","KIT.25371A","KIT.25371B","KIT.25371C","OK","OK","OK",null,"3.10",{"$f":"VLOOKUP(S97,'[1]Extraction Tracking 2905'!D:D,1,FALSE)","v":"KIT.25371A"},null,1,"B1-09",2,"B1-092",25371,{"$f":"VLOOKUP(C97,[2]Feuil2!A:B,2,FALSE)","v":"BLK1-1"},"421BLK1-1",{"$f":"VLOOKUP(Regroupement!AI97,[2]Wip!AC:AC,1,FALSE)","v":"421BLK1-1"},{"$f":"VLOOKUP(AI97,[2]Wip!AC:AC,1,FALSE)","v":"421BLK1-1"}]
[19,98,"Block 1","3.10","B1-10","KPO","Visserie","Buffer","2X80X120",null,10,"Logistiport",25050,511,1,"NA","B1-10","Placer les goujons du roulement de l'union roulement - disque de frein - tour","KIT.25050A","KIT.25050B","KIT.25050C","OK","OK","OK",null,"3.10",{"$f":"VLOOKUP(S98,'[1]Extraction Tracking 2905'!D:D,1,FALSE)","v":"KIT.25050A"},null,1,"B1-10",1,"B1-101",25050,{"$f":"VLOOKUP(C98,[2]Feuil2!A:B,2,FALSE)","v":"BLK1-1"},"511BLK1-1",{"$f":"VLOOKUP(Regroupement!AI98,[2]Wip!AC:AC,1,FALSE)","v":"511BLK1-1"},{"$f":"VLOOKUP(AI98,[2]Wip!AC:AC,1,FALSE)","v":"511BLK1-1"}]
[20,99,"Block 1","3.10","B1-11","KPO","P1","Buffer","80X120","Fibre",7,"Chantenay",25540,751,1,"NA","B1-11","Montage des carters du roulement du Yaw.","KIT.25540A","KIT.25540B","KIT.25540C","OK","OK","OK","Mallette","3.10",{"$f":"VLOOKUP(S99,'[1]Extraction Tracking 2905'!D:D,1,FALSE)","v":"KIT.25540A"},null,1,"B1-11",1,"B1-111",25540,{"$f":"VLOOKUP(C99,[2]Feuil2!A:B,2,FALSE)","v":"BLK1-1"},"751BLK1-1",{"$f":"VLOOKUP(Regroupement!AI99,[2]Wip!AC:AC,1,FALSE)","v":"751BLK1-1"},{"$f":"VLOOKUP(AI99,[2]Wip!AC:AC,1,FALSE)","v":"751BLK1-1"}]
[21,100,"Block 1","3.10","B1-12","KPO",null,"Buffer","80X120","1 pal PP + centrale hydraulique",10,"Logistiport",25450,131,1,"NA","B1-12","Prémontage du bâti central: Montage de l'armoire électrique NC1 dans le bâti central","KIT.25450A","KIT.25450B1","KIT.25450C1","OK","OK","OK","Mallette","3.10",{"$f":"VLOOKUP(S100,'[1]Extraction Tracking 2905'!D:D,1,FALSE)","v":"KIT.25450A"},null,1,"B1-12",1,"B1-121",25450,{"$f":"VLOOKUP(C100,[2]Feuil2!A:B,2,FALSE)","v":"BLK1-1"},"131BLK1-1",{"$f":"VLOOKUP(Regroupement!AI100,[2]Wip!AC:AC,1,FALSE)","v":"131BLK1-1"},{"$f":"VLOOKUP(AI100,[2]Wip!AC:AC,1,FALSE)","v":"131BLK1-1"}]
[22,101,"Block 1","3.10","B1-12","KPO",null,"Buffer","80X120","1 pal PP + centrale hydraulique",10,"Logistiport",25460,201,1,"NA","B1-12","Prémontage du bâti central: Montage de l'armoire électrique NC2 dans le bâti central. Routeage final système d'extinction incendie.","KIT.25460A","KIT.25460B","KIT.25460C","OK","OK","OK","Mallette","3.10",{"$f":"VLOOKUP(S101,'[1]Extraction Tracking 2905'!D:D,1,FALSE)","v":"KIT.25460A"},null,1,"B1-12",2,"B1-122",25460,{"$f":"VLOOKUP(C101,[2]Feuil2!A:B,2,FALSE)","v":"BLK1-1"},"201BLK1-1",{"$f":"VLOOKUP(Regroupement!AI101,[2]Wip!AC:AC,1,FALSE)","v":"201BLK1-1"},{"$f":"VLOOKUP(AI101,[2]Wip!AC:AC,1,FALSE)","v":"201BLK1-1"}]
[25,102,"Block 1","3.10","B1-12","KPO",null,"Buffer","80X120","1 pal PP + centrale hydraulique",10,"Logistiport",25440,106,2,"NA","B1-12","Prémontage du NC2: Montage de la centrale hydraulique du yaw sur la structure NC2. Remplir et mettre le filtre. Montage système d'extinction incendie.","KIT.25440A","KIT.25440B","KIT.25440C","OK","OK","OK","Mallette","3.10",{"$f":"VLOOKUP(S102,'[1]Extraction Tracking 2905'!D:D,1,FALSE)","v":"KIT.25440A"},null,2,"B1-12",3,"B1-123",25440,{"$f":"VLOOKUP(C102,[2]Feuil2!A:B,2,FALSE)","v":"BLK1-1"},"106BLK1-1",{"$f":"VLOOKUP(Regroupement!AI102,[2]Wip!AC:AC,1,FALSE)","v":"106BLK1-1"},{"$f":"VLOOKUP(AI102,[2]Wip!AC:AC,1,FALSE)","v":"106BLK1-1"}]
[26,103,"Block 1","3.10A/B","B1-16","Support fournisseur",null,"Buffer",null,"YAW GEARBOX",10,"Logistiport",25220,761,1,"NA","B1-16","Prémontage de motoréducteurs de Yaw: Déballage des motoréducteurs et remplissage d'huile (x7).","KIT.25220A","KIT.25220B1","KIT.25220C1","Support fournisseur",null,null,null,"3.10A/B",{"$f":"VLOOKUP(S103,'[1]Extraction Tracking 2905'!D:D,1,FALSE)","v":"KIT.25220A"},null,1,"B1-16",1,"B1-161",25220,{"$f":"VLOOKUP(C103,[2]Feuil2!A:B,2,FALSE)","v":"BLK1-1"},"761BLK1-1",{"$f":"VLOOKUP(Regroupement!AI103,[2]Wip!AC:AC,1,FALSE)","v":"761BLK1-1"},{"$f":"VLOOKUP(AI103,[2]Wip!AC:AC,1,FALSE)","v":"761BLK1-1"}]
[27,104,"Block 1","3.10A/B","B1-17","KPO",null,"Buffer","80X120",null,10,"Logistiport",25270,611,1,"NA","B1-17","Pré serrage du 1er motoréducteur d'orientation sur le BC.","KIT.25270A","KIT.25270B1","KIT.25270C1","OK","OK","OK",null,"3.10A/B",{"$f":"VLOOKUP(S104,'[1]Extraction Tracking 2905'!D:D,1,FALSE)","v":"KIT.25270A"},null,1,"B1-17",1,"B1-171",25270,{"$f":"VLOOKUP(C104,[2]Feuil2!A:B,2,FALSE)","v":"BLK1-1"},"611BLK1-1",{"$f":"VLOOKUP(Regroupement!AI104,[2]Wip!AC:AC,1,FALSE)","v":"611BLK1-1"},{"$f":"VLOOKUP(AI104,[2]Wip!AC:AC,1,FALSE)","v":"611BLK1-1"}]
[28,105,"Block 1","3.10A/B","B1-17","KPO",null,"Buffer","80X120",null,10,"Logistiport",25280,621,1,"NA","B1-17","REGLAGE_ET_CALAGE_DE_LA_COURONNE_DU_PREMIER_MOTOREDUCTEUR_DU_YAW","KIT.25280A","KIT.25280B","KIT.25280C","OK","OK","OK",null,"3.10A/B",{"$f":"VLOOKUP(S105,'[1]Extraction Tracking 2905'!D:D,1,FALSE)","v":"KIT.25280A"},null,1,"B1-17",2,"B1-172",25280,{"$f":"VLOOKUP(C105,[2]Feuil2!A:B,2,FALSE)","v":"BLK1-1"},"621BLK1-1",{"$f":"VLOOKUP(Regroupement!AI105,[2]Wip!AC:AC,1,FALSE)","v":"621BLK1-1"},{"$f":"VLOOKUP(AI105,[2]Wip!AC:AC,1,FALSE)","v":"621BLK1-1"}]
[29,106,"Block 1","3.10A/B","B1-17","KPO",null,"Buffer","80X120",null,10,"Logistiport",25285,1201,1,"NA","B1-17","Réglage et calage de la couronne des motoréducteurs   2, 3, 4, 5, 6 et 7.","KIT.25285A","KIT.25285B1","KIT.25285C1","OK","OK","OK",null,"3.10A/B",{"$f":"VLOOKUP(S106,'[1]Extraction Tracking 2905'!D:D,1,FALSE)","v":"KIT.25285A"},null,1,"B1-17",3,"B1-173",25285,{"$f":"VLOOKUP(C106,[2]Feuil2!A:B,2,FALSE)","v":"BLK1-1"},"1201BLK1-1",{"$f":"VLOOKUP(Regroupement!AI106,[2]Wip!AC:AC,1,FALSE)","v":"1201BLK1-1"},{"$f":"VLOOKUP(AI106,[2]Wip!AC:AC,1,FALSE)","v":"1201BLK1-1"}]
[null,107,"Block 1","3.10A/B","B1-17","KPO",null,"Buffer","80X120",null,10,"Logistiport",25284,626,1,"NA","B1-17","REGLAGE_ET_CALAGE_DE_LA_COURONNE_DU_MOTOREDUCTEUR_No_7","KIT.25284A",null,null,"OK","OK","OK",null,null,null,null,1,"B1-17",4,"B1-174",25284,{"$f":"VLOOKUP(C107,[2]Feuil2!A:B,2,FALSE)","v":"BLK1-1"},"626BLK1-1",{"$f":"VLOOKUP(Regroupement!AI107,[2]Wip!AC:AC,1,FALSE)","v":"626BLK1-1"},{"$f":"VLOOKUP(AI107,[2]Wip!AC:AC,1,FALSE)","v":"626BLK1-1"}]
[null,108,"Block 1","3.10A/B","B1-18","KPO","P2","Buffer","80X120",null,10,"Logistiport",80103,211,1,"NA","B1-18","ROUTAGE_CAPTEURS_D USURE_DES_PINCES_DE_FREIN_DANS_LA_BI_SUR_LES_CHEMINS_DE_CABLES","KIT.80103A",null,null,"OK","OK","OK","Mallette","3.10A/B",null,null,1,"B1-18",1,"B1-181",80103,{"$f":"VLOOKUP(C108,[2]Feuil2!A:B,2,FALSE)","v":"BLK1-1"},"211BLK1-1",{"$f":"VLOOKUP(Regroupement!AI108,[2]Wip!AC:AC,1,FALSE)","v":"211BLK1-1"},{"$f":"VLOOKUP(AI108,[2]Wip!AC:AC,1,FALSE)","v":"211BLK1-1"}]
[null,109,"Block 1","3.10A/B","B1-18","KPO","P2","Buffer","80X120",null,10,"Logistiport",80104,221,1,"NA","B1-18","PREMONTAGE_DU_BATI_CENTRAL_CABLAGE_ELECTRIQUE_NC1_DANS_BATI_CENTRAL","KIT.80104A",null,null,"OK","OK","OK","Mallette","3.10A/B",null,null,1,"B1-18",2,"B1-182",80104,{"$f":"VLOOKUP(C109,[2]Feuil2!A:B,2,FALSE)","v":"BLK1-1"},"221BLK1-1",{"$f":"VLOOKUP(Regroupement!AI109,[2]Wip!AC:AC,1,FALSE)","v":"221BLK1-1"},{"$f":"VLOOKUP(AI109,[2]Wip!AC:AC,1,FALSE)","v":"221BLK1-1"}]
[34,110,"Block 1","3.10A/B","B1-18","KPO","P2","Buffer","80X120",null,10,"Logistiport",80106,151,1,"NA","B1-18","Prémontage de motoréducteurs de yaw:  Prémontage électrique câbles rallonge outil PS0039 (x7)","KIT.80106A","KIT.80106B","KIT.80106C","OK","OK","OK","Mallette","3.10A/B",{"$f":"VLOOKUP(S110,'[1]Extraction Tracking 2905'!D:D,1,FALSE)","v":"KIT.80106A"},null,1,"B1-18",3,"B1-183",80106,{"$f":"VLOOKUP(C110,[2]Feuil2!A:B,2,FALSE)","v":"BLK1-1"},"151BLK1-1",{"$f":"VLOOKUP(Regroupement!AI110,[2]Wip!AC:AC,1,FALSE)","v":"151BLK1-1"},{"$f":"VLOOKUP(AI110,[2]Wip!AC:AC,1,FALSE)","v":"151BLK1-1"}]
[31,111,"Block 1","3.10A/B","B1-18,5","KPO","P2","Buffer","80X120",null,10,"Logistiport",80101,411,2,"NA",{"$f":"E111","v":"B1-18,5"},"Prémontage du NC1:  Câblage électrique NC1. Connection des torons et routeage en chemins des câbles du NC1.","KIT.80101A","KIT.80101B","KIT.80101C","OK","OK","OK","Mallette",{"$f":"D111","v":"3.10A/B"},{"$f":"VLOOKUP(S111,'[1]Extraction Tracking 2905'!D:D,1,FALSE)","v":"KIT.80101A"},null,2,"B1-18,5",1,"B1-18,51",80101,{"$f":"VLOOKUP(C111,[2]Feuil2!A:B,2,FALSE)","v":"BLK1-1"},"411BLK1-1",{"$f":"VLOOKUP(Regroupement!AI111,[2]Wip!AC:AC,1,FALSE)","v":"411BLK1-1"},{"$f":"VLOOKUP(AI111,[2]Wip!AC:AC,1,FALSE)","v":"411BLK1-1"}]
[32,112,"Block 1","3.10A/B","B1-18,5","KPO","P2","Buffer","80X120",null,10,"Logistiport",80102,501,1,"NA",{"$f":"E112","v":"B1-18,5"},"Prémontage du NC2:  Câblage électrique NC2 et groupe hydraulique. Connection des torons et routeage en chemins des câbles du NC2.","KIT.80102A","KIT.80102B","KIT.80102C","OK","OK","OK","Mallette",{"$f":"D112","v":"3.10A/B"},{"$f":"VLOOKUP(S112,'[1]Extraction Tracking 2905'!D:D,1,FALSE)","v":"KIT.80102A"},null,1,"B1-18,5",2,"B1-18,52",80102,{"$f":"VLOOKUP(C112,[2]Feuil2!A:B,2,FALSE)","v":"BLK1-1"},"501BLK1-1",{"$f":"VLOOKUP(Regroupement!AI112,[2]Wip!AC:AC,1,FALSE)","v":"501BLK1-1"},{"$f":"VLOOKUP(AI112,[2]Wip!AC:AC,1,FALSE)","v":"501BLK1-1"}]
[23,113,"Block 1","3.10","B1-13","Support fournisseur",null,"Buffer","NC1",null,7,"Logistiport",80101,412,2,"NA",{"$f":"E113","v":"B1-13"},"PREMONTAGE_DU_BATI_CENTRAL_MONTAGE_DE_L ARMOIRE_ELECTRIQUE_NC1_DANS_LE_BATI_CENTRAL","KIT.80101A2",null,null,"Support fournisseur",null,null,"Mallette",{"$f":"D113","v":"3.10"},{"$f":"VLOOKUP(S113,'[1]Extraction Tracking 2905'!D:D,1,FALSE)","v":{"$error":"#N/A"}},null,2,"B1-13",1,"B1-131",80101,{"$f":"VLOOKUP(C113,[2]Feuil2!A:B,2,FALSE)","v":"BLK1-1"},"412BLK1-1",{"$f":"VLOOKUP(Regroupement!AI113,[2]Wip!AC:AC,1,FALSE)","v":"412BLK1-1"},{"$f":"VLOOKUP(AI113,[2]Wip!AC:AC,1,FALSE)","v":"412BLK1-1"}]
[24,114,"Block 1","3.10","B1-14","Support fournisseur",null,"Buffer","NC2",null,7,"Logistiport",25440,107,2,"NA",{"$f":"E114","v":"B1-14"},"PREMONTAGE_DU_BATI_CENTRAL_MONTAGE_DE_L ARMOIRE_ELECTRIQUE_NC1_DANS_LE_BATI_CENTRAL","KIT.25440A2",null,null,"Support fournisseur",null,null,"Mallette",{"$f":"D114","v":"3.10"},{"$f":"VLOOKUP(S114,'[1]Extraction Tracking 2905'!D:D,1,FALSE)","v":{"$error":"#N/A"}},null,2,"B1-14",1,"B1-141",25440,{"$f":"VLOOKUP(C114,[2]Feuil2!A:B,2,FALSE)","v":"BLK1-1"},"107BLK1-1",{"$f":"VLOOKUP(Regroupement!AI114,[2]Wip!AC:AC,1,FALSE)","v":"107BLK1-1"},{"$f":"VLOOKUP(AI114,[2]Wip!AC:AC,1,FALSE)","v":"107BLK1-1"}]
[35,115,"Block 1","3.15","B1-19","KPO",null,"Buffer","80X120",null,10,"Logistiport",25376,1421,1,"NA","B1-19","Prémontage du capteur d'enroulement des câbles du Yaw.","KIT.25376A","KIT.25376B","KIT.25376C","OK","OK","OK","Mallette","3.15",{"$f":"VLOOKUP(S115,'[1]Extraction Tracking 2905'!D:D,1,FALSE)","v":"KIT.25376A"},null,1,"B1-19",1,"B1-191",25376,{"$f":"VLOOKUP(C115,[2]Feuil2!A:B,2,FALSE)","v":"BLK1-1"},"1421BLK1-1",{"$f":"VLOOKUP(Regroupement!AI115,[2]Wip!AC:AC,1,FALSE)","v":"1421BLK1-1"},{"$f":"VLOOKUP(AI115,[2]Wip!AC:AC,1,FALSE)","v":"1421BLK1-1"}]
[36,116,"Block 1","3.15","B1-19","KPO",null,"Buffer","80X120",null,10,"Logistiport",25377,1431,1,"NA","B1-19","Prémontage du système paratonnerre de la nacelle.","KIT.25377A","KIT.25377B","KIT.25377C","OK","OK","OK","Mallette","3.15",{"$f":"VLOOKUP(S116,'[1]Extraction Tracking 2905'!D:D,1,FALSE)","v":"KIT.25377A"},null,1,"B1-19",2,"B1-192",25377,{"$f":"VLOOKUP(C116,[2]Feuil2!A:B,2,FALSE)","v":"BLK1-1"},"1431BLK1-1",{"$f":"VLOOKUP(Regroupement!AI116,[2]Wip!AC:AC,1,FALSE)","v":"1431BLK1-1"},{"$f":"VLOOKUP(AI116,[2]Wip!AC:AC,1,FALSE)","v":"1431BLK1-1"}]
[37,117,"Block 1","3.15","B1-19","KPO",null,"Buffer","80X120",null,10,"Logistiport",25378,1441,1,"NA","B1-19","Prémontage ensemble sensors de securité grue giratoire","KIT.25378A","KIT.25378B","KIT.25378C","OK","OK","OK","Mallette","3.15",{"$f":"VLOOKUP(S117,'[1]Extraction Tracking 2905'!D:D,1,FALSE)","v":"KIT.25378A"},null,1,"B1-19",3,"B1-193",25378,{"$f":"VLOOKUP(C117,[2]Feuil2!A:B,2,FALSE)","v":"BLK1-1"},"1441BLK1-1",{"$f":"VLOOKUP(Regroupement!AI117,[2]Wip!AC:AC,1,FALSE)","v":"1441BLK1-1"},{"$f":"VLOOKUP(AI117,[2]Wip!AC:AC,1,FALSE)","v":"1441BLK1-1"}]
[38,118,"Block 1","3.15","B1-20","KPO",null,"Buffer","80X120",null,10,"Logistiport",26200,1321,1,"NA","B1-20","Graissage de la couronne du roulement d'orientation","KIT.26200A","KIT.26200B","KIT.26200C","OK","OK","OK",null,"3.15",{"$f":"VLOOKUP(S118,'[1]Extraction Tracking 2905'!D:D,1,FALSE)","v":"KIT.26200A"},null,1,"B1-20",1,"B1-201",26200,{"$f":"VLOOKUP(C118,[2]Feuil2!A:B,2,FALSE)","v":"BLK1-1"},"1321BLK1-1",{"$f":"VLOOKUP(Regroupement!AI118,[2]Wip!AC:AC,1,FALSE)","v":"1321BLK1-1"},{"$f":"VLOOKUP(AI118,[2]Wip!AC:AC,1,FALSE)","v":"1321BLK1-1"}]
[39,119,"Block 1","3.15","B1-21","Support fournisseur",null,"Buffer Exterieur",null,"Plate forme lateral Droite",10,"Logistiport",26230,1406,1,"NA","B1-21","PREMONTAGE_DU_BATI_CENTRAL_PREMONTAGE_DE_LA_PLATEFORME_LATERALE_DROITE","KIT.26230A","KIT.26230B","KIT.26230C","Support fournisseur","NA","NA",null,"3.15",{"$f":"VLOOKUP(S119,'[1]Extraction Tracking 2905'!D:D,1,FALSE)","v":"KIT.26230A"},null,1,"B1-21",1,"B1-211",26230,{"$f":"VLOOKUP(C119,[2]Feuil2!A:B,2,FALSE)","v":"BLK1-1"},"1406BLK1-1",{"$f":"VLOOKUP(Regroupement!AI119,[2]Wip!AC:AC,1,FALSE)","v":"1406BLK1-1"},{"$f":"VLOOKUP(AI119,[2]Wip!AC:AC,1,FALSE)","v":"1406BLK1-1"}]
[41,120,"Block 1","3.15","B1-24","KPO","P1","Buffer","Revoir dim en faisant","1 plal PP + 1 pal Pompe",10,"Logistiport",26220,1401,2,"NA","B1-24","PREMONTAGE_DU_BATI_CENTRAL_MONTAGE_DE_LA_POMPE_SUR_LA_PLATEFORME_LATERAILE_GAUCHE","KIT.26220A",null,null,"OK","OK","OK","Mallette","3.15","KIT.26220A",null,2,"B1-24",1,"B1-241",26220,{"$f":"VLOOKUP(C120,[2]Feuil2!A:B,2,FALSE)","v":"BLK1-1"},"1401BLK1-1",{"$f":"VLOOKUP(Regroupement!AI120,[2]Wip!AC:AC,1,FALSE)","v":"1401BLK1-1"},{"$f":"VLOOKUP(AI120,[2]Wip!AC:AC,1,FALSE)","v":"1401BLK1-1"}]
[43,121,"Block 1","3.15","B1-24","KPO",null,"Buffer","80X120","1 plal PP + 1 pal Pompe",10,"Logistiport",26250,1411,1,"NA","B1-24","Prémontage du bâti central: Montage des plateformes gauche et droite.","KIT.26250A","KIT.26250B","KIT.26250C","OK","OK","OK","Mallette","3.15",{"$f":"VLOOKUP(S121,'[1]Extraction Tracking 2905'!D:D,1,FALSE)","v":"KIT.26250A"},null,1,"B1-24",2,"B1-242",26250,{"$f":"VLOOKUP(C121,[2]Feuil2!A:B,2,FALSE)","v":"BLK1-1"},"1411BLK1-1",{"$f":"VLOOKUP(Regroupement!AI121,[2]Wip!AC:AC,1,FALSE)","v":"1411BLK1-1"},{"$f":"VLOOKUP(AI121,[2]Wip!AC:AC,1,FALSE)","v":"1411BLK1-1"}]
[40,122,"Block 1","3.15","B1-22","Support fournisseur",null,"Buffer Exterieur",null,"Plate forme lateral Gauche",10,"Logistiport",26220,1402,2,"NA",{"$f":"E122","v":"B1-22"},"PREMONTAGE_DU_BATI_CENTRAL_MONTAGE_DE_LA_POMPE_SUR_LA_PLATEFORME_LATERAILE_GAUCHE","KIT.26229A2","KIT.26229B","KIT.26229C","Support fournisseur","NA","NA","Mallette",{"$f":"D122","v":"3.15"},{"$f":"VLOOKUP(S122,'[1]Extraction Tracking 2905'!D:D,1,FALSE)","v":{"$error":"#N/A"}},null,2,"B1-22",1,"B1-221",26220,{"$f":"VLOOKUP(C122,[2]Feuil2!A:B,2,FALSE)","v":"BLK1-1"},"1402BLK1-1",{"$f":"VLOOKUP(Regroupement!AI122,[2]Wip!AC:AC,1,FALSE)","v":"1402BLK1-1"},{"$f":"VLOOKUP(AI122,[2]Wip!AC:AC,1,FALSE)","v":"1402BLK1-1"}]
[46,123,"Block 1","3.15","B1-26","KPO","P1","Buffer","80X120",null,10,"Logistiport",26255,1501,1,"NA","B1-26","MONTAGE_DES_PILIERS_DE_GARDE_CORPS_DEVANT_LA_PORTE_DU_BATI_DE_TRANSPORT","KIT.26255A","KIT.26255B","KIT.26255C","OK","OK","OK","Mallette",{"$f":"D123","v":"3.15"},{"$f":"VLOOKUP(S123,'[1]Extraction Tracking 2905'!D:D,1,FALSE)","v":{"$error":"#N/A"}},null,1,"B1-26",1,"B1-261",26255,{"$f":"VLOOKUP(C123,[2]Feuil2!A:B,2,FALSE)","v":"BLK1-1"},"1501BLK1-1",{"$f":"VLOOKUP(Regroupement!AI123,[2]Wip!AC:AC,1,FALSE)","v":"1501BLK1-1"},{"$f":"VLOOKUP(AI123,[2]Wip!AC:AC,1,FALSE)","v":"1501BLK1-1"}]
[47,124,"Block 1","3.20","B1-27","KPO","P1","Buffer","200X80",null,10,"Logistiport",25590,3101,1,"NA","B1-27","Montage de la structure A sur le BC.","KIT.25590A","KIT.25590B","KIT.25590C","OK","OK","OK",null,"3.20",{"$f":"VLOOKUP(S124,'[1]Extraction Tracking 2905'!D:D,1,FALSE)","v":"KIT.25590A"},null,1,"B1-27",1,"B1-271",25590,{"$f":"VLOOKUP(C124,[2]Feuil2!A:B,2,FALSE)","v":"BLK1-1"},"3101BLK1-1",{"$f":"VLOOKUP(Regroupement!AI124,[2]Wip!AC:AC,1,FALSE)","v":"3101BLK1-1"},{"$f":"VLOOKUP(AI124,[2]Wip!AC:AC,1,FALSE)","v":"3101BLK1-1"}]
[48,125,"Block 1","3.20","B1-27","KPO","P1","Buffer","200X80",null,10,"Logistiport",25620,3111,1,"NA","B1-27","Assemblage de la structure B sur la nacelle.","KIT.25620A","KIT.25620B","KIT.25620C","OK","OK","OK",null,"3.20",{"$f":"VLOOKUP(S125,'[1]Extraction Tracking 2905'!D:D,1,FALSE)","v":"KIT.25620A"},null,1,"B1-27",2,"B1-272",25620,{"$f":"VLOOKUP(C125,[2]Feuil2!A:B,2,FALSE)","v":"BLK1-1"},"3111BLK1-1",{"$f":"VLOOKUP(Regroupement!AI125,[2]Wip!AC:AC,1,FALSE)","v":"3111BLK1-1"},{"$f":"VLOOKUP(AI125,[2]Wip!AC:AC,1,FALSE)","v":"3111BLK1-1"}]
[49,126,"Block 1","3.20","B1-28","KPO","P1","Buffer","325X100",null,10,"Logistiport",25650,3221,1,"NA","B1-28","Union des supports de fibre avec la structure B et union avec le système de ventilation de la nacelle",{"$f":"\"Mallette \"&M126","v":"Mallette 25650"},"KIT.25650B","KIT.25650C","OK","OK","OK","Mallette Uniquement","3.20",{"$f":"VLOOKUP(S126,'[1]Extraction Tracking 2905'!D:D,1,FALSE)","v":{"$error":"#N/A"}},null,1,"B1-28",1,"B1-281",25650,{"$f":"VLOOKUP(C126,[2]Feuil2!A:B,2,FALSE)","v":"BLK1-1"},"3221BLK1-1",{"$f":"VLOOKUP(Regroupement!AI126,[2]Wip!AC:AC,1,FALSE)","v":"3221BLK1-1"},{"$f":"VLOOKUP(AI126,[2]Wip!AC:AC,1,FALSE)","v":"3221BLK1-1"}]
[50,127,"Block 1","3.20","B1-28","KPO","P1","Buffer","325X100",null,10,"Logistiport",26000,3261,1,"NA","B1-28","Prémontage de la grille, des barrières et de la porte rétractable de l'escalier d'accès à la plateforme latérale droite-plateforme supérieure.","KIT.26000A","KIT.26000B","KIT.26000C","OK","OK","OK","Mallette","3.20",{"$f":"VLOOKUP(S127,'[1]Extraction Tracking 2905'!D:D,1,FALSE)","v":"KIT.26000A"},null,1,"B1-28",2,"B1-282",26000,{"$f":"VLOOKUP(C127,[2]Feuil2!A:B,2,FALSE)","v":"BLK1-1"},"3261BLK1-1",{"$f":"VLOOKUP(Regroupement!AI127,[2]Wip!AC:AC,1,FALSE)","v":"3261BLK1-1"},{"$f":"VLOOKUP(AI127,[2]Wip!AC:AC,1,FALSE)","v":"3261BLK1-1"}]
[51,128,"Block 1","3.20","B1-28","KPO","P1","Buffer","325X100",null,10,"Logistiport",26010,3271,1,"NA","B1-28","Prémontage de l'escalier d'accès à la plateforme latérale gauche- plateforme supérieure.","KIT.26010A","KIT.26010B","KIT.26010C","OK","OK","OK","Mallette","3.20",{"$f":"VLOOKUP(S128,'[1]Extraction Tracking 2905'!D:D,1,FALSE)","v":"KIT.26010A"},null,1,"B1-28",3,"B1-283",26010,{"$f":"VLOOKUP(C128,[2]Feuil2!A:B,2,FALSE)","v":"BLK1-1"},"3271BLK1-1",{"$f":"VLOOKUP(Regroupement!AI128,[2]Wip!AC:AC,1,FALSE)","v":"3271BLK1-1"},{"$f":"VLOOKUP(AI128,[2]Wip!AC:AC,1,FALSE)","v":"3271BLK1-1"}]
[52,129,"Block 1","3.20","B1-28","KPO","P1","Buffer","325X100",null,10,"Logistiport",26030,3291,1,"NA","B1-28","Montage de l'escalier d'accès à la plateforme latérale droite-plateforme supérieure.","KIT.26030A","KIT.26030B","KIT.26030C","OK","OK","OK","Mallette","3.20",{"$f":"VLOOKUP(S129,'[1]Extraction Tracking 2905'!D:D,1,FALSE)","v":"KIT.26030A"},null,1,"B1-28",4,"B1-284",26030,{"$f":"VLOOKUP(C129,[2]Feuil2!A:B,2,FALSE)","v":"BLK1-1"},"3291BLK1-1",{"$f":"VLOOKUP(Regroupement!AI129,[2]Wip!AC:AC,1,FALSE)","v":"3291BLK1-1"},{"$f":"VLOOKUP(AI129,[2]Wip!AC:AC,1,FALSE)","v":"3291BLK1-1"}]
[53,130,"Block 1","3.20","B1-28","KPO","P1","Buffer","325X100",null,10,"Logistiport",26251,3251,{"$f":"COUNTIF(M:M,M130)","v":1},"NA","B1-28","Montage de la plateforme supérieure du BC","KIT.26251A","KIT.26251B","KIT.26251C","OK","OK","OK","Mallette","3.20",{"$f":"VLOOKUP(S130,'[1]Extraction Tracking 2905'!D:D,1,FALSE)","v":"KIT.26251A"},null,{"$f":"COUNTIF(M:M,M130)","v":1},{"$f":"Q130","v":"B1-28"},5,{"$f":"AD130&AE130","v":"B1-285"},{"$f":"M130","v":26251},{"$f":"VLOOKUP(C130,[2]Feuil2!A:B,2,FALSE)","v":"BLK1-1"},"3251BLK1-1",{"$f":"VLOOKUP(Regroupement!AI130,[2]Wip!AC:AC,1,FALSE)","v":"3251BLK1-1"},{"$f":"VLOOKUP(AI130,[2]Wip!AC:AC,1,FALSE)","v":"3251BLK1-1"}]
[54,131,"Block 1","3.20","B1-28","KPO","P1","Buffer","325X100",null,10,"Logistiport",26252,3286,1,"NA",{"$f":"E131","v":"B1-28"},"Montage de l'escalier d'accès à la plateforme latérale gauche-plateforme supérieure.","KIT.26252A",null,null,"OK","OK","OK","Mallette","3.20",{"$f":"VLOOKUP(S131,'[1]Extraction Tracking 2905'!D:D,1,FALSE)","v":"KIT.26252A"},null,1,"B1-28",6,"B1-286",26252,{"$f":"VLOOKUP(C131,[2]Feuil2!A:B,2,FALSE)","v":"BLK1-1"},{"$f":"N131&AH131","v":"3286BLK1-1"},{"$f":"VLOOKUP(Regroupement!AI131,[2]Wip!AC:AC,1,FALSE)","v":"3286BLK1-1"},{"$f":"VLOOKUP(AI131,[2]Wip!AC:AC,1,FALSE)","v":"3286BLK1-1"}]
[55,132,"Block 1","3.20","B1-28","KPO","P1","Buffer","325X100",null,10,"Logistiport",26260,6371,1,"NA","B1-28","Montage de l'échelle intérieure du BC.","KIT.26260A","KIT.26260B","KIT.26260C","OK","OK","OK","Mallette","3.20",{"$f":"VLOOKUP(S132,'[1]Extraction Tracking 2905'!D:D,1,FALSE)","v":"KIT.26260A"},null,1,"B1-28",{"$f":"IF(AD132=AD131,AE131+1,1)","v":7},"B1-287",26260,{"$f":"VLOOKUP(C132,[2]Feuil2!A:B,2,FALSE)","v":"BLK1-1"},"6371BLK1-1",{"$f":"VLOOKUP(Regroupement!AI132,[2]Wip!AC:AC,1,FALSE)","v":"6371BLK1-1"},{"$f":"VLOOKUP(AI132,[2]Wip!AC:AC,1,FALSE)","v":"6371BLK1-1"}]
[58,133,"Block 1","3.20","B1-30","KPO",null,"Buffer","80X120",null,10,"Logistiport",80016,3201,1,"NA","B1-30","Préparation câbles paratonnerre bâti central","KIT.80016A","KIT.80016B","KIT.80016C","OK","OK","OK",null,"3.20",{"$f":"VLOOKUP(S133,'[1]Extraction Tracking 2905'!D:D,1,FALSE)","v":"KIT.80016A"},null,1,"B1-30",1,"B1-301",80016,{"$f":"VLOOKUP(C133,[2]Feuil2!A:B,2,FALSE)","v":"BLK1-1"},"3201BLK1-1",{"$f":"VLOOKUP(Regroupement!AI133,[2]Wip!AC:AC,1,FALSE)","v":"3201BLK1-1"},{"$f":"VLOOKUP(AI133,[2]Wip!AC:AC,1,FALSE)","v":"3201BLK1-1"}]
[59,134,"Block 1","3.20","B1-30","KPO",null,"Buffer","80X120",null,10,"Logistiport",80114,3231,1,"NA","B1-30","Routage électrique structure A + B après l'assemblage","KIT.80114A","KIT.80114B","KIT.80114C","OK","OK","OK",null,"3.20",{"$f":"VLOOKUP(S134,'[1]Extraction Tracking 2905'!D:D,1,FALSE)","v":"KIT.80114A"},null,1,"B1-30",2,"B1-302",80114,{"$f":"VLOOKUP(C134,[2]Feuil2!A:B,2,FALSE)","v":"BLK1-1"},"3231BLK1-1",{"$f":"VLOOKUP(Regroupement!AI134,[2]Wip!AC:AC,1,FALSE)","v":"3231BLK1-1"},{"$f":"VLOOKUP(AI134,[2]Wip!AC:AC,1,FALSE)","v":"3231BLK1-1"}]
[60,135,"Block 1","3.20","B1-30","KPO",null,"Buffer","80X120",null,10,"Logistiport",80115,3281,1,"NA","B1-30","Connexions électriques structure A+ B après l'assemblage","KIT.80115A","KIT.80115B","KIT.80115C","OK","OK","OK",null,"3.20",{"$f":"VLOOKUP(S135,'[1]Extraction Tracking 2905'!D:D,1,FALSE)","v":"KIT.80115A"},null,1,"B1-30",3,"B1-303",80115,{"$f":"VLOOKUP(C135,[2]Feuil2!A:B,2,FALSE)","v":"BLK1-1"},"3281BLK1-1",{"$f":"VLOOKUP(Regroupement!AI135,[2]Wip!AC:AC,1,FALSE)","v":"3281BLK1-1"},{"$f":"VLOOKUP(AI135,[2]Wip!AC:AC,1,FALSE)","v":"3281BLK1-1"}]
[64,136,"Block 1","3.21A","B1-32","KPO",null,"Buffer","80X120","Accessoires structure A",10,"Logistiport",25560,2251,2,"NA","B1-32","Prémontage de la  structure A: Montage du système de ventilation de la nacelle.","KIT.25560A","KIT.25560B1","KIT.25560C1","OK","OK","OK","Mallette","3.21A",{"$f":"VLOOKUP(S136,'[1]Extraction Tracking 2905'!D:D,1,FALSE)","v":"KIT.25560A"},"KIT.25560A1",2,"B1-32",1,"B1-321",25560,{"$f":"VLOOKUP(C136,[2]Feuil2!A:B,2,FALSE)","v":"BLK1-1"},"2251BLK1-1",{"$f":"VLOOKUP(Regroupement!AI136,[2]Wip!AC:AC,1,FALSE)","v":"2251BLK1-1"},{"$f":"VLOOKUP(AI136,[2]Wip!AC:AC,1,FALSE)","v":"2251BLK1-1"}]
[null,137,"Block 1","3.21A","B1-32,5","KPO",null,"Buffer Exterieur",null,"STRUCTURE A",7,"Logistiport",25560,2252,2,null,"B1-32,5",null,"KIT.25560A2",null,null,"OK","OK","OK",null,null,null,null,null,"B1-32,5",1,"B1-32,51",25560,{"$f":"VLOOKUP(C137,[2]Feuil2!A:B,2,FALSE)","v":"BLK1-1"},"2252BLK1-1",{"$f":"VLOOKUP(Regroupement!AI137,[2]Wip!AC:AC,1,FALSE)","v":"2252BLK1-1"},{"$f":"VLOOKUP(AI137,[2]Wip!AC:AC,1,FALSE)","v":"2252BLK1-1"}]
[65,138,"Block 1","3.21A","B1-33","KPO","P2","Buffer","80X120",null,10,"Logistiport",25561,2231,1,"NA","B1-33","Prémontage de la  structure A: Montage de la boite de contrôle de la balise.","KIT.25561A","KIT.25561B","KIT.25561C","OK","OK","OK","Mallette","3.21A",{"$f":"VLOOKUP(S138,'[1]Extraction Tracking 2905'!D:D,1,FALSE)","v":"KIT.25561A"},null,{"$f":"COUNTIF(M:M,M138)","v":1},"B1-33",1,"B1-331",25561,{"$f":"VLOOKUP(C138,[2]Feuil2!A:B,2,FALSE)","v":"BLK1-1"},"2231BLK1-1",{"$f":"VLOOKUP(Regroupement!AI138,[2]Wip!AC:AC,1,FALSE)","v":"2231BLK1-1"},{"$f":"VLOOKUP(AI138,[2]Wip!AC:AC,1,FALSE)","v":"2231BLK1-1"}]
[66,139,"Block 1","3.21A","B1-34","KPO","P1","Buffer","80X120",null,10,"Logistiport",25580,2241,1,"NA","B1-34","Prémontage de la  structure A: Montage des chemins de câbles auxiliaires, sondes de température et d'humidité, de l'alarme et des connecteurs des capteurs","KIT.25580A","KIT.25580B","KIT.25580C","OK","OK","OK","Mallette","3.21A",{"$f":"VLOOKUP(S139,'[1]Extraction Tracking 2905'!D:D,1,FALSE)","v":"KIT.25580A"},null,1,"B1-34",1,"B1-341",25580,{"$f":"VLOOKUP(C139,[2]Feuil2!A:B,2,FALSE)","v":"BLK1-1"},"2241BLK1-1",{"$f":"VLOOKUP(Regroupement!AI139,[2]Wip!AC:AC,1,FALSE)","v":"2241BLK1-1"},{"$f":"VLOOKUP(AI139,[2]Wip!AC:AC,1,FALSE)","v":"2241BLK1-1"}]
[67,140,"Block 1","3.21A","B1-34","KPO","P1","Buffer","80X120",null,10,"Logistiport",80109,2601,1,"NA","B1-34","Prémontage de la  structure A: Câblage électrique","KIT.80109A","KIT.80109B","KIT.80109C","OK","OK","OK","Mallette","3.21A",{"$f":"VLOOKUP(S140,'[1]Extraction Tracking 2905'!D:D,1,FALSE)","v":"KIT.80109A"},null,1,"B1-34",2,"B1-342",80109,{"$f":"VLOOKUP(C140,[2]Feuil2!A:B,2,FALSE)","v":"BLK1-1"},"2601BLK1-1",{"$f":"VLOOKUP(Regroupement!AI140,[2]Wip!AC:AC,1,FALSE)","v":"2601BLK1-1"},{"$f":"VLOOKUP(AI140,[2]Wip!AC:AC,1,FALSE)","v":"2601BLK1-1"}]
[68,141,"Block 1","3.21A","B1-35","KPO",null,"Buffer","80X120",null,10,"Logistiport",25562,2301,1,"NA","B1-35","Prémontage de la  structure A: Montage des luminaires.","KIT.25562A","KIT.25562B","KIT.25562C","OK","OK","OK","Mallette","3.21A",{"$f":"VLOOKUP(S141,'[1]Extraction Tracking 2905'!D:D,1,FALSE)","v":"KIT.25562A"},null,1,"B1-35",1,"B1-351",25562,{"$f":"VLOOKUP(C141,[2]Feuil2!A:B,2,FALSE)","v":"BLK1-1"},"2301BLK1-1",{"$f":"VLOOKUP(Regroupement!AI141,[2]Wip!AC:AC,1,FALSE)","v":"2301BLK1-1"},{"$f":"VLOOKUP(AI141,[2]Wip!AC:AC,1,FALSE)","v":"2301BLK1-1"}]
[69,142,"Block 1","3.21A","B1-35","KPO",null,"Buffer","80X120",null,10,"Logistiport",25563,2311,1,"NA","B1-35","PREMONTAGE_DE_LA_STRUCTURE_A_MONTAGE_DES_SUPPORTS_D EXTINCTEURS","KIT.25563A","KIT.25563B","KIT.25563C","OK","OK","OK","Mallette","3.21A",{"$f":"VLOOKUP(S142,'[1]Extraction Tracking 2905'!D:D,1,FALSE)","v":"KIT.25563A"},null,1,"B1-35",2,"B1-352",25563,{"$f":"VLOOKUP(C142,[2]Feuil2!A:B,2,FALSE)","v":"BLK1-1"},"2311BLK1-1",{"$f":"VLOOKUP(Regroupement!AI142,[2]Wip!AC:AC,1,FALSE)","v":"2311BLK1-1"},{"$f":"VLOOKUP(AI142,[2]Wip!AC:AC,1,FALSE)","v":"2311BLK1-1"}]
[70,143,"Block 1","3.21A","B1-35","KPO",null,"Buffer","80X120",null,10,"Logistiport",25564,2321,1,"NA","B1-35","Prémontage de la  structure A: Montage du PCH","KIT.25564A","KIT.25564B","KIT.25564C","OK","OK","OK","Mallette","3.21A",{"$f":"VLOOKUP(S143,'[1]Extraction Tracking 2905'!D:D,1,FALSE)","v":"KIT.25564A"},null,1,"B1-35",3,"B1-353",25564,{"$f":"VLOOKUP(C143,[2]Feuil2!A:B,2,FALSE)","v":"BLK1-1"},"2321BLK1-1",{"$f":"VLOOKUP(Regroupement!AI143,[2]Wip!AC:AC,1,FALSE)","v":"2321BLK1-1"},{"$f":"VLOOKUP(AI143,[2]Wip!AC:AC,1,FALSE)","v":"2321BLK1-1"}]
[71,144,"Block 1","3.21A","B1-36","KPO","P1","Buffer","80X200",null,10,"Logistiport",25585,2331,1,"NA","B1-36","Prémontage de la  structure A: Montage de la plateforme auxiliaire du BC.","KIT.25585A","KIT.25585B","KIT.25585C","OK","OK","OK","Mallette","3.21A",{"$f":"VLOOKUP(S144,'[1]Extraction Tracking 2905'!D:D,1,FALSE)","v":"KIT.25585A"},null,1,"B1-36",1,"B1-361",25585,{"$f":"VLOOKUP(C144,[2]Feuil2!A:B,2,FALSE)","v":"BLK1-1"},"2331BLK1-1",{"$f":"VLOOKUP(Regroupement!AI144,[2]Wip!AC:AC,1,FALSE)","v":"2331BLK1-1"},{"$f":"VLOOKUP(AI144,[2]Wip!AC:AC,1,FALSE)","v":"2331BLK1-1"}]
[73,145,"Block 1","3.21B","B1-38","Support fournisseur",null,"Buffer",null,"Pal grue",10,"Logistiport",25940,2101,2,"NA","B1-38","PREMONTAGE_STRUCTURE_B_MONTAGE_DE_LA_GRUE_GIRATOIRE","KIT.25940A",null,null,null,null,null,"Mallette","3.21B",{"$f":"VLOOKUP(S145,'[1]Extraction Tracking 2905'!D:D,1,FALSE)","v":"KIT.25940A"},"KIT.25940A2",2,"B1-38",1,"B1-381",25940,{"$f":"VLOOKUP(C145,[2]Feuil2!A:B,2,FALSE)","v":"BLK1-1"},"2101BLK1-1",{"$f":"VLOOKUP(Regroupement!AI145,[2]Wip!AC:AC,1,FALSE)","v":"2101BLK1-1"},{"$f":"VLOOKUP(AI145,[2]Wip!AC:AC,1,FALSE)","v":"2101BLK1-1"}]
[null,146,"Block 1","3.21B","B1-38,5","Idea",null,"Buffer Exterieur",null,"Structure B",7,"Logistiport",25940,2102,2,null,"B1-38,5",null,"KIT.25940A2",null,null,"OK","OK","OK",null,null,null,null,null,"B1-38,5",1,"B1-38,51",25940,{"$f":"VLOOKUP(C146,[2]Feuil2!A:B,2,FALSE)","v":"BLK1-1"},"2102BLK1-1",{"$f":"VLOOKUP(Regroupement!AI146,[2]Wip!AC:AC,1,FALSE)","v":"2102BLK1-1"},{"$f":"VLOOKUP(AI146,[2]Wip!AC:AC,1,FALSE)","v":"2102BLK1-1"}]
[75,147,"Block 1","3.21B","B1-40","KPO",null,"Buffer","80X120",null,10,"Logistiport",25614,2111,1,"NA","B1-40","Prémontage structure B: montage des supports de fibre du BC et des supports Hélipad.","KIT.25614A","KIT.25614B","KIT.25614C","OK","OK","OK","Mallette","3.21B",{"$f":"VLOOKUP(S147,'[1]Extraction Tracking 2905'!D:D,1,FALSE)","v":"KIT.25614A"},null,{"$f":"COUNTIF(M:M,M147)","v":1},"B1-40",1,"B1-401",25614,{"$f":"VLOOKUP(C147,[2]Feuil2!A:B,2,FALSE)","v":"BLK1-1"},"2111BLK1-1",{"$f":"VLOOKUP(Regroupement!AI147,[2]Wip!AC:AC,1,FALSE)","v":"2111BLK1-1"},{"$f":"VLOOKUP(AI147,[2]Wip!AC:AC,1,FALSE)","v":"2111BLK1-1"}]
[76,148,"Block 1","3.21B","B1-41","KPO","P1","Buffer","80X120",null,10,"Logistiport",25610,2201,1,"NA","B1-41","Prémontage structure B: Montage des passages de câbles auxiliaires et de la platine de terre.","KIT.25610A","KIT.25610B1","KIT.25610C1","OK","OK","OK","Mallette","3.21B",{"$f":"VLOOKUP(S148,'[1]Extraction Tracking 2905'!D:D,1,FALSE)","v":"KIT.25610A"},null,1,"B1-41",1,"B1-411",25610,{"$f":"VLOOKUP(C148,[2]Feuil2!A:B,2,FALSE)","v":"BLK1-1"},"2201BLK1-1",{"$f":"VLOOKUP(Regroupement!AI148,[2]Wip!AC:AC,1,FALSE)","v":"2201BLK1-1"},{"$f":"VLOOKUP(AI148,[2]Wip!AC:AC,1,FALSE)","v":"2201BLK1-1"}]
[77,149,"Block 1","3.21B","B1-43","KPO","P1","Buffer","80X120",null,10,"Logistiport",25600,2121,1,"NA","B1-43","Prémontage structure B: montage des passages des câbles de puissance.","KIT.25600A","KIT.25600B","KIT.25600C","OK","OK","OK","Mallette","3.21B",{"$f":"VLOOKUP(S149,'[1]Extraction Tracking 2905'!D:D,1,FALSE)","v":"KIT.25600A"},null,1,"B1-43",1,"B1-431",25600,{"$f":"VLOOKUP(C149,[2]Feuil2!A:B,2,FALSE)","v":"BLK1-1"},"2121BLK1-1",{"$f":"VLOOKUP(Regroupement!AI149,[2]Wip!AC:AC,1,FALSE)","v":"2121BLK1-1"},{"$f":"VLOOKUP(AI149,[2]Wip!AC:AC,1,FALSE)","v":"2121BLK1-1"}]
[78,150,"Block 1","3.21B","B1-43","KPO","P1","Buffer","80X120",null,10,"Logistiport",25613,2401,1,"NA","B1-43","PREMONTAGE_STRUCTURE_B_MONTAGE_DES_LUMINAIRES","KIT.25613A","KIT.25613B","KIT.25613C","OK","OK","OK","Mallette","3.21B",{"$f":"VLOOKUP(S150,'[1]Extraction Tracking 2905'!D:D,1,FALSE)","v":{"$error":"#N/A"}},null,1,"B1-43",2,"B1-432",25613,{"$f":"VLOOKUP(C150,[2]Feuil2!A:B,2,FALSE)","v":"BLK1-1"},"2401BLK1-1",{"$f":"VLOOKUP(Regroupement!AI150,[2]Wip!AC:AC,1,FALSE)","v":"2401BLK1-1"},{"$f":"VLOOKUP(AI150,[2]Wip!AC:AC,1,FALSE)","v":"2401BLK1-1"}]
[79,151,"Block 1","3.21B","B1-43","KPO","P1","Buffer","80X120",null,10,"Logistiport",25615,2411,1,"NA","B1-43","Prémontage structure B: Montage de la webcam, routage.","KIT.25615A","KIT.25615B","KIT.25615C","OK","OK","OK","Mallette","3.21B",{"$f":"VLOOKUP(S151,'[1]Extraction Tracking 2905'!D:D,1,FALSE)","v":"KIT.25615A"},null,1,"B1-43",3,"B1-433",25615,{"$f":"VLOOKUP(C151,[2]Feuil2!A:B,2,FALSE)","v":"BLK1-1"},"2411BLK1-1",{"$f":"VLOOKUP(Regroupement!AI151,[2]Wip!AC:AC,1,FALSE)","v":"2411BLK1-1"},{"$f":"VLOOKUP(AI151,[2]Wip!AC:AC,1,FALSE)","v":"2411BLK1-1"}]
[81,152,"Block 1","3.21B","B1-45","KPO","P1","Buffer","80X120",null,10,"Logistiport",25612,2131,1,"NA","B1-45","Prémontage structure B: Montage des supports et routage des tubes du système de refroidissement.","KIT.25612A",null,null,"OK","OK","OK","Mallette","3.21B",{"$f":"VLOOKUP(S152,'[1]Extraction Tracking 2905'!D:D,1,FALSE)","v":"KIT.25612A"},null,1,"B1-45",1,"B1-451",25612,{"$f":"VLOOKUP(C152,[2]Feuil2!A:B,2,FALSE)","v":"BLK1-1"},"2131BLK1-1",{"$f":"VLOOKUP(Regroupement!AI152,[2]Wip!AC:AC,1,FALSE)","v":"2131BLK1-1"},{"$f":"VLOOKUP(AI152,[2]Wip!AC:AC,1,FALSE)","v":"2131BLK1-1"}]
[82,153,"Block 1","3.21B","B1-46","KPO",null,"Buffer","80X120",null,10,"Logistiport",25611,2211,1,"NA","B1-46","Prémontage structure B: Montage du système de ventilation de la nacelle.","KIT.25611A","KIT.25611B","KIT.25611C","OK","OK","OK","Mallette","3.21B",{"$f":"VLOOKUP(S153,'[1]Extraction Tracking 2905'!D:D,1,FALSE)","v":"KIT.25611A"},null,1,"B1-46",1,"B1-461",25611,{"$f":"VLOOKUP(C153,[2]Feuil2!A:B,2,FALSE)","v":"BLK1-1"},"2211BLK1-1",{"$f":"VLOOKUP(Regroupement!AI153,[2]Wip!AC:AC,1,FALSE)","v":"2211BLK1-1"},{"$f":"VLOOKUP(AI153,[2]Wip!AC:AC,1,FALSE)","v":"2211BLK1-1"}]
[83,154,"Block 1","3.21B","B1-47","KPO","P1","Buffer","4X80X120","PAL 1/4",10,"Logistiport",80110,2221,1,"NA","B1-47","Mise à longueur et préparation des câbles de puissance du générateur","KIT.80110A","KIT.80110B","KIT.80110C","OK","OK","OK",null,"3.21B",{"$f":"VLOOKUP(S154,'[1]Extraction Tracking 2905'!D:D,1,FALSE)","v":"KIT.80110A"},null,1,"B1-47",1,"B1-471",80110,{"$f":"VLOOKUP(C154,[2]Feuil2!A:B,2,FALSE)","v":"BLK1-1"},"2221BLK1-1",{"$f":"VLOOKUP(Regroupement!AI154,[2]Wip!AC:AC,1,FALSE)","v":"2221BLK1-1"},{"$f":"VLOOKUP(AI154,[2]Wip!AC:AC,1,FALSE)","v":"2221BLK1-1"}]
[84,155,"Block 1","3.21B","B1-47","KPO","P1","Buffer","4X80X120","PAL 1/4",10,"Logistiport",80111,2351,1,"NA","B1-47","Prémontage structure B: Mise en place des câbles de puissance dans la structure B.","KIT.80111A","KIT.80111B","KIT.80111C","OK","OK","OK",null,"3.21B",{"$f":"VLOOKUP(S155,'[1]Extraction Tracking 2905'!D:D,1,FALSE)","v":"KIT.80111A"},null,1,"B1-47",2,"B1-472",80111,{"$f":"VLOOKUP(C155,[2]Feuil2!A:B,2,FALSE)","v":"BLK1-1"},"2351BLK1-1",{"$f":"VLOOKUP(Regroupement!AI155,[2]Wip!AC:AC,1,FALSE)","v":"2351BLK1-1"},{"$f":"VLOOKUP(AI155,[2]Wip!AC:AC,1,FALSE)","v":"2351BLK1-1"}]
[85,156,"Block 1","3.21B","B1-48","KPO",null,"Buffer","80X120",null,10,"Logistiport",80112,2421,1,"NA","B1-48","Prémontage structure B: Câblage électrique","KIT.80112A","KIT.80112B","KIT.80112C","OK","OK","OK",null,"3.21B",{"$f":"VLOOKUP(S156,'[1]Extraction Tracking 2905'!D:D,1,FALSE)","v":"KIT.80112A"},null,1,"B1-48",1,"B1-481",80112,{"$f":"VLOOKUP(C156,[2]Feuil2!A:B,2,FALSE)","v":"BLK1-1"},"2421BLK1-1",{"$f":"VLOOKUP(Regroupement!AI156,[2]Wip!AC:AC,1,FALSE)","v":"2421BLK1-1"},{"$f":"VLOOKUP(AI156,[2]Wip!AC:AC,1,FALSE)","v":"2421BLK1-1"}]
[86,157,"Block 1","3.21B","B1-48","KPO",null,"Buffer","80X120",null,10,"Logistiport",80113,2441,1,"NA","B1-48","Prémontage structure B: Routage et connection des câbles GND du chemins des câbles + câbles GND générateur","KIT.80113A","KIT.80113B","KIT.80113C","OK","OK","OK","Mallette","3.21B",{"$f":"VLOOKUP(S157,'[1]Extraction Tracking 2905'!D:D,1,FALSE)","v":"KIT.80113A"},null,1,"B1-48",2,"B1-482",80113,{"$f":"VLOOKUP(C157,[2]Feuil2!A:B,2,FALSE)","v":"BLK1-1"},"2441BLK1-1",{"$f":"VLOOKUP(Regroupement!AI157,[2]Wip!AC:AC,1,FALSE)","v":"2441BLK1-1"},{"$f":"VLOOKUP(AI157,[2]Wip!AC:AC,1,FALSE)","v":"2441BLK1-1"}]
[null,158,"Block 1","3.21B","B1-48","KPO",null,"Buffer","80X120",null,10,"Logistiport",80012,2431,1,"NA","B1-48","Preparation cables de terre structure B","KIT.80012A",null,null,"OK","OK","OK",null,"3.21B",{"$f":"VLOOKUP(S158,'[1]Extraction Tracking 2905'!D:D,1,FALSE)","v":"KIT.80012A"},null,1,"B1-48",3,"B1-483",80012,{"$f":"VLOOKUP(C158,[2]Feuil2!A:B,2,FALSE)","v":"BLK1-1"},"2431BLK1-1",{"$f":"VLOOKUP(Regroupement!AI158,[2]Wip!AC:AC,1,FALSE)","v":"2431BLK1-1"},{"$f":"VLOOKUP(AI158,[2]Wip!AC:AC,1,FALSE)","v":"2431BLK1-1"}]
[87,159,"Block 1","3.21B","B1-49","KPO","P1","Buffer","143X230",null,10,"Logistiport",25680,2361,1,"NA","B1-49","Prémontage structure B: Prémontage de l'échelle d'accès à l'extérieur de la nacelle.","KIT.25680A","KIT.25680B","KIT.25680C","OK","OK","OK","Mallette","3.21B",{"$f":"VLOOKUP(S159,'[1]Extraction Tracking 2905'!D:D,1,FALSE)","v":"KIT.25680A"},null,1,"B1-49",1,"B1-491",25680,{"$f":"VLOOKUP(C159,[2]Feuil2!A:B,2,FALSE)","v":"BLK1-1"},"2361BLK1-1",{"$f":"VLOOKUP(Regroupement!AI159,[2]Wip!AC:AC,1,FALSE)","v":"2361BLK1-1"},{"$f":"VLOOKUP(AI159,[2]Wip!AC:AC,1,FALSE)","v":"2361BLK1-1"}]
[88,160,"Block 1","3.21B","B1-49","KPO","P1","Buffer","143X230",null,10,"Logistiport",26020,2371,1,"NA","B1-49","Prémontage structure B: Montage de l'échelle d'accès du BC à la plateforme supérieure.","KIT.26020A","KIT.26020B","KIT.26020C","OK","OK","OK","Mallette","3.21B",{"$f":"VLOOKUP(S160,'[1]Extraction Tracking 2905'!D:D,1,FALSE)","v":"KIT.26020A"},null,1,"B1-49",2,"B1-492",26020,{"$f":"VLOOKUP(C160,[2]Feuil2!A:B,2,FALSE)","v":"BLK1-1"},"2371BLK1-1",{"$f":"VLOOKUP(Regroupement!AI160,[2]Wip!AC:AC,1,FALSE)","v":"2371BLK1-1"},{"$f":"VLOOKUP(AI160,[2]Wip!AC:AC,1,FALSE)","v":"2371BLK1-1"}]
[89,161,"Block 1","3.21B","B1-49","KPO","P1","Buffer","143X230",null,10,"Logistiport",26240,2341,1,"NA","B1-49","Prémontage structure B: Prémontage de la plateforme supérieure du BC.","KIT.26240A","KIT.26240B","KIT.26240C","OK","OK","OK","Mallette","3.21B",{"$f":"VLOOKUP(S161,'[1]Extraction Tracking 2905'!D:D,1,FALSE)","v":"KIT.26240A"},null,1,"B1-49",3,"B1-493",26240,{"$f":"VLOOKUP(C161,[2]Feuil2!A:B,2,FALSE)","v":"BLK1-1"},"2341BLK1-1",{"$f":"VLOOKUP(Regroupement!AI161,[2]Wip!AC:AC,1,FALSE)","v":"2341BLK1-1"},{"$f":"VLOOKUP(AI161,[2]Wip!AC:AC,1,FALSE)","v":"2341BLK1-1"}]
[90,162,"Block 1","3.30","B1-50","Idea","P1","Buffer Exterieur","320X230","Fibre",7,"Chantenay",26100,4101,1,"NA","B1-50","Montage des capots centraux droit et gauche bâti central","KIT.26100A","KIT.26100B","KIT.26100C","OK","OK","OK","Mallette","3.30",{"$f":"VLOOKUP(S162,'[1]Extraction Tracking 2905'!D:D,1,FALSE)","v":"KIT.26100A"},null,1,"B1-50",1,"B1-501",26100,{"$f":"VLOOKUP(C162,[2]Feuil2!A:B,2,FALSE)","v":"BLK1-1"},"4101BLK1-1",{"$f":"VLOOKUP(Regroupement!AI162,[2]Wip!AC:AC,1,FALSE)","v":"4101BLK1-1"},{"$f":"VLOOKUP(AI162,[2]Wip!AC:AC,1,FALSE)","v":"4101BLK1-1"}]
[91,163,"Block 1","3.30","B1-51","Idea","P1","Buffer Exterieur","320X230","Fibre",7,"Chantenay",26110,4111,1,"NA","B1-51","Montage des capots arrières droit et gauche bâti central","KIT.26110A","KIT.26110B","KIT.26110C","OK","OK","OK","Mallette","3.30",{"$f":"VLOOKUP(S163,'[1]Extraction Tracking 2905'!D:D,1,FALSE)","v":"KIT.26110A"},null,1,"B1-51",1,"B1-511",26110,{"$f":"VLOOKUP(C163,[2]Feuil2!A:B,2,FALSE)","v":"BLK1-1"},"4111BLK1-1",{"$f":"VLOOKUP(Regroupement!AI163,[2]Wip!AC:AC,1,FALSE)","v":"4111BLK1-1"},{"$f":"VLOOKUP(AI163,[2]Wip!AC:AC,1,FALSE)","v":"4111BLK1-1"}]
[92,164,"Block 1","3.30","B1-52","Idea","P1","Buffer Exterieur","200X440","Fibre",7,"Chantenay",26060,4201,1,"NA","B1-52","Montage du capot supérieur avant du bâti central","KIT.26060A","KIT.26060B1","KIT.26060C1","OK","OK","OK","Mallette","3.30",{"$f":"VLOOKUP(S164,'[1]Extraction Tracking 2905'!D:D,1,FALSE)","v":"KIT.26060A"},null,1,"B1-52",1,"B1-521",26060,{"$f":"VLOOKUP(C164,[2]Feuil2!A:B,2,FALSE)","v":"BLK1-1"},"4201BLK1-1",{"$f":"VLOOKUP(Regroupement!AI164,[2]Wip!AC:AC,1,FALSE)","v":"4201BLK1-1"},{"$f":"VLOOKUP(AI164,[2]Wip!AC:AC,1,FALSE)","v":"4201BLK1-1"}]
[93,165,"Block 1","3.30","B1-52","Idea","P1","Buffer Exterieur","200X440","Fibre",7,"Chantenay",26070,4211,1,"NA","B1-52","Montage du capot supérieur arrière du bâti central","KIT.26070A",null,null,"OK","OK","OK","Mallette","3.30",{"$f":"VLOOKUP(S165,'[1]Extraction Tracking 2905'!D:D,1,FALSE)","v":"KIT.26070A"},null,1,"B1-52",2,"B1-522",26070,{"$f":"VLOOKUP(C165,[2]Feuil2!A:B,2,FALSE)","v":"BLK1-1"},"4211BLK1-1",{"$f":"VLOOKUP(Regroupement!AI165,[2]Wip!AC:AC,1,FALSE)","v":"4211BLK1-1"},{"$f":"VLOOKUP(AI165,[2]Wip!AC:AC,1,FALSE)","v":"4211BLK1-1"}]
[94,166,"Block 1","3.30","B1-52","Idea","P1","Buffer Exterieur","200X440","Fibre",7,"Chantenay",26120,4121,1,"NA","B1-52","Montage des capots arrière bâti central","KIT.26120A","KIT.26120B","KIT.26120C","OK","OK","OK","Mallette","3.30",{"$f":"VLOOKUP(S166,'[1]Extraction Tracking 2905'!D:D,1,FALSE)","v":"KIT.26120A"},null,1,"B1-52",3,"B1-523",26120,{"$f":"VLOOKUP(C166,[2]Feuil2!A:B,2,FALSE)","v":"BLK1-1"},"4121BLK1-1",{"$f":"VLOOKUP(Regroupement!AI166,[2]Wip!AC:AC,1,FALSE)","v":"4121BLK1-1"},{"$f":"VLOOKUP(AI166,[2]Wip!AC:AC,1,FALSE)","v":"4121BLK1-1"}]
[95,167,"Block 1","3.30","B1-53","KPO",null,"Buffer","80X120",null,10,"Logistiport",25625,4221,1,"NA","B1-53","Système de régulation de la ventilation : réaliser la liaison avec la fibre du BC","KIT.25625A","KIT.25625B","KIT.25625C","OK","OK","OK","Mallette","3.30",{"$f":"VLOOKUP(S167,'[1]Extraction Tracking 2905'!D:D,1,FALSE)","v":"KIT.25625A"},null,1,"B1-53",1,"B1-531",25625,{"$f":"VLOOKUP(C167,[2]Feuil2!A:B,2,FALSE)","v":"BLK1-1"},"4221BLK1-1",{"$f":"VLOOKUP(Regroupement!AI167,[2]Wip!AC:AC,1,FALSE)","v":"4221BLK1-1"},{"$f":"VLOOKUP(AI167,[2]Wip!AC:AC,1,FALSE)","v":"4221BLK1-1"}]
[101,168,"Block 1","3.30","B1-53","KPO",null,"Buffer","80X120",null,10,"Logistiport",26500,4506,1,"NA","B1-53","Montage de l'assemblage exit cover sur le bloc 1",{"$f":"\"Mallette \"&M168","v":"Mallette 26500"},"KIT.26500B1","KIT.26500C1","OK","OK","OK","Mallette Uniquement","3.30",{"$f":"VLOOKUP(S168,'[1]Extraction Tracking 2905'!D:D,1,FALSE)","v":{"$error":"#N/A"}},null,1,"B1-53",2,"B1-532",26500,{"$f":"VLOOKUP(C168,[2]Feuil2!A:B,2,FALSE)","v":"BLK1-1"},"4506BLK1-1",{"$f":"VLOOKUP(Regroupement!AI168,[2]Wip!AC:AC,1,FALSE)","v":"4506BLK1-1"},{"$f":"VLOOKUP(AI168,[2]Wip!AC:AC,1,FALSE)","v":"4506BLK1-1"}]
[102,169,"Block 1","3.30","B1-54","KPO","P1","Buffer","120X230",null,10,"Logistiport",26330,4301,1,"NA","B1-54","Montage des supports des garde-corps sur la passerelle extérieure d'orientation.","KIT.26330A","KIT.26330B","KIT.26330C","OK","OK","OK","Mallette","3.30",{"$f":"VLOOKUP(S169,'[1]Extraction Tracking 2905'!D:D,1,FALSE)","v":"KIT.26330A"},null,1,"B1-54",1,"B1-541",26330,{"$f":"VLOOKUP(C169,[2]Feuil2!A:B,2,FALSE)","v":"BLK1-1"},"4301BLK1-1",{"$f":"VLOOKUP(Regroupement!AI169,[2]Wip!AC:AC,1,FALSE)","v":"4301BLK1-1"},{"$f":"VLOOKUP(AI169,[2]Wip!AC:AC,1,FALSE)","v":"4301BLK1-1"}]
[103,170,"Block 1","3.30","B1-55","Idea","P1","Buffer Exterieur","210X210","Fibre",7,"Chantenay",26140,4311,1,"NA","B1-55","Montage des capots inférieurs droits du bâti central","KIT.26140A","KIT.26140B1","KIT.26140C1","OK","OK","OK","Mallette","3.30",{"$f":"VLOOKUP(S170,'[1]Extraction Tracking 2905'!D:D,1,FALSE)","v":"KIT.26140A"},null,1,"B1-55",1,"B1-551",26140,{"$f":"VLOOKUP(C170,[2]Feuil2!A:B,2,FALSE)","v":"BLK1-1"},"4311BLK1-1",{"$f":"VLOOKUP(Regroupement!AI170,[2]Wip!AC:AC,1,FALSE)","v":"4311BLK1-1"},{"$f":"VLOOKUP(AI170,[2]Wip!AC:AC,1,FALSE)","v":"4311BLK1-1"}]
[104,171,"Block 1","3.30","B1-55","Idea","P1","Buffer Exterieur","210X210","Fibre",7,"Chantenay",26150,4321,1,"NA","B1-55","Montage des capots inférieurs gauches du bâti central","KIT.26150A","KIT.26150B1","KIT.26150C1","OK","OK","OK","Mallette","3.30",{"$f":"VLOOKUP(S171,'[1]Extraction Tracking 2905'!D:D,1,FALSE)","v":"KIT.26150A"},null,1,"B1-55",2,"B1-552",26150,{"$f":"VLOOKUP(C171,[2]Feuil2!A:B,2,FALSE)","v":"BLK1-1"},"4321BLK1-1",{"$f":"VLOOKUP(Regroupement!AI171,[2]Wip!AC:AC,1,FALSE)","v":"4321BLK1-1"},{"$f":"VLOOKUP(AI171,[2]Wip!AC:AC,1,FALSE)","v":"4321BLK1-1"}]
[105,172,"Block 1","3.30","B1-56","KPO","P1","Buffer Exterieur","100X350","Fibre",7,"Chantenay",26350,4331,1,"NA","B1-56","Montage des capots latéraux gauches de fermeture du générateur","KIT.26350A","KIT.26350B","KIT.26350C","OK","OK","OK","Mallette","3.30",{"$f":"VLOOKUP(S172,'[1]Extraction Tracking 2905'!D:D,1,FALSE)","v":"KIT.26350A"},null,1,"B1-56",1,"B1-561",26350,{"$f":"VLOOKUP(C172,[2]Feuil2!A:B,2,FALSE)","v":"BLK1-1"},"4331BLK1-1",{"$f":"VLOOKUP(Regroupement!AI172,[2]Wip!AC:AC,1,FALSE)","v":"4331BLK1-1"},{"$f":"VLOOKUP(AI172,[2]Wip!AC:AC,1,FALSE)","v":"4331BLK1-1"}]
[106,173,"Block 1","3.30","B1-57","KPO","P1","Buffer Exterieur","100X350","Fibre",7,"Chantenay",26360,4411,1,"NA","B1-57","Montage des capots latéraux droits de fermeture du générateur","KIT.26360A","KIT.26360B","KIT.26360C","OK","OK","OK","Mallette","3.30",{"$f":"VLOOKUP(S173,'[1]Extraction Tracking 2905'!D:D,1,FALSE)","v":"KIT.26360A"},null,1,"B1-57",1,"B1-571",26360,{"$f":"VLOOKUP(C173,[2]Feuil2!A:B,2,FALSE)","v":"BLK1-1"},"4411BLK1-1",{"$f":"VLOOKUP(Regroupement!AI173,[2]Wip!AC:AC,1,FALSE)","v":"4411BLK1-1"},{"$f":"VLOOKUP(AI173,[2]Wip!AC:AC,1,FALSE)","v":"4411BLK1-1"}]
[107,174,"Block 1","3.30","B1-58","Idea","P1","Buffer Exterieur","152X304","Fibre",7,"Chantenay",35116,4421,1,"NA","B1-58","Montage des capots inférieurs du BC avec ceux du générateur (x2)","KIT.35116A","KIT.35116B","KIT.35116C","OK","OK","OK","Mallette","3.30",{"$f":"VLOOKUP(S174,'[1]Extraction Tracking 2905'!D:D,1,FALSE)","v":"KIT.35116A"},null,1,"B1-58",1,"B1-581",35116,{"$f":"VLOOKUP(C174,[2]Feuil2!A:B,2,FALSE)","v":"BLK1-1"},"4421BLK1-1",{"$f":"VLOOKUP(Regroupement!AI174,[2]Wip!AC:AC,1,FALSE)","v":"4421BLK1-1"},{"$f":"VLOOKUP(AI174,[2]Wip!AC:AC,1,FALSE)","v":"4421BLK1-1"}]
[108,175,"Block 1","3.30","B1-59","KPO","P1","Buffer","100X200",null,10,"Logistiport",25592,6366,1,"NA","B1-59","Montage de l'échelle auxiliaire d'accès à la structure A.","KIT.25592A","KIT.25592B","KIT.25592C","OK","OK","OK","Mallette","3.30",{"$f":"VLOOKUP(S175,'[1]Extraction Tracking 2905'!D:D,1,FALSE)","v":"KIT.25592A"},null,1,"B1-59",1,"B1-591",25592,{"$f":"VLOOKUP(C175,[2]Feuil2!A:B,2,FALSE)","v":"BLK1-1"},"6366BLK1-1",{"$f":"VLOOKUP(Regroupement!AI175,[2]Wip!AC:AC,1,FALSE)","v":"6366BLK1-1"},{"$f":"VLOOKUP(AI175,[2]Wip!AC:AC,1,FALSE)","v":"6366BLK1-1"}]
[109,176,"Block 1","3.30","B1-59","KPO","P1","Buffer","100X200",null,10,"Logistiport",26290,4501,1,"NA","B1-59","Prémontage du bâti central: Montage de l'interface de la grue manuelle du maintenace.","KIT.26290A","KIT.26290B","KIT.26290C","OK","OK","OK","Mallette","3.30",{"$f":"VLOOKUP(S176,'[1]Extraction Tracking 2905'!D:D,1,FALSE)","v":"KIT.26290A"},null,1,"B1-59",2,"B1-592",26290,{"$f":"VLOOKUP(C176,[2]Feuil2!A:B,2,FALSE)","v":"BLK1-1"},"4501BLK1-1",{"$f":"VLOOKUP(Regroupement!AI176,[2]Wip!AC:AC,1,FALSE)","v":"4501BLK1-1"},{"$f":"VLOOKUP(AI176,[2]Wip!AC:AC,1,FALSE)","v":"4501BLK1-1"}]
[111,177,"Block 1","3.40","B1-61","KPO",null,"Buffer","80X120",null,10,"Logistiport",80119,4611,1,"NA","B1-61","Pré-assemblage exit cover: Prémontage électrique exit cover","KIT.80119A","KIT.80119B","KIT.80119C","OK","OK","OK","Mallette","3.40",{"$f":"VLOOKUP(S177,'[1]Extraction Tracking 2905'!D:D,1,FALSE)","v":"KIT.80119A"},null,1,"B1-61",1,"B1-611",80119,{"$f":"VLOOKUP(C177,[2]Feuil2!A:B,2,FALSE)","v":"BLK1-1"},"4611BLK1-1",{"$f":"VLOOKUP(Regroupement!AI177,[2]Wip!AC:AC,1,FALSE)","v":"4611BLK1-1"},{"$f":"VLOOKUP(AI177,[2]Wip!AC:AC,1,FALSE)","v":"4611BLK1-1"}]
[112,178,"Block 1","3.40","B1-61","KPO",null,"Buffer","80X120",null,10,"Logistiport",80120,5111,1,"NA","B1-61","Câblage exit cover après l'assemblage à NC2","KIT.80120A","KIT.80120B","KIT.80120C","OK","OK","OK","Mallette","3.40",{"$f":"VLOOKUP(S178,'[1]Extraction Tracking 2905'!D:D,1,FALSE)","v":"KIT.80120A"},null,1,"B1-61",2,"B1-612",80120,{"$f":"VLOOKUP(C178,[2]Feuil2!A:B,2,FALSE)","v":"BLK1-1"},"5111BLK1-1",{"$f":"VLOOKUP(Regroupement!AI178,[2]Wip!AC:AC,1,FALSE)","v":"5111BLK1-1"},{"$f":"VLOOKUP(AI178,[2]Wip!AC:AC,1,FALSE)","v":"5111BLK1-1"}]
[113,179,"Block 1","3.40","B1-61","KPO",null,"Buffer","80X120",null,10,"Logistiport",80017,4601,1,"NA","B1-61","PREPARATION_CABLES_PARATONNERRE_EXIT_COVER","KIT.80017A","KIT.80017B","KIT.80017C","OK","OK","OK",null,"3.40",{"$f":"VLOOKUP(S179,'[1]Extraction Tracking 2905'!D:D,1,FALSE)","v":"KIT.80017A"},null,1,"B1-61",3,"B1-613",80017,{"$f":"VLOOKUP(C179,[2]Feuil2!A:B,2,FALSE)","v":"BLK1-1"},"4601BLK1-1",{"$f":"VLOOKUP(Regroupement!AI179,[2]Wip!AC:AC,1,FALSE)","v":"4601BLK1-1"},{"$f":"VLOOKUP(AI179,[2]Wip!AC:AC,1,FALSE)","v":"4601BLK1-1"}]
[110,180,"Block 1","3.30","B1-60","Support fournisseur","P1","Buffer","430X200","Exit cover",7,"Chantenay","MY way 80119",4612,1,"NA",{"$f":"E180","v":"B1-60"},"Montage de l'assemblage exit cover sur le bloc 1","My way","KIT.26500B1","KIT.26500C1","Support fournisseur","Support fournisseur","Support fournisseur","Mallette",{"$f":"D180","v":"3.30"},{"$f":"VLOOKUP(S180,'[1]Extraction Tracking 2905'!D:D,1,FALSE)","v":{"$error":"#N/A"}},null,1,"B1-60",1,"B1-601","MY way 80119",{"$f":"VLOOKUP(C180,[2]Feuil2!A:B,2,FALSE)","v":"BLK1-1"},"4612BLK1-1",{"$f":"VLOOKUP(Regroupement!AI180,[2]Wip!AC:AC,1,FALSE)","v":{"$error":"#N/A"}},{"$f":"VLOOKUP(AI180,[2]Wip!AC:AC,1,FALSE)","v":{"$error":"#N/A"}}]
[114,181,"Block 1","3.50","B1-63","KPO","P1","Buffer","80X120",null,10,"Logistiport",25520,6401,1,"NA","B1-63","Montage des protections du Yaw.","KIT.25520A","KIT.25520B","KIT.25520C","OK","OK","OK","Mallette","3.50",{"$f":"VLOOKUP(S181,'[1]Extraction Tracking 2905'!D:D,1,FALSE)","v":"KIT.25520A"},null,1,"B1-63",1,"B1-631",25520,{"$f":"VLOOKUP(C181,[2]Feuil2!A:B,2,FALSE)","v":"BLK1-1"},"6401BLK1-1",{"$f":"VLOOKUP(Regroupement!AI181,[2]Wip!AC:AC,1,FALSE)","v":"6401BLK1-1"},{"$f":"VLOOKUP(AI181,[2]Wip!AC:AC,1,FALSE)","v":"6401BLK1-1"}]
[null,182,"Block 1","3.50","B1-64","KPO",null,"Buffer","80X120",null,10,"Logistiport",26530,6351,1,"NA","B1-64","PREMONTAGE_NC1_NC2_MONTAGE_SYSTEME_EXTINCTION_INCENDIE_ET_WIFI_ACCESS_SUR_NC2","KIT.26530A",null,null,"OK","OK","OK","Mallette","3.50",{"$f":"VLOOKUP(S182,'[1]Extraction Tracking 2905'!D:D,1,FALSE)","v":{"$error":"#N/A"}},null,1,"B1-64",1,"B1-641",26530,{"$f":"VLOOKUP(C182,[2]Feuil2!A:B,2,FALSE)","v":"BLK1-1"},"6351BLK1-1",{"$f":"VLOOKUP(Regroupement!AI182,[2]Wip!AC:AC,1,FALSE)","v":"6351BLK1-1"},{"$f":"VLOOKUP(AI182,[2]Wip!AC:AC,1,FALSE)","v":"6351BLK1-1"}]
[null,183,"Block 1",null,1,null,null,null,null,null,null,null,80108,1131,1,"NA",1,null,null,null,null,null,null,null,null,null,null,null,1,1,1,"11",80108,{"$f":"VLOOKUP(C183,[2]Feuil2!A:B,2,FALSE)","v":"BLK1-1"},"1131BLK1-1",{"$f":"VLOOKUP(Regroupement!AI183,[2]Wip!AC:AC,1,FALSE)","v":"1131BLK1-1"},{"$f":"VLOOKUP(AI183,[2]Wip!AC:AC,1,FALSE)","v":"1131BLK1-1"}]
[null,184,"Block 1",null,2,null,null,null,null,null,null,null,80116,3331,1,"NA",2,null,null,null,null,null,null,null,null,null,null,null,1,2,1,"21",80116,{"$f":"VLOOKUP(C184,[2]Feuil2!A:B,2,FALSE)","v":"BLK1-1"},"3331BLK1-1",{"$f":"VLOOKUP(Regroupement!AI184,[2]Wip!AC:AC,1,FALSE)","v":"3331BLK1-1"},{"$f":"VLOOKUP(AI184,[2]Wip!AC:AC,1,FALSE)","v":"3331BLK1-1"}]
[115,185,"Block 2","1.10","B2-R01","KPO",null,"Buffer","80X120",null,10,"Logistiport",20365,231,1,"NA","B2-R01","Prémontage Hub: Montage des plateformes","KIT.20365A","KIT.20365B","KIT.20365C","OK","OK","OK","Mallette","1.10",{"$f":"VLOOKUP(S185,'[1]Extraction Tracking 2905'!D:D,1,FALSE)","v":"KIT.20365A"},null,1,"B2-R01",1,"B2-R011",20365,{"$f":"VLOOKUP(C185,[2]Feuil2!A:B,2,FALSE)","v":"BLK2"},"231BLK2",{"$f":"VLOOKUP(Regroupement!AI185,[2]Wip!AC:AC,1,FALSE)","v":"231BLK2"},{"$f":"VLOOKUP(AI185,[2]Wip!AC:AC,1,FALSE)","v":"231BLK2"}]
[116,186,"Block 2","1.10","B2-R01","KPO",null,"Buffer","80X120",null,10,"Logistiport",20366,221,1,"NA","B2-R01","Prémontage Hub: Montage des points d'ancrage de sécurité (x3)","KIT.20366A","KIT.20366B","KIT.20366C","OK","OK","OK","Mallette","1.10",{"$f":"VLOOKUP(S186,'[1]Extraction Tracking 2905'!D:D,1,FALSE)","v":"KIT.20366A"},null,1,"B2-R01",2,"B2-R012",20366,{"$f":"VLOOKUP(C186,[2]Feuil2!A:B,2,FALSE)","v":"BLK2"},"221BLK2",{"$f":"VLOOKUP(Regroupement!AI186,[2]Wip!AC:AC,1,FALSE)","v":"221BLK2"},{"$f":"VLOOKUP(AI186,[2]Wip!AC:AC,1,FALSE)","v":"221BLK2"}]
[118,187,"Block 2","1.10","B2-R02","KPO","P1","Buffer","80X120","Fibre",7,"Chantenay",20332,246,1,"NA","B2-R02","Prémontage Hub: Montage des écoutilles du Hub (x3)","KIT.20332A","KIT.20332B","KIT.20332C","OK","OK","OK","Mallette","1.10",{"$f":"VLOOKUP(S187,'[1]Extraction Tracking 2905'!D:D,1,FALSE)","v":"KIT.20332A"},null,1,"B2-R02",1,"B2-R021",20332,{"$f":"VLOOKUP(C187,[2]Feuil2!A:B,2,FALSE)","v":"BLK2"},"246BLK2",{"$f":"VLOOKUP(Regroupement!AI187,[2]Wip!AC:AC,1,FALSE)","v":"246BLK2"},{"$f":"VLOOKUP(AI187,[2]Wip!AC:AC,1,FALSE)","v":"246BLK2"}]
[119,188,"Block 2","1.10","B2-R03","Support fournisseur",null,"Direct ligne",null,"HUB",6,"TGO","My Way 20330",102,1,"NA","B2-R03","Prémontage Hub: Réception, nettoyage du HUB, ponçage des portées et vérification des taraudages","My way","KIT.20360B","KIT.20360C","Support fournisseur","NA","NA",null,"1.10",{"$f":"VLOOKUP(S188,'[1]Extraction Tracking 2905'!D:D,1,FALSE)","v":{"$error":"#N/A"}},null,1,"B2-R03",1,"B2-R031","My Way 20330",{"$f":"VLOOKUP(C188,[2]Feuil2!A:B,2,FALSE)","v":"BLK2"},"102BLK2",{"$f":"VLOOKUP(Regroupement!AI188,[2]Wip!AC:AC,1,FALSE)","v":{"$error":"#N/A"}},{"$f":"VLOOKUP(AI188,[2]Wip!AC:AC,1,FALSE)","v":{"$error":"#N/A"}}]
[120,189,"Block 2","1.10","B2-R04","KPO","P1","Buffer","100X200",null,10,"Logistiport",20433,251,1,"NA","B2-R04","Prémontage Hub: Montage des chemins de câbles de pitch","KIT.20433A","KIT.20433B","KIT.20433C","OK","OK","OK","Mallette","1.10",{"$f":"VLOOKUP(S189,'[1]Extraction Tracking 2905'!D:D,1,FALSE)","v":"KIT.20433A"},null,1,"B2-R04",1,"B2-R041",20433,{"$f":"VLOOKUP(C189,[2]Feuil2!A:B,2,FALSE)","v":"BLK2"},"251BLK2",{"$f":"VLOOKUP(Regroupement!AI189,[2]Wip!AC:AC,1,FALSE)","v":"251BLK2"},{"$f":"VLOOKUP(AI189,[2]Wip!AC:AC,1,FALSE)","v":"251BLK2"}]
[121,190,"Block 2","1.10","B2-R05","KPO",null,"Buffer","80X120",null,10,"Logistiport",20360,241,1,"NA","B2-R05","Prémontage Hub: Montage des luminaires dans le HUB (x3)","KIT.20360A","KIT.20360B","KIT.20360C","OK","OK","OK","Mallette",{"$f":"D190","v":"1.10"},{"$f":"VLOOKUP(S190,'[1]Extraction Tracking 2905'!D:D,1,FALSE)","v":"KIT.20360A"},null,1,"B2-R05",1,"B2-R051",20360,{"$f":"VLOOKUP(C190,[2]Feuil2!A:B,2,FALSE)","v":"BLK2"},"241BLK2",{"$f":"VLOOKUP(Regroupement!AI190,[2]Wip!AC:AC,1,FALSE)","v":"241BLK2"},{"$f":"VLOOKUP(AI190,[2]Wip!AC:AC,1,FALSE)","v":"241BLK2"}]
[null,191,"Block 2","1.20","B2-R06","KPO",null,"Buffer","350*80",null,10,"Logistiport",20330,101,1,"NA","B2-R06","PREMONTAGE_HUB_RECEPTION_NETTOYAGE_DU_HUB_PONCAGE_DES_PORTEES_ET_VERIFICATION_DES_TARAUDAGES","KIT.20330A",null,null,"OK","OK","OK",null,"1.20",{"$f":"VLOOKUP(S191,'[1]Extraction Tracking 2905'!D:D,1,FALSE)","v":"KIT.20330A"},null,1,"B2-R06",1,"B2-R061",20330,{"$f":"VLOOKUP(C191,[2]Feuil2!A:B,2,FALSE)","v":"BLK2"},"101BLK2",{"$f":"VLOOKUP(Regroupement!AI191,[2]Wip!AC:AC,1,FALSE)","v":"101BLK2"},{"$f":"VLOOKUP(AI191,[2]Wip!AC:AC,1,FALSE)","v":"101BLK2"}]
[123,192,"Block 2","1.20","B2-R06","KPO",null,"Buffer","350*80",null,10,"Logistiport",20021,1111,1,"NA","B2-R06","Prémontage Bâti Avant: Montage des chemins de câbles dans le bâti avant","KIT.20021A","KIT.20021B","KIT.20021C","OK","OK","OK","Mallette","1.20",{"$f":"VLOOKUP(S192,'[1]Extraction Tracking 2905'!D:D,1,FALSE)","v":"KIT.20021A"},null,1,"B2-R06",2,"B2-R062",20021,{"$f":"VLOOKUP(C192,[2]Feuil2!A:B,2,FALSE)","v":"BLK2"},"1111BLK2",{"$f":"VLOOKUP(Regroupement!AI192,[2]Wip!AC:AC,1,FALSE)","v":"1111BLK2"},{"$f":"VLOOKUP(AI192,[2]Wip!AC:AC,1,FALSE)","v":"1111BLK2"}]
[124,193,"Block 2","1.20","B2-R06","KPO",null,"Buffer","350*80",null,10,"Logistiport",20022,1131,1,"NA","B2-R06","Prémontage Bâti Avant: Préassemblage de la structure du sol du bâti avant","KIT.20022A","KIT.20022B","KIT.20022C","OK","OK","OK","Mallette","1.20",{"$f":"VLOOKUP(S193,'[1]Extraction Tracking 2905'!D:D,1,FALSE)","v":"KIT.20022A"},null,1,"B2-R06",3,"B2-R063",20022,{"$f":"VLOOKUP(C193,[2]Feuil2!A:B,2,FALSE)","v":"BLK2"},"1131BLK2",{"$f":"VLOOKUP(Regroupement!AI193,[2]Wip!AC:AC,1,FALSE)","v":"1131BLK2"},{"$f":"VLOOKUP(AI193,[2]Wip!AC:AC,1,FALSE)","v":"1131BLK2"}]
[125,194,"Block 2","1.20","B2-R06","KPO",null,"Buffer","350*80",null,10,"Logistiport",20023,1141,{"$f":"COUNTIF(M:M,M194)","v":1},"NA","B2-R06","Prémontage Bâti Avant: Montage de la structure du sol dans le bâti avant","KIT.20023A","KIT.20023B","KIT.20023C","OK","OK","OK","Mallette","1.20",{"$f":"VLOOKUP(S194,'[1]Extraction Tracking 2905'!D:D,1,FALSE)","v":"KIT.20023A"},null,1,{"$f":"Q194","v":"B2-R06"},4,{"$f":"AD194&AE194","v":"B2-R064"},{"$f":"M194","v":20023},{"$f":"VLOOKUP(C194,[2]Feuil2!A:B,2,FALSE)","v":"BLK2"},"1141BLK2",{"$f":"VLOOKUP(Regroupement!AI194,[2]Wip!AC:AC,1,FALSE)","v":"1141BLK2"},{"$f":"VLOOKUP(AI194,[2]Wip!AC:AC,1,FALSE)","v":"1141BLK2"}]
[126,195,"Block 2","1.20","B2-R06","KPO",null,"Buffer","350*80",null,10,"Logistiport",20060,1201,1,"NA","B2-R06","Prémontage Bâti Avant: Montage des chemins de câbles auxiliaires dans le bâti avant","KIT.20060A","KIT.20060B","KIT.20060C","OK","OK","OK","Mallette","1.20",{"$f":"VLOOKUP(S195,'[1]Extraction Tracking 2905'!D:D,1,FALSE)","v":"KIT.20060A"},null,1,"B2-R06",5,"B2-R065",20060,{"$f":"VLOOKUP(C195,[2]Feuil2!A:B,2,FALSE)","v":"BLK2"},{"$f":"N195&AH195","v":"1201BLK2"},{"$f":"VLOOKUP(Regroupement!AI195,[2]Wip!AC:AC,1,FALSE)","v":"1201BLK2"},{"$f":"VLOOKUP(AI195,[2]Wip!AC:AC,1,FALSE)","v":"1201BLK2"}]
[127,196,"Block 2","1.20","B2-R06","KPO",null,"Buffer","350*80",null,10,"Logistiport",20070,1231,1,"NA","B2-R06","Prémontage Bâti Avant: Montage du système de lubrification à l'intérieur du bâti avant","KIT.20070A","KIT.20070B","KIT.20070C","OK","OK","OK","Mallette","1.20",{"$f":"VLOOKUP(S196,'[1]Extraction Tracking 2905'!D:D,1,FALSE)","v":"KIT.20070A"},null,1,"B2-R06",{"$f":"IF(AD196=AD195,AE195+1,1)","v":6},"B2-R066",20070,{"$f":"VLOOKUP(C196,[2]Feuil2!A:B,2,FALSE)","v":"BLK2"},"1231BLK2",{"$f":"VLOOKUP(Regroupement!AI196,[2]Wip!AC:AC,1,FALSE)","v":"1231BLK2"},{"$f":"VLOOKUP(AI196,[2]Wip!AC:AC,1,FALSE)","v":"1231BLK2"}]
[130,197,"Block 2","1.20","B2-R06","KPO",null,"Buffer","350*80",null,10,"Logistiport",20020,1101,1,"NA","B2-R06","Réception, déballage et nettoyage du bâti avant","KIT.20020A","KIT.20020B","KIT.20020C","OK","OK","OK",null,"1.20",{"$f":"VLOOKUP(S197,'[1]Extraction Tracking 2905'!D:D,1,FALSE)","v":"KIT.20020A"},null,1,"B2-R06",7,"B2-R067",20020,{"$f":"VLOOKUP(C197,[2]Feuil2!A:B,2,FALSE)","v":"BLK2"},"1101BLK2",{"$f":"VLOOKUP(Regroupement!AI197,[2]Wip!AC:AC,1,FALSE)","v":"1101BLK2"},{"$f":"VLOOKUP(AI197,[2]Wip!AC:AC,1,FALSE)","v":"1101BLK2"}]
[131,198,"Block 2","1.20","B2-R07","Idea",null,"Buffer","200*200",null,7,"Logistiport",20170,1301,1,"NA",{"$f":"E198","v":"B2-R07"},"Montage de l'appui axial arrière du BA","KIT.20170A","KIT.20170B","KIT.20170C","OK","OK","OK","Mallette","1.20",{"$f":"VLOOKUP(S198,'[1]Extraction Tracking 2905'!D:D,1,FALSE)","v":"KIT.20170A"},null,1,"B2-R07",1,"B2-R071",20170,{"$f":"VLOOKUP(C198,[2]Feuil2!A:B,2,FALSE)","v":"BLK2"},"1301BLK2",{"$f":"VLOOKUP(Regroupement!AI198,[2]Wip!AC:AC,1,FALSE)","v":"1301BLK2"},{"$f":"VLOOKUP(AI198,[2]Wip!AC:AC,1,FALSE)","v":"1301BLK2"}]
[132,199,"Block 2","1.20","B2-R07","Idea",null,"Buffer","200*200",null,7,"Logistiport",20191,1311,1,"NA","B2-R07","Montage fenêtres de inspection en appui axial et application d'un joint de silicone entre appui axial et bâti avant","KIT.20191A","KIT.20191B","KIT.20191C","OK","OK","OK","Mallette","1.20",{"$f":"VLOOKUP(S199,'[1]Extraction Tracking 2905'!D:D,1,FALSE)","v":"KIT.20191A"},null,1,"B2-R07",2,"B2-R072",20191,{"$f":"VLOOKUP(C199,[2]Feuil2!A:B,2,FALSE)","v":"BLK2"},"1311BLK2",{"$f":"VLOOKUP(Regroupement!AI199,[2]Wip!AC:AC,1,FALSE)","v":"1311BLK2"},{"$f":"VLOOKUP(AI199,[2]Wip!AC:AC,1,FALSE)","v":"1311BLK2"}]
[133,200,"Block 2","1.20","B2-R08","Idea",null,"Buffer","200*200",null,7,"Logistiport",20180,1401,1,"NA","B2-R08","Positionnement de joint interieur avant et arrière dans bâti avant","KIT.20180A","KIT.20180B","KIT.20180C","OK","OK","OK",null,"1.20",{"$f":"VLOOKUP(S200,'[1]Extraction Tracking 2905'!D:D,1,FALSE)","v":"KIT.20180A"},null,1,"B2-R08",1,"B2-R081",20180,{"$f":"VLOOKUP(C200,[2]Feuil2!A:B,2,FALSE)","v":"BLK2"},"1401BLK2",{"$f":"VLOOKUP(Regroupement!AI200,[2]Wip!AC:AC,1,FALSE)","v":"1401BLK2"},{"$f":"VLOOKUP(AI200,[2]Wip!AC:AC,1,FALSE)","v":"1401BLK2"}]
[134,201,"Block 2","1.20","B2-R08","Idea",null,"Buffer","200*200",null,7,"Logistiport",20192,1341,1,"NA","B2-R08","Montage de la bague joint  intérieure du roulement arrière et avant.","KIT.20192A","KIT.20192B","KIT.20192C","OK","OK","OK","Mallette","1.20",{"$f":"VLOOKUP(S201,'[1]Extraction Tracking 2905'!D:D,1,FALSE)","v":"KIT.20192A"},null,1,"B2-R08",2,"B2-R082",20192,{"$f":"VLOOKUP(C201,[2]Feuil2!A:B,2,FALSE)","v":"BLK2"},"1341BLK2",{"$f":"VLOOKUP(Regroupement!AI201,[2]Wip!AC:AC,1,FALSE)","v":"1341BLK2"},{"$f":"VLOOKUP(AI201,[2]Wip!AC:AC,1,FALSE)","v":"1341BLK2"}]
[135,202,"Block 2","1.20","B2-R09","Support fournisseur",null,"Direct ligne",null,"Front Frame",6,"TGO","My Way 20020",1101,1,"NA","B2-R09","Réception, déballage et nettoyage du bâti avant","My way","KIT.20020B","KIT.20020C","Support fournisseur","NA","NA",null,"1.20",{"$f":"VLOOKUP(S202,'[1]Extraction Tracking 2905'!D:D,1,FALSE)","v":{"$error":"#N/A"}},null,1,"B2-R09",1,"B2-R091","My Way 20020",{"$f":"VLOOKUP(C202,[2]Feuil2!A:B,2,FALSE)","v":"BLK2"},"1101BLK2",{"$f":"VLOOKUP(Regroupement!AI202,[2]Wip!AC:AC,1,FALSE)","v":"1101BLK2"},{"$f":"VLOOKUP(AI202,[2]Wip!AC:AC,1,FALSE)","v":"1101BLK2"}]
[137,203,"Block 2","1.20","B2-R11","Support fournisseur",null,"Buffer Exterieur","200*200","Roulement arrière & Avant",7,"Chantenay",20125,1211,1,"NA","B2-R11","Elingage et nettoyage du roulement arrière, positionnement sur chauffe roulement et montage des barres de centrage.","KIT.20125A","KIT.20125B","KIT.20125C","Support fournisseur","Support fournisseur","Support fournisseur","Mallette","1.20",{"$f":"VLOOKUP(S203,'[1]Extraction Tracking 2905'!D:D,1,FALSE)","v":"KIT.20125A"},null,1,"B2-R11",1,"B2-R111",20125,{"$f":"VLOOKUP(C203,[2]Feuil2!A:B,2,FALSE)","v":"BLK2"},"1211BLK2",{"$f":"VLOOKUP(Regroupement!AI203,[2]Wip!AC:AC,1,FALSE)","v":"1211BLK2"},{"$f":"VLOOKUP(AI203,[2]Wip!AC:AC,1,FALSE)","v":"1211BLK2"}]
[138,204,"Block 2","1.20","B2-R11","Support fournisseur",null,"Buffer Exterieur","200*200","Roulement arrière & Avant",7,"Chantenay",20710,2331,1,"NA","B2-R11","Mise en température du roulement avant. Mesure de la température","KIT.20710A","KIT.20710B","KIT.20710C","Support fournisseur","Support fournisseur","Support fournisseur",null,"1.20",{"$f":"VLOOKUP(S204,'[1]Extraction Tracking 2905'!D:D,1,FALSE)","v":"KIT.20710A"},null,1,"B2-R11",2,"B2-R112",20710,{"$f":"VLOOKUP(C204,[2]Feuil2!A:B,2,FALSE)","v":"BLK2"},"2331BLK2",{"$f":"VLOOKUP(Regroupement!AI204,[2]Wip!AC:AC,1,FALSE)","v":"2331BLK2"},{"$f":"VLOOKUP(AI204,[2]Wip!AC:AC,1,FALSE)","v":"2331BLK2"}]
[139,205,"Block 2","1.30","B2-R12","Idea",null,"Buffer","150X150",null,10,"Logistiport",20770,2431,1,"NA","B2-R12","Montage de l'appui axial du roulement AV. Serrage intermédiaire","KIT.20770A","KIT.20770B","KIT.20770C","OK","OK","OK","Mallette","1.30",{"$f":"VLOOKUP(S205,'[1]Extraction Tracking 2905'!D:D,1,FALSE)","v":"KIT.20770A"},null,1,"B2-R12",1,"B2-R121",20770,{"$f":"VLOOKUP(C205,[2]Feuil2!A:B,2,FALSE)","v":"BLK2"},"2431BLK2",{"$f":"VLOOKUP(Regroupement!AI205,[2]Wip!AC:AC,1,FALSE)","v":"2431BLK2"},{"$f":"VLOOKUP(AI205,[2]Wip!AC:AC,1,FALSE)","v":"2431BLK2"}]
[140,206,"Block 2","1.30","B2-R13","KPO","P2","Buffer","80X120",null,10,"Logistiport",20810,2631,1,"NA","B2-R13","Montage le joint du roulement arriere","KIT.20810A","KIT.20810B","KIT.20810C","OK","OK","OK","Mallette","1.30",{"$f":"VLOOKUP(S206,'[1]Extraction Tracking 2905'!D:D,1,FALSE)","v":"KIT.20810A"},null,1,"B2-R13",1,"B2-R131",20810,{"$f":"VLOOKUP(C206,[2]Feuil2!A:B,2,FALSE)","v":"BLK2"},"2631BLK2",{"$f":"VLOOKUP(Regroupement!AI206,[2]Wip!AC:AC,1,FALSE)","v":"2631BLK2"},{"$f":"VLOOKUP(AI206,[2]Wip!AC:AC,1,FALSE)","v":"2631BLK2"}]
[141,207,"Block 2","1.30","B2-R13","KPO","P2","Buffer","80X120",null,10,"Logistiport",20851,2721,1,"NA","B2-R13","Montage des bouteilles de retour de graisse du roulement AR",{"$f":"\"Mallette \"&M207","v":"Mallette 20851"},"KIT.20851B","KIT.20851C","OK","OK","OK","Mallette Uniquement","1.30",{"$f":"VLOOKUP(S207,'[1]Extraction Tracking 2905'!D:D,1,FALSE)","v":{"$error":"#N/A"}},null,1,"B2-R13",2,"B2-R132",20851,{"$f":"VLOOKUP(C207,[2]Feuil2!A:B,2,FALSE)","v":"BLK2"},"2721BLK2",{"$f":"VLOOKUP(Regroupement!AI207,[2]Wip!AC:AC,1,FALSE)","v":"2721BLK2"},{"$f":"VLOOKUP(AI207,[2]Wip!AC:AC,1,FALSE)","v":"2721BLK2"}]
[142,208,"Block 2","1.30","B2-R13","KPO","P2","Buffer","80X120",null,10,"Logistiport",20852,2701,1,"NA","B2-R13","MONTAGE_DU_PLATEAU_RECUPERATEUR_DE_GRAISSE_DU_ROULEMENT_ARRIERE","KIT.20852A",{"$error":"#N/A"},{"$error":"#N/A"},"OK","OK","OK","Mallette","1.30",{"$f":"VLOOKUP(S208,'[1]Extraction Tracking 2905'!D:D,1,FALSE)","v":{"$error":"#N/A"}},null,1,"B2-R13",3,"B2-R133",20852,{"$f":"VLOOKUP(C208,[2]Feuil2!A:B,2,FALSE)","v":"BLK2"},"2701BLK2",{"$f":"VLOOKUP(Regroupement!AI208,[2]Wip!AC:AC,1,FALSE)","v":"2701BLK2"},{"$f":"VLOOKUP(AI208,[2]Wip!AC:AC,1,FALSE)","v":"2701BLK2"}]
[143,209,"Block 2","1.30","B2-R14","KPO","P2","Buffer","60X150",null,10,"Logistiport",20790,2501,1,"NA","B2-R14","MONTER_ET_FIXER_LE_JOINT_DU_ROULEMENT_AVANT",{"$f":"\"Mallette \"&M209","v":"Mallette 20790"},"KIT.20790B","KIT.20790C","OK","OK","OK","Mallette Uniquement","1.30",{"$f":"VLOOKUP(S209,'[1]Extraction Tracking 2905'!D:D,1,FALSE)","v":{"$error":"#N/A"}},null,1,"B2-R14",1,"B2-R141",20790,{"$f":"VLOOKUP(C209,[2]Feuil2!A:B,2,FALSE)","v":"BLK2"},"2501BLK2",{"$f":"VLOOKUP(Regroupement!AI209,[2]Wip!AC:AC,1,FALSE)","v":"2501BLK2"},{"$f":"VLOOKUP(AI209,[2]Wip!AC:AC,1,FALSE)","v":"2501BLK2"}]
[144,210,"Block 2","1.30","B2-R14","KPO","P2","Buffer","60X150",null,10,"Logistiport",20820,2511,1,"NA","B2-R14","Monter et fixer le joint du roulement avant","KIT.20820A","KIT.20820B","KIT.20820C","OK","OK","OK","Mallette","1.30",{"$f":"VLOOKUP(S210,'[1]Extraction Tracking 2905'!D:D,1,FALSE)","v":"KIT.20820A"},null,1,"B2-R14",2,"B2-R142",20820,{"$f":"VLOOKUP(C210,[2]Feuil2!A:B,2,FALSE)","v":"BLK2"},"2511BLK2",{"$f":"VLOOKUP(Regroupement!AI210,[2]Wip!AC:AC,1,FALSE)","v":"2511BLK2"},{"$f":"VLOOKUP(AI210,[2]Wip!AC:AC,1,FALSE)","v":"2511BLK2"}]
[145,211,"Block 2","1.30","B2-R14","KPO","P2","Buffer","60X150",null,10,"Logistiport",20821,2621,1,"NA","B2-R14","Montage final du joint interièure du roulement arrière et avant","KIT.20821A","KIT.20821B","KIT.20821C","OK","OK","OK","Mallette","1.30",{"$f":"VLOOKUP(S211,'[1]Extraction Tracking 2905'!D:D,1,FALSE)","v":"KIT.20821A"},null,{"$f":"COUNTIF(M:M,M211)","v":1},"B2-R14",3,"B2-R143",20821,{"$f":"VLOOKUP(C211,[2]Feuil2!A:B,2,FALSE)","v":"BLK2"},"2621BLK2",{"$f":"VLOOKUP(Regroupement!AI211,[2]Wip!AC:AC,1,FALSE)","v":"2621BLK2"},{"$f":"VLOOKUP(AI211,[2]Wip!AC:AC,1,FALSE)","v":"2621BLK2"}]
[320,212,"Block 2","1.20","Graisse","Support fournisseur",null,null,null,"Graisse",null,null,20241,1331,1,"NA","Graisse","Graissage du roulement et mise en place d'un film protecteur","Graisse","KIT.20241B","KIT.20241C","Support fournisseur","NA","NA",null,"1.20",{"$f":"VLOOKUP(S212,'[1]Extraction Tracking 2905'!D:D,1,FALSE)","v":{"$error":"#N/A"}},null,1,"Graisse",1,"Graisse1",20241,{"$f":"VLOOKUP(C212,[2]Feuil2!A:B,2,FALSE)","v":"BLK2"},"1331BLK2",{"$f":"VLOOKUP(Regroupement!AI212,[2]Wip!AC:AC,1,FALSE)","v":"1331BLK2"},{"$f":"VLOOKUP(AI212,[2]Wip!AC:AC,1,FALSE)","v":"1331BLK2"}]
[321,213,"Block 2","1.30","Graisse","Support fournisseur",null,null,null,"Graisse",null,null,20730,2231,1,"NA","Graisse","Prégraisser la piste intérieure du roulement AV","Graisse","KIT.20730B","KIT.20730C","Support fournisseur","NA","NA",null,"1.30",{"$f":"VLOOKUP(S213,'[1]Extraction Tracking 2905'!D:D,1,FALSE)","v":{"$error":"#N/A"}},null,1,"Graisse",2,"Graisse2",20730,{"$f":"VLOOKUP(C213,[2]Feuil2!A:B,2,FALSE)","v":"BLK2"},"2231BLK2",{"$f":"VLOOKUP(Regroupement!AI213,[2]Wip!AC:AC,1,FALSE)","v":"2231BLK2"},{"$f":"VLOOKUP(AI213,[2]Wip!AC:AC,1,FALSE)","v":"2231BLK2"}]
[149,214,"Block 2","2.11A","B2-R18","KPO","P1","Buffer","80X120",null,10,"Logistiport",22330,3111,3,"S","B2-R18","PREMONTAGE_DES_ARMOIRES_ELECTRIQUES_DE_PITCH_SUR_LEUR_STRUCTURE_SUPPORT_X3","KIT.22330A","KIT.22330B","KIT.22330C","OK","OK","OK","Mallette","2.11A",{"$f":"VLOOKUP(S214,'[1]Extraction Tracking 2905'!D:D,1,FALSE)","v":"KIT.22330A"},null,3,"B2-R18",1,"B2-R181",22330,{"$f":"VLOOKUP(C214,[2]Feuil2!A:B,2,FALSE)","v":"BLK2"},"3111BLK2",{"$f":"VLOOKUP(Regroupement!AI214,[2]Wip!AC:AC,1,FALSE)","v":"3111BLK2"},{"$f":"VLOOKUP(AI214,[2]Wip!AC:AC,1,FALSE)","v":"3111BLK2"}]
[147,215,"Block 2","2.11A","B2-R16","Support fournisseur",null,"Buffer",null,"Axis Box",10,"Logistiport",22330,3112,3,"S",{"$f":"E215","v":"B2-R16"},"PREMONTAGE_DES_ARMOIRES_ELECTRIQUES_DE_PITCH_SUR_LEUR_STRUCTURE_SUPPORT_X3","KIT.22330A","KIT.22330B","KIT.22330C","Support fournisseur","NA","NA",null,{"$f":"D215","v":"2.11A"},{"$f":"VLOOKUP(S215,'[1]Extraction Tracking 2905'!D:D,1,FALSE)","v":"KIT.22330A"},null,3,"B2-R16",1,"B2-R161",22330,{"$f":"VLOOKUP(C215,[2]Feuil2!A:B,2,FALSE)","v":"BLK2"},"3112BLK2",{"$f":"VLOOKUP(Regroupement!AI215,[2]Wip!AC:AC,1,FALSE)","v":"3112BLK2"},{"$f":"VLOOKUP(AI215,[2]Wip!AC:AC,1,FALSE)","v":"3112BLK2"}]
[146,216,"Block 2","2.11A","B2-R15","Idea",null,"Buffer",null,"Supports WND 101397",10,"Logistiport",22330,3113,3,"S",{"$f":"E216","v":"B2-R15"},"PREMONTAGE_DES_ARMOIRES_ELECTRIQUES_DE_PITCH_SUR_LEUR_STRUCTURE_SUPPORT_X3","KIT.22330A","KIT.22330B","KIT.22330C","OK","OK","OK",null,{"$f":"D216","v":"2.11A"},{"$f":"VLOOKUP(S216,'[1]Extraction Tracking 2905'!D:D,1,FALSE)","v":"KIT.22330A"},null,3,"B2-R15",1,"B2-R151",22330,{"$f":"VLOOKUP(C216,[2]Feuil2!A:B,2,FALSE)","v":"BLK2"},"3113BLK2",{"$f":"VLOOKUP(Regroupement!AI216,[2]Wip!AC:AC,1,FALSE)","v":"3113BLK2"},{"$f":"VLOOKUP(AI216,[2]Wip!AC:AC,1,FALSE)","v":"3113BLK2"}]
[150,217,"Block 2","2.11A","B2-R19","KPO","P1","Buffer","150X100",null,10,"Logistiport",22310,3251,1,"S","B2-R19","Pré-assemblage des pompes de graissage sur leurs supports: Pitch (x3), couronne (x1).","KIT.22310A","KIT.22310B","KIT.22310C","OK","OK","OK","Mallette","2.11A",{"$f":"VLOOKUP(S217,'[1]Extraction Tracking 2905'!D:D,1,FALSE)","v":"KIT.22310A"},null,1,"B2-R19",1,"B2-R191",22310,{"$f":"VLOOKUP(C217,[2]Feuil2!A:B,2,FALSE)","v":"BLK2"},"3251BLK2",{"$f":"VLOOKUP(Regroupement!AI217,[2]Wip!AC:AC,1,FALSE)","v":"3251BLK2"},{"$f":"VLOOKUP(AI217,[2]Wip!AC:AC,1,FALSE)","v":"3251BLK2"}]
[151,218,"Block 2","2.11A","B2-R20","Support fournisseur",null,"Direct ligne","380x380","Roulements de Pitch",7,"TGO","My Way 22051",3102,1,"S","B2-R20","Pré-assemblage des roulements de pitch (x3): Montage du système de lubrification du pitch","My way","KIT.22051B","KIT.22051C","Support fournisseur","NA","NA",null,"2.11A",{"$f":"VLOOKUP(S218,'[1]Extraction Tracking 2905'!D:D,1,FALSE)","v":{"$error":"#N/A"}},null,1,"B2-R20",1,"B2-R201","My Way 22051",{"$f":"VLOOKUP(C218,[2]Feuil2!A:B,2,FALSE)","v":"BLK2"},"3102BLK2",{"$f":"VLOOKUP(Regroupement!AI218,[2]Wip!AC:AC,1,FALSE)","v":{"$error":"#N/A"}},{"$f":"VLOOKUP(AI218,[2]Wip!AC:AC,1,FALSE)","v":{"$error":"#N/A"}}]
[152,219,"Block 2","2.11A","B2-R21","KPO",null,"Buffer","80X120",null,10,"Logistiport",22053,3221,1,"NA","B2-R21","Pré-assemblage des roulements de pitch (x3): Montage des extenseurs de pales","KIT.22053A","KIT.22053B","KIT.22053C","OK","OK","OK","Mallette","2.11A",{"$f":"VLOOKUP(S219,'[1]Extraction Tracking 2905'!D:D,1,FALSE)","v":"KIT.22053A"},null,1,"B2-R21",1,"B2-R211",22053,{"$f":"VLOOKUP(C219,[2]Feuil2!A:B,2,FALSE)","v":"BLK2"},"3221BLK2",{"$f":"VLOOKUP(Regroupement!AI219,[2]Wip!AC:AC,1,FALSE)","v":"3221BLK2"},{"$f":"VLOOKUP(AI219,[2]Wip!AC:AC,1,FALSE)","v":"3221BLK2"}]
[153,220,"Block 2","2.11A","B2-R22","Support fournisseur",null,"Direct ligne","380x380","Extenseurs de pales",7,"TGO","My way 22053",3222,1,"NA","B2-R22","Pré-assemblage des roulements de pitch (x3): Montage des extenseurs de pales","My way","KIT.22053B","KIT.22053C","Support fournisseur","NA","NA","Mallette","2.11A",{"$f":"VLOOKUP(S220,'[1]Extraction Tracking 2905'!D:D,1,FALSE)","v":{"$error":"#N/A"}},null,1,"B2-R22",1,"B2-R221","My way 22053",{"$f":"VLOOKUP(C220,[2]Feuil2!A:B,2,FALSE)","v":"BLK2"},"3222BLK2",{"$f":"VLOOKUP(Regroupement!AI220,[2]Wip!AC:AC,1,FALSE)","v":{"$error":"#N/A"}},{"$f":"VLOOKUP(AI220,[2]Wip!AC:AC,1,FALSE)","v":{"$error":"#N/A"}}]
[154,221,"Block 2","2.11A","B2-R23","KPO",null,"Buffer","80X120",null,10,"Logistiport",22052,3361,1,"NA","B2-R23","Pré-assemblage des roulements de pitch (x3): Montage de la came de frein du pitch","KIT.22052A","KIT.22052B","KIT.22052C","OK","OK","OK",null,"2.11A",{"$f":"VLOOKUP(S221,'[1]Extraction Tracking 2905'!D:D,1,FALSE)","v":"KIT.22052A"},null,1,"B2-R23",1,"B2-R231",22052,{"$f":"VLOOKUP(C221,[2]Feuil2!A:B,2,FALSE)","v":"BLK2"},"3361BLK2",{"$f":"VLOOKUP(Regroupement!AI221,[2]Wip!AC:AC,1,FALSE)","v":"3361BLK2"},{"$f":"VLOOKUP(AI221,[2]Wip!AC:AC,1,FALSE)","v":"3361BLK2"}]
[155,222,"Block 2","2.11A","B2-R24","KPO","Visserie","Buffer","3X80X120","PAL 1/3 (Visserie)",10,"Logistiport",22054,3411,1,"NA","B2-R24","Pré-assemblage des roulements de pitch (x3): Mise en place des vis dans les trous des roulements. Ecrire la séquence de serrage.","KIT.22054A","KIT.22054B","KIT.22054C","OK","OK","OK",null,"2.11A",{"$f":"VLOOKUP(S222,'[1]Extraction Tracking 2905'!D:D,1,FALSE)","v":"KIT.22054A"},null,1,"B2-R24",1,"B2-R241",22054,{"$f":"VLOOKUP(C222,[2]Feuil2!A:B,2,FALSE)","v":"BLK2"},"3411BLK2",{"$f":"VLOOKUP(Regroupement!AI222,[2]Wip!AC:AC,1,FALSE)","v":"3411BLK2"},{"$f":"VLOOKUP(AI222,[2]Wip!AC:AC,1,FALSE)","v":"3411BLK2"}]
[156,223,"Block 2","2.11A","B2-R25","KPO",null,"Buffer","80X120",null,10,"Logistiport",22055,3401,1,"NA","B2-R25","Pré-assemblage des roulements de pitch (x3): Montage des supports du deflécteur dans le roulements.","KIT.22055A","KIT.22055B","KIT.22055C","OK","OK","OK",null,"2.11A",{"$f":"VLOOKUP(S223,'[1]Extraction Tracking 2905'!D:D,1,FALSE)","v":"KIT.22055A"},null,1,"B2-R25",1,"B2-R251",22055,{"$f":"VLOOKUP(C223,[2]Feuil2!A:B,2,FALSE)","v":"BLK2"},"3401BLK2",{"$f":"VLOOKUP(Regroupement!AI223,[2]Wip!AC:AC,1,FALSE)","v":"3401BLK2"},{"$f":"VLOOKUP(AI223,[2]Wip!AC:AC,1,FALSE)","v":"3401BLK2"}]
[157,224,"Block 2","2.11A","B2-R26","KPO","P1","Buffer","80X120",null,10,"Logistiport",22051,3101,1,"NA","B2-R26","Pré-assemblage des roulements de pitch (x3): Montage du système de lubrification du pitch","KIT.22051A","KIT.22051B","KIT.22051C","OK","OK","OK",null,"2.11A",{"$f":"VLOOKUP(S224,'[1]Extraction Tracking 2905'!D:D,1,FALSE)","v":"KIT.22051A"},null,1,"B2-R26",1,"B2-R261",22051,{"$f":"VLOOKUP(C224,[2]Feuil2!A:B,2,FALSE)","v":"BLK2"},"3101BLK2",{"$f":"VLOOKUP(Regroupement!AI224,[2]Wip!AC:AC,1,FALSE)","v":"3101BLK2"},{"$f":"VLOOKUP(AI224,[2]Wip!AC:AC,1,FALSE)","v":"3101BLK2"}]
[158,225,"Block 2","2.11A","SUP le 22 01 Thomas","Support fournisseur",null,null,null,"PITCH MECHANICAL ACTUATOR",7,"Chantenay","SUP 22150",3231,1,"NA","SUP le 22 01 Thomas","Pré-assemblage des motoréducteurs (x3): Montage des moteurs sur les réducteurs de pitch","KIT.22150A",{"$error":"#N/A"},{"$error":"#N/A"},"Support fournisseur","NA","NA","Mallette","2.11A",{"$f":"VLOOKUP(S225,'[1]Extraction Tracking 2905'!D:D,1,FALSE)","v":"KIT.22150A"},null,1,"SUP le 22 01 Thomas",1,"SUP le 22 01 Thomas1","SUP 22150",{"$f":"VLOOKUP(C225,[2]Feuil2!A:B,2,FALSE)","v":"BLK2"},"3231BLK2",{"$f":"VLOOKUP(Regroupement!AI225,[2]Wip!AC:AC,1,FALSE)","v":"3231BLK2"},{"$f":"VLOOKUP(AI225,[2]Wip!AC:AC,1,FALSE)","v":"3231BLK2"}]
[159,226,"Block 2","2.11A","B2-R28","Support fournisseur",null,"Buffer",null,"PITCH ACTION MOTOR  + PITCH MECHANICAL ACTUATOR",7,"Chantenay",22190,3201,1,"S","B2-R28","Pré-assemblage des motoréducteurs (x3): Montage des moteurs sur les réducteurs de pitch","KIT.22190A","KIT.22190B","KIT.22190C","Support fournisseur","Support fournisseur","Support fournisseur","Mallette","2.11A",{"$f":"VLOOKUP(S226,'[1]Extraction Tracking 2905'!D:D,1,FALSE)","v":"KIT.22190A"},null,1,"B2-R28",1,"B2-R281",22190,{"$f":"VLOOKUP(C226,[2]Feuil2!A:B,2,FALSE)","v":"BLK2"},"3201BLK2",{"$f":"VLOOKUP(Regroupement!AI226,[2]Wip!AC:AC,1,FALSE)","v":"3201BLK2"},{"$f":"VLOOKUP(AI226,[2]Wip!AC:AC,1,FALSE)","v":"3201BLK2"}]
[161,227,"Block 2","2.11A","B2-R30","KPO",null,"Buffer","80X120",null,10,"Logistiport",22185,3301,1,"NA","B2-R30","Pré-assemblage du paratonerre hub-pale (x3)","KIT.22185A","KIT.22185B","KIT.22185C","OK","OK","OK","Mallette","2.11A",{"$f":"VLOOKUP(S227,'[1]Extraction Tracking 2905'!D:D,1,FALSE)","v":"KIT.22185A"},null,1,"B2-R30",1,"B2-R301",22185,{"$f":"VLOOKUP(C227,[2]Feuil2!A:B,2,FALSE)","v":"BLK2"},"3301BLK2",{"$f":"VLOOKUP(Regroupement!AI227,[2]Wip!AC:AC,1,FALSE)","v":"3301BLK2"},{"$f":"VLOOKUP(AI227,[2]Wip!AC:AC,1,FALSE)","v":"3301BLK2"}]
[162,228,"Block 2","2.11A","B2-R30","KPO",null,"Buffer","80X120",null,10,"Logistiport",22186,3311,1,"NA","B2-R30","Pré-assemblage des encodeurs redondants (x3)","KIT.22186A","KIT.22186B","KIT.22186C","OK","OK","OK","Mallette","2.11A",{"$f":"VLOOKUP(S228,'[1]Extraction Tracking 2905'!D:D,1,FALSE)","v":"KIT.22186A"},null,1,"B2-R30",2,"B2-R302",22186,{"$f":"VLOOKUP(C228,[2]Feuil2!A:B,2,FALSE)","v":"BLK2"},"3311BLK2",{"$f":"VLOOKUP(Regroupement!AI228,[2]Wip!AC:AC,1,FALSE)","v":"3311BLK2"},{"$f":"VLOOKUP(AI228,[2]Wip!AC:AC,1,FALSE)","v":"3311BLK2"}]
[163,229,"Block 2","2.11A","B2-R30","KPO",null,"Buffer","80X120",null,10,"Logistiport",22353,3321,1,"NA","B2-R30","Pre -ensamblage équerre en armoire éléctrique pour les suports du BMS (x3).","KIT.22353A","KIT.22353B","KIT.22353C","OK","OK","OK","Mallette","2.11A",{"$f":"VLOOKUP(S229,'[1]Extraction Tracking 2905'!D:D,1,FALSE)","v":"KIT.22353A"},null,1,"B2-R30",3,"B2-R303",22353,{"$f":"VLOOKUP(C229,[2]Feuil2!A:B,2,FALSE)","v":"BLK2"},"3321BLK2",{"$f":"VLOOKUP(Regroupement!AI229,[2]Wip!AC:AC,1,FALSE)","v":"3321BLK2"},{"$f":"VLOOKUP(AI229,[2]Wip!AC:AC,1,FALSE)","v":"3321BLK2"}]
[164,230,"Block 2","2.11A","B2-R30","KPO",null,"Buffer","80X120",null,10,"Logistiport",22389,3331,1,"NA","B2-R30","Pré-assemblage paratonerre Hub-nacelle","KIT.22389A","KIT.22389B","KIT.22389C","OK","OK","OK","Mallette","2.11A",{"$f":"VLOOKUP(S230,'[1]Extraction Tracking 2905'!D:D,1,FALSE)","v":"KIT.22389A"},null,1,"B2-R30",4,"B2-R304",22389,{"$f":"VLOOKUP(C230,[2]Feuil2!A:B,2,FALSE)","v":"BLK2"},"3331BLK2",{"$f":"VLOOKUP(Regroupement!AI230,[2]Wip!AC:AC,1,FALSE)","v":"3331BLK2"},{"$f":"VLOOKUP(AI230,[2]Wip!AC:AC,1,FALSE)","v":"3331BLK2"}]
[165,231,"Block 2","2.11A","B2-R31","KPO","P2","Buffer","80X120",null,10,"Logistiport",80013,3151,1,"NA","B2-R31","Préparation câbles paratonnerre HUB","KIT.80013A","KIT.80013B","KIT.80013C","OK","OK","OK",null,"2.11A",{"$f":"VLOOKUP(S231,'[1]Extraction Tracking 2905'!D:D,1,FALSE)","v":"KIT.80013A"},null,1,"B2-R31",1,"B2-R311",80013,{"$f":"VLOOKUP(C231,[2]Feuil2!A:B,2,FALSE)","v":"BLK2"},"3151BLK2",{"$f":"VLOOKUP(Regroupement!AI231,[2]Wip!AC:AC,1,FALSE)","v":"3151BLK2"},{"$f":"VLOOKUP(AI231,[2]Wip!AC:AC,1,FALSE)","v":"3151BLK2"}]
[166,232,"Block 2","2.11A","B2-R31","KPO","P2","Buffer","80X120",null,10,"Logistiport",80014,3121,1,"NA","B2-R31","Préparation câbles paratonnerre HUB Pale 1","KIT.80014A","KIT.80014B","KIT.80014C","OK","OK","OK",null,"2.11A",{"$f":"VLOOKUP(S232,'[1]Extraction Tracking 2905'!D:D,1,FALSE)","v":"KIT.80014A"},null,1,"B2-R31",2,"B2-R312",80014,{"$f":"VLOOKUP(C232,[2]Feuil2!A:B,2,FALSE)","v":"BLK2"},"3121BLK2",{"$f":"VLOOKUP(Regroupement!AI232,[2]Wip!AC:AC,1,FALSE)","v":"3121BLK2"},{"$f":"VLOOKUP(AI232,[2]Wip!AC:AC,1,FALSE)","v":"3121BLK2"}]
[168,233,"Block 2","2.11A","B2-R31","KPO","P2","Buffer","80X120",null,10,"Logistiport",80202,3241,1,"NA","B2-R31","Prémontage des armoires électriques de pitch: préparation des câbles et regroupement des câbles","KIT.80202A","KIT.80202B","KIT.80202C","OK","OK","OK",null,"2.11A",{"$f":"VLOOKUP(S233,'[1]Extraction Tracking 2905'!D:D,1,FALSE)","v":"KIT.80202A"},null,1,"B2-R31",3,"B2-R313",80202,{"$f":"VLOOKUP(C233,[2]Feuil2!A:B,2,FALSE)","v":"BLK2"},"3241BLK2",{"$f":"VLOOKUP(Regroupement!AI233,[2]Wip!AC:AC,1,FALSE)","v":"3241BLK2"},{"$f":"VLOOKUP(AI233,[2]Wip!AC:AC,1,FALSE)","v":"3241BLK2"}]
[170,234,"Block 2","2.11A","B2-R31","KPO","P2","Buffer","80X120",null,10,"Logistiport",80007,3161,1,"NA","B2-R31","PREPARATION_CABLES_LIGHT_HUB","KIT.80007A",{"$error":"#N/A"},{"$error":"#N/A"},"OK","OK","OK",null,"2.11A",{"$f":"VLOOKUP(S234,'[1]Extraction Tracking 2905'!D:D,1,FALSE)","v":"KIT.80007A"},null,1,"B2-R31",4,"B2-R314",80007,{"$f":"VLOOKUP(C234,[2]Feuil2!A:B,2,FALSE)","v":"BLK2"},"3161BLK2",{"$f":"VLOOKUP(Regroupement!AI234,[2]Wip!AC:AC,1,FALSE)","v":"3161BLK2"},{"$f":"VLOOKUP(AI234,[2]Wip!AC:AC,1,FALSE)","v":"3161BLK2"}]
[171,235,"Block 2","2.11A","B2-R31","KPO","P2","Buffer","80X120",null,10,"Logistiport",80008,3171,1,"NA","B2-R31","PREPARATION_DES_CABLES_LIGHT_POUR_BATI_AVANT_ET_INTERMEDIAIRE","KIT.80008A",{"$error":"#N/A"},{"$error":"#N/A"},"OK","OK","OK",null,"2.11A",{"$f":"VLOOKUP(S235,'[1]Extraction Tracking 2905'!D:D,1,FALSE)","v":"KIT.80008A"},null,1,"B2-R31",5,"B2-R315",80008,{"$f":"VLOOKUP(C235,[2]Feuil2!A:B,2,FALSE)","v":"BLK2"},"3171BLK2",{"$f":"VLOOKUP(Regroupement!AI235,[2]Wip!AC:AC,1,FALSE)","v":"3171BLK2"},{"$f":"VLOOKUP(AI235,[2]Wip!AC:AC,1,FALSE)","v":"3171BLK2"}]
[174,236,"Block 2","2.11A","B2-R31","KPO","P2","Buffer","80X120",null,10,"Logistiport",80020,3141,1,"NA","B2-R31","PREPARATION_DES_CABLES_DE_SONDE_DE_TEMPERATURE","KIT.80020A",{"$error":"#N/A"},{"$error":"#N/A"},"OK","OK","OK",null,"2.11A",{"$f":"VLOOKUP(S236,'[1]Extraction Tracking 2905'!D:D,1,FALSE)","v":"KIT.80020A"},null,1,"B2-R31",6,"B2-R316",80020,{"$f":"VLOOKUP(C236,[2]Feuil2!A:B,2,FALSE)","v":"BLK2"},"3141BLK2",{"$f":"VLOOKUP(Regroupement!AI236,[2]Wip!AC:AC,1,FALSE)","v":"3141BLK2"},{"$f":"VLOOKUP(AI236,[2]Wip!AC:AC,1,FALSE)","v":"3141BLK2"}]
[175,237,"Block 2","2.10","B2-R32","KPO",null,"Buffer","80X120",null,10,"Logistiport",22090,4201,1,"NA","B2-R32","Montage du roulement de pitch sur la pale 2","KIT.22090A","KIT.22090B","KIT.22090C","OK","OK","OK","Mallette","2.10",{"$f":"VLOOKUP(S237,'[1]Extraction Tracking 2905'!D:D,1,FALSE)","v":"KIT.22090A"},null,1,"B2-R32",1,"B2-R321",22090,{"$f":"VLOOKUP(C237,[2]Feuil2!A:B,2,FALSE)","v":"BLK2"},"4201BLK2",{"$f":"VLOOKUP(Regroupement!AI237,[2]Wip!AC:AC,1,FALSE)","v":"4201BLK2"},{"$f":"VLOOKUP(AI237,[2]Wip!AC:AC,1,FALSE)","v":"4201BLK2"}]
[176,238,"Block 2","2.10","B2-R33","KPO","P2","Buffer","80X120",null,10,"Logistiport",22210,4511,1,"NA","B2-R33","Montage de l'ensemble motoréducteur dans la pale 2","KIT.22210A","KIT.22210B","KIT.22210C","OK","OK","OK",null,"2.10",{"$f":"VLOOKUP(S238,'[1]Extraction Tracking 2905'!D:D,1,FALSE)","v":"KIT.22210A"},null,1,"B2-R33",1,"B2-R331",22210,{"$f":"VLOOKUP(C238,[2]Feuil2!A:B,2,FALSE)","v":"BLK2"},"4511BLK2",{"$f":"VLOOKUP(Regroupement!AI238,[2]Wip!AC:AC,1,FALSE)","v":"4511BLK2"},{"$f":"VLOOKUP(AI238,[2]Wip!AC:AC,1,FALSE)","v":"4511BLK2"}]
[177,239,"Block 2","2.10","B2-R33","KPO","P2","Buffer","80X120",null,10,"Logistiport",22220,4521,1,"NA","B2-R33","Réglage du motoréducteur de pitch de la pale 2","KIT.22220A","KIT.22220B","KIT.22220C","OK","OK","OK",null,"2.10",{"$f":"VLOOKUP(S239,'[1]Extraction Tracking 2905'!D:D,1,FALSE)","v":"KIT.22220A"},null,1,"B2-R33",2,"B2-R332",22220,{"$f":"VLOOKUP(C239,[2]Feuil2!A:B,2,FALSE)","v":"BLK2"},"4521BLK2",{"$f":"VLOOKUP(Regroupement!AI239,[2]Wip!AC:AC,1,FALSE)","v":"4521BLK2"},{"$f":"VLOOKUP(AI239,[2]Wip!AC:AC,1,FALSE)","v":"4521BLK2"}]
[178,240,"Block 2","2.10","B2-R33","KPO","P2","Buffer","80X120",null,10,"Logistiport",22291,4531,1,"NA","B2-R33","Montage paratonerre, encodeur, pignon de graissage de la pale 2","KIT.22291A","KIT.22291B","KIT.22291C","OK","OK","OK","Mallette","2.10",{"$f":"VLOOKUP(S240,'[1]Extraction Tracking 2905'!D:D,1,FALSE)","v":"KIT.22291A"},null,1,"B2-R33",3,"B2-R333",22291,{"$f":"VLOOKUP(C240,[2]Feuil2!A:B,2,FALSE)","v":"BLK2"},"4531BLK2",{"$f":"VLOOKUP(Regroupement!AI240,[2]Wip!AC:AC,1,FALSE)","v":"4531BLK2"},{"$f":"VLOOKUP(AI240,[2]Wip!AC:AC,1,FALSE)","v":"4531BLK2"}]
[179,241,"Block 2","2.10","B2-R33","KPO","P2","Buffer","80X120",null,10,"Logistiport",22296,4601,1,"NA","B2-R33","Montage de l'ensemble pompe de graissage pale 2","KIT.22296A","KIT.22296B","KIT.22296C","OK","OK","OK","Mallette","2.10",{"$f":"VLOOKUP(S241,'[1]Extraction Tracking 2905'!D:D,1,FALSE)","v":"KIT.22296A"},null,1,"B2-R33",4,"B2-R334",22296,{"$f":"VLOOKUP(C241,[2]Feuil2!A:B,2,FALSE)","v":"BLK2"},"4601BLK2",{"$f":"VLOOKUP(Regroupement!AI241,[2]Wip!AC:AC,1,FALSE)","v":"4601BLK2"},{"$f":"VLOOKUP(AI241,[2]Wip!AC:AC,1,FALSE)","v":"4601BLK2"}]
[181,242,"Block 2","2.10","B2-R33","KPO","P2","Buffer","80X120",null,10,"Logistiport",22345,4611,1,"NA","B2-R33","Montage de l'ensemble armoires électriques de pitch dans le hub pale 2","KIT.22345A","KIT.22345B","KIT.22345C","OK","OK","OK","Mallette","2.10",{"$f":"VLOOKUP(S242,'[1]Extraction Tracking 2905'!D:D,1,FALSE)","v":"KIT.22345A"},null,1,"B2-R33",5,"B2-R335",22345,{"$f":"VLOOKUP(C242,[2]Feuil2!A:B,2,FALSE)","v":"BLK2"},"4611BLK2",{"$f":"VLOOKUP(Regroupement!AI242,[2]Wip!AC:AC,1,FALSE)","v":"4611BLK2"},{"$f":"VLOOKUP(AI242,[2]Wip!AC:AC,1,FALSE)","v":"4611BLK2"}]
[182,243,"Block 2","2.10","B2-R34","KPO","P2","Buffer","80X120",null,10,"Logistiport",22250,4621,1,"NA","B2-R34","Montage de l'ensemble motoréducteur dans la pale 3","KIT.22250A","KIT.22250B","KIT.22250C","OK","OK","OK",null,"2.10",{"$f":"VLOOKUP(S243,'[1]Extraction Tracking 2905'!D:D,1,FALSE)","v":"KIT.22250A"},null,1,"B2-R34",1,"B2-R341",22250,{"$f":"VLOOKUP(C243,[2]Feuil2!A:B,2,FALSE)","v":"BLK2"},"4621BLK2",{"$f":"VLOOKUP(Regroupement!AI243,[2]Wip!AC:AC,1,FALSE)","v":"4621BLK2"},{"$f":"VLOOKUP(AI243,[2]Wip!AC:AC,1,FALSE)","v":"4621BLK2"}]
[183,244,"Block 2","2.10","B2-R34","KPO","P2","Buffer","80X120",null,10,"Logistiport",22260,4631,1,"NA","B2-R34","Réglage du motoréducteur de pitch de la pale 3","KIT.22260A","KIT.22260B","KIT.22260C","OK","OK","OK",null,"2.10",{"$f":"VLOOKUP(S244,'[1]Extraction Tracking 2905'!D:D,1,FALSE)","v":"KIT.22260A"},null,1,"B2-R34",2,"B2-R342",22260,{"$f":"VLOOKUP(C244,[2]Feuil2!A:B,2,FALSE)","v":"BLK2"},"4631BLK2",{"$f":"VLOOKUP(Regroupement!AI244,[2]Wip!AC:AC,1,FALSE)","v":"4631BLK2"},{"$f":"VLOOKUP(AI244,[2]Wip!AC:AC,1,FALSE)","v":"4631BLK2"}]
[184,245,"Block 2","2.10","B2-R34","KPO","P2","Buffer","80X120",null,10,"Logistiport",22292,4641,1,"NA","B2-R34","Montage paratonerre, encodeur, pignon de graissage de la pale 3","KIT.22292A","KIT.22292B","KIT.22292C","OK","OK","OK","Mallette","2.10",{"$f":"VLOOKUP(S245,'[1]Extraction Tracking 2905'!D:D,1,FALSE)","v":"KIT.22292A"},null,1,"B2-R34",3,"B2-R343",22292,{"$f":"VLOOKUP(C245,[2]Feuil2!A:B,2,FALSE)","v":"BLK2"},"4641BLK2",{"$f":"VLOOKUP(Regroupement!AI245,[2]Wip!AC:AC,1,FALSE)","v":"4641BLK2"},{"$f":"VLOOKUP(AI245,[2]Wip!AC:AC,1,FALSE)","v":"4641BLK2"}]
[185,246,"Block 2","2.10","B2-R34","KPO","P2","Buffer","80X120",null,10,"Logistiport",22293,4701,1,"NA","B2-R34","Montage de l'ensemble pompe de graissage pale 3","KIT.22293A","KIT.22293B","KIT.22293C","OK","OK","OK","Mallette","2.10",{"$f":"VLOOKUP(S246,'[1]Extraction Tracking 2905'!D:D,1,FALSE)","v":"KIT.22293A"},null,1,"B2-R34",4,"B2-R344",22293,{"$f":"VLOOKUP(C246,[2]Feuil2!A:B,2,FALSE)","v":"BLK2"},"4701BLK2",{"$f":"VLOOKUP(Regroupement!AI246,[2]Wip!AC:AC,1,FALSE)","v":"4701BLK2"},{"$f":"VLOOKUP(AI246,[2]Wip!AC:AC,1,FALSE)","v":"4701BLK2"}]
[187,247,"Block 2","2.10","B2-R34","KPO","P2","Buffer","80X120",null,10,"Logistiport",22346,4711,1,"NA","B2-R34","Montage de l'ensemble armoires électriques de pitch dans le hub pale 3","KIT.22346A","KIT.22346B","KIT.22346C","OK","OK","OK","Mallette","2.10",{"$f":"VLOOKUP(S247,'[1]Extraction Tracking 2905'!D:D,1,FALSE)","v":"KIT.22346A"},null,1,"B2-R34",5,"B2-R345",22346,{"$f":"VLOOKUP(C247,[2]Feuil2!A:B,2,FALSE)","v":"BLK2"},"4711BLK2",{"$f":"VLOOKUP(Regroupement!AI247,[2]Wip!AC:AC,1,FALSE)","v":"4711BLK2"},{"$f":"VLOOKUP(AI247,[2]Wip!AC:AC,1,FALSE)","v":"4711BLK2"}]
[188,248,"Block 2","2.10","B2-R35","KPO","P2","Buffer","80X120",null,10,"Logistiport",22170,4311,1,"NA","B2-R35","Montage de l'ensemble motoréducteur dans la pale 1","KIT.22170A","KIT.22170B","KIT.22170C","OK","OK","OK",null,"2.10",{"$f":"VLOOKUP(S248,'[1]Extraction Tracking 2905'!D:D,1,FALSE)","v":"KIT.22170A"},null,1,"B2-R35",1,"B2-R351",22170,{"$f":"VLOOKUP(C248,[2]Feuil2!A:B,2,FALSE)","v":"BLK2"},"4311BLK2",{"$f":"VLOOKUP(Regroupement!AI248,[2]Wip!AC:AC,1,FALSE)","v":"4311BLK2"},{"$f":"VLOOKUP(AI248,[2]Wip!AC:AC,1,FALSE)","v":"4311BLK2"}]
[189,249,"Block 2","2.10","B2-R35","KPO","P2","Buffer","80X120",null,10,"Logistiport",22180,4401,1,"NA","B2-R35","Réglage du motoréducteur de pitch de la pale 1","KIT.22180A","KIT.22180B","KIT.22180C","OK","OK","OK",null,"2.10",{"$f":"VLOOKUP(S249,'[1]Extraction Tracking 2905'!D:D,1,FALSE)","v":"KIT.22180A"},null,1,"B2-R35",2,"B2-R352",22180,{"$f":"VLOOKUP(C249,[2]Feuil2!A:B,2,FALSE)","v":"BLK2"},"4401BLK2",{"$f":"VLOOKUP(Regroupement!AI249,[2]Wip!AC:AC,1,FALSE)","v":"4401BLK2"},{"$f":"VLOOKUP(AI249,[2]Wip!AC:AC,1,FALSE)","v":"4401BLK2"}]
[190,250,"Block 2","2.10","B2-R35","KPO","P2","Buffer","80X120",null,10,"Logistiport",22290,4411,1,"NA","B2-R35","Montage paratonerre, encodeur, pignon de graissage de la pale 1","KIT.22290A","KIT.22290B","KIT.22290C","OK","OK","OK","Mallette","2.10",{"$f":"VLOOKUP(S250,'[1]Extraction Tracking 2905'!D:D,1,FALSE)","v":"KIT.22290A"},null,1,"B2-R35",3,"B2-R353",22290,{"$f":"VLOOKUP(C250,[2]Feuil2!A:B,2,FALSE)","v":"BLK2"},"4411BLK2",{"$f":"VLOOKUP(Regroupement!AI250,[2]Wip!AC:AC,1,FALSE)","v":"4411BLK2"},{"$f":"VLOOKUP(AI250,[2]Wip!AC:AC,1,FALSE)","v":"4411BLK2"}]
[191,251,"Block 2","2.10","B2-R35","KPO","P2","Buffer","80X120",null,10,"Logistiport",22295,4431,1,"NA","B2-R35","Montage de l'ensemble pompe de graissage pale 1","KIT.22295A","KIT.22295B","KIT.22295C","OK","OK","OK","Mallette","2.10",{"$f":"VLOOKUP(S251,'[1]Extraction Tracking 2905'!D:D,1,FALSE)","v":"KIT.22295A"},null,1,"B2-R35",4,"B2-R354",22295,{"$f":"VLOOKUP(C251,[2]Feuil2!A:B,2,FALSE)","v":"BLK2"},"4431BLK2",{"$f":"VLOOKUP(Regroupement!AI251,[2]Wip!AC:AC,1,FALSE)","v":"4431BLK2"},{"$f":"VLOOKUP(AI251,[2]Wip!AC:AC,1,FALSE)","v":"4431BLK2"}]
[193,252,"Block 2","2.10","B2-R35","KPO","P2","Buffer","80X120",null,10,"Logistiport",22340,4501,1,"NA","B2-R35","Montage de l'ensemble armoires électriques de pitch dans le hub pale 1","KIT.22340A","KIT.22340B","KIT.22340C","OK","OK","OK","Mallette","2.10",{"$f":"VLOOKUP(S252,'[1]Extraction Tracking 2905'!D:D,1,FALSE)","v":"KIT.22340A"},null,1,"B2-R35",5,"B2-R355",22340,{"$f":"VLOOKUP(C252,[2]Feuil2!A:B,2,FALSE)","v":"BLK2"},"4501BLK2",{"$f":"VLOOKUP(Regroupement!AI252,[2]Wip!AC:AC,1,FALSE)","v":"4501BLK2"},{"$f":"VLOOKUP(AI252,[2]Wip!AC:AC,1,FALSE)","v":"4501BLK2"}]
[180,253,"Block 2","2.10","B2-R35,5","KPO","P2","Buffer","80X120",null,10,"Logistiport",22312,4541,1,"NA",{"$f":"E253","v":"B2-R35,5"},"Montage du frein de pitch pale 2","KIT.22312A","KIT.22312B","KIT.22312C","OK","OK","OK",null,{"$f":"D253","v":"2.10"},{"$f":"VLOOKUP(S253,'[1]Extraction Tracking 2905'!D:D,1,FALSE)","v":"KIT.22312A"},null,1,"B2-R35,5",1,"B2-R35,51",22312,{"$f":"VLOOKUP(C253,[2]Feuil2!A:B,2,FALSE)","v":"BLK2"},"4541BLK2",{"$f":"VLOOKUP(Regroupement!AI253,[2]Wip!AC:AC,1,FALSE)","v":"4541BLK2"},{"$f":"VLOOKUP(AI253,[2]Wip!AC:AC,1,FALSE)","v":"4541BLK2"}]
[186,254,"Block 2","2.10","B2-R35,5","KPO","P2","Buffer","80X120",null,10,"Logistiport",22313,4651,1,"NA",{"$f":"E254","v":"B2-R35,5"},"Montage du frein de pitch pale 3","KIT.22313A","KIT.22313B","KIT.22313C","OK","OK","OK",null,{"$f":"D254","v":"2.10"},{"$f":"VLOOKUP(S254,'[1]Extraction Tracking 2905'!D:D,1,FALSE)","v":"KIT.22313A"},null,1,"B2-R35,5",2,"B2-R35,52",22313,{"$f":"VLOOKUP(C254,[2]Feuil2!A:B,2,FALSE)","v":"BLK2"},"4651BLK2",{"$f":"VLOOKUP(Regroupement!AI254,[2]Wip!AC:AC,1,FALSE)","v":"4651BLK2"},{"$f":"VLOOKUP(AI254,[2]Wip!AC:AC,1,FALSE)","v":"4651BLK2"}]
[192,255,"Block 2","2.10","B2-R35,5","KPO","P2","Buffer","80X120",null,10,"Logistiport",22311,4421,1,"NA",{"$f":"E255","v":"B2-R35,5"},"Montage du frein de pitch pale 1","KIT.22311A","KIT.22311B","KIT.22311C","OK","OK","OK",null,{"$f":"D255","v":"2.10"},{"$f":"VLOOKUP(S255,'[1]Extraction Tracking 2905'!D:D,1,FALSE)","v":"KIT.22311A"},null,1,"B2-R35,5",3,"B2-R35,53",22311,{"$f":"VLOOKUP(C255,[2]Feuil2!A:B,2,FALSE)","v":"BLK2"},"4421BLK2",{"$f":"VLOOKUP(Regroupement!AI255,[2]Wip!AC:AC,1,FALSE)","v":"4421BLK2"},{"$f":"VLOOKUP(AI255,[2]Wip!AC:AC,1,FALSE)","v":"4421BLK2"}]
[194,256,"Block 2","2.20","B2-R36","KPO","P1","Buffer","80X120",null,10,"Logistiport",22181,5221,1,"NA","B2-R36","Montage de l'échelle de maintenance sur le moteur de la pale 1","KIT.22181A","KIT.22181B","KIT.22181C","OK","OK","OK","Mallette",{"$f":"D256","v":"2.20"},{"$f":"VLOOKUP(S256,'[1]Extraction Tracking 2905'!D:D,1,FALSE)","v":"KIT.22181A"},null,1,"B2-R36",1,"B2-R361",22181,{"$f":"VLOOKUP(C256,[2]Feuil2!A:B,2,FALSE)","v":"BLK2"},"5221BLK2",{"$f":"VLOOKUP(Regroupement!AI256,[2]Wip!AC:AC,1,FALSE)","v":"5221BLK2"},{"$f":"VLOOKUP(AI256,[2]Wip!AC:AC,1,FALSE)","v":"5221BLK2"}]
[195,257,"Block 2","2.20","B2-R36","KPO","P1","Buffer","80X120",null,10,"Logistiport",22323,5211,1,"NA","B2-R36","Montage des points d'ancrage de sécurité jaunes à l'extérieur, pale 1","KIT.22323A","KIT.22323B","KIT.22323C","OK","OK","OK","Mallette","2.20",{"$f":"VLOOKUP(S257,'[1]Extraction Tracking 2905'!D:D,1,FALSE)","v":"KIT.22323A"},null,1,"B2-R36",2,"B2-R362",22323,{"$f":"VLOOKUP(C257,[2]Feuil2!A:B,2,FALSE)","v":"BLK2"},"5211BLK2",{"$f":"VLOOKUP(Regroupement!AI257,[2]Wip!AC:AC,1,FALSE)","v":"5211BLK2"},{"$f":"VLOOKUP(AI257,[2]Wip!AC:AC,1,FALSE)","v":"5211BLK2"}]
[196,258,"Block 2","2.20","B2-R36","KPO","P1","Buffer","80X120",null,10,"Logistiport",22324,5101,{"$f":"COUNTIF(M:M,M258)","v":1},"NA","B2-R36","Réalisation des connexions hydrauliques entre pompes, pignon de graissage, injecteurs et extracteurs. Mise en service des pompes contrôle de l'étanchéité pale 1.","KIT.22324A","KIT.22324B","KIT.22324C","OK","OK","OK","Mallette","2.20",{"$f":"VLOOKUP(S258,'[1]Extraction Tracking 2905'!D:D,1,FALSE)","v":"KIT.22324A"},null,1,{"$f":"Q258","v":"B2-R36"},3,{"$f":"AD258&AE258","v":"B2-R363"},{"$f":"M258","v":22324},{"$f":"VLOOKUP(C258,[2]Feuil2!A:B,2,FALSE)","v":"BLK2"},"5101BLK2",{"$f":"VLOOKUP(Regroupement!AI258,[2]Wip!AC:AC,1,FALSE)","v":"5101BLK2"},{"$f":"VLOOKUP(AI258,[2]Wip!AC:AC,1,FALSE)","v":"5101BLK2"}]
[197,259,"Block 2","2.20","B2-R36","KPO","P1","Buffer","80X120",null,10,"Logistiport",22331,5201,1,"NA","B2-R36","MISE_EN_PLACE_DES_GRANDES_BOUTEILLES_DE_GRAISSE_SUR_LA_PALE_1","KIT.22331A",{"$error":"#N/A"},{"$error":"#N/A"},"OK","OK","OK",null,"2.20",{"$f":"VLOOKUP(S259,'[1]Extraction Tracking 2905'!D:D,1,FALSE)","v":"KIT.22331A"},null,1,"B2-R36",4,"B2-R364",22331,{"$f":"VLOOKUP(C259,[2]Feuil2!A:B,2,FALSE)","v":"BLK2"},{"$f":"N259&AH259","v":"5201BLK2"},{"$f":"VLOOKUP(Regroupement!AI259,[2]Wip!AC:AC,1,FALSE)","v":"5201BLK2"},{"$f":"VLOOKUP(AI259,[2]Wip!AC:AC,1,FALSE)","v":"5201BLK2"}]
[198,260,"Block 2","2.20","B2-R37","KPO","P1","Buffer","80X120",null,10,"Logistiport",22121,5321,1,"NA","B2-R37","Montage de l'échelle de maintenance sur le moteur de la pale 2","KIT.22121A","KIT.22121B","KIT.22121C","OK","OK","OK","Mallette","2.20",{"$f":"VLOOKUP(S260,'[1]Extraction Tracking 2905'!D:D,1,FALSE)","v":"KIT.22121A"},null,1,"B2-R37",{"$f":"IF(AD260=AD259,AE259+1,1)","v":1},"B2-R371",22121,{"$f":"VLOOKUP(C260,[2]Feuil2!A:B,2,FALSE)","v":"BLK2"},"5321BLK2",{"$f":"VLOOKUP(Regroupement!AI260,[2]Wip!AC:AC,1,FALSE)","v":"5321BLK2"},{"$f":"VLOOKUP(AI260,[2]Wip!AC:AC,1,FALSE)","v":"5321BLK2"}]
[199,261,"Block 2","2.20","B2-R37","KPO","P1","Buffer","80X120",null,10,"Logistiport",22325,5231,1,"NA","B2-R37","Réalisation des connexions hydrauliques entre pompes, pignon de graissage, injecteurs et extracteurs. Mise en service des pompes contrôle de l'étanchéité pale 2","KIT.22325A","KIT.22325B","KIT.22325C","OK","OK","OK","Mallette","2.20",{"$f":"VLOOKUP(S261,'[1]Extraction Tracking 2905'!D:D,1,FALSE)","v":"KIT.22325A"},null,1,"B2-R37",2,"B2-R372",22325,{"$f":"VLOOKUP(C261,[2]Feuil2!A:B,2,FALSE)","v":"BLK2"},"5231BLK2",{"$f":"VLOOKUP(Regroupement!AI261,[2]Wip!AC:AC,1,FALSE)","v":"5231BLK2"},{"$f":"VLOOKUP(AI261,[2]Wip!AC:AC,1,FALSE)","v":"5231BLK2"}]
[200,262,"Block 2","2.20","B2-R37","KPO","P1","Buffer","80X120",null,10,"Logistiport",22327,5311,1,"NA",{"$f":"E262","v":"B2-R37"},"Montage des point d'ancrage de sécurité jaunes à l'extérieur, pale 2","KIT.22327A","KIT.22327B","KIT.22327C","OK","OK","OK","Mallette","2.20",{"$f":"VLOOKUP(S262,'[1]Extraction Tracking 2905'!D:D,1,FALSE)","v":"KIT.22327A"},null,1,"B2-R37",3,"B2-R373",22327,{"$f":"VLOOKUP(C262,[2]Feuil2!A:B,2,FALSE)","v":"BLK2"},"5311BLK2",{"$f":"VLOOKUP(Regroupement!AI262,[2]Wip!AC:AC,1,FALSE)","v":"5311BLK2"},{"$f":"VLOOKUP(AI262,[2]Wip!AC:AC,1,FALSE)","v":"5311BLK2"}]
[201,263,"Block 2","2.20","B2-R37","KPO","P1","Buffer","80X120",null,10,"Logistiport",22332,5301,1,"NA","B2-R37","MISE_EN_PLACE_DES_GRANDES_BOUTEILLES_DE_GRAISSE_SUR_LA_PALE_2","KIT.22332A",{"$error":"#N/A"},{"$error":"#N/A"},"OK","OK","OK",null,"2.20",{"$f":"VLOOKUP(S263,'[1]Extraction Tracking 2905'!D:D,1,FALSE)","v":"KIT.22332A"},null,1,"B2-R37",4,"B2-R374",22332,{"$f":"VLOOKUP(C263,[2]Feuil2!A:B,2,FALSE)","v":"BLK2"},"5301BLK2",{"$f":"VLOOKUP(Regroupement!AI263,[2]Wip!AC:AC,1,FALSE)","v":"5301BLK2"},{"$f":"VLOOKUP(AI263,[2]Wip!AC:AC,1,FALSE)","v":"5301BLK2"}]
[202,264,"Block 2","2.20","B2-R38","KPO","P1","Buffer","80X120",null,10,"Logistiport",22161,5521,1,"NA","B2-R38","Montage de l'échelle de maintenance sur le moteur de la pale 3","KIT.22161A","KIT.22161B","KIT.22161C","OK","OK","OK","Mallette","2.20",{"$f":"VLOOKUP(S264,'[1]Extraction Tracking 2905'!D:D,1,FALSE)","v":"KIT.22161A"},null,1,"B2-R38",1,"B2-R381",22161,{"$f":"VLOOKUP(C264,[2]Feuil2!A:B,2,FALSE)","v":"BLK2"},"5521BLK2",{"$f":"VLOOKUP(Regroupement!AI264,[2]Wip!AC:AC,1,FALSE)","v":"5521BLK2"},{"$f":"VLOOKUP(AI264,[2]Wip!AC:AC,1,FALSE)","v":"5521BLK2"}]
[203,265,"Block 2","2.20","B2-R38","KPO","P1","Buffer","80X120",null,10,"Logistiport",22326,5401,1,"NA","B2-R38","Réalisation des connexions hydrauliques entre pompes, pignon de graissage, injecteurs et extracteurs. Mise en service des pompes contrôle de l'étanchéité pale 3.","KIT.22326A","KIT.22326B","KIT.22326C","OK","OK","OK","Mallette","2.20",{"$f":"VLOOKUP(S265,'[1]Extraction Tracking 2905'!D:D,1,FALSE)","v":"KIT.22326A"},null,1,"B2-R38",2,"B2-R382",22326,{"$f":"VLOOKUP(C265,[2]Feuil2!A:B,2,FALSE)","v":"BLK2"},"5401BLK2",{"$f":"VLOOKUP(Regroupement!AI265,[2]Wip!AC:AC,1,FALSE)","v":"5401BLK2"},{"$f":"VLOOKUP(AI265,[2]Wip!AC:AC,1,FALSE)","v":"5401BLK2"}]
[204,266,"Block 2","2.20","B2-R38","KPO","P1","Buffer","80X120",null,10,"Logistiport",22328,5511,1,"NA","B2-R38","Montage des point d'ancrage de sécurité jaunes à l'extérieur, pale 3","KIT.22328A","KIT.22328B","KIT.22328C","OK","OK","OK","Mallette","2.20",{"$f":"VLOOKUP(S266,'[1]Extraction Tracking 2905'!D:D,1,FALSE)","v":"KIT.22328A"},null,1,"B2-R38",3,"B2-R383",22328,{"$f":"VLOOKUP(C266,[2]Feuil2!A:B,2,FALSE)","v":"BLK2"},"5511BLK2",{"$f":"VLOOKUP(Regroupement!AI266,[2]Wip!AC:AC,1,FALSE)","v":"5511BLK2"},{"$f":"VLOOKUP(AI266,[2]Wip!AC:AC,1,FALSE)","v":"5511BLK2"}]
[205,267,"Block 2","2.20","B2-R38","KPO","P1","Buffer","80X120",null,10,"Logistiport",22333,5501,1,"NA","B2-R38","MISE_EN_PLACE_DES_GRANDES_BOUTEILLES_DE_GRAISSE_SUR_LA_PALE_3","KIT.22333A",{"$error":"#N/A"},{"$error":"#N/A"},"OK","OK","OK",null,"2.20",{"$f":"VLOOKUP(S267,'[1]Extraction Tracking 2905'!D:D,1,FALSE)","v":"KIT.22333A"},null,1,"B2-R38",4,"B2-R384",22333,{"$f":"VLOOKUP(C267,[2]Feuil2!A:B,2,FALSE)","v":"BLK2"},"5501BLK2",{"$f":"VLOOKUP(Regroupement!AI267,[2]Wip!AC:AC,1,FALSE)","v":"5501BLK2"},{"$f":"VLOOKUP(AI267,[2]Wip!AC:AC,1,FALSE)","v":"5501BLK2"}]
[207,268,"Block 2","2.20","B2-R39","KPO",null,"Buffer","80X120",null,10,"Logistiport",80204,5241,1,"NA",{"$f":"E268","v":"B2-R39"},"Câblage bloc 2: Pré-câblage Pale 2","KIT.80204A","KIT.80204B","KIT.80204C","OK","OK","OK",null,{"$f":"D268","v":"2.20"},{"$f":"VLOOKUP(S268,'[1]Extraction Tracking 2905'!D:D,1,FALSE)","v":"KIT.80204A"},null,1,"B2-R39",1,"B2-R391",80204,{"$f":"VLOOKUP(C268,[2]Feuil2!A:B,2,FALSE)","v":"BLK2"},"5241BLK2",{"$f":"VLOOKUP(Regroupement!AI268,[2]Wip!AC:AC,1,FALSE)","v":"5241BLK2"},{"$f":"VLOOKUP(AI268,[2]Wip!AC:AC,1,FALSE)","v":"5241BLK2"}]
[206,269,"Block 2","2.20","SUP le 23 02 B2-R39",null,null,null,"80X120",null,10,"Logistiport","SUP 80203",5111,1,"NA","SUP le 23 02 B2-R39","Câblage bloc 2: Pré-câblage pale 1","KIT.80203A","KIT.80203B","KIT.80203C","OK","OK","OK",null,"2.20",{"$f":"VLOOKUP(S269,'[1]Extraction Tracking 2905'!D:D,1,FALSE)","v":"KIT.80203A"},null,1,"SUP le 23 02 B2-R39",1,"SUP le 23 02 B2-R391","SUP 80203",{"$f":"VLOOKUP(C269,[2]Feuil2!A:B,2,FALSE)","v":"BLK2"},"5111BLK2",{"$f":"VLOOKUP(Regroupement!AI269,[2]Wip!AC:AC,1,FALSE)","v":"5111BLK2"},{"$f":"VLOOKUP(AI269,[2]Wip!AC:AC,1,FALSE)","v":"5111BLK2"}]
[208,270,"Block 2","2.20","SUP le 22 01 B2-R39",null,null,null,"80X120",null,10,"Logistiport","SUP 80205",5411,1,"NA","SUP le 22 01 B2-R39","Câblage bloc 2: Pré-câblage pale 3","KIT.80205A","KIT.80205B","KIT.80205C","OK","OK","OK",null,"2.20",{"$f":"VLOOKUP(S270,'[1]Extraction Tracking 2905'!D:D,1,FALSE)","v":"KIT.80205A"},null,1,"SUP le 22 01 B2-R39",1,"SUP le 22 01 B2-R391","SUP 80205",{"$f":"VLOOKUP(C270,[2]Feuil2!A:B,2,FALSE)","v":"BLK2"},"5411BLK2",{"$f":"VLOOKUP(Regroupement!AI270,[2]Wip!AC:AC,1,FALSE)","v":{"$error":"#N/A"}},{"$f":"VLOOKUP(AI270,[2]Wip!AC:AC,1,FALSE)","v":{"$error":"#N/A"}}]
[209,271,"Block 2","2.20","SUP le 22 01 B2-R39",null,null,null,"80X120",null,10,"Logistiport","SUP 80206",6411,1,"NA","SUP le 22 01 B2-R39","Câblage bloc 2: Connexion finale à l'armoire principale pale 1.","KIT.80206A","KIT.80206B","KIT.80206C","OK","OK","OK",null,"2.20",{"$f":"VLOOKUP(S271,'[1]Extraction Tracking 2905'!D:D,1,FALSE)","v":"KIT.80206A"},null,1,"SUP le 22 01 B2-R39",2,"SUP le 22 01 B2-R392","SUP 80206",{"$f":"VLOOKUP(C271,[2]Feuil2!A:B,2,FALSE)","v":"BLK2"},"6411BLK2",{"$f":"VLOOKUP(Regroupement!AI271,[2]Wip!AC:AC,1,FALSE)","v":{"$error":"#N/A"}},{"$f":"VLOOKUP(AI271,[2]Wip!AC:AC,1,FALSE)","v":{"$error":"#N/A"}}]
[210,272,"Block 2","2.20","B2-R40","Idea","P1","Buffer Exterieur","160X90+120X231","Fibre ",7,"Chantenay",22703,5531,1,"NA","B2-R40","Montage du emsemble déflecteur intermédiaire (x3) avec le Hub","KIT.22703A","KIT.22703B","KIT.22703C","OK","OK","OK","Mallette","2.20",{"$f":"VLOOKUP(S272,'[1]Extraction Tracking 2905'!D:D,1,FALSE)","v":"KIT.22703A"},null,1,"B2-R40",1,"B2-R401",22703,{"$f":"VLOOKUP(C272,[2]Feuil2!A:B,2,FALSE)","v":"BLK2"},"5531BLK2",{"$f":"VLOOKUP(Regroupement!AI272,[2]Wip!AC:AC,1,FALSE)","v":"5531BLK2"},{"$f":"VLOOKUP(AI272,[2]Wip!AC:AC,1,FALSE)","v":"5531BLK2"}]
[212,273,"Block 2","2.20","B2-R42","KPO","P1 TEST","Buffer","80*120",null,10,"Logistiport",22680,3341,1,"NA","B2-R42","Pré-assemblage des structures de l'anneau tournant et montage de l'anneau tournant dans ses structures.","KIT.22680A","KIT.22680B","KIT.22680C","OK","OK","OK","Mallette","2.20",{"$f":"VLOOKUP(S273,'[1]Extraction Tracking 2905'!D:D,1,FALSE)","v":"KIT.22680A"},null,1,"B2-R42",1,"B2-R421",22680,{"$f":"VLOOKUP(C273,[2]Feuil2!A:B,2,FALSE)","v":"BLK2"},"3341BLK2",{"$f":"VLOOKUP(Regroupement!AI273,[2]Wip!AC:AC,1,FALSE)","v":"3341BLK2"},{"$f":"VLOOKUP(AI273,[2]Wip!AC:AC,1,FALSE)","v":"3341BLK2"}]
[213,274,"Block 2","2.20","B2-R42","KPO","P1 TEST","Buffer","80*120",null,10,"Logistiport",22700,6231,1,"NA","B2-R42","Montage de l'ensemble anneau tournant sur le Hub","KIT.22700A","KIT.22700B","KIT.22700C","OK","OK","OK","Mallette","2.20",{"$f":"VLOOKUP(S274,'[1]Extraction Tracking 2905'!D:D,1,FALSE)","v":"KIT.22700A"},null,1,"B2-R42",2,"B2-R422",22700,{"$f":"VLOOKUP(C274,[2]Feuil2!A:B,2,FALSE)","v":"BLK2"},"6231BLK2",{"$f":"VLOOKUP(Regroupement!AI274,[2]Wip!AC:AC,1,FALSE)","v":"6231BLK2"},{"$f":"VLOOKUP(AI274,[2]Wip!AC:AC,1,FALSE)","v":"6231BLK2"}]
[214,275,"Block 2","2.20","B2-R43","Idea","P1","Buffer Exterieur","220X238","Fibre",7,"Chantenay",22701,3371,1,"NA","B2-R43","Prémontage du emsemble déflecteur interne (x3) et plateforme du deflécteur.","KIT.22701A","KIT.22701B","KIT.22701C","OK","OK","OK","Mallette","2.20",{"$f":"VLOOKUP(S275,'[1]Extraction Tracking 2905'!D:D,1,FALSE)","v":"KIT.22701A"},null,{"$f":"COUNTIF(M:M,M275)","v":1},"B2-R43",1,"B2-R431",22701,{"$f":"VLOOKUP(C275,[2]Feuil2!A:B,2,FALSE)","v":"BLK2"},"3371BLK2",{"$f":"VLOOKUP(Regroupement!AI275,[2]Wip!AC:AC,1,FALSE)","v":"3371BLK2"},{"$f":"VLOOKUP(AI275,[2]Wip!AC:AC,1,FALSE)","v":"3371BLK2"}]
[215,276,"Block 2","2.20","B2-R44","KPO","P1","Buffer","80*170",null,10,"Logistiport",22670,3351,1,"NA","B2-R44","Pré-assemblage des supports du deflécteur et des structures de liaison de l'anneau tournant avec le déflecteur.","KIT.22670A","KIT.22670B","KIT.22670C","OK","OK","OK","Mallette","2.20",{"$f":"VLOOKUP(S276,'[1]Extraction Tracking 2905'!D:D,1,FALSE)","v":"KIT.22670A"},null,1,"B2-R44",1,"B2-R441",22670,{"$f":"VLOOKUP(C276,[2]Feuil2!A:B,2,FALSE)","v":"BLK2"},"3351BLK2",{"$f":"VLOOKUP(Regroupement!AI276,[2]Wip!AC:AC,1,FALSE)","v":"3351BLK2"},{"$f":"VLOOKUP(AI276,[2]Wip!AC:AC,1,FALSE)","v":"3351BLK2"}]
[218,277,"Block 2","2.20","B2-R45","KPO",null,"Buffer","80*120",null,10,"Logistiport",22710,6351,1,"NA","B2-R45","Montage des structures de liaison de l'anneau tournant avec le déflecteur.",{"$f":"\"Mallette \"&M277","v":"Mallette 22710"},"KIT.22710B","KIT.22710C","OK","OK","OK","Mallette Uniquement","2.20",{"$f":"VLOOKUP(S277,'[1]Extraction Tracking 2905'!D:D,1,FALSE)","v":{"$error":"#N/A"}},null,1,"B2-R45",1,"B2-R451",22710,{"$f":"VLOOKUP(C277,[2]Feuil2!A:B,2,FALSE)","v":"BLK2"},"6351BLK2",{"$f":"VLOOKUP(Regroupement!AI277,[2]Wip!AC:AC,1,FALSE)","v":"6351BLK2"},{"$f":"VLOOKUP(AI277,[2]Wip!AC:AC,1,FALSE)","v":"6351BLK2"}]
[219,278,"Block 2","2.20","B2-R45","KPO",null,"Buffer","80*120",null,10,"Logistiport",45260,6401,1,"NA","B2-R45","Montage de la partie avant du déflecteur B2 et siliconnage","KIT.45260A","KIT.45260B","KIT.45260C","OK","OK","OK","Mallette","2.20",{"$f":"VLOOKUP(S278,'[1]Extraction Tracking 2905'!D:D,1,FALSE)","v":"KIT.45260A"},null,1,"B2-R45",2,"B2-R452",45260,{"$f":"VLOOKUP(C278,[2]Feuil2!A:B,2,FALSE)","v":"BLK2"},"6401BLK2",{"$f":"VLOOKUP(Regroupement!AI278,[2]Wip!AC:AC,1,FALSE)","v":"6401BLK2"},{"$f":"VLOOKUP(AI278,[2]Wip!AC:AC,1,FALSE)","v":"6401BLK2"}]
[220,279,"Block 2","2.20","B2-R48","Idea","P1","Buffer Exterieur","400X120","Fibre",7,"Chantenay",22702,3421,1,"NA","B2-R48","Prémontage du emsemble pointe déflecteur (x3)","KIT.22702A","KIT.22702B","KIT.22702C","OK","OK","OK","Mallette","2.20",{"$f":"VLOOKUP(S279,'[1]Extraction Tracking 2905'!D:D,1,FALSE)","v":"KIT.22702A"},null,1,"B2-R48",1,"B2-R481",22702,{"$f":"VLOOKUP(C279,[2]Feuil2!A:B,2,FALSE)","v":"BLK2"},"3421BLK2",{"$f":"VLOOKUP(Regroupement!AI279,[2]Wip!AC:AC,1,FALSE)","v":"3421BLK2"},{"$f":"VLOOKUP(AI279,[2]Wip!AC:AC,1,FALSE)","v":"3421BLK2"}]
[222,280,"Block 2","2.20","B2-R46","KPO",null,"Buffer","80*120",null,10,"Logistiport",22720,6241,1,"NA","B2-R46","Montage du emsemble déflecteur interne (x3) avec le Hub et liaison avec les structures.","KIT.22720A","KIT.22720B","KIT.22720C","OK","OK","OK","Mallette","2.20",{"$f":"VLOOKUP(S280,'[1]Extraction Tracking 2905'!D:D,1,FALSE)","v":"KIT.22720A"},null,1,"B2-R46",1,"B2-R461",22720,{"$f":"VLOOKUP(C280,[2]Feuil2!A:B,2,FALSE)","v":"BLK2"},"6241BLK2",{"$f":"VLOOKUP(Regroupement!AI280,[2]Wip!AC:AC,1,FALSE)","v":"6241BLK2"},{"$f":"VLOOKUP(AI280,[2]Wip!AC:AC,1,FALSE)","v":"6241BLK2"}]
[223,281,"Block 2","2.20","B2-R47","Idea","P1","Buffer Exterieur","500X120","Fibre",7,"Chantenay",22650,6331,1,"NA","B2-R47","Montage des secteurs arrières du déflecteur (x3)","KIT.22650A","KIT.22650B","KIT.22650C","OK","OK","OK","Mallette","2.20",{"$f":"VLOOKUP(S281,'[1]Extraction Tracking 2905'!D:D,1,FALSE)","v":"KIT.22650A"},null,1,"B2-R47",1,"B2-R471",22650,{"$f":"VLOOKUP(C281,[2]Feuil2!A:B,2,FALSE)","v":"BLK2"},"6331BLK2",{"$f":"VLOOKUP(Regroupement!AI281,[2]Wip!AC:AC,1,FALSE)","v":"6331BLK2"},{"$f":"VLOOKUP(AI281,[2]Wip!AC:AC,1,FALSE)","v":"6331BLK2"}]
[225,282,"Block 2","2.30","B2-R49","KPO",null,"Buffer","80X120",null,10,"Logistiport",22297,6131,1,"NA","B2-R49","Montage des vis non montées de l'union bâti avant et appui axial du roulement avant","KIT.22297A","KIT.22297B","KIT.22297C","OK","OK","OK",null,"2.30",{"$f":"VLOOKUP(S282,'[1]Extraction Tracking 2905'!D:D,1,FALSE)","v":"KIT.22297A"},null,1,"B2-R49",1,"B2-R491",22297,{"$f":"VLOOKUP(C282,[2]Feuil2!A:B,2,FALSE)","v":"BLK2"},"6131BLK2",{"$f":"VLOOKUP(Regroupement!AI282,[2]Wip!AC:AC,1,FALSE)","v":"6131BLK2"},{"$f":"VLOOKUP(AI282,[2]Wip!AC:AC,1,FALSE)","v":"6131BLK2"}]
[226,283,"Block 2","2.30","B2-R49","KPO",null,"Buffer","80X120",null,10,"Logistiport",22380,6161,1,"NA","B2-R49","Montage de la sonde de température et bouteilles graissage dans le supports axial avant","KIT.22380A","KIT.22380B","KIT.22380C","OK","OK","OK","Mallette","2.30",{"$f":"VLOOKUP(S283,'[1]Extraction Tracking 2905'!D:D,1,FALSE)","v":"KIT.22380A"},null,1,"B2-R49",2,"B2-R492",22380,{"$f":"VLOOKUP(C283,[2]Feuil2!A:B,2,FALSE)","v":"BLK2"},"6161BLK2",{"$f":"VLOOKUP(Regroupement!AI283,[2]Wip!AC:AC,1,FALSE)","v":"6161BLK2"},{"$f":"VLOOKUP(AI283,[2]Wip!AC:AC,1,FALSE)","v":"6161BLK2"}]
[227,284,"Block 2","2.30","B2-R49","KPO",null,"Buffer","80X120",null,10,"Logistiport",22390,6211,1,"NA","B2-R49","Montage paratonerre Hub _nacelle sur l'appui axial du roulement avant. Passage des câbles du paratonerre.","KIT.22390A","KIT.22390B","KIT.22390C","OK","OK","OK","Mallette","2.30",{"$f":"VLOOKUP(S284,'[1]Extraction Tracking 2905'!D:D,1,FALSE)","v":"KIT.22390A"},null,1,"B2-R49",3,"B2-R493",22390,{"$f":"VLOOKUP(C284,[2]Feuil2!A:B,2,FALSE)","v":"BLK2"},"6211BLK2",{"$f":"VLOOKUP(Regroupement!AI284,[2]Wip!AC:AC,1,FALSE)","v":"6211BLK2"},{"$f":"VLOOKUP(AI284,[2]Wip!AC:AC,1,FALSE)","v":"6211BLK2"}]
[228,285,"Block 2","2.30","B2-R49","KPO",null,"Buffer","80X120",null,10,"Logistiport",22402,6201,1,"NA","B2-R49","Montage des marchepieds d'accès à l'anneau tournant","KIT.22402A","KIT.22402B","KIT.22402C","OK","OK","OK","Mallette","2.30",{"$f":"VLOOKUP(S285,'[1]Extraction Tracking 2905'!D:D,1,FALSE)","v":"KIT.22402A"},null,1,"B2-R49",4,"B2-R494",22402,{"$f":"VLOOKUP(C285,[2]Feuil2!A:B,2,FALSE)","v":"BLK2"},"6201BLK2",{"$f":"VLOOKUP(Regroupement!AI285,[2]Wip!AC:AC,1,FALSE)","v":"6201BLK2"},{"$f":"VLOOKUP(AI285,[2]Wip!AC:AC,1,FALSE)","v":"6201BLK2"}]
[229,286,"Block 2","2.30","B2-R49","KPO",null,"Buffer","80X120",null,10,"Logistiport",22440,6221,1,"NA","B2-R49","Montage du sol avant du bâti avant","KIT.22440A","KIT.22440B","KIT.22440C","OK","OK","OK","Mallette","2.30",{"$f":"VLOOKUP(S286,'[1]Extraction Tracking 2905'!D:D,1,FALSE)","v":"KIT.22440A"},null,1,"B2-R49",5,"B2-R495",22440,{"$f":"VLOOKUP(C286,[2]Feuil2!A:B,2,FALSE)","v":"BLK2"},"6221BLK2",{"$f":"VLOOKUP(Regroupement!AI286,[2]Wip!AC:AC,1,FALSE)","v":"6221BLK2"},{"$f":"VLOOKUP(AI286,[2]Wip!AC:AC,1,FALSE)","v":"6221BLK2"}]
[224,287,"Block 2","2.30","B2-R49","KPO",null,"Buffer","80X120",null,10,"Logistiport",22450,6151,1,"NA","B2-R49","Introduction de graisse dans les roulements avant et arrière à l'aide de la pompe pneumatique","KIT.22450A","KIT.22450B","KIT.22450C","OK","OK","OK","Mallette","2.30",{"$f":"VLOOKUP(S287,'[1]Extraction Tracking 2905'!D:D,1,FALSE)","v":"KIT.22450A"},null,1,"B2-R49",6,"B2-R496",22450,{"$f":"VLOOKUP(C287,[2]Feuil2!A:B,2,FALSE)","v":"BLK2"},"6151BLK2",{"$f":"VLOOKUP(Regroupement!AI287,[2]Wip!AC:AC,1,FALSE)","v":"6151BLK2"},{"$f":"VLOOKUP(AI287,[2]Wip!AC:AC,1,FALSE)","v":"6151BLK2"}]
[230,288,"Block 2","2.30","B2-R49","KPO",null,"Buffer","80X120",null,10,"Logistiport",22401,6171,1,"NA","B2-R49","MONTAGE_DU_PLATEAU_AVANT_DE_RECUPERATION_D HUILE","KIT.22401A",{"$error":"#N/A"},{"$error":"#N/A"},"OK","OK","OK","Mallette","2.30",{"$f":"VLOOKUP(S288,'[1]Extraction Tracking 2905'!D:D,1,FALSE)","v":"KIT.22401A"},null,1,"B2-R49",7,"B2-R497",22401,{"$f":"VLOOKUP(C288,[2]Feuil2!A:B,2,FALSE)","v":"BLK2"},"6171BLK2",{"$f":"VLOOKUP(Regroupement!AI288,[2]Wip!AC:AC,1,FALSE)","v":"6171BLK2"},{"$f":"VLOOKUP(AI288,[2]Wip!AC:AC,1,FALSE)","v":"6171BLK2"}]
[232,289,"Block 2","2.30","B2-R49","KPO",null,"Buffer","80X120",null,10,"Logistiport",80208,6321,1,"NA","B2-R49","MONTAGE_ET_CONNEXION_DES_LUMINIARES_DANS_LE_BATI_AVANT","KIT.80208A",{"$error":"#N/A"},{"$error":"#N/A"},"OK","OK","OK",null,"2.30",{"$f":"VLOOKUP(S289,'[1]Extraction Tracking 2905'!D:D,1,FALSE)","v":"KIT.80208A"},null,1,"B2-R49",8,"B2-R498",80208,{"$f":"VLOOKUP(C289,[2]Feuil2!A:B,2,FALSE)","v":"BLK2"},"6321BLK2",{"$f":"VLOOKUP(Regroupement!AI289,[2]Wip!AC:AC,1,FALSE)","v":"6321BLK2"},{"$f":"VLOOKUP(AI289,[2]Wip!AC:AC,1,FALSE)","v":"6321BLK2"}]
[233,290,"Block 2","2.30","B2-R51","KPO",null,"Buffer","80X120",null,10,"Logistiport",22280,6421,1,"NA","B2-R51","MONTAGE_DES_CAPOTS_X3_PIGNONS_DES_MOTOREDUCTEURS","KIT.22280A","KIT.22280B","KIT.22280C","OK","OK","OK","Mallette","2.30",{"$f":"VLOOKUP(S290,'[1]Extraction Tracking 2905'!D:D,1,FALSE)","v":"KIT.22280A"},null,1,"B2-R51",1,"B2-R511",22280,{"$f":"VLOOKUP(C290,[2]Feuil2!A:B,2,FALSE)","v":"BLK2"},"6421BLK2",{"$f":"VLOOKUP(Regroupement!AI290,[2]Wip!AC:AC,1,FALSE)","v":"6421BLK2"},{"$f":"VLOOKUP(AI290,[2]Wip!AC:AC,1,FALSE)","v":"6421BLK2"}]
[null,291,"Block 2","2.30","B2-R51","KPO",null,"Buffer","350*80",null,10,"Logistiport",22400,6141,1,"NA",{"$f":"E291","v":"B2-R51"},"Montage de l'ensemble des capteurs de vitesse sur l'axe avant","KIT.22400A","KIT.22400B","KIT.22400C","OK","OK","OK",null,{"$f":"D291","v":"2.30"},{"$f":"VLOOKUP(S291,'[1]Extraction Tracking 2905'!D:D,1,FALSE)","v":"KIT.22400A"},null,1,"B2-R51",2,"B2-R512",22400,{"$f":"VLOOKUP(C291,[2]Feuil2!A:B,2,FALSE)","v":"BLK2"},"6141BLK2",{"$f":"VLOOKUP(Regroupement!AI291,[2]Wip!AC:AC,1,FALSE)","v":"6141BLK2"},{"$f":"VLOOKUP(AI291,[2]Wip!AC:AC,1,FALSE)","v":"6141BLK2"}]
[128,292,"Block 2","2.30","B2-R51","KPO",null,"Buffer","350*80",null,10,"Logistiport",20080,6216,1,"NA",{"$f":"E292","v":"B2-R51"},"Prémontage Bâti Avant: Montage des sols dans le bâti avant","KIT.20080A","KIT.20080B","KIT.20080C","OK","OK","OK","Mallette",{"$f":"D292","v":"2.30"},{"$f":"VLOOKUP(S292,'[1]Extraction Tracking 2905'!D:D,1,FALSE)","v":"KIT.20080A"},null,1,"B2-R51",3,"B2-R513",20080,{"$f":"VLOOKUP(C292,[2]Feuil2!A:B,2,FALSE)","v":"BLK2"},"6216BLK2",{"$f":"VLOOKUP(Regroupement!AI292,[2]Wip!AC:AC,1,FALSE)","v":"6216BLK2"},{"$f":"VLOOKUP(AI292,[2]Wip!AC:AC,1,FALSE)","v":"6216BLK2"}]
[322,293,"B1.2/B1.3","4.10","ML-R01","Support fournisseur","P1","Buffer Exterieur","120*515","Buff EXT",7,"Chantenay",30500,121,1,"NA",{"$f":"E293","v":"ML-R01"},"MONTAGE_DE_LA_PLATEFORME_SUR_LE_GENERATEUR",{"$f":"\"Malette \"&M293","v":"Malette 30500"},"KIT.30500B","KIT.30500C","Support fournisseur","Support fournisseur","Support fournisseur","Mallette","4.10",{"$f":"VLOOKUP(S293,'[1]Extraction Tracking 2905'!D:D,1,FALSE)","v":{"$error":"#N/A"}},null,1,"ML-R01",1,"ML-R011",30500,{"$f":"VLOOKUP(C293,[2]Feuil2!A:B,2,FALSE)","v":"BLK1-2_1-3"},"121BLK1-2_1-3",{"$f":"VLOOKUP(Regroupement!AI293,[2]Wip!AC:AC,1,FALSE)","v":"121BLK1-2_1-3"},{"$f":"VLOOKUP(AI293,[2]Wip!AC:AC,1,FALSE)","v":"121BLK1-2_1-3"}]
[323,294,"B1.2/B1.3","4.10","ML-R02","Idea","P1","Buffer Exterieur",null,"Fibres",7,"Chantenay",30510,141,1,"NA",{"$f":"E294","v":"ML-R02"},"MONTAGE_DES_CAPOTS_DU_GENERATEUR_COTE_TOUR_X2","KIT.30510A","KIT.30510B","KIT.30510C","OK","OK",null,"Mallette","4.10",{"$f":"VLOOKUP(S294,'[1]Extraction Tracking 2905'!D:D,1,FALSE)","v":"KIT.30510A"},null,1,"ML-R02",1,"ML-R021",30510,{"$f":"VLOOKUP(C294,[2]Feuil2!A:B,2,FALSE)","v":"BLK1-2_1-3"},"141BLK1-2_1-3",{"$f":"VLOOKUP(Regroupement!AI294,[2]Wip!AC:AC,1,FALSE)","v":"141BLK1-2_1-3"},{"$f":"VLOOKUP(AI294,[2]Wip!AC:AC,1,FALSE)","v":"141BLK1-2_1-3"}]
[324,295,"B1.2/B1.3","4.10","ML-R03","Idea","P1","Buffer Exterieur","80X340","Fibres",7,"Chantenay",30530,151,1,"NA","ML-R03","MONTAGE_DES_CAPOTS_GOUTIERES_SUR_LE_PERIMETRE_EXTERIEUR_DU_GENERATEUR","KIT.30530A","KIT.30530B","KIT.30530C","OK","OK",null,"Mallette","4.10",{"$f":"VLOOKUP(S295,'[1]Extraction Tracking 2905'!D:D,1,FALSE)","v":"KIT.30530A"},null,1,"ML-R03",1,"ML-R031",30530,{"$f":"VLOOKUP(C295,[2]Feuil2!A:B,2,FALSE)","v":"BLK1-2_1-3"},"151BLK1-2_1-3",{"$f":"VLOOKUP(Regroupement!AI295,[2]Wip!AC:AC,1,FALSE)","v":"151BLK1-2_1-3"},{"$f":"VLOOKUP(AI295,[2]Wip!AC:AC,1,FALSE)","v":"151BLK1-2_1-3"}]
[null,296,"B1.2/B1.3","4.10","ML-R04","Idea","P1","Buffer Exterieur",null,"Fibres",7,"Chantenay",30491,201,1,"NA","ML-R04","PRE_MONTAGE_DES_LUMIERES_SUR_LES_STRUCTURES_DES_CAPOTS_DU_GENERATEUR","KIT.30491A",null,null,"OK","OK",null,"Mallette","4.10",{"$f":"VLOOKUP(S296,'[1]Extraction Tracking 2905'!D:D,1,FALSE)","v":"KIT.30491A"},null,1,"ML-R04",1,"ML-R041",30491,{"$f":"VLOOKUP(C296,[2]Feuil2!A:B,2,FALSE)","v":"BLK1-2_1-3"},"201BLK1-2_1-3",{"$f":"VLOOKUP(Regroupement!AI296,[2]Wip!AC:AC,1,FALSE)","v":"201BLK1-2_1-3"},{"$f":"VLOOKUP(AI296,[2]Wip!AC:AC,1,FALSE)","v":"201BLK1-2_1-3"}]
[329,297,"B1.2/B1.3","4.10","ML-R04","Idea","P1","Buffer Exterieur",null,"Fibres",7,"Chantenay",30550,221,1,"NA","ML-R04","MONTAGE_DES_SUPPORTS_DE_CAPOTS_SUR_LE_GENERATEUR_X5",{"$f":"\"Mallette \"&M297","v":"Mallette 30550"},"KIT.30550B","KIT.30550C","OK","OK",null,"Mallette Uniquement","4.10",{"$f":"VLOOKUP(S297,'[1]Extraction Tracking 2905'!D:D,1,FALSE)","v":{"$error":"#N/A"}},null,1,"ML-R04",2,"ML-R042",30550,{"$f":"VLOOKUP(C297,[2]Feuil2!A:B,2,FALSE)","v":"BLK1-2_1-3"},"221BLK1-2_1-3",{"$f":"VLOOKUP(Regroupement!AI297,[2]Wip!AC:AC,1,FALSE)","v":"221BLK1-2_1-3"},{"$f":"VLOOKUP(AI297,[2]Wip!AC:AC,1,FALSE)","v":"221BLK1-2_1-3"}]
[326,298,"B1.2/B1.3","4.10","ML-R04","Idea",null,"Buffer Exterieur",null,"Fibres",7,"Chantenay",30560,211,1,"NA","ML-R04","PRE_MONTAGE_DES PROTECTIONS_SUR_LE_SUPPORTS_DE_CAPOT_DU_GENERATEUR","KIT.30560A","KIT.30560B","KIT.30560C","OK","OK",null,null,"4.10",{"$f":"VLOOKUP(S298,'[1]Extraction Tracking 2905'!D:D,1,FALSE)","v":"KIT.30560A"},null,1,"ML-R04",3,"ML-R043",30560,{"$f":"VLOOKUP(C298,[2]Feuil2!A:B,2,FALSE)","v":"BLK1-2_1-3"},"211BLK1-2_1-3",{"$f":"VLOOKUP(Regroupement!AI298,[2]Wip!AC:AC,1,FALSE)","v":"211BLK1-2_1-3"},{"$f":"VLOOKUP(AI298,[2]Wip!AC:AC,1,FALSE)","v":"211BLK1-2_1-3"}]
[327,299,"B1.2/B1.3","4.10","ML-R04","Idea",null,"Buffer Exterieur",null,"Fibres",7,"Chantenay",15007,1006,1,"NA","ML-R04","FERMETURE_DES_TRAPPES_RAIDISSEURS","KIT.15007A","KIT.15007B","KIT.15007C","OK","OK",null,"Mallette","4.10",{"$f":"VLOOKUP(S299,'[1]Extraction Tracking 2905'!D:D,1,FALSE)","v":"KIT.15007A"},null,1,"ML-R04",4,"ML-R044",15007,{"$f":"VLOOKUP(C299,[2]Feuil2!A:B,2,FALSE)","v":"BLK1-2_1-3"},"1006BLK1-2_1-3",{"$f":"VLOOKUP(Regroupement!AI299,[2]Wip!AC:AC,1,FALSE)","v":"1006BLK1-2_1-3"},{"$f":"VLOOKUP(AI299,[2]Wip!AC:AC,1,FALSE)","v":"1006BLK1-2_1-3"}]
[330,300,"B1.2/B1.3","4.10","ML-R04,5","Idea",null,"Buffer Exterieur","80X120","Fibres",7,"Chantenay",30580,231,1,"NA","ML-R04,5","MONTAGE_DES_CAPOTS_DE_LA_PARTIE_SUPERIEURE_DU_GENERATEUR_X2","KIT.30580A","KIT.30580B","KIT.30580C","OK","OK",null,"Mallette","4.10",{"$f":"VLOOKUP(S300,'[1]Extraction Tracking 2905'!D:D,1,FALSE)","v":"KIT.30580A"},null,1,"ML-R04,5",1,"ML-R04,51",30580,{"$f":"VLOOKUP(C300,[2]Feuil2!A:B,2,FALSE)","v":"BLK1-2_1-3"},"231BLK1-2_1-3",{"$f":"VLOOKUP(Regroupement!AI300,[2]Wip!AC:AC,1,FALSE)","v":"231BLK1-2_1-3"},{"$f":"VLOOKUP(AI300,[2]Wip!AC:AC,1,FALSE)","v":"231BLK1-2_1-3"}]
[332,301,"B1.2/B1.3","4.10","ML-R08","KPO",null,"Buffer","80X120",null,10,"Logistiport",80326,411,1,"NA","ML-R08","MISE_EN_PLACE_ET_CHEMINEMENT_DES_CABLES_SUR_LE_BI_ET_GENERATEUR","KIT.80326A",{"$error":"#N/A"},{"$error":"#N/A"},"OK","OK","OK","Mallette","4.10",{"$f":"VLOOKUP(S301,'[1]Extraction Tracking 2905'!D:D,1,FALSE)","v":{"$error":"#N/A"}},null,1,"ML-R08",1,"ML-R081",80326,{"$f":"VLOOKUP(C301,[2]Feuil2!A:B,2,FALSE)","v":"BLK1-2_1-3"},"411BLK1-2_1-3",{"$f":"VLOOKUP(Regroupement!AI301,[2]Wip!AC:AC,1,FALSE)","v":"411BLK1-2_1-3"},{"$f":"VLOOKUP(AI301,[2]Wip!AC:AC,1,FALSE)","v":"411BLK1-2_1-3"}]
[null,302,"B1.2/B1.3","4.10","ML-R08,5","KPO",null,"Buffer","4X80X120","PAL 1/3 (Cables de puissance)",10,"Logistiport",80328,401,1,"NA","ML-R08,5","PREPARATION_DES_CABLES_DE_PUISSANCE","KIT.80328A",null,null,"OK","OK","OK",null,null,null,null,1,"ML-R08,5",1,"ML-R08,51",80328,{"$f":"VLOOKUP(C302,[2]Feuil2!A:B,2,FALSE)","v":"BLK1-2_1-3"},"401BLK1-2_1-3",{"$f":"VLOOKUP(Regroupement!AI302,[2]Wip!AC:AC,1,FALSE)","v":"401BLK1-2_1-3"},{"$f":"VLOOKUP(AI302,[2]Wip!AC:AC,1,FALSE)","v":"401BLK1-2_1-3"}]
[333,303,"B1.2/B1.3","4.10","ML-R09","KPO",null,"Buffer","80X120","OP elec",10,"Logistiport",80010,101,1,"NA","ML-R09","PREPARATION_CABLES_LIGHT_SUPPORT_GENERATEUR","KIT.80010A",{"$error":"#N/A"},{"$error":"#N/A"},"OK","OK","OK",null,"4.10",{"$f":"VLOOKUP(S303,'[1]Extraction Tracking 2905'!D:D,1,FALSE)","v":{"$error":"#N/A"}},null,1,"ML-R09",1,"ML-R091",80010,{"$f":"VLOOKUP(C303,[2]Feuil2!A:B,2,FALSE)","v":"BLK1-2_1-3"},"101BLK1-2_1-3",{"$f":"VLOOKUP(Regroupement!AI303,[2]Wip!AC:AC,1,FALSE)","v":"101BLK1-2_1-3"},{"$f":"VLOOKUP(AI303,[2]Wip!AC:AC,1,FALSE)","v":"101BLK1-2_1-3"}]
[334,304,"B1.2/B1.3","4.10","ML-R09","KPO",null,"Buffer","80X120","OP elec",10,"Logistiport",80300,131,1,"NA","ML-R09","MONTAGE_DES_GAINES_DE_PROTECTION_ET_ACCELEROMETRE_PCH","KIT.80300A","KIT.80300B","KIT.80300C","OK","OK","OK","Mallette","4.10",{"$f":"VLOOKUP(S304,'[1]Extraction Tracking 2905'!D:D,1,FALSE)","v":"KIT.80300A"},null,1,"ML-R09",2,"ML-R092",80300,{"$f":"VLOOKUP(C304,[2]Feuil2!A:B,2,FALSE)","v":"BLK1-2_1-3"},"131BLK1-2_1-3",{"$f":"VLOOKUP(Regroupement!AI304,[2]Wip!AC:AC,1,FALSE)","v":"131BLK1-2_1-3"},{"$f":"VLOOKUP(AI304,[2]Wip!AC:AC,1,FALSE)","v":"131BLK1-2_1-3"}]
[335,305,"B1.2/B1.3","4.10","ML-R09","KPO",null,"Buffer","80X120","OP elec",10,"Logistiport",80301,301,1,"NA","ML-R09","ROUTAGE_DES_CABLES_DE_LA_BALISE_SUR_LES_CAPOTS_DU_GENERATEUR_VERS_L_INTERIEUR","KIT.80301A","KIT.80301B","KIT.80301C","OK","OK","OK","Mallette","4.10",{"$f":"VLOOKUP(S305,'[1]Extraction Tracking 2905'!D:D,1,FALSE)","v":"KIT.80301A"},null,1,"ML-R09",3,"ML-R093",80301,{"$f":"VLOOKUP(C305,[2]Feuil2!A:B,2,FALSE)","v":"BLK1-2_1-3"},"301BLK1-2_1-3",{"$f":"VLOOKUP(Regroupement!AI305,[2]Wip!AC:AC,1,FALSE)","v":"301BLK1-2_1-3"},{"$f":"VLOOKUP(AI305,[2]Wip!AC:AC,1,FALSE)","v":"301BLK1-2_1-3"}]
[336,306,"B1.2/B1.3","4.10","ML-R09","KPO",null,"Buffer","80X120","OP elec",10,"Logistiport",80302,1511,1,"NA","ML-R09","MONTER_LES_ACCELEROMETRES_ET_PT100_SUR_LE_ROULEMENT_DU_GENERATEUR_ROUTER_LES_CABLES_JUSQU_AU_BATI_INTERMEDIAIRE","KIT.80302A","KIT.80302B","KIT.80302C","OK","OK","OK","Mallette","4.10",{"$f":"VLOOKUP(S306,'[1]Extraction Tracking 2905'!D:D,1,FALSE)","v":"KIT.80302A"},null,1,"ML-R09",4,"ML-R094",80302,{"$f":"VLOOKUP(C306,[2]Feuil2!A:B,2,FALSE)","v":"BLK1-2_1-3"},"1511BLK1-2_1-3",{"$f":"VLOOKUP(Regroupement!AI306,[2]Wip!AC:AC,1,FALSE)","v":"1511BLK1-2_1-3"},{"$f":"VLOOKUP(AI306,[2]Wip!AC:AC,1,FALSE)","v":"1511BLK1-2_1-3"}]
[331,307,"B1.2/B1.3","4.15","ML-R07","KPO",null,"Buffer","80X120","1 pal PP + HPU",10,"Logistiport",30650,421,1,"NA","ML-R07","MONTAGE_DE_LA_CENTRALE_HYDRAULIQUE_DU_LOCKING_PIN_DU_GENERATEUR_CONNEXIONS_ELECTRIQUES_ET_HYDRAULIQUES","KIT.30650A","KIT.30650B","KIT.30650C","Palette perdue",null,null,"Mallette","4.15",{"$f":"VLOOKUP(S307,'[1]Extraction Tracking 2905'!D:D,1,FALSE)","v":"KIT.30650A"},null,1,"ML-R07",1,"ML-R071",30650,{"$f":"VLOOKUP(C307,[2]Feuil2!A:B,2,FALSE)","v":"BLK1-2_1-3"},"421BLK1-2_1-3",{"$f":"VLOOKUP(Regroupement!AI307,[2]Wip!AC:AC,1,FALSE)","v":"421BLK1-2_1-3"},{"$f":"VLOOKUP(AI307,[2]Wip!AC:AC,1,FALSE)","v":"421BLK1-2_1-3"}]
[337,308,"B1.2/B1.3","4.15","ML-R07","KPO",null,"Buffer","80X120","1 pal PP + HPU",10,"Logistiport",80303,161,1,"NA","ML-R07","PREPARATION_DES_CABLES_DES_CAPTEURS_HPU","KIT.80303A","KIT.80303B","KIT.80303C","Palette perdue",null,null,null,"4.15",{"$f":"VLOOKUP(S308,'[1]Extraction Tracking 2905'!D:D,1,FALSE)","v":"KIT.80303A"},null,1,"ML-R07",2,"ML-R072",80303,{"$f":"VLOOKUP(C308,[2]Feuil2!A:B,2,FALSE)","v":"BLK1-2_1-3"},"161BLK1-2_1-3",{"$f":"VLOOKUP(Regroupement!AI308,[2]Wip!AC:AC,1,FALSE)","v":"161BLK1-2_1-3"},{"$f":"VLOOKUP(AI308,[2]Wip!AC:AC,1,FALSE)","v":"161BLK1-2_1-3"}]
[340,309,"B1.2/B1.3","4.15","ML-R10","KPO","P1","Buffer","80X120",null,10,"Logistiport",30041,1101,1,"NA","ML-R10","POSER_LES_BRIDES_SUR_LE_ROULEMENT_DU_GENERATEUR_POUR_LE_ROUTAGE_DES_CABLES_ELECTRIQUES_ET_LA_LUBRIFICATION","KIT.30041A","KIT.30041B","KIT.30041C","OK","OK","OK","Mallette","4.15",{"$f":"VLOOKUP(S309,'[1]Extraction Tracking 2905'!D:D,1,FALSE)","v":"KIT.30041A"},null,1,"ML-R10",1,"ML-R101",30041,{"$f":"VLOOKUP(C309,[2]Feuil2!A:B,2,FALSE)","v":"BLK1-2_1-3"},"1101BLK1-2_1-3",{"$f":"VLOOKUP(Regroupement!AI309,[2]Wip!AC:AC,1,FALSE)","v":"1101BLK1-2_1-3"},{"$f":"VLOOKUP(AI309,[2]Wip!AC:AC,1,FALSE)","v":"1101BLK1-2_1-3"}]
[341,310,"B1.2/B1.3","4.15","ML-R10","KPO","P1","Buffer","80X120",null,10,"Logistiport",30044,1201,1,"NA","ML-R10","PREMONTAGE_DE_LA_BALISE_NACELLE","KIT.30044A","KIT.30044B","KIT.30044C","OK","OK","OK","Mallette","4.15",{"$f":"VLOOKUP(S310,'[1]Extraction Tracking 2905'!D:D,1,FALSE)","v":"KIT.30044A"},null,1,"ML-R10",2,"ML-R102",30044,{"$f":"VLOOKUP(C310,[2]Feuil2!A:B,2,FALSE)","v":"BLK1-2_1-3"},"1201BLK1-2_1-3",{"$f":"VLOOKUP(Regroupement!AI310,[2]Wip!AC:AC,1,FALSE)","v":"1201BLK1-2_1-3"},{"$f":"VLOOKUP(AI310,[2]Wip!AC:AC,1,FALSE)","v":"1201BLK1-2_1-3"}]
[342,311,"B1.2/B1.3","4.15","ML-R10","KPO","P1","Buffer","80X120",null,10,"Logistiport",30046,1231,1,"NA","ML-R10","ASSEMBLAGE_DE_LA_BALISE_DE_LA_NACELLE_SUR_LE_GENERATEUR",{"$f":"\"Mallette \"&M311","v":"Mallette 30046"},"KIT.30046B","KIT.30046C","OK","OK","OK","Mallette Uniquement","4.15",{"$f":"VLOOKUP(S311,'[1]Extraction Tracking 2905'!D:D,1,FALSE)","v":{"$error":"#N/A"}},null,1,"ML-R10",3,"ML-R103",30046,{"$f":"VLOOKUP(C311,[2]Feuil2!A:B,2,FALSE)","v":"BLK1-2_1-3"},"1231BLK1-2_1-3",{"$f":"VLOOKUP(Regroupement!AI311,[2]Wip!AC:AC,1,FALSE)","v":"1231BLK1-2_1-3"},{"$f":"VLOOKUP(AI311,[2]Wip!AC:AC,1,FALSE)","v":"1231BLK1-2_1-3"}]
[343,312,"B1.2/B1.3","4.15","ML-R10","KPO","P1","Buffer","80X120",null,10,"Logistiport",30049,1301,1,"NA","ML-R10","MONTAGE_DES_POINTS_D_ANCRAGE_DE_SECURITE_SUR_LE_ROTOR_DU_GENERATEUR","KIT.30049A",{"$error":"#N/A"},{"$error":"#N/A"},"OK","OK","OK","Mallette","4.15",{"$f":"VLOOKUP(S312,'[1]Extraction Tracking 2905'!D:D,1,FALSE)","v":{"$error":"#N/A"}},null,1,"ML-R10",4,"ML-R104",30049,{"$f":"VLOOKUP(C312,[2]Feuil2!A:B,2,FALSE)","v":"BLK1-2_1-3"},"1301BLK1-2_1-3",{"$f":"VLOOKUP(Regroupement!AI312,[2]Wip!AC:AC,1,FALSE)","v":"1301BLK1-2_1-3"},{"$f":"VLOOKUP(AI312,[2]Wip!AC:AC,1,FALSE)","v":"1301BLK1-2_1-3"}]
[344,313,"B1.2/B1.3","4.15","ML-R11","KPO","P1","Buffer","80X120","plancher",10,"Logistiport",30045,1211,1,"NA","ML-R11","ASSEMBLAGE_DES_PLATEFORMES_ET_ECHELLES_D_ACCES_AU_SPINNER","KIT.30045A","KIT.30045B","KIT.30045C","OK","OK","OK","Mallette","4.15",{"$f":"VLOOKUP(S313,'[1]Extraction Tracking 2905'!D:D,1,FALSE)","v":"KIT.30045A"},null,1,"ML-R11",1,"ML-R111",30045,{"$f":"VLOOKUP(C313,[2]Feuil2!A:B,2,FALSE)","v":"BLK1-2_1-3"},"1211BLK1-2_1-3",{"$f":"VLOOKUP(Regroupement!AI313,[2]Wip!AC:AC,1,FALSE)","v":"1211BLK1-2_1-3"},{"$f":"VLOOKUP(AI313,[2]Wip!AC:AC,1,FALSE)","v":"1211BLK1-2_1-3"}]
[345,314,"B1.2/B1.3","4.15","ML-R12 Gestal","KPO",null,"Buffer","80X120","Silent bloc Gestal",10,"Logistiport",30060,1311,1,"NA","ML-R12 Gestal","MISE_EN_PLACE_DES_OUTILS_DE_PRE_ASSEMBLAGE_DES_BRAS_DE_LIAISON_DU_GENERATEUR","KIT.30060A",{"$error":"#N/A"},{"$error":"#N/A"},"Palette perdue",null,null,"Mallette","4.15",{"$f":"VLOOKUP(S314,'[1]Extraction Tracking 2905'!D:D,1,FALSE)","v":{"$error":"#N/A"}},null,1,"ML-R12 Gestal",1,"ML-R12 Gestal1",30060,{"$f":"VLOOKUP(C314,[2]Feuil2!A:B,2,FALSE)","v":"BLK1-2_1-3"},"1311BLK1-2_1-3",{"$f":"VLOOKUP(Regroupement!AI314,[2]Wip!AC:AC,1,FALSE)","v":"1311BLK1-2_1-3"},{"$f":"VLOOKUP(AI314,[2]Wip!AC:AC,1,FALSE)","v":"1311BLK1-2_1-3"}]
[346,315,"B1.2/B1.3","4.15","ML-R13","KPO",null,"Buffer","80X120","Supports et flexibles",10,"Logistiport",30071,1401,1,"NA","ML-R13","PRE_ASSEMBLAGE_DU_SYSTEME_HYDRAULIQUE_DES_SILENTBLOCKS_DU_GENERATEUR","KIT.30071A","KIT.30071B","KIT.30071C","OK","OK","OK","Mallette","4.15",{"$f":"VLOOKUP(S315,'[1]Extraction Tracking 2905'!D:D,1,FALSE)","v":"KIT.30071A"},null,1,"ML-R13",1,"ML-R131",30071,{"$f":"VLOOKUP(C315,[2]Feuil2!A:B,2,FALSE)","v":"BLK1-2_1-3"},"1401BLK1-2_1-3",{"$f":"VLOOKUP(Regroupement!AI315,[2]Wip!AC:AC,1,FALSE)","v":"1401BLK1-2_1-3"},{"$f":"VLOOKUP(AI315,[2]Wip!AC:AC,1,FALSE)","v":"1401BLK1-2_1-3"}]
[347,316,"B1.2/B1.3","4.15","ML-R13","KPO",null,"Buffer","80X120","Supports et flexibles",10,"Logistiport",30280,1106,1,"NA","ML-R13","CONNECTIONS_HYDRAULIQUES_SYSTEME_DE_LUBRIFICATION_ROULEMENT_GENERATOR","KIT.30280A","KIT.30280B","KIT.30280C","OK","OK","OK",null,"4.15",{"$f":"VLOOKUP(S316,'[1]Extraction Tracking 2905'!D:D,1,FALSE)","v":"KIT.30280A"},null,1,"ML-R13",2,"ML-R132",30280,{"$f":"VLOOKUP(C316,[2]Feuil2!A:B,2,FALSE)","v":"BLK1-2_1-3"},"1106BLK1-2_1-3",{"$f":"VLOOKUP(Regroupement!AI316,[2]Wip!AC:AC,1,FALSE)","v":"1106BLK1-2_1-3"},{"$f":"VLOOKUP(AI316,[2]Wip!AC:AC,1,FALSE)","v":"1106BLK1-2_1-3"}]
[348,317,"B1.2/B1.3","4.15","ML-R13","KPO",null,"Buffer","80X120","Supports et flexibles",10,"Logistiport",30471,1501,1,"NA","ML-R13","MONTAGE_DES_SUPPORTS_ET_DES_BLOCS_HYDRAULIQUES_DU_SYSTEME_DE_GRAISSAGE_DU_GENERATEUR","KIT.30471A","KIT.30471B","KIT.30471C","OK","OK","OK","Mallette","4.15",{"$f":"VLOOKUP(S317,'[1]Extraction Tracking 2905'!D:D,1,FALSE)","v":"KIT.30471A"},null,1,"ML-R13",3,"ML-R133",30471,{"$f":"VLOOKUP(C317,[2]Feuil2!A:B,2,FALSE)","v":"BLK1-2_1-3"},"1501BLK1-2_1-3",{"$f":"VLOOKUP(Regroupement!AI317,[2]Wip!AC:AC,1,FALSE)","v":"1501BLK1-2_1-3"},{"$f":"VLOOKUP(AI317,[2]Wip!AC:AC,1,FALSE)","v":"1501BLK1-2_1-3"}]
[387,318,"B1.2/B1.3","4.15","ML-R13","KPO",null,"Buffer","80X120",null,10,"Logistiport",40249,1316,1,"NA","ML-R13","MONTER_LES_BLOCKS_DE_VALVES_ET_DE_PRESSOSTATS_DU_SYSTEME_HYDRAULIQUE_DES_SILENT_BLOCKS_SUR_BA1","KIT.40249A","KIT.40249B","KIT.40249C","OK","OK","OK","Mallette","4.15",{"$f":"VLOOKUP(S318,'[1]Extraction Tracking 2905'!D:D,1,FALSE)","v":"KIT.40249A"},null,1,"ML-R13",4,"ML-R134",40249,{"$f":"VLOOKUP(C318,[2]Feuil2!A:B,2,FALSE)","v":"BLK1-2_1-3"},"1316BLK1-2_1-3",{"$f":"VLOOKUP(Regroupement!AI318,[2]Wip!AC:AC,1,FALSE)","v":"1316BLK1-2_1-3"},{"$f":"VLOOKUP(AI318,[2]Wip!AC:AC,1,FALSE)","v":"1316BLK1-2_1-3"}]
[349,319,"B1.2/B1.3","4.15","ML-R14","Support fournisseur",null,"Buffer",null,"Coupling arms",10,"Chantenay",30410,1601,1,"NA","ML-R14","NETTOYER_LES_BRIDES_DES_BRAS_DE_LIAISON_1_2_3","KIT.30410A",{"$error":"#N/A"},{"$error":"#N/A"},"Support fournisseur","Support fournisseur","Support fournisseur",null,"4.15",{"$f":"VLOOKUP(S319,'[1]Extraction Tracking 2905'!D:D,1,FALSE)","v":{"$error":"#N/A"}},null,1,"ML-R14",1,"ML-R141",30410,{"$f":"VLOOKUP(C319,[2]Feuil2!A:B,2,FALSE)","v":"BLK1-2_1-3"},"1601BLK1-2_1-3",{"$f":"VLOOKUP(Regroupement!AI319,[2]Wip!AC:AC,1,FALSE)","v":"1601BLK1-2_1-3"},{"$f":"VLOOKUP(AI319,[2]Wip!AC:AC,1,FALSE)","v":"1601BLK1-2_1-3"}]
[351,320,"B1.2/B1.3","5.10","ML-R16","KPO","P1","Buffer","150X150","Plate forme",10,"Logistiport",35290,3711,1,"NA","ML-R16","MONTER_LA_STRUCTURE_LES_PLANCHERS_ET_GARDE_CORPS_DE_LA_PLATEFORME_D_ACCES_BC_BI","KIT.35290A","KIT.35290B","KIT.35290C","OK","OK","OK","Mallette",{"$f":"D320","v":"5.10"},{"$f":"VLOOKUP(S320,'[1]Extraction Tracking 2905'!D:D,1,FALSE)","v":"KIT.35290A"},null,1,"ML-R16",1,"ML-R161",35290,{"$f":"VLOOKUP(C320,[2]Feuil2!A:B,2,FALSE)","v":"BLK1-2_1-3"},"3711BLK1-2_1-3",{"$f":"VLOOKUP(Regroupement!AI320,[2]Wip!AC:AC,1,FALSE)","v":{"$error":"#N/A"}},{"$f":"VLOOKUP(AI320,[2]Wip!AC:AC,1,FALSE)","v":{"$error":"#N/A"}}]
[352,321,"B1.2/B1.3","5.10","ML-R16","KPO","P1","Buffer","150X150","Sol plate forme generateur",10,"Logistiport",35117,2801,1,"NA","ML-R16","MONTAGE_DES_SOLS_DE_LA_PLATEFORME_DU_GENERATEUR","KIT.35117A","KIT.35117B","KIT.35117C","OK","OK","OK","Mallette","5.10",{"$f":"VLOOKUP(S321,'[1]Extraction Tracking 2905'!D:D,1,FALSE)","v":"KIT.35117A"},null,1,"ML-R16",2,"ML-R162",35117,{"$f":"VLOOKUP(C321,[2]Feuil2!A:B,2,FALSE)","v":"BLK1-2_1-3"},"2801BLK1-2_1-3",{"$f":"VLOOKUP(Regroupement!AI321,[2]Wip!AC:AC,1,FALSE)","v":"2801BLK1-2_1-3"},{"$f":"VLOOKUP(AI321,[2]Wip!AC:AC,1,FALSE)","v":"2801BLK1-2_1-3"}]
[353,322,"B1.2/B1.3","5.10","ML-R16","KPO","P1","Buffer","150X150",null,10,"Logistiport",35122,2701,{"$f":"COUNTIF(M:M,M322)","v":1},"NA","ML-R16","MONTAGE_DE_LA_PARTIE_AVANT_DE_LA_PLATEFORME_SUPERIEURE_APPUYEE_SUR_BATI_INTERMEDIAIRE","KIT.35122A","KIT.35122B","KIT.35122C","OK","OK","OK","Mallette","5.10",{"$f":"VLOOKUP(S322,'[1]Extraction Tracking 2905'!D:D,1,FALSE)","v":"KIT.35122A"},null,1,{"$f":"Q322","v":"ML-R16"},3,{"$f":"AD322&AE322","v":"ML-R163"},{"$f":"M322","v":35122},{"$f":"VLOOKUP(C322,[2]Feuil2!A:B,2,FALSE)","v":"BLK1-2_1-3"},"2701BLK1-2_1-3",{"$f":"VLOOKUP(Regroupement!AI322,[2]Wip!AC:AC,1,FALSE)","v":"2701BLK1-2_1-3"},{"$f":"VLOOKUP(AI322,[2]Wip!AC:AC,1,FALSE)","v":"2701BLK1-2_1-3"}]
[354,323,"B1.2/B1.3","5.10","ML-R17","KPO",null,"Buffer","2X80X120","PAL 1/2",10,"Logistiport",35055,2221,1,"NA","ML-R17","MISE_EN_PLACE_DES_PEIGNES_ET_GOUJONS_PUIS_DE_LA_VISSERIE_DE_JONCTION_BC_BI","KIT.35055A",{"$error":"#N/A"},{"$error":"#N/A"},"OK","OK","OK",null,"5.10",{"$f":"VLOOKUP(S323,'[1]Extraction Tracking 2905'!D:D,1,FALSE)","v":{"$error":"#N/A"}},null,1,"ML-R17",1,"ML-R171",35055,{"$f":"VLOOKUP(C323,[2]Feuil2!A:B,2,FALSE)","v":"BLK1-2_1-3"},{"$f":"N323&AH323","v":"2221BLK1-2_1-3"},{"$f":"VLOOKUP(Regroupement!AI323,[2]Wip!AC:AC,1,FALSE)","v":"2221BLK1-2_1-3"},{"$f":"VLOOKUP(AI323,[2]Wip!AC:AC,1,FALSE)","v":"2221BLK1-2_1-3"}]
[355,324,"B1.2/B1.3","5.10","ML-R18","KPO",null,"Buffer","80X120",null,10,"Logistiport",35112,2811,1,"NA","ML-R18","ASSEMBLAGE_VERTICAL_DE_L_EXIT_COVER_PUIS_LE_JOINDRE_AVEC_LES_CAPOTS_DU_B1-1_ET_CEUX_DU_GENRATEUR","KIT.35112A","KIT.35112B","KIT.35112C","OK","OK","OK","Mallette","5.10",{"$f":"VLOOKUP(S324,'[1]Extraction Tracking 2905'!D:D,1,FALSE)","v":"KIT.35112A"},null,1,"ML-R18",{"$f":"IF(AD324=AD323,AE323+1,1)","v":1},"ML-R181",35112,{"$f":"VLOOKUP(C324,[2]Feuil2!A:B,2,FALSE)","v":"BLK1-2_1-3"},"2811BLK1-2_1-3",{"$f":"VLOOKUP(Regroupement!AI324,[2]Wip!AC:AC,1,FALSE)","v":"2811BLK1-2_1-3"},{"$f":"VLOOKUP(AI324,[2]Wip!AC:AC,1,FALSE)","v":"2811BLK1-2_1-3"}]
[405,325,"B1.2/B1.3","5.20","ML-R18,5","KPO",null,"Buffer","80X120",null,10,"Logistiport",30215,4821,1,"NA","ML-R18,5","PREMONTER_LA_PORTE_D ACCES_ENTRE_LE_BATI_AVANT_ET_LE_BATI_INTERMEDIAIRE","KIT.30215A","KIT.30215B","KIT.30215C","OK","OK","OK","Mallette","5.20",{"$f":"VLOOKUP(S325,'[1]Extraction Tracking 2905'!D:D,1,FALSE)","v":"KIT.30215A"},null,1,"ML-R18,5",1,"ML-R18,51",30215,{"$f":"VLOOKUP(C325,[2]Feuil2!A:B,2,FALSE)","v":"BLK1-2_1-3"},"4821BLK1-2_1-3",{"$f":"VLOOKUP(Regroupement!AI325,[2]Wip!AC:AC,1,FALSE)","v":"4821BLK1-2_1-3"},{"$f":"VLOOKUP(AI325,[2]Wip!AC:AC,1,FALSE)","v":"4821BLK1-2_1-3"}]
[null,326,"B1.2/B1.3","5.20","ML-R18,5","KPO",null,"Buffer","80X120",null,10,"Logistiport",40166,4901,1,"NA","ML-R18,5","MONTER_LA_PORTE_D ACCES_ENTRE_LE_BATI_AVANT_ET_LE_BATI_INTERMEDIAIRE","KIT.40166A",null,null,"OK","OK","OK","Mallette","5.20",{"$f":"VLOOKUP(S326,'[1]Extraction Tracking 2905'!D:D,1,FALSE)","v":"KIT.40166A"},null,1,"ML-R18,5",2,"ML-R18,52",40166,{"$f":"VLOOKUP(C326,[2]Feuil2!A:B,2,FALSE)","v":"BLK1-2_1-3"},"4901BLK1-2_1-3",{"$f":"VLOOKUP(Regroupement!AI326,[2]Wip!AC:AC,1,FALSE)","v":"4901BLK1-2_1-3"},{"$f":"VLOOKUP(AI326,[2]Wip!AC:AC,1,FALSE)","v":"4901BLK1-2_1-3"}]
[357,327,"B1.2/B1.3","5.20","ML-R19","KPO","P1","Buffer","80X120",null,10,"Logistiport",35291,3101,1,"NA","ML-R19","ASSEMBLAGE_DES_BRIDES_POUR_LE_PASSAGE_DES_CABLES_DE_PUISSANCE_SUR_LE_BATI_CENTRAL","KIT.35291A",{"$error":"#N/A"},{"$error":"#N/A"},"OK","OK","OK","Mallette","5.20",{"$f":"VLOOKUP(S327,'[1]Extraction Tracking 2905'!D:D,1,FALSE)","v":{"$error":"#N/A"}},null,1,"ML-R19",1,"ML-R191",35291,{"$f":"VLOOKUP(C327,[2]Feuil2!A:B,2,FALSE)","v":"BLK1-2_1-3"},"3101BLK1-2_1-3",{"$f":"VLOOKUP(Regroupement!AI327,[2]Wip!AC:AC,1,FALSE)","v":{"$error":"#N/A"}},{"$f":"VLOOKUP(AI327,[2]Wip!AC:AC,1,FALSE)","v":{"$error":"#N/A"}}]
[358,328,"B1.2/B1.3","5.20","ML-R19","KPO","P1","Buffer","80X120",null,10,"Logistiport",35115,3521,1,"NA","ML-R19","MONTAGE_LA_LIGNE_DE_VIE_SUR_L_EXIT_COVER","KIT.35115A","KIT.35115B","KIT.35115C","OK","OK","OK","Mallette","5.20",{"$f":"VLOOKUP(S328,'[1]Extraction Tracking 2905'!D:D,1,FALSE)","v":"KIT.35115A"},null,1,"ML-R19",2,"ML-R192",35115,{"$f":"VLOOKUP(C328,[2]Feuil2!A:B,2,FALSE)","v":"BLK1-2_1-3"},"3521BLK1-2_1-3",{"$f":"VLOOKUP(Regroupement!AI328,[2]Wip!AC:AC,1,FALSE)","v":"3521BLK1-2_1-3"},{"$f":"VLOOKUP(AI328,[2]Wip!AC:AC,1,FALSE)","v":"3521BLK1-2_1-3"}]
[359,329,"B1.2/B1.3","5.20","ML-R19","KPO","P1","Buffer","80X120",null,10,"Logistiport",35296,3411,1,"NA","ML-R19","CONNEXION_HYDRAULIQUE_DE_LA_POMPE_DE_GRAISSAGE_DU_GENERATEUR_AUX_DISTRIBUTEUR_COTE_ROTOR_DU_GENERATEUR","KIT.35296A",{"$error":"#N/A"},{"$error":"#N/A"},"OK","OK","OK",null,"5.20",{"$f":"VLOOKUP(S329,'[1]Extraction Tracking 2905'!D:D,1,FALSE)","v":{"$error":"#N/A"}},null,1,"ML-R19",3,"ML-R193",35296,{"$f":"VLOOKUP(C329,[2]Feuil2!A:B,2,FALSE)","v":"BLK1-2_1-3"},"3411BLK1-2_1-3",{"$f":"VLOOKUP(Regroupement!AI329,[2]Wip!AC:AC,1,FALSE)","v":{"$error":"#N/A"}},{"$f":"VLOOKUP(AI329,[2]Wip!AC:AC,1,FALSE)","v":{"$error":"#N/A"}}]
[360,330,"B1.2/B1.3","5.20","ML-R19","KPO","P1","Buffer","80X120",null,10,"Logistiport",30213,3611,1,"NA","ML-R19","MONTAGE_DE_LA_SERRURE_DE_SECURITE_SUR_LE_LOCKING_PIN_DU_GENERATEUR","KIT.30213A","KIT.30213B","KIT.30213C","OK","OK","OK","Mallette","5.20",{"$f":"VLOOKUP(S330,'[1]Extraction Tracking 2905'!D:D,1,FALSE)","v":"KIT.30213A"},null,1,"ML-R19",4,"ML-R194",30213,{"$f":"VLOOKUP(C330,[2]Feuil2!A:B,2,FALSE)","v":"BLK1-2_1-3"},"3611BLK1-2_1-3",{"$f":"VLOOKUP(Regroupement!AI330,[2]Wip!AC:AC,1,FALSE)","v":{"$error":"#N/A"}},{"$f":"VLOOKUP(AI330,[2]Wip!AC:AC,1,FALSE)","v":{"$error":"#N/A"}}]
[363,331,"B1.2/B1.3","5.20","ML-R21,5","KPO",null,"Buffer","80X120",null,10,"Logistiport",35123,3121,1,"NA","ML-R21,5","ASSEMBLAGE_DES_CAPOTS_DU_GENERATEUR_COTE_TOUR_X2_AVEC_CEUX_DE_L_EXIT_COVER_X2","KIT.35123A","KIT.35123B","KIT.35123C","OK","OK","OK","Mallette","5.20",{"$f":"VLOOKUP(S331,'[1]Extraction Tracking 2905'!D:D,1,FALSE)","v":"KIT.35123A"},null,1,"ML-R21,5",1,"ML-R21,51",35123,{"$f":"VLOOKUP(C331,[2]Feuil2!A:B,2,FALSE)","v":"BLK1-2_1-3"},"3121BLK1-2_1-3",{"$f":"VLOOKUP(Regroupement!AI331,[2]Wip!AC:AC,1,FALSE)","v":{"$error":"#N/A"}},{"$f":"VLOOKUP(AI331,[2]Wip!AC:AC,1,FALSE)","v":{"$error":"#N/A"}}]
[null,332,"B1.2/B1.3","5.20","ML-R21,5","KPO",null,"Buffer","80X120","& Pal + Echelle 4m",10,"Logistiport",35118,3401,1,"NA","ML-R21,5","Montage de l echelle laterale droite exterieur BC","KIT.35118A",null,null,"OK","OK","OK","Mallette","5.20",{"$f":"VLOOKUP(S332,'[1]Extraction Tracking 2905'!D:D,1,FALSE)","v":"KIT.35118A"},null,1,"ML-R21,5",2,"ML-R21,52",35118,{"$f":"VLOOKUP(C332,[2]Feuil2!A:B,2,FALSE)","v":"BLK1-2_1-3"},"3401BLK1-2_1-3",{"$f":"VLOOKUP(Regroupement!AI332,[2]Wip!AC:AC,1,FALSE)","v":"3401BLK1-2_1-3"},{"$f":"VLOOKUP(AI332,[2]Wip!AC:AC,1,FALSE)","v":"3401BLK1-2_1-3"}]
[null,333,"B1.2/B1.3","5.20","ML-R21,5","KPO",null,"Buffer",null,"Malette",10,"Logistiport",80305,3721,1,"NA",{"$f":"E333","v":"ML-R21,5"},"NA",{"$f":"\"Mallette \"&M333","v":"Mallette 80305"},null,null,"OK","OK","OK","Mallette Uniquement","5.20",null,null,1,"ML-R21,5",3,"ML-R21,53",80305,{"$f":"VLOOKUP(C333,[2]Feuil2!A:B,2,FALSE)","v":"BLK1-2_1-3"},"3721BLK1-2_1-3",{"$f":"VLOOKUP(Regroupement!AI333,[2]Wip!AC:AC,1,FALSE)","v":"3721BLK1-2_1-3"},{"$f":"VLOOKUP(AI333,[2]Wip!AC:AC,1,FALSE)","v":"3721BLK1-2_1-3"}]
[365,334,"B1.2/B1.3","5.20","ML-R22","Idea","P1","Buffer Exterieur","80X260","Fibres",7,"Chantenay",35113,3421,1,"NA","ML-R22","MONTAGE_DES_CAPOTS_ARRIERE_HAUT_DE_L EXIT_COVER","KIT.35113A","KIT.35113B","KIT.35113C","OK","OK",null,"Mallette","5.20",{"$f":"VLOOKUP(S334,'[1]Extraction Tracking 2905'!D:D,1,FALSE)","v":"KIT.35113A"},null,1,"ML-R22",1,"ML-R221",35113,{"$f":"VLOOKUP(C334,[2]Feuil2!A:B,2,FALSE)","v":"BLK1-2_1-3"},"3421BLK1-2_1-3",{"$f":"VLOOKUP(Regroupement!AI334,[2]Wip!AC:AC,1,FALSE)","v":{"$error":"#N/A"}},{"$f":"VLOOKUP(AI334,[2]Wip!AC:AC,1,FALSE)","v":{"$error":"#N/A"}}]
[366,335,"B1.2/B1.3","5.20","ML-R23","Idea","P1","Buffer Exterieur","80X330","Fibres 1/2 et 2/2",7,"Chantenay",35130,3511,1,"NA","ML-R23","MONTAGE_DES_CAPOTS_DI_GENERATEUR_CENTRAUX_LATERAUX_DROITS_ET_GAUCHES_X4","KIT.35130A","KIT.35130B","KIT.35130C","OK","OK",null,"Mallette","5.20",{"$f":"VLOOKUP(S335,'[1]Extraction Tracking 2905'!D:D,1,FALSE)","v":"KIT.35130A"},null,1,"ML-R23",1,"ML-R231",35130,{"$f":"VLOOKUP(C335,[2]Feuil2!A:B,2,FALSE)","v":"BLK1-2_1-3"},"3511BLK1-2_1-3",{"$f":"VLOOKUP(Regroupement!AI335,[2]Wip!AC:AC,1,FALSE)","v":"3511BLK1-2_1-3"},{"$f":"VLOOKUP(AI335,[2]Wip!AC:AC,1,FALSE)","v":"3511BLK1-2_1-3"}]
[369,336,"B1.2/B1.3","5.20","ML-R25","KPO",null,"Buffer","80X120","Capot pince de frein",10,"Logistiport",35119,3901,1,"NA","ML-R25","MONTAGE_DES_CAPOTS_SOUS_LES_PINCES_DE_FREINS","KIT.35119A","KIT.35119B","KIT.35119C","OK","OK","OK","Mallette","5.20",{"$f":"VLOOKUP(S336,'[1]Extraction Tracking 2905'!D:D,1,FALSE)","v":"KIT.35119A"},null,1,"ML-R25",1,"ML-R251",35119,{"$f":"VLOOKUP(C336,[2]Feuil2!A:B,2,FALSE)","v":"BLK1-2_1-3"},"3901BLK1-2_1-3",{"$f":"VLOOKUP(Regroupement!AI336,[2]Wip!AC:AC,1,FALSE)","v":"3901BLK1-2_1-3"},{"$f":"VLOOKUP(AI336,[2]Wip!AC:AC,1,FALSE)","v":"3901BLK1-2_1-3"}]
[370,337,"B1.2/B1.3","5.20","ML-R25","KPO",null,"Buffer","80X120","Bouchons gene",10,"Logistiport",45280,3201,1,"NA","ML-R25","DEMONTER_LES_CEINTURES_DU_GENERATEUR_X2_RETOUCHES_DE_PEINTURE_ET_SILICONAGE_DES_TROUS","KIT.45280A","KIT.45280B","KIT.45280C","OK","OK","OK",null,"5.20",{"$f":"VLOOKUP(S337,'[1]Extraction Tracking 2905'!D:D,1,FALSE)","v":{"$error":"#N/A"}},null,1,"ML-R25",2,"ML-R252",45280,{"$f":"VLOOKUP(C337,[2]Feuil2!A:B,2,FALSE)","v":"BLK1-2_1-3"},"3201BLK1-2_1-3",{"$f":"VLOOKUP(Regroupement!AI337,[2]Wip!AC:AC,1,FALSE)","v":"3201BLK1-2_1-3"},{"$f":"VLOOKUP(AI337,[2]Wip!AC:AC,1,FALSE)","v":"3201BLK1-2_1-3"}]
[371,338,"B1.2/B1.3","6.10","ML-R26","KPO","P1","Buffer","80X120","Echelle ",10,"Logistiport",30460,4101,1,"NA","ML-R26","PRE_MONTAGE_DES_LUMINAIRES_LED_ET_L_ESCALIER_DU_BATI_INTERMEDIAIRE","KIT.30460A","KIT.30460B","KIT.30460C","OK","OK","OK","Mallette","6.10",{"$f":"VLOOKUP(S338,'[1]Extraction Tracking 2905'!D:D,1,FALSE)","v":"KIT.30460A"},null,1,"ML-R26",1,"ML-R261",30460,{"$f":"VLOOKUP(C338,[2]Feuil2!A:B,2,FALSE)","v":"BLK1-2_1-3"},"4101BLK1-2_1-3",{"$f":"VLOOKUP(Regroupement!AI338,[2]Wip!AC:AC,1,FALSE)","v":"4101BLK1-2_1-3"},{"$f":"VLOOKUP(AI338,[2]Wip!AC:AC,1,FALSE)","v":"4101BLK1-2_1-3"}]
[372,339,"B1.2/B1.3","6.10","ML-R26","KPO","P1","Buffer","80X120","Echelle ",10,"Logistiport",30470,4811,1,"NA","ML-R26","MONTAGE_DE_L_ECHELLE_DU_BATI_INTERMEDIAIRE_AVEC_ROUTAGE_DES_CABLES","KIT.30470A","KIT.30470B","KIT.30470C","OK","OK","OK","Mallette","6.10",{"$f":"VLOOKUP(S339,'[1]Extraction Tracking 2905'!D:D,1,FALSE)","v":"KIT.30470A"},null,{"$f":"COUNTIF(M:M,M339)","v":1},"ML-R26",2,"ML-R262",30470,{"$f":"VLOOKUP(C339,[2]Feuil2!A:B,2,FALSE)","v":"BLK1-2_1-3"},"4811BLK1-2_1-3",{"$f":"VLOOKUP(Regroupement!AI339,[2]Wip!AC:AC,1,FALSE)","v":"4811BLK1-2_1-3"},{"$f":"VLOOKUP(AI339,[2]Wip!AC:AC,1,FALSE)","v":"4811BLK1-2_1-3"}]
[null,340,"B1.2/B1.3","6.10","ML-R27,5","KPO",null,"Buffer","80X120","Visserie 1/2",10,"Logistiport",40160,4801,1,"NA","ML-R27,5","Serrer les vis definitives dans les emplacements libres enlever les vis non definitives et placer les vi","KIT.40160A",null,null,"OK","OK","OK",null,"6.10",null,null,1,"ML-R27,5",1,"ML-R27,51",40160,{"$f":"VLOOKUP(C340,[2]Feuil2!A:B,2,FALSE)","v":"BLK1-2_1-3"},"4801BLK1-2_1-3",{"$f":"VLOOKUP(Regroupement!AI340,[2]Wip!AC:AC,1,FALSE)","v":"4801BLK1-2_1-3"},{"$f":"VLOOKUP(AI340,[2]Wip!AC:AC,1,FALSE)","v":"4801BLK1-2_1-3"}]
[null,341,"B1.4","6.20","ML-R28","KPO","P1","Buffer","80X120","Visserie ",10,"Logistiport",40180,101,1,"NA","ML-R28","UNIR_LE_BRAS_D ACCOUPLEMENT_BA2_AU_HUB","KIT.40180A","KIT.40180B","KIT.40180C","OK","OK","OK","Mallette","6.20",{"$f":"VLOOKUP(S341,'[1]Extraction Tracking 2905'!D:D,1,FALSE)","v":"KIT.40180A"},null,1,"ML-R28",1,"ML-R281",40180,{"$f":"VLOOKUP(C341,[2]Feuil2!A:B,2,FALSE)","v":"BLK1-4"},"101BLK1-4",{"$f":"VLOOKUP(Regroupement!AI341,[2]Wip!AC:AC,1,FALSE)","v":"101BLK1-4"},{"$f":"VLOOKUP(AI341,[2]Wip!AC:AC,1,FALSE)","v":"101BLK1-4"}]
[null,342,"B1.4","6.20","ML-R28","KPO","P1","Buffer","80X120","Visserie ",10,"Logistiport",40247,121,1,"NA","ML-R28","MONTER_LES_SILENT_BLOCKS_ET_DEMONTER_LES_OUTILS_SUR_BA2","KIT.40247A",null,null,"OK","OK","OK","Mallette","6.20",null,null,1,"ML-R28",2,"ML-R282",40247,{"$f":"VLOOKUP(C342,[2]Feuil2!A:B,2,FALSE)","v":"BLK1-4"},"121BLK1-4",{"$f":"VLOOKUP(Regroupement!AI342,[2]Wip!AC:AC,1,FALSE)","v":"121BLK1-4"},{"$f":"VLOOKUP(AI342,[2]Wip!AC:AC,1,FALSE)","v":"121BLK1-4"}]
[null,353,"B1.4","6.20","ML-R28","KPO",null,"Buffer","80X60","Visserie ",10,"Logistiport",40601,311,1,"NA",{"$f":"E343","v":"ML-R28"},"CONNEXION_HYDRAULIQUE_DU_SILENT_BLOCK_SUR_BA1","KIT.40601A","KIT.40601B","KIT.40601C","OK","OK","OK","Mallette",{"$f":"D343","v":"6.20"},{"$f":"VLOOKUP(S343,'[1]Extraction Tracking 2905'!D:D,1,FALSE)","v":"KIT.40601A"},null,1,{"$f":"Q343","v":"ML-R28"},{"$f":"IF(AD343=AD346,AE346+1,1)","v":1},{"$f":"AD343&AE343","v":"ML-R281"},{"$f":"M343","v":40601},{"$f":"VLOOKUP(C343,[2]Feuil2!A:B,2,FALSE)","v":"BLK1-4"},"311BLK1-4",{"$f":"VLOOKUP(Regroupement!AI343,[2]Wip!AC:AC,1,FALSE)","v":"311BLK1-4"},{"$f":"VLOOKUP(AI343,[2]Wip!AC:AC,1,FALSE)","v":"311BLK1-4"}]
[null,343,"B1.4","6.20","ML-R28,5","KPO","P1","Buffer","80X120","Visserie ",10,"Logistiport",40450,146,1,"NA","ML-R28,5","UNIE_LE_BRAS_D ACCOUPLEMENT_BA3_AU_HUB","KIT.40450A","KIT.40450B","KIT.40450C","OK","OK","OK","Mallette","6.20",{"$f":"VLOOKUP(S344,'[1]Extraction Tracking 2905'!D:D,1,FALSE)","v":"KIT.40450A"},null,1,"ML-R28,5",{"$f":"IF(AD344=AD342,AE342+1,1)","v":1},"ML-R28,51",40450,{"$f":"VLOOKUP(C344,[2]Feuil2!A:B,2,FALSE)","v":"BLK1-4"},"146BLK1-4",{"$f":"VLOOKUP(Regroupement!AI344,[2]Wip!AC:AC,1,FALSE)","v":"146BLK1-4"},{"$f":"VLOOKUP(AI344,[2]Wip!AC:AC,1,FALSE)","v":"146BLK1-4"}]
[null,344,"B1.4","6.20","ML-R28,5","KPO","P1","Buffer","80X120","Visserie ",10,"Logistiport",40500,201,1,"NA","ML-R28,5","MONTER_LA_PLATEFORME_DU_BRAS_D ACCOUPLEMENT_ET_CHEMINS_DE_","KIT.40500A",null,null,"OK","OK","OK","Mallette","6.20",null,null,1,"ML-R28,5",2,"ML-R28,52",40500,{"$f":"VLOOKUP(C345,[2]Feuil2!A:B,2,FALSE)","v":"BLK1-4"},"201BLK1-4",{"$f":"VLOOKUP(Regroupement!AI345,[2]Wip!AC:AC,1,FALSE)","v":"201BLK1-4"},{"$f":"VLOOKUP(AI345,[2]Wip!AC:AC,1,FALSE)","v":"201BLK1-4"}]
[null,352,"B1.4","6.20","ML-R28,5","KPO",null,"Buffer","80X60","Visserie ",10,"Logistiport",40251,126,1,"NA",{"$f":"E346","v":"ML-R28,5"},"CONNEXION_HYDRAULIQUE_DU_SILENT_BLOCK_SUR_BA2","KIT.40251A","KIT.40251B","KIT.40251C","OK","OK","OK","Mallette",{"$f":"D346","v":"6.20"},{"$f":"VLOOKUP(S346,'[1]Extraction Tracking 2905'!D:D,1,FALSE)","v":"KIT.40251A"},null,1,{"$f":"Q346","v":"ML-R28,5"},{"$f":"IF(AD346=AD354,AE354+1,1)","v":1},{"$f":"AD346&AE346","v":"ML-R28,51"},{"$f":"M346","v":40251},{"$f":"VLOOKUP(C346,[2]Feuil2!A:B,2,FALSE)","v":"BLK1-4"},"126BLK1-4",{"$f":"VLOOKUP(Regroupement!AI346,[2]Wip!AC:AC,1,FALSE)","v":"126BLK1-4"},{"$f":"VLOOKUP(AI346,[2]Wip!AC:AC,1,FALSE)","v":"126BLK1-4"}]
[null,345,"B1.4","6.20","ML-R29","KPO","P1","Buffer","80X120","Visserie ",10,"Logistiport",40530,251,1,"NA","ML-R29","UNIR_LE_BRAS_D ACCOUPLEMENT_BA1_AU_HUB","KIT.40530A","KIT.40530B","KIT.40530C","OK","OK","OK","Mallette","6.20",{"$f":"VLOOKUP(S347,'[1]Extraction Tracking 2905'!D:D,1,FALSE)","v":"KIT.40530A"},null,1,"ML-R29",{"$f":"IF(AD347=AD345,AE345+1,1)","v":1},"ML-R291",40530,{"$f":"VLOOKUP(C347,[2]Feuil2!A:B,2,FALSE)","v":"BLK1-4"},"251BLK1-4",{"$f":"VLOOKUP(Regroupement!AI347,[2]Wip!AC:AC,1,FALSE)","v":"251BLK1-4"},{"$f":"VLOOKUP(AI347,[2]Wip!AC:AC,1,FALSE)","v":"251BLK1-4"}]
[null,346,"B1.4","6.20","ML-R29","KPO","P1","Buffer","80X120","Visserie ",10,"Logistiport",40580,301,1,"NA","ML-R29","MONTER_LES_SILENT_BLOCKS_ET_DEMONTER_LES_OUTILS_SUR_BA1","KIT.40580A",null,null,"OK","OK","OK","Mallette","6.20",null,null,1,"ML-R29",2,"ML-R292",40580,{"$f":"VLOOKUP(C348,[2]Feuil2!A:B,2,FALSE)","v":"BLK1-4"},"301BLK1-4",{"$f":"VLOOKUP(Regroupement!AI348,[2]Wip!AC:AC,1,FALSE)","v":"301BLK1-4"},{"$f":"VLOOKUP(AI348,[2]Wip!AC:AC,1,FALSE)","v":"301BLK1-4"}]
[null,347,"B1.4","6.20","ML-R29","KPO",null,"Buffer",null,"Visserie ",10,"Logistiport",40480,306,1,"NA","ML-R29","ASSEMBLER_LES_MARCHES_DANS_LE_BATI_INTERMEDIAIRE","KIT.40480A",null,null,"OK","OK","OK",null,"6.20",null,null,1,"ML-R29",3,"ML-R293",40480,{"$f":"VLOOKUP(C349,[2]Feuil2!A:B,2,FALSE)","v":"BLK1-4"},"306BLK1-4",{"$f":"VLOOKUP(Regroupement!AI349,[2]Wip!AC:AC,1,FALSE)","v":"306BLK1-4"},{"$f":"VLOOKUP(AI349,[2]Wip!AC:AC,1,FALSE)","v":"306BLK1-4"}]
[null,354,"B1.4","6.20","ML-R29","KPO",null,"Buffer","80X60","Visserie ",10,"Logistiport",40521,211,1,"NA",{"$f":"E350","v":"ML-R29"},"CONNEXION_HYDRAULIQUE_DU_SILENT_BLOCK_SUR_BA3","KIT.40521A",null,null,"OK","OK","OK","Mallette",{"$f":"D350","v":"6.20"},null,null,1,{"$f":"Q350","v":"ML-R29"},{"$f":"IF(AD350=AD343,AE343+1,1)","v":1},{"$f":"AD350&AE350","v":"ML-R291"},{"$f":"M350","v":40521},{"$f":"VLOOKUP(C350,[2]Feuil2!A:B,2,FALSE)","v":"BLK1-4"},"211BLK1-4",{"$f":"VLOOKUP(Regroupement!AI350,[2]Wip!AC:AC,1,FALSE)","v":"211BLK1-4"},{"$f":"VLOOKUP(AI350,[2]Wip!AC:AC,1,FALSE)","v":"211BLK1-4"}]
[null,348,"B1.4","6.20","ML-R31","KPO","P1","Buffer",null,"supports + planchers",10,"Logistiport",40256,231,1,"NA","ML-R31","MONTER_LA_PLATEFORME_DU_BRAS_D ACCOUPLEMENT_ET_DHEMINS_DE_CABLES_EN_BA3","KIT.40256A","KIT.40256B","KIT.40256C","OK","OK","OK","Mallette","6.20",{"$f":"VLOOKUP(S351,'[1]Extraction Tracking 2905'!D:D,1,FALSE)","v":"KIT.40256A"},null,1,"ML-R31",{"$f":"IF(AD351=AD349,AE349+1,1)","v":1},"ML-R311",40256,{"$f":"VLOOKUP(C351,[2]Feuil2!A:B,2,FALSE)","v":"BLK1-4"},"231BLK1-4",{"$f":"VLOOKUP(Regroupement!AI351,[2]Wip!AC:AC,1,FALSE)","v":"231BLK1-4"},{"$f":"VLOOKUP(AI351,[2]Wip!AC:AC,1,FALSE)","v":"231BLK1-4"}]
[null,349,"B1.4","6.20","ML-R31","KPO","P1","Buffer",null,"supports + planchers",10,"Logistiport",40257,401,1,"NA","ML-R31","MONTER_LA_PLATEFORME_DU_BRAS_D ACCOUPLEMENT_ET_CHEMINS_DE_CABLES_EN_BA1","KIT.40257A","KIT.40257B","KIT.40257C","OK","OK","OK","Mallette","6.20",{"$f":"VLOOKUP(S352,'[1]Extraction Tracking 2905'!D:D,1,FALSE)","v":"KIT.40257A"},null,1,"ML-R31",2,"ML-R312",40257,{"$f":"VLOOKUP(C352,[2]Feuil2!A:B,2,FALSE)","v":"BLK1-4"},"401BLK1-4",{"$f":"VLOOKUP(Regroupement!AI352,[2]Wip!AC:AC,1,FALSE)","v":"401BLK1-4"},{"$f":"VLOOKUP(AI352,[2]Wip!AC:AC,1,FALSE)","v":"401BLK1-4"}]
[null,350,"B1.4","6.20","ML-R31","KPO","P1","Buffer",null,"supports + planchers",10,"Logistiport",40495,136,1,"NA","ML-R31","MONTER_LA_PLATEFORME_DU_BRAS_D ACCOUPLEMENT_ET_CHEMINS_DE_CABLES_EN_BA2","KIT.40495A","KIT.40495B","KIT.40495C","OK","OK","OK","Mallette","6.20",{"$f":"VLOOKUP(S353,'[1]Extraction Tracking 2905'!D:D,1,FALSE)","v":"KIT.40495A"},null,1,"ML-R31",3,"ML-R313",40495,{"$f":"VLOOKUP(C353,[2]Feuil2!A:B,2,FALSE)","v":"BLK1-4"},"136BLK1-4",{"$f":"VLOOKUP(Regroupement!AI353,[2]Wip!AC:AC,1,FALSE)","v":"136BLK1-4"},{"$f":"VLOOKUP(AI353,[2]Wip!AC:AC,1,FALSE)","v":"136BLK1-4"}]
[null,351,"B1.4","6.20","ML-R32","KPO",null,"Buffer","80X60",null,10,"Logistiport",40195,116,1,"NA","ML-R32","REPRISE_PEINTURE_GENRATEUR_ET_MISE_EN_PLACE_DES_PETITS_BOUCHONS_CEINTURE","KIT.40195A",{"$error":"#N/A"},{"$error":"#N/A"},"OK","OK","OK",null,"6.20",{"$f":"VLOOKUP(S354,'[1]Extraction Tracking 2905'!D:D,1,FALSE)","v":{"$error":"#N/A"}},null,1,"ML-R32",1,"ML-R321",40195,{"$f":"VLOOKUP(C354,[2]Feuil2!A:B,2,FALSE)","v":"BLK1-4"},"116BLK1-4",{"$f":"VLOOKUP(Regroupement!AI354,[2]Wip!AC:AC,1,FALSE)","v":"116BLK1-4"},{"$f":"VLOOKUP(AI354,[2]Wip!AC:AC,1,FALSE)","v":"116BLK1-4"}]
[null,355,"B1.4","6.20","ML-R32","KPO",null,"Buffer","80X60",null,10,"Logistiport",30047,221,1,"NA","ML-R32","MONTAGE_DES_SONDES_DE_TEMPERATURE_DU_GENERATEUR_COTE_BA3","KIT.30047A","KIT.30047B","KIT.30047C","OK","OK","OK","Mallette","6.20",{"$f":"VLOOKUP(S355,'[1]Extraction Tracking 2905'!D:D,1,FALSE)","v":"KIT.30047A"},null,1,"ML-R32",{"$f":"IF(AD355=AD350,AE350+1,1)","v":1},"ML-R321",30047,{"$f":"VLOOKUP(C355,[2]Feuil2!A:B,2,FALSE)","v":"BLK1-4"},"221BLK1-4",{"$f":"VLOOKUP(Regroupement!AI355,[2]Wip!AC:AC,1,FALSE)","v":"221BLK1-4"},{"$f":"VLOOKUP(AI355,[2]Wip!AC:AC,1,FALSE)","v":"221BLK1-4"}]
["1/2 pal",356,"B1.4","6.20","ML-R32","KPO",null,"Buffer","80X60",null,10,"Logistiport",80311,111,1,"NA",{"$f":"E356","v":"ML-R32"},"CONNEXIONS_ELECTRIQUES_ENTRE_BLOC_1 1_NC1_ET_ANNEAU_TOURNANT","KIT.80311A",null,null,"OK","OK","OK","Mallette",{"$f":"D356","v":"6.20"},null,null,null,"ML-R32",2,"ML-R322",80311,{"$f":"VLOOKUP(C356,[2]Feuil2!A:B,2,FALSE)","v":"BLK1-4"},"111BLK1-4",{"$f":"VLOOKUP(Regroupement!AI356,[2]Wip!AC:AC,1,FALSE)","v":"111BLK1-4"},{"$f":"VLOOKUP(AI356,[2]Wip!AC:AC,1,FALSE)","v":"111BLK1-4"}]
[null,357,"B1.4","6.20","ML-R3,5","Idea",null,"Buffer Exterieur",null,"Fibres",7,"Chantenay",40189,131,1,"NA","ML-R3,5","POSE_DES_FILETS_DE_PROTECTION_ANTICHUTE_OBJET_ET_PERSONNE_SUR_PALE_2","KIT.40189A",null,null,"OK","OK",null,"Mallette","6.20",null,null,{"$f":"COUNTIF(M:M,M357)","v":1},"ML-R3,5",1,"ML-R3,51",40189,{"$f":"VLOOKUP(C357,[2]Feuil2!A:B,2,FALSE)","v":"BLK1-4"},"131BLK1-4",{"$f":"VLOOKUP(Regroupement!AI357,[2]Wip!AC:AC,1,FALSE)","v":"131BLK1-4"},{"$f":"VLOOKUP(AI357,[2]Wip!AC:AC,1,FALSE)","v":"131BLK1-4"}]
[null,358,"B1.4","6.20","ML-R40","Idea","P1","Buffer Exterieur","300x80","Fibres",7,"Chantenay",45050,461,1,"NA",{"$f":"E358","v":"ML-R40"},"ASSEMBLAGE_DES_PLAQUES_DE_FIXATION_DES_CAPOTS_DU_JOINT_DYNAMIQUE_X3_COTE_HUB","KIT.45050A","KIT.45050B","KIT.45050C","OK","OK",null,"Mallette",{"$f":"D358","v":"6.20"},{"$f":"VLOOKUP(S358,'[1]Extraction Tracking 2905'!D:D,1,FALSE)","v":"KIT.45050A"},null,1,"ML-R40",1,"ML-R401",45050,{"$f":"VLOOKUP(C358,[2]Feuil2!A:B,2,FALSE)","v":"BLK1-4"},"461BLK1-4",{"$f":"VLOOKUP(Regroupement!AI358,[2]Wip!AC:AC,1,FALSE)","v":"461BLK1-4"},{"$f":"VLOOKUP(AI358,[2]Wip!AC:AC,1,FALSE)","v":"461BLK1-4"}]
[null,359,"B1.4","6.30","ML-R30","KPO",null,"Buffer",null,"Recuperateur graisse et accessoires",10,"Logistiport",40169,431,1,"NA",{"$f":"E359","v":"ML-R30"},"MONTER_LE_COLLECTEUR_DE_GRAISSE_DU_ROULEMENT_ARRIERE","KIT.40169A","KIT.40169B","KIT.40169C","OK","OK","OK","Mallette",{"$f":"D359","v":"6.30"},{"$f":"VLOOKUP(S359,'[1]Extraction Tracking 2905'!D:D,1,FALSE)","v":"KIT.40169A"},null,1,"ML-R30",1,"ML-R301",40169,{"$f":"VLOOKUP(C359,[2]Feuil2!A:B,2,FALSE)","v":"BLK1-4"},"431BLK1-4",{"$f":"VLOOKUP(Regroupement!AI359,[2]Wip!AC:AC,1,FALSE)","v":"431BLK1-4"},{"$f":"VLOOKUP(AI359,[2]Wip!AC:AC,1,FALSE)","v":"431BLK1-4"}]
[null,360,"B1.4","6.30","ML-R35","Idea","P1","Buffer Exterieur","2,30X450","Structure C",10,"Logistiport",25669,1101,1,"NA",{"$f":"E360","v":"ML-R35"},"PRE-ASSEMBLAGE_DE_LA_STRUCTURE_C_MISE_EN_PLACE_DES_CALES","KIT.25669A","KIT.25669B","KIT.25669C","OK","OK",null,null,"6.30",{"$f":"VLOOKUP(S360,'[1]Extraction Tracking 2905'!D:D,1,FALSE)","v":"KIT.25669A"},null,1,"ML-R35",1,"ML-R351",25669,{"$f":"VLOOKUP(C360,[2]Feuil2!A:B,2,FALSE)","v":"BLK1-4"},"1101BLK1-4",{"$f":"VLOOKUP(Regroupement!AI360,[2]Wip!AC:AC,1,FALSE)","v":"1101BLK1-4"},{"$f":"VLOOKUP(AI360,[2]Wip!AC:AC,1,FALSE)","v":"1101BLK1-4"}]
[null,361,"B1.4","6.30","ML-R36","KPO",null,"Buffer","80X120 Visserie +CALES",null,10,"Logistiport",25670,1126,1,"NA","ML-R36","ASSEMBLAGE_DE_LA_STRUCTURE_C_SUPPORT_HELIPAD_SUR_LE_BC","KIT.25670A","KIT.25670B","KIT.25670C","OK","OK","OK","Mallette","6.30",{"$f":"VLOOKUP(S361,'[1]Extraction Tracking 2905'!D:D,1,FALSE)","v":"KIT.25670A"},null,1,"ML-R36",1,"ML-R361",25670,{"$f":"VLOOKUP(C361,[2]Feuil2!A:B,2,FALSE)","v":"BLK1-4"},"1126BLK1-4",{"$f":"VLOOKUP(Regroupement!AI361,[2]Wip!AC:AC,1,FALSE)","v":"1126BLK1-4"},{"$f":"VLOOKUP(AI361,[2]Wip!AC:AC,1,FALSE)","v":"1126BLK1-4"}]
[{"$error":"#N/A"},362,"B1.4","6.30","ML-R36","KPO",null,"Buffer","80X120 Visserie +CALES",null,10,"Logistiport",26090,1146,1,"NA","ML-R36","ASSEMBLAGE_DE_L HELIPAD_SUR_LA_STRUCTURE_ARRIERE",{"$f":"\"Mallette \"&M362","v":"Mallette 26090"},"KIT.26090B","KIT.26090C","OK","OK","OK","Mallette Uniquement","6.30",{"$f":"VLOOKUP(S362,'[1]Extraction Tracking 2905'!D:D,1,FALSE)","v":{"$error":"#N/A"}},null,1,"ML-R36",2,"ML-R362",26090,{"$f":"VLOOKUP(C362,[2]Feuil2!A:B,2,FALSE)","v":"BLK1-4"},"1146BLK1-4",{"$f":"VLOOKUP(Regroupement!AI362,[2]Wip!AC:AC,1,FALSE)","v":"1146BLK1-4"},{"$f":"VLOOKUP(AI362,[2]Wip!AC:AC,1,FALSE)","v":"1146BLK1-4"}]
[null,363,"B1.4","6.30","ML-R37,5","KPO",null,"Buffer",null,null,10,"Logistiport",26520,1231,1,"NA",{"$f":"E363","v":"ML-R37,5"},"CONNEXION_DES_TUBES_DE_REFROIDISSEMENT_DU_GENERATEUR_","KIT.26520A",null,null,"OK","OK","OK",null,{"$f":"D363","v":"6.30"},null,null,1,"ML-R37,5",1,"ML-R37,51",26520,{"$f":"VLOOKUP(C363,[2]Feuil2!A:B,2,FALSE)","v":"BLK1-4"},"1231BLK1-4",{"$f":"VLOOKUP(Regroupement!AI363,[2]Wip!AC:AC,1,FALSE)","v":"1231BLK1-4"},{"$f":"VLOOKUP(AI363,[2]Wip!AC:AC,1,FALSE)","v":"1231BLK1-4"}]
[null,364,"B1.4","6.30","ML-R37,5","KPO",null,"Buffer",null,"fixation",10,"Logistiport",25760,1211,2,"NA",{"$f":"E364","v":"ML-R37,5"},"MONTAGE_DU_SYSTEME_DE_REFRIGERATION_DU_GENERATEUR_SUR_L HELIPAD","KIT.25760A1",null,null,"OK","OK","OK",null,{"$f":"D364","v":"6.30"},null,null,2,"ML-R37,5",2,"ML-R37,52",25760,{"$f":"VLOOKUP(C364,[2]Feuil2!A:B,2,FALSE)","v":"BLK1-4"},"1211BLK1-4",{"$f":"VLOOKUP(Regroupement!AI364,[2]Wip!AC:AC,1,FALSE)","v":"1211BLK1-4"},{"$f":"VLOOKUP(AI364,[2]Wip!AC:AC,1,FALSE)","v":"1211BLK1-4"}]
[null,365,"B1.4","6.30","ML-R37","Support fournisseur",null,"Buffer Exterieur",null,"Cooling",10,"Chantenay",25760,1212,2,"NA",{"$f":"E365","v":"ML-R37"},"MONTAGE_DU_SYSTEME_DE_REFRIGERATION_DU_GENERATEUR_SUR_L HELIPAD","KIT.25760A2",{"$error":"#N/A"},{"$error":"#N/A"},"Support fournisseur","Support fournisseur","Support fournisseur","Mallette",{"$f":"D365","v":"6.30"},{"$f":"VLOOKUP(S365,'[1]Extraction Tracking 2905'!D:D,1,FALSE)","v":{"$error":"#N/A"}},null,2,"ML-R37",1,"ML-R371",25760,{"$f":"VLOOKUP(C365,[2]Feuil2!A:B,2,FALSE)","v":"BLK1-4"},"1212BLK1-4",{"$f":"VLOOKUP(Regroupement!AI365,[2]Wip!AC:AC,1,FALSE)","v":"1212BLK1-4"},{"$f":"VLOOKUP(AI365,[2]Wip!AC:AC,1,FALSE)","v":"1212BLK1-4"}]
[null,366,"B1.4","6.30","ML-R38","KPO",null,"Buffer","80X120",null,10,"Logistiport",40167,481,1,"NA","ML-R38","MONTER_LE_SOL_INFERIEUR_ENTRE_BI_ET_BA","KIT.40167A","KIT.40167B","KIT.40167C","OK","OK","OK","Mallette","6.30",{"$f":"VLOOKUP(S366,'[1]Extraction Tracking 2905'!D:D,1,FALSE)","v":"KIT.40167A"},null,1,"ML-R38",1,"ML-R381",40167,{"$f":"VLOOKUP(C366,[2]Feuil2!A:B,2,FALSE)","v":"BLK1-4"},"481BLK1-4",{"$f":"VLOOKUP(Regroupement!AI366,[2]Wip!AC:AC,1,FALSE)","v":"481BLK1-4"},{"$f":"VLOOKUP(AI366,[2]Wip!AC:AC,1,FALSE)","v":"481BLK1-4"}]
[null,367,"B1.4","6.30","ML-R38 SUP PBG46","KPO",null,"Buffer","80X120",null,10,"Logistiport",30219,1141,1,"NA","ML-R38 SUP PBG46","PREMONTAGE_BATI_INTERMEDIAIRE_MONTAGE_SUPPPORT_DE_FIXATION_PORTE_D ACCES_BI_BA","KIT.30219A SUP PBG46","KIT.30219B","KIT.30219C","OK","OK","OK","Mallette","6.30",{"$f":"VLOOKUP(S367,'[1]Extraction Tracking 2905'!D:D,1,FALSE)","v":{"$error":"#N/A"}},null,1,"ML-R38 SUP PBG46",1,"ML-R38 SUP PBG461",30219,{"$f":"VLOOKUP(C367,[2]Feuil2!A:B,2,FALSE)","v":"BLK1-4"},"1141BLK1-4",{"$f":"VLOOKUP(Regroupement!AI367,[2]Wip!AC:AC,1,FALSE)","v":"1141BLK1-4"},{"$f":"VLOOKUP(AI367,[2]Wip!AC:AC,1,FALSE)","v":"1141BLK1-4"}]
[null,368,"B1.4","6.30","ML-R39","KPO",null,"Buffer","80X120",null,10,"Logistiport",80322,1121,1,"NA","ML-R39","PRE-ASSEMBLAGE_DU_SYSTEME_DE_REFRIGERATION_DU_GENERATEUR_PLACER_LES_SUPPORTS_DE_FIXATION_DES_CABLES_ET_PRESSE_ETOUPE","KIT.80322A","KIT.80322B","KIT.80322C","OK","OK","OK","Mallette","6.30",{"$f":"VLOOKUP(S368,'[1]Extraction Tracking 2905'!D:D,1,FALSE)","v":"KIT.80322A"},null,1,"ML-R39",1,"ML-R391",80322,{"$f":"VLOOKUP(C368,[2]Feuil2!A:B,2,FALSE)","v":"BLK1-4"},"1121BLK1-4",{"$f":"VLOOKUP(Regroupement!AI368,[2]Wip!AC:AC,1,FALSE)","v":"1121BLK1-4"},{"$f":"VLOOKUP(AI368,[2]Wip!AC:AC,1,FALSE)","v":"1121BLK1-4"}]
[null,369,"B1.4","6.30","ML-R39","KPO",null,"Buffer","80X120",null,10,"Logistiport",80317,1241,1,"NA","ML-R39","ROUTAGE_ET_CONNEXION_FINALE_DES_CABLES_GND_ET_PARATONNERRE","KIT.80317A","KIT.80317B","KIT.80317C","OK","OK","OK","Mallette","6.30",{"$f":"VLOOKUP(S369,'[1]Extraction Tracking 2905'!D:D,1,FALSE)","v":"KIT.80317A"},null,1,"ML-R39",2,"ML-R392",80317,{"$f":"VLOOKUP(C369,[2]Feuil2!A:B,2,FALSE)","v":"BLK1-4"},"1241BLK1-4",{"$f":"VLOOKUP(Regroupement!AI369,[2]Wip!AC:AC,1,FALSE)","v":"1241BLK1-4"},{"$f":"VLOOKUP(AI369,[2]Wip!AC:AC,1,FALSE)","v":"1241BLK1-4"}]
[null,370,"B1.4","6.30","ML-R39","KPO",null,"Buffer","80X120",null,10,"Logistiport",80313,1321,1,"NA",{"$f":"E370","v":"ML-R39"},"ROUTAGE_ET_CONNEXION_DU_CABLE_D ACCELEROMETRE_A_LA_VIBROWEB_BOX","KIT.80313A",null,null,"OK","OK","OK",null,"6.30",null,null,1,"ML-R39",3,"ML-R393",80313,{"$f":"VLOOKUP(C370,[2]Feuil2!A:B,2,FALSE)","v":"BLK1-4"},"1321BLK1-4",{"$f":"VLOOKUP(Regroupement!AI370,[2]Wip!AC:AC,1,FALSE)","v":"1321BLK1-4"},{"$f":"VLOOKUP(AI370,[2]Wip!AC:AC,1,FALSE)","v":"1321BLK1-4"}]
[null,371,"B1.4","6.30","ML-R39","KPO",null,"Buffer",null,null,10,"Logistiport",80315,1361,1,"NA",{"$f":"E371","v":"ML-R39"},"ROUTAGE_ET_CONNEXION_FINALE_ELECTRIQUE_DE_LA_LIAISON_A_LA_TERRE_DE_LA_BALISE_MI_PLUS_PO","KIT.80315A",null,null,"OK","OK","OK",null,"6.30",null,null,1,"ML-R39",4,"ML-R394",80315,{"$f":"VLOOKUP(C371,[2]Feuil2!A:B,2,FALSE)","v":"BLK1-4"},"1361BLK1-4",{"$f":"VLOOKUP(Regroupement!AI371,[2]Wip!AC:AC,1,FALSE)","v":"1361BLK1-4"},{"$f":"VLOOKUP(AI371,[2]Wip!AC:AC,1,FALSE)","v":"1361BLK1-4"}]
[null,372,"B1.4","6.30","ML-R39","KPO",null,"Buffer",null,null,10,"Logistiport",80310,1341,1,"NA",{"$f":"E372","v":"ML-R39"},"CONNEXIONS_FINALES_DES_CABLEs_LUMIERES_LED_BATI_INTERMEDIAIRE_ET_BATI_AVANT","KIT.80310A",null,null,"OK","OK","OK",null,"6.30",null,null,null,"ML-R39",5,"ML-R395",80310,{"$f":"VLOOKUP(C372,[2]Feuil2!A:B,2,FALSE)","v":"BLK1-4"},"1341BLK1-4",{"$f":"VLOOKUP(Regroupement!AI372,[2]Wip!AC:AC,1,FALSE)","v":"1341BLK1-4"},{"$f":"VLOOKUP(AI372,[2]Wip!AC:AC,1,FALSE)","v":"1341BLK1-4"}]
[null,373,"B1.4","6.30","ML-R41","Idea","P1","Buffer Exterieur","100X400 X3","Fibres",7,"Chantenay",45090,1351,1,"NA",{"$f":"E373","v":"ML-R41"},"PREMONTER_DES_PROTECTIONS_EXTERIEURES_X3_ASSEMBLAGE_DES_CALES_DE_FRICTIONS_X6","KIT.45090A","KIT.45090B","KIT.45090C","OK","OK",null,"Mallette","6.30",{"$f":"VLOOKUP(S373,'[1]Extraction Tracking 2905'!D:D,1,FALSE)","v":"KIT.45090A"},null,{"$f":"COUNTIF(M:M,M373)","v":1},"ML-R41",1,"ML-R411",45090,{"$f":"VLOOKUP(C373,[2]Feuil2!A:B,2,FALSE)","v":"BLK1-4"},"1351BLK1-4",{"$f":"VLOOKUP(Regroupement!AI373,[2]Wip!AC:AC,1,FALSE)","v":"1351BLK1-4"},{"$f":"VLOOKUP(AI373,[2]Wip!AC:AC,1,FALSE)","v":"1351BLK1-4"}]
[null,374,"B1.4","6.30","ML-R41","Idea","P1","Buffer Exterieur","100X400 X3","Fibres",7,"Chantenay",45100,2311,1,"NA","ML-R41","ASSEMBLAGE_DES_PROTECTIONS_EXTERIEURES_A_LA_PLAQUE_DE_FIXATION_DU_JOINT_DYNAMIQUE_X3","KIT.45100A",null,null,"OK","OK",null,"Mallette","6.30",null,null,1,"ML-R41",2,"ML-R412",45100,{"$f":"VLOOKUP(C374,[2]Feuil2!A:B,2,FALSE)","v":"BLK1-4"},"2311BLK1-4",{"$f":"VLOOKUP(Regroupement!AI374,[2]Wip!AC:AC,1,FALSE)","v":"2311BLK1-4"},{"$f":"VLOOKUP(AI374,[2]Wip!AC:AC,1,FALSE)","v":"2311BLK1-4"}]
[null,375,"B1.4","6.30","ML-R43","Idea","P1","Buffer Exterieur","150 X 450 ","Fibres",7,"Chantenay",45070,1311,1,"NA","ML-R43","ASSEMBLAGE_DES_PLAQUES_DE_FIXATION_DES_CAPOTS_DU_JOINT_DYNAMIQUE_X3_COTE_GENERATEUR","KIT.45070A","KIT.45070B","KIT.45070C","OK","OK",null,"Mallette","6.30",{"$f":"VLOOKUP(S375,'[1]Extraction Tracking 2905'!D:D,1,FALSE)","v":"KIT.45070A"},null,1,"ML-R43",1,"ML-R431",45070,{"$f":"VLOOKUP(C375,[2]Feuil2!A:B,2,FALSE)","v":"BLK1-4"},"1311BLK1-4",{"$f":"VLOOKUP(Regroupement!AI375,[2]Wip!AC:AC,1,FALSE)","v":"1311BLK1-4"},{"$f":"VLOOKUP(AI375,[2]Wip!AC:AC,1,FALSE)","v":"1311BLK1-4"}]
[null,376,"B1.4","6.30","ML-R48","KPO",null,"Buffer","80X120",null,10,"Logistiport",45240,1381,1,"NA",{"$f":"E376","v":"ML-R48"},"PLACER_LE_SAC_DE_SECOURS_ET_LES_SYSTEMES_ANTI_CHUTES","KIT.45240A","KIT.45240B","KIT.45240C","OK","OK","OK","Mallette","6.30",{"$f":"VLOOKUP(S376,'[1]Extraction Tracking 2905'!D:D,1,FALSE)","v":"KIT.45240A"},null,1,"ML-R48",1,"ML-R481",45240,{"$f":"VLOOKUP(C376,[2]Feuil2!A:B,2,FALSE)","v":"BLK1-4"},"1381BLK1-4",{"$f":"VLOOKUP(Regroupement!AI376,[2]Wip!AC:AC,1,FALSE)","v":"1381BLK1-4"},{"$f":"VLOOKUP(AI376,[2]Wip!AC:AC,1,FALSE)","v":"1381BLK1-4"}]
["Classeur JBV Cedric.L",377,"B1.4","6.30","ML-R49","KPO",null,"Buffer","80X120",null,10,"Logistiport",45370,1391,1,"NA",{"$f":"E377","v":"ML-R49"},"PLACER_LA_SIGNALETIQUE_DE_SECURITE_DE_LA_NACELLE","KIT.45370A","KIT.45370B","KIT.45370C","OK","OK","OK",null,"6.30",{"$f":"VLOOKUP(S377,'[1]Extraction Tracking 2905'!D:D,1,FALSE)","v":"KIT.45370A"},null,1,"ML-R49",1,"ML-R491",45370,{"$f":"VLOOKUP(C377,[2]Feuil2!A:B,2,FALSE)","v":"BLK1-4"},"1391BLK1-4",{"$f":"VLOOKUP(Regroupement!AI377,[2]Wip!AC:AC,1,FALSE)","v":"1391BLK1-4"},{"$f":"VLOOKUP(AI377,[2]Wip!AC:AC,1,FALSE)","v":"1391BLK1-4"}]
[null,378,"B1.4","6.40","ML-R44","Idea","P1","Buffer Exterieur","80X400","Fibres",7,"Chantenay",45120,2421,1,"NA","ML-R44","ASSEMBLAGE_DES_PROTECTIONS_STATIQUES_DU_GENERATEUR","KIT.45120A","KIT.45120B","KIT.45120C","OK","OK",null,"Mallette","6.40",{"$f":"VLOOKUP(S378,'[1]Extraction Tracking 2905'!D:D,1,FALSE)","v":"KIT.45120A"},null,1,"ML-R44",1,"ML-R441",45120,{"$f":"VLOOKUP(C378,[2]Feuil2!A:B,2,FALSE)","v":"BLK1-4"},"2421BLK1-4",{"$f":"VLOOKUP(Regroupement!AI378,[2]Wip!AC:AC,1,FALSE)","v":"2421BLK1-4"},{"$f":"VLOOKUP(AI378,[2]Wip!AC:AC,1,FALSE)","v":"2421BLK1-4"}]
[null,379,"B1.4","6.40","ML-R45","KPO",null,"Buffer","80X120",null,10,"Logistiport",45252,2501,1,"NA","ML-R45","MONTAGE_DE_L ESCALIER_D ACCES_AU_SPINNER","KIT.45252A","KIT.45252B","KIT.45252C","Palette perdue",null,null,"Mallette","6.40",{"$f":"VLOOKUP(S379,'[1]Extraction Tracking 2905'!D:D,1,FALSE)","v":"KIT.45252A"},null,1,"ML-R45",1,"ML-R451",45252,{"$f":"VLOOKUP(C379,[2]Feuil2!A:B,2,FALSE)","v":"BLK1-4"},"2501BLK1-4",{"$f":"VLOOKUP(Regroupement!AI379,[2]Wip!AC:AC,1,FALSE)","v":"2501BLK1-4"},{"$f":"VLOOKUP(AI379,[2]Wip!AC:AC,1,FALSE)","v":"2501BLK1-4"}]
[null,380,"B1.4","6.40","ML-R45","KPO",null,"Buffer",null,null,10,"Logistiport",80321,2111,1,"NA","ML-R45","Cablage Helipad et Coolers apres l assemblage","KIT.80321A",null,null,"Palette perdue",null,null,null,"6.40",null,null,1,"ML-R45",2,"ML-R452",80321,{"$f":"VLOOKUP(C380,[2]Feuil2!A:B,2,FALSE)","v":"BLK1-4"},"2111BLK1-4",{"$f":"VLOOKUP(Regroupement!AI380,[2]Wip!AC:AC,1,FALSE)","v":"2111BLK1-4"},{"$f":"VLOOKUP(AI380,[2]Wip!AC:AC,1,FALSE)","v":"2111BLK1-4"}]
[null,null,"B1.4","6.40","ML-R45","KPO",null,"Buffer",null,null,10,"Logistiport",80307,null,1,null,"ML-R45",null,"Mallette 80307",null,null,null,null,null,"Mallette Uniquement","6.40",null,null,1,"ML-R45",3,"ML-R453",80307,{"$f":"VLOOKUP(C381,[2]Feuil2!A:B,2,FALSE)","v":"BLK1-4"},"BLK1-4",{"$f":"VLOOKUP(Regroupement!AI381,[2]Wip!AC:AC,1,FALSE)","v":{"$error":"#N/A"}},{"$f":"VLOOKUP(AI381,[2]Wip!AC:AC,1,FALSE)","v":{"$error":"#N/A"}}]
[null,381,"B1.4","6.40","ML-R46","Idea","P1","Buffer Exterieur","170X600","Fibres",7,"Chantenay",45250,2531,1,"NA","ML-R46","MONTAGE_DES_SECTEURS_ARRIERES_DU_DEFLECTEUR_X3","KIT.45250A","KIT.45250B","KIT.45250C","OK","OK",null,"Mallette","6.40",{"$f":"VLOOKUP(S382,'[1]Extraction Tracking 2905'!D:D,1,FALSE)","v":"KIT.45250A"},null,1,"ML-R46",{"$f":"IF(AD382=AD380,AE380+1,1)","v":1},"ML-R461",45250,{"$f":"VLOOKUP(C382,[2]Feuil2!A:B,2,FALSE)","v":"BLK1-4"},"2531BLK1-4",{"$f":"VLOOKUP(Regroupement!AI382,[2]Wip!AC:AC,1,FALSE)","v":"2531BLK1-4"},{"$f":"VLOOKUP(AI382,[2]Wip!AC:AC,1,FALSE)","v":"2531BLK1-4"}]
[null,382,"B1.4","6.40","ML-R50","KPO",null,"Buffer","80X120",null,10,"Logistiport",45420,2561,1,"NA",{"$f":"E383","v":"ML-R50"},"MONTAGE_DES_POINTS_D ANCRAGE_DU_GENERATEUR","KIT.45420A","KIT.45420B","KIT.45420C","OK","OK","OK","Mallette",{"$f":"D383","v":"6.40"},{"$f":"VLOOKUP(S383,'[1]Extraction Tracking 2905'!D:D,1,FALSE)","v":"KIT.45420A"},null,1,"ML-R50",1,"ML-R501",45420,{"$f":"VLOOKUP(C383,[2]Feuil2!A:B,2,FALSE)","v":"BLK1-4"},"2561BLK1-4",{"$f":"VLOOKUP(Regroupement!AI383,[2]Wip!AC:AC,1,FALSE)","v":"2561BLK1-4"},{"$f":"VLOOKUP(AI383,[2]Wip!AC:AC,1,FALSE)","v":"2561BLK1-4"}]
["a traiter PP",383,"B1.4","6.60","ML-R47","KPO",null,"Buffer","80X120",null,10,"Logistiport","Safety",10,1,"NA","ML-R47","PREPARATION_ET_MISE_EN_PLACE_DES_BACHES_ET_GRAISSAGE_DES_COURONNES_DENTEES_DE_PITCH_X3","KIT.SAETY",{"$error":"#N/A"},{"$error":"#N/A"},"OK","OK","OK",null,"6.60",{"$f":"VLOOKUP(S384,'[1]Extraction Tracking 2905'!D:D,1,FALSE)","v":{"$error":"#N/A"}},null,1,"ML-R47",1,"ML-R471","Safety",{"$f":"VLOOKUP(C384,[2]Feuil2!A:B,2,FALSE)","v":"BLK1-4"},"10BLK1-4",{"$f":"VLOOKUP(Regroupement!AI384,[2]Wip!AC:AC,1,FALSE)","v":"10BLK1-4"},{"$f":"VLOOKUP(AI384,[2]Wip!AC:AC,1,FALSE)","v":"10BLK1-4"}]
[null,384,"B1.4","6.60","ML-R51","KPO",null,"Buffer",null,null,10,"Logistiport",45225,4151,1,"NA","ML-R51","DEMONTAGE_DEMI_PROTIERES_PLEXI_LOCKING_PIN_PLUS_REMONTAGE_DES_PORTIERES_DEFINITIVES","KIT.45225A",null,null,"OK","OK","OK",null,"6.60",null,null,1,"ML-R51",1,"ML-R511",45225,{"$f":"VLOOKUP(C385,[2]Feuil2!A:B,2,FALSE)","v":"BLK1-4"},"4151BLK1-4",{"$f":"VLOOKUP(Regroupement!AI385,[2]Wip!AC:AC,1,FALSE)","v":"4151BLK1-4"},{"$f":"VLOOKUP(AI385,[2]Wip!AC:AC,1,FALSE)","v":"4151BLK1-4"}]
[null,386,"B1.4","6.60","ML-R51","KPO",null,"Buffer",null,null,10,"Logistiport",80323,4111,1,"NA",{"$f":"E386","v":"ML-R51"},"CABLAGE_NC1_NC2_DEVICE_FIRE","KIT.80323A",null,null,"OK","OK","OK",null,{"$f":"D386","v":"6.60"},null,null,1,{"$f":"Q386","v":"ML-R51"},2,{"$f":"AD386&AE386","v":"ML-R512"},{"$f":"M386","v":80323},{"$f":"VLOOKUP(C386,[2]Feuil2!A:B,2,FALSE)","v":"BLK1-4"},"4111BLK1-4",{"$f":"VLOOKUP(Regroupement!AI386,[2]Wip!AC:AC,1,FALSE)","v":"4111BLK1-4"},{"$f":"VLOOKUP(AI386,[2]Wip!AC:AC,1,FALSE)","v":"4111BLK1-4"}]
[null,385,"B1.4","6.60","ML-R51,5","KPO",null,"Buffer",null,null,10,"Logistiport",80325,3511,1,"NA",{"$f":"E387","v":"ML-R51,5"},"MISE_A_LONGUEUR_SERTISSAGE_ET_CONNEXIONS_DES_CABLES_DE_PUISSANCES","KIT.80325A",null,null,"OK","OK","OK","MALLETTE",{"$f":"D387","v":"6.60"},null,null,1,"ML-R51,5",1,"ML-R51,51",80325,{"$f":"VLOOKUP(C387,[2]Feuil2!A:B,2,FALSE)","v":"BLK1-4"},{"$f":"N387&AH387","v":"3511BLK1-4"},{"$f":"VLOOKUP(Regroupement!AI387,[2]Wip!AC:AC,1,FALSE)","v":"3511BLK1-4"},{"$f":"VLOOKUP(AI387,[2]Wip!AC:AC,1,FALSE)","v":"3511BLK1-4"}]
[{"$error":"#N/A"},387,"B1.4","6.60","ML-R52","KPO",null,"Buffer",null,null,10,"Logistiport",45430,4311,1,"NA",{"$f":"E388","v":"ML-R52"},"KIT Site","KIT.45430A",null,null,"Palette perdue",null,null,"Sachet de visserie",{"$f":"D388","v":"6.60"},null,null,1,"ML-R52",{"$f":"IF(AD388=AD386,AE386+1,1)","v":1},"ML-R521",45430,{"$f":"VLOOKUP(C388,[2]Feuil2!A:B,2,FALSE)","v":"BLK1-4"},"4311BLK1-4",{"$f":"VLOOKUP(Regroupement!AI388,[2]Wip!AC:AC,1,FALSE)","v":"4311BLK1-4"},{"$f":"VLOOKUP(AI388,[2]Wip!AC:AC,1,FALSE)","v":"4311BLK1-4"}]
[null,388,"B1.4","6.60","ML-R52","KPO",null,"Buffer",null,null,10,"Logistiport",26358,4206,1,"NA",{"$f":"E389","v":"ML-R52"},"Premontage du verrou sur la porte inferieure-Suppression de lâ\u0080\u0099Ã©tape 6 et deplacement de bloc et de station","KIT.26358A",null,null,"Palette perdue",null,null,"Mallette","6.60",null,null,1,"ML-R52",{"$f":"IF(AD389=AD388,AE388+1,1)","v":2},"ML-R522",26358,{"$f":"VLOOKUP(C389,[2]Feuil2!A:B,2,FALSE)","v":"BLK1-4"},"4206BLK1-4",{"$f":"VLOOKUP(Regroupement!AI389,[2]Wip!AC:AC,1,FALSE)","v":"4206BLK1-4"},{"$f":"VLOOKUP(AI389,[2]Wip!AC:AC,1,FALSE)","v":"4206BLK1-4"}]
[null,389,"B1.4",null,"Glycole",null,null,"Buffer",null,null,null,null,35320,1251,1,"NA","Glycole","Remplir le circuit de refroidissement du generateur-mettre en marche le systeme avec la pression de fon","KIT.35320A",null,null,null,null,null,null,0,null,null,1,"Glycole",1,"Glycole1",35320,{"$f":"VLOOKUP(C390,[2]Feuil2!A:B,2,FALSE)","v":"BLK1-4"},"1251BLK1-4",{"$f":"VLOOKUP(Regroupement!AI390,[2]Wip!AC:AC,1,FALSE)","v":"1251BLK1-4"},{"$f":"VLOOKUP(AI390,[2]Wip!AC:AC,1,FALSE)","v":"1251BLK1-4"}]
[null,null,null,null,null,null,null,null,null,null,null,null,null,null,null,null,null,null,null,null,null,null,null,null,null,null,null,null,null,null,null,null,null,{"$f":"VLOOKUP(C391,[2]Feuil2!A:B,2,FALSE)","v":{"$error":"#N/A"}},{"$error":"#N/A"},{"$f":"VLOOKUP(Regroupement!AI391,[2]Wip!AC:AC,1,FALSE)","v":{"$error":"#N/A"}},{"$f":"VLOOKUP(AI391,[2]Wip!AC:AC,1,FALSE)","v":{"$error":"#N/A"}}]
[null,null,null,null,null,null,null,null,null,null,null,null,null,null,null,null,null,null,null,null,null,null,null,null,null,null,null,null,null,null,null,null,null,{"$f":"VLOOKUP(C392,[2]Feuil2!A:B,2,FALSE)","v":{"$error":"#N/A"}},{"$error":"#N/A"},{"$f":"VLOOKUP(Regroupement!AI392,[2]Wip!AC:AC,1,FALSE)","v":{"$error":"#N/A"}},{"$f":"VLOOKUP(AI392,[2]Wip!AC:AC,1,FALSE)","v":{"$error":"#N/A"}}]
[null,null,null,null,null,null,null,null,null,null,null,null,null,null,null,null,null,null,null,null,null,null,null,null,null,null,null,null,null,null,null,null,null,{"$f":"VLOOKUP(C393,[2]Feuil2!A:B,2,FALSE)","v":{"$error":"#N/A"}},{"$error":"#N/A"},{"$f":"VLOOKUP(Regroupement!AI393,[2]Wip!AC:AC,1,FALSE)","v":{"$error":"#N/A"}},{"$f":"VLOOKUP(AI393,[2]Wip!AC:AC,1,FALSE)","v":{"$error":"#N/A"}}]
[null,null,null,null,null,null,null,null,null,null,null,null,null,null,null,null,null,null,null,null,null,null,null,null,null,null,null,null,null,null,null,null,null,{"$f":"VLOOKUP(C394,[2]Feuil2!A:B,2,FALSE)","v":{"$error":"#N/A"}},{"$error":"#N/A"},{"$f":"VLOOKUP(Regroupement!AI394,[2]Wip!AC:AC,1,FALSE)","v":{"$error":"#N/A"}},{"$f":"VLOOKUP(AI394,[2]Wip!AC:AC,1,FALSE)","v":{"$error":"#N/A"}}]
[null,null,null,null,null,null,null,null,null,null,null,null,null,null,null,null,null,null,null,null,null,null,null,null,null,null,null,null,null,null,null,null,null,{"$f":"VLOOKUP(C395,[2]Feuil2!A:B,2,FALSE)","v":{"$error":"#N/A"}},{"$error":"#N/A"},{"$f":"VLOOKUP(Regroupement!AI395,[2]Wip!AC:AC,1,FALSE)","v":{"$error":"#N/A"}},{"$f":"VLOOKUP(AI395,[2]Wip!AC:AC,1,FALSE)","v":{"$error":"#N/A"}}]
[null,null,null,null,null,null,null,null,null,null,null,null,null,null,null,null,null,null,null,null,null,null,null,null,null,null,null,null,null,null,null,null,null,{"$f":"VLOOKUP(C396,[2]Feuil2!A:B,2,FALSE)","v":{"$error":"#N/A"}},{"$error":"#N/A"},{"$f":"VLOOKUP(Regroupement!AI396,[2]Wip!AC:AC,1,FALSE)","v":{"$error":"#N/A"}},{"$f":"VLOOKUP(AI396,[2]Wip!AC:AC,1,FALSE)","v":{"$error":"#N/A"}}]
[null,null,null,null,null,null,null,null,null,null,null,null,null,null,null,null,null,null,null,null,null,null,null,null,null,null,null,null,null,null,null,null,null,{"$f":"VLOOKUP(C397,[2]Feuil2!A:B,2,FALSE)","v":{"$error":"#N/A"}},{"$error":"#N/A"},{"$f":"VLOOKUP(Regroupement!AI397,[2]Wip!AC:AC,1,FALSE)","v":{"$error":"#N/A"}},{"$f":"VLOOKUP(AI397,[2]Wip!AC:AC,1,FALSE)","v":{"$error":"#N/A"}}]

{"sheet":"Reg Camion","index":4,"n_rows":49,"n_cols":6,"rows_kept":49,"cut":false,"hidden":false,"merged":[]}
["Kit","Reg","Numéro Kit Camion","Numéro Regroupement Camion",null,"Aléatoire"]
[{"$f":"IF(LTRU!D2=\"\",\"FIN\",LTRU!D2)","v":"A"},{"$f":"IF(A2=\"FIN\",\"0\",INDEX(Regroupement!E:E,MATCH(A2,LTRU!D:D,0)))","v":"N°LIVRABLE"},1,1,null,{"$f":"RANDBETWEEN(1,Random!C2)","v":{"$error":"#NUM!"}}]
[{"$f":"IF(LTRU!D3=\"\",\"FIN\",LTRU!D3)","v":"A"},{"$f":"IF(A3=\"FIN\",\"0\",INDEX(Regroupement!E:E,MATCH(A3,LTRU!D:D,0)))","v":"N°LIVRABLE"},{"$f":"IF(A3<>\"FIN\",C2+1,0)","v":2},{"$f":"IF(A3=\"FIN\",\"0\",IF(B3=B2,D2,D2+1))","v":1}]
[{"$f":"IF(LTRU!D4=\"\",\"FIN\",LTRU!D4)","v":"A"},{"$f":"IF(A4=\"FIN\",\"0\",INDEX(Regroupement!E:E,MATCH(A4,LTRU!D:D,0)))","v":"N°LIVRABLE"},{"$f":"IF(A4<>\"FIN\",C3+1,0)","v":3},1]
[{"$f":"IF(LTRU!D5=\"\",\"FIN\",LTRU!D5)","v":"A"},{"$f":"IF(A5=\"FIN\",\"0\",INDEX(Regroupement!E:E,MATCH(A5,LTRU!D:D,0)))","v":"N°LIVRABLE"},4,1]
[{"$f":"IF(LTRU!D6=\"\",\"FIN\",LTRU!D6)","v":"A"},{"$f":"IF(A6=\"FIN\",\"0\",INDEX(Regroupement!E:E,MATCH(A6,LTRU!D:D,0)))","v":"N°LIVRABLE"},5,1]
[{"$f":"IF(LTRU!D7=\"\",\"FIN\",LTRU!D7)","v":"A"},{"$f":"IF(A7=\"FIN\",\"0\",INDEX(Regroupement!E:E,MATCH(A7,LTRU!D:D,0)))","v":"N°LIVRABLE"},6,1]
[{"$f":"IF(LTRU!D8=\"\",\"FIN\",LTRU!D8)","v":"A"},{"$f":"IF(A8=\"FIN\",\"0\",INDEX(Regroupement!E:E,MATCH(A8,LTRU!D:D,0)))","v":"N°LIVRABLE"},7,1]
[{"$f":"IF(LTRU!D9=\"\",\"FIN\",LTRU!D9)","v":"A"},{"$f":"IF(A9=\"FIN\",\"0\",INDEX(Regroupement!E:E,MATCH(A9,LTRU!D:D,0)))","v":"N°LIVRABLE"},8,1]
[{"$f":"IF(LTRU!D10=\"\",\"FIN\",LTRU!D10)","v":"A"},{"$f":"IF(A10=\"FIN\",\"0\",INDEX(Regroupement!E:E,MATCH(A10,LTRU!D:D,0)))","v":"N°LIVRABLE"},9,1]
[{"$f":"IF(LTRU!D11=\"\",\"FIN\",LTRU!D11)","v":"A"},{"$f":"IF(A11=\"FIN\",\"0\",INDEX(Regroupement!E:E,MATCH(A11,LTRU!D:D,0)))","v":"N°LIVRABLE"},10,1]
[{"$f":"IF(LTRU!D12=\"\",\"FIN\",LTRU!D12)","v":"A"},{"$f":"IF(A12=\"FIN\",\"0\",INDEX(Regroupement!E:E,MATCH(A12,LTRU!D:D,0)))","v":"N°LIVRABLE"},11,1]
[{"$f":"IF(LTRU!D13=\"\",\"FIN\",LTRU!D13)","v":"A"},{"$f":"IF(A13=\"FIN\",\"0\",INDEX(Regroupement!E:E,MATCH(A13,LTRU!D:D,0)))","v":"N°LIVRABLE"},12,1]
[{"$f":"IF(LTRU!D14=\"\",\"FIN\",LTRU!D14)","v":"A"},{"$f":"IF(A14=\"FIN\",\"0\",INDEX(Regroupement!E:E,MATCH(A14,LTRU!D:D,0)))","v":"N°LIVRABLE"},13,1]
[{"$f":"IF(LTRU!D15=\"\",\"FIN\",LTRU!D15)","v":"A"},{"$f":"IF(A15=\"FIN\",\"0\",INDEX(Regroupement!E:E,MATCH(A15,LTRU!D:D,0)))","v":"N°LIVRABLE"},14,1]
[{"$f":"IF(LTRU!D16=\"\",\"FIN\",LTRU!D16)","v":"A"},{"$f":"IF(A16=\"FIN\",\"0\",INDEX(Regroupement!E:E,MATCH(A16,LTRU!D:D,0)))","v":"N°LIVRABLE"},15,1]
[{"$f":"IF(LTRU!D17=\"\",\"FIN\",LTRU!D17)","v":"A"},{"$f":"IF(A17=\"FIN\",\"0\",INDEX(Regroupement!E:E,MATCH(A17,LTRU!D:D,0)))","v":"N°LIVRABLE"},16,1]
[{"$f":"IF(LTRU!D18=\"\",\"FIN\",LTRU!D18)","v":"FIN"},{"$f":"IF(A18=\"FIN\",\"0\",INDEX(Regroupement!E:E,MATCH(A18,LTRU!D:D,0)))","v":"0"},0,"0"]
[{"$f":"IF(LTRU!D19=\"\",\"FIN\",LTRU!D19)","v":"FIN"},{"$f":"IF(A19=\"FIN\",\"0\",INDEX(Regroupement!E:E,MATCH(A19,LTRU!D:D,0)))","v":"0"},0,"0"]
[{"$f":"IF(LTRU!D20=\"\",\"FIN\",LTRU!D20)","v":"FIN"},{"$f":"IF(A20=\"FIN\",\"0\",INDEX(Regroupement!E:E,MATCH(A20,LTRU!D:D,0)))","v":"0"},0,"0"]
[{"$f":"IF(LTRU!D21=\"\",\"FIN\",LTRU!D21)","v":"FIN"},{"$f":"IF(A21=\"FIN\",\"0\",INDEX(Regroupement!E:E,MATCH(A21,LTRU!D:D,0)))","v":"0"},0,"0"]
[{"$f":"IF(LTRU!D22=\"\",\"FIN\",LTRU!D22)","v":"FIN"},{"$f":"IF(A22=\"FIN\",\"0\",INDEX(Regroupement!E:E,MATCH(A22,LTRU!D:D,0)))","v":"0"},0,"0"]
[{"$f":"IF(LTRU!D23=\"\",\"FIN\",LTRU!D23)","v":"FIN"},{"$f":"IF(A23=\"FIN\",\"0\",INDEX(Regroupement!E:E,MATCH(A23,LTRU!D:D,0)))","v":"0"},0,"0"]
[{"$f":"IF(LTRU!D24=\"\",\"FIN\",LTRU!D24)","v":"FIN"},{"$f":"IF(A24=\"FIN\",\"0\",INDEX(Regroupement!E:E,MATCH(A24,LTRU!D:D,0)))","v":"0"},0,"0"]
[{"$f":"IF(LTRU!D25=\"\",\"FIN\",LTRU!D25)","v":"FIN"},{"$f":"IF(A25=\"FIN\",\"0\",INDEX(Regroupement!E:E,MATCH(A25,LTRU!D:D,0)))","v":"0"},0,{"$f":"IF(A25=\"FIN\",\"0\",IF(B25=B24,D24,D24+1))","v":"0"}]
[{"$f":"IF(LTRU!D26=\"\",\"FIN\",LTRU!D26)","v":"FIN"},{"$f":"IF(A26=\"FIN\",\"0\",INDEX(Regroupement!E:E,MATCH(A26,LTRU!D:D,0)))","v":"0"},0,{"$f":"IF(A26=\"FIN\",\"0\",IF(B26=B25,D25,D25+1))","v":"0"}]
[{"$f":"IF(LTRU!D27=\"\",\"FIN\",LTRU!D27)","v":"FIN"},{"$f":"IF(A27=\"FIN\",\"0\",INDEX(Regroupement!E:E,MATCH(A27,LTRU!D:D,0)))","v":"0"},0,"0"]
[{"$f":"IF(LTRU!D28=\"\",\"FIN\",LTRU!D28)","v":"FIN"},{"$f":"IF(A28=\"FIN\",\"0\",INDEX(Regroupement!E:E,MATCH(A28,LTRU!D:D,0)))","v":"0"},0,"0"]
[{"$f":"IF(LTRU!D29=\"\",\"FIN\",LTRU!D29)","v":"FIN"},{"$f":"IF(A29=\"FIN\",\"0\",INDEX(Regroupement!E:E,MATCH(A29,LTRU!D:D,0)))","v":"0"},0,"0"]
[{"$f":"IF(LTRU!D30=\"\",\"FIN\",LTRU!D30)","v":"FIN"},{"$f":"IF(A30=\"FIN\",\"0\",INDEX(Regroupement!E:E,MATCH(A30,LTRU!D:D,0)))","v":"0"},0,"0"]
[{"$f":"IF(LTRU!D31=\"\",\"FIN\",LTRU!D31)","v":"FIN"},{"$f":"IF(A31=\"FIN\",\"0\",INDEX(Regroupement!E:E,MATCH(A31,LTRU!D:D,0)))","v":"0"},0,"0"]
[{"$f":"IF(LTRU!D32=\"\",\"FIN\",LTRU!D32)","v":"FIN"},{"$f":"IF(A32=\"FIN\",\"0\",INDEX(Regroupement!E:E,MATCH(A32,LTRU!D:D,0)))","v":"0"},0,"0"]
[{"$f":"IF(LTRU!D33=\"\",\"FIN\",LTRU!D33)","v":"FIN"},{"$f":"IF(A33=\"FIN\",\"0\",INDEX(Regroupement!E:E,MATCH(A33,LTRU!D:D,0)))","v":"0"},0,"0"]
[{"$f":"IF(LTRU!D34=\"\",\"FIN\",LTRU!D34)","v":"FIN"},{"$f":"IF(A34=\"FIN\",\"0\",INDEX(Regroupement!E:E,MATCH(A34,LTRU!D:D,0)))","v":"0"},0,"0"]
[{"$f":"IF(LTRU!D35=\"\",\"FIN\",LTRU!D35)","v":"FIN"},{"$f":"IF(A35=\"FIN\",\"0\",INDEX(Regroupement!E:E,MATCH(A35,LTRU!D:D,0)))","v":"0"},0,"0"]
[{"$f":"IF(LTRU!D36=\"\",\"FIN\",LTRU!D36)","v":"FIN"},{"$f":"IF(A36=\"FIN\",\"0\",INDEX(Regroupement!E:E,MATCH(A36,LTRU!D:D,0)))","v":"0"},0,"0"]
[{"$f":"IF(LTRU!D37=\"\",\"FIN\",LTRU!D37)","v":"FIN"},{"$f":"IF(A37=\"FIN\",\"0\",INDEX(Regroupement!E:E,MATCH(A37,LTRU!D:D,0)))","v":"0"},0,"0"]
[{"$f":"IF(LTRU!D38=\"\",\"FIN\",LTRU!D38)","v":"FIN"},{"$f":"IF(A38=\"FIN\",\"0\",INDEX(Regroupement!E:E,MATCH(A38,LTRU!D:D,0)))","v":"0"},0,"0"]
[{"$f":"IF(LTRU!D39=\"\",\"FIN\",LTRU!D39)","v":"FIN"},{"$f":"IF(A39=\"FIN\",\"0\",INDEX(Regroupement!E:E,MATCH(A39,LTRU!D:D,0)))","v":"0"},0,"0"]
[{"$f":"IF(LTRU!D40=\"\",\"FIN\",LTRU!D40)","v":"FIN"},{"$f":"IF(A40=\"FIN\",\"0\",INDEX(Regroupement!E:E,MATCH(A40,LTRU!D:D,0)))","v":"0"},0,"0"]
[{"$f":"IF(LTRU!D41=\"\",\"FIN\",LTRU!D41)","v":"FIN"},{"$f":"IF(A41=\"FIN\",\"0\",INDEX(Regroupement!E:E,MATCH(A41,LTRU!D:D,0)))","v":"0"},0,"0"]
[{"$f":"IF(LTRU!D42=\"\",\"FIN\",LTRU!D42)","v":"FIN"},{"$f":"IF(A42=\"FIN\",\"0\",INDEX(Regroupement!E:E,MATCH(A42,LTRU!D:D,0)))","v":"0"},0,"0"]
[{"$f":"IF(LTRU!D43=\"\",\"FIN\",LTRU!D43)","v":"FIN"},{"$f":"IF(A43=\"FIN\",\"0\",INDEX(Regroupement!E:E,MATCH(A43,LTRU!D:D,0)))","v":"0"},0,"0"]
[{"$f":"IF(LTRU!D44=\"\",\"FIN\",LTRU!D44)","v":"FIN"},{"$f":"IF(A44=\"FIN\",\"0\",INDEX(Regroupement!E:E,MATCH(A44,LTRU!D:D,0)))","v":"0"},0,"0"]
[{"$f":"IF(LTRU!D45=\"\",\"FIN\",LTRU!D45)","v":"FIN"},{"$f":"IF(A45=\"FIN\",\"0\",INDEX(Regroupement!E:E,MATCH(A45,LTRU!D:D,0)))","v":"0"},0,"0"]
[{"$f":"IF(LTRU!D46=\"\",\"FIN\",LTRU!D46)","v":"FIN"},{"$f":"IF(A46=\"FIN\",\"0\",INDEX(Regroupement!E:E,MATCH(A46,LTRU!D:D,0)))","v":"0"},0,"0"]
[{"$f":"IF(LTRU!D47=\"\",\"FIN\",LTRU!D47)","v":"FIN"},{"$f":"IF(A47=\"FIN\",\"0\",INDEX(Regroupement!E:E,MATCH(A47,LTRU!D:D,0)))","v":"0"},0,"0"]
[{"$f":"IF(LTRU!D48=\"\",\"FIN\",LTRU!D48)","v":"FIN"},{"$f":"IF(A48=\"FIN\",\"0\",INDEX(Regroupement!E:E,MATCH(A48,LTRU!D:D,0)))","v":"0"},0,"0"]
[{"$f":"IF(LTRU!D49=\"\",\"FIN\",LTRU!D49)","v":"FIN"},{"$f":"IF(A49=\"FIN\",\"0\",INDEX(Regroupement!E:E,MATCH(A49,LTRU!D:D,0)))","v":"0"},0,"0"]

{"sheet":"Conso moyen","index":5,"n_rows":17,"n_cols":7,"rows_kept":17,"cut":false,"hidden":false,"merged":[[1,3,2,3],[1,4,2,4],[3,2,5,2],[3,3,5,3],[3,4,5,4],[9,2,10,2],[9,0,10,0],[1,0,2,0],[3,0,5,0],[1,2,2,2]]}
["Regroupement","OP seq","Temps Phys","Temps Info","Temps Total","Commentaires"]
["ML-R37,5",26520,"01:25:00"]
[null,25760]
["ML-R51",45225,"04:17:00",null,null,"104W1345P060"]
[null,80325,null,null,null,"51 phys 52 conso"]
[null,80323,null,null,null,"Compter x2"]
["ML-R38",40167,"00:53:00"]
["ML-R17","35055A","14:48:00",null,null,"447W1835P002","50 et non 53 conso"]
["ML.R18",35112,"03:44:00"]
["B1-06",25190,"13:20:00"]
[null,25200]
[]
[]
[]
[]
["Moyenne / kit",null,{"$f":"SUM(C2:C11)/10","v":"03:50:42"}]
["Moyenne / regroupement",null,{"$f":"SUM(C2:C11)/6","v":"06:24:30"}]