{"text_format":"1","workbook":"xlsx","n_sheets":4,"sheets":["Liste","Annexe C original","Dupont Etienne","Données"],"not_rendered":{"charts":0,"images":1,"macros":1,"external_links":0,"defined_names":2,"comments":0,"pivot_tables":0},"unopened":[],"bounds":{"document_bytes":16777216,"sheet_cells":100000,"rows_first":2000,"rows_last":500,"rows_between":2000,"halvings":0,"cell_chars":16384,"cell_head_chars":4096},"cells_cut":0,"cells_raw":0,"read":"whole","date_system":"1900"}

{"sheet":"Liste","index":0,"n_rows":6,"n_cols":14,"rows_kept":6,"cut":false,"hidden":false,"merged":[]}
["Nom","Prénom","Date de naissance ","Âge ","Groupe d'âge","Plan A","Plan V","Plan B","Plan C","Groupe diagnostic","Date d'inscription","Date de cessation ","Nouveaux","Cessés"]
["Dion","Céline","1969-03-18",51,"18-64 ans",0,0,0,0,0,"2021-01-10","2021-03-17","",""]
["Dupont","Etienne","1956-03-11",65,"65 ans et +",1,2,3,4,5,"2021-03-20","2021-04-22","","x"]
["LUC","Albert","1955-03-13",66,"65 ans et +",1,2,"","","","","","x","x"]
["Untel","Monsieur","1980-02-02",41,"18-64 ans","","","","","","2021-03-17","","","x"]
["Chose","Madame","1960-01-01",61,"18-64 ans",0,0,0,0,0,"2021-03-17","2021-04-02","","x"]

{"sheet":"Annexe C original","index":1,"n_rows":39,"n_cols":24,"rows_kept":39,"cut":false,"hidden":false,"merged":[[0,2,0,7],[22,3,22,6],[23,3,23,6],[2,6,2,7],[3,6,3,7],[2,4,2,5],[3,4,3,5],[2,2,2,3],[3,2,3,3],[4,2,4,7],[5,6,5,7],[5,2,5,3],[5,4,5,5],[32,1,32,7],[25,1,25,7],[38,6,38,7],[6,6,6,7],[8,2,8,7],[27,2,27,3],[9,2,9,7],[6,2,6,3],[6,4,6,5],[12,1,12,7],[20,1,20,7],[7,2,7,7],[10,5,10,7],[39,1,39,7],[40,0,40,8],[29,5,29,7],[27,5,27,7],[28,5,28,7],[28,2,28,3],[38,2,38,4],[34,4,34,6],[34,1,34,2],[35,1,35,2],[36,1,36,2],[35,4,35,7],[30,5,30,7],[30,2,30,3],[36,3,36,7],[29,2,29,3]]}
[null,null,"Fiche d'inscription d'oxygénothérapie\nInstallation et livraison d'oxygène"]
[]
[null,"Nom : ",null,null,"Prénom : ",null,null,null,null,null,"Nom","Prénom","DDN","Âge ","Groupe d'âge","Plan V","Plan A","Plan B","Plan C","Groupe diagnostic","Date d'inscription","Date de cessation ","Nouveaux","Cessés"]
[null,"Date de naissance : ",null,null,"Téléphone : ",null,null,null,null,null,{"$f":"IF(C3<>\"\",C3,\"\")","v":""},{"$f":"IF(G3<>\"\",G3,\"\")","v":""},{"$f":"IF(C4<>\"\",C4,\"\")","v":""},{"$f":"DATEDIF(M4,TODAY(),\"Y\")","v":{"$error":"#VALUE!"}},{"$f":"IF(N4<18,\"0-17 ans\",IF(N4<65,\"18-64 ans\",IF(N4>64,\"65 ans et +\",\"\")))","v":{"$error":"#VALUE!"}},{"$f":"IF(C15<>\"\",C15,\"\")","v":""},{"$f":"IF(C16<>\"\",C16,\"\")","v":""},{"$f":"IF(C17<>\"\",C17,\"\")","v":""},{"$f":"IF(C18<>\"\",C18,\"\")","v":""},{"$f":"IF(D36<>\"\",D36,\"\")","v":""},{"$f":"IF(G39<>\"\",G39,\"\")","v":""},{"$f":"IF(C30<>\"\",C30,\"\")","v":""},{"$f":"IF(U4>=K6,\"x\",\"\")","v":"x"},{"$f":"IF(V4>=K6,\"x\",\"\")","v":"x"}]
[null,"Adresse : "]
[null,"Ville : ",null,null,"Code Postal : ",null,null,null,null,null,"2021-04-01"]
[null,"Personne contact : ",null,null,"Téléphone : "]
[null,"Résidence : "]
[null,"Agent Payeur : "]
[null,"RLS : "]
[null,"Période du : ",null,"au"]
[]
[null,"Matériel à installer"]
[]
[null,"Plan V ",null,null,"Cylindre","ML6 (dodu) "]
[null,"Plan A ",null,null,null,"LBE (mini) "]
[null,"Plan B ",null,null,null,"AD "]
[null,"Plan C ",null,null,null,"AE "]
[null,null,null,null,null,"M "]
[]
[null,"Fournitures (matériel)"]
[]
[null,"Location cylindre : ",null,"Connecteur d'O2 pour CPAP/BiPAP : "]
[null,"Matériel accessoire : ",null,"Valve anti-retour : "]
[]
[null,"Modifications"]
[]
[null,"Date du déménagement : ",null,null,"Adresse : "]
[null,"Changement du plan : ",null,null,"Ville : "]
[null,"Date de cessation : ",null,null,"Code postal : "]
[null,"Récupération : ",null,null,"Téléphone : "]
[]
[null,"Prescription"]
[]
[null,"Débit O2 ajusté par CLSC (prescription) : ",null,null,"Nombre d'heures d'utilisation par jour : "]
[null,"Diagnostic : "]
[null,"Commentaires : "]
[]
[null,"Évalué par : ",null,null,null,"Date : "]

{"sheet":"Dupont Etienne","index":2,"n_rows":39,"n_cols":24,"rows_kept":39,"cut":false,"hidden":false,"merged":[[39,1,39,7],[40,0,40,8],[35,1,35,2],[35,4,35,7],[36,1,36,2],[36,3,36,7],[38,2,38,4],[38,6,38,7],[29,2,29,3],[29,5,29,7],[30,2,30,3],[30,5,30,7],[32,1,32,7],[34,1,34,2],[34,4,34,6],[22,3,22,6],[23,3,23,6],[25,1,25,7],[27,2,27,3],[27,5,27,7],[28,2,28,3],[28,5,28,7],[7,2,7,7],[8,2,8,7],[9,2,9,7],[10,5,10,7],[12,1,12,7],[20,1,20,7],[4,2,4,7],[5,2,5,3],[5,4,5,5],[5,6,5,7],[6,2,6,3],[6,4,6,5],[6,6,6,7],[0,2,0,7],[2,2,2,3],[2,4,2,5],[2,6,2,7],[3,2,3,3],[3,4,3,5],[3,6,3,7]]}
[null,null,"Fiche d'inscription d'oxygénothérapie\nInstallation et livraison d'oxygène"]
[]
[null,"Nom : ","Dupont",null,"Prénom : ",null,"Etienne",null,null,null,"Nom","Prénom","DDN","Âge ","Groupe d'âge","Plan V","Plan A","Plan B","Plan C","Groupe diagnostic","Date d'inscription","Date de cessation ","Nouveaux","Cessés"]
[null,"Date de naissance : ","1956-03-11",null,"Téléphone : ",null,102030405,null,null,null,{"$f":"IF(C3<>\"\",C3,\"\")","v":"Dupont"},{"$f":"IF(G3<>\"\",G3,\"\")","v":"Etienne"},{"$f":"IF(C4<>\"\",C4,\"\")","v":"1956-03-11"},{"$f":"DATEDIF(M4,TODAY(),\"Y\")","v":65},{"$f":"IF(N4<18,\"0-17 ans\",IF(N4<65,\"18-64 ans\",IF(N4>64,\"65 ans et +\",\"\")))","v":"65 ans et +"},{"$f":"IF(C15<>\"\",C15,\"\")","v":1},{"$f":"IF(C16<>\"\",C16,\"\")","v":2},{"$f":"IF(C17<>\"\",C17,\"\")","v":3},{"$f":"IF(C18<>\"\",C18,\"\")","v":4},{"$f":"IF(D36<>\"\",D36,\"\")","v":5},{"$f":"IF(G39<>\"\",G39,\"\")","v":"2021-03-20"},{"$f":"IF(C30<>\"\",C30,\"\")","v":"2021-04-22"},{"$f":"IF(U4>=K6,\"x\",\"\")","v":""},{"$f":"IF(V4>=K6,\"x\",\"\")","v":"x"}]
[null,"Adresse : ","RUE DES PINS"]
[null,"Ville : ","ZER",null,"Code Postal : ",null,234567,null,null,null,"2021-04-01"]
[null,"Personne contact : ","DUPONT MARIE",null,"Téléphone : ",null,30400505]
[null,"Résidence : ","RESIDENCES DES PINS"]
[null,"Agent Payeur : ","Assurances privées"]
[null,"RLS : ","Trois-Rivières"]
[null,"Période du : ","2021-04-21","au","2022-05-21"]
[]
[null,"Matériel à installer"]
[]
[null,"Plan V ",1,null,"Cylindre","ML6 (dodu) ",5]
[null,"Plan A ",2,null,null,"LBE (mini) ",6]
[null,"Plan B ",3,null,null,"AD ",7]
[null,"Plan C ",4,null,null,"AE ",8]
[null,null,null,null,null,"M ",9]
[]
[null,"Fournitures (matériel)"]
[]
[null,"Location cylindre : ","Oui","Connecteur d'O2 pour CPAP/BiPAP : ",null,null,null,"Oui"]
[null,"Matériel accessoire : ","Oui","Valve anti-retour : ",null,null,null,"Oui"]
[]
[null,"Modifications"]
[]
[null,"Date du déménagement : ","2022-03-12",null,"Adresse : ","NOUVELLE"]
[null,"Changement du plan : ","ZZZ",null,"Ville : ","ZER"]
[null,"Date de cessation : ","2021-04-22",null,"Code postal : ","EED"]
[null,"Récupération : ","Domicile",null,"Téléphone : ",23456789]
[]
[null,"Prescription"]
[]
[null,"Débit O2 ajusté par CLSC (prescription) : ",null,1,"Nombre d'heures d'utilisation par jour : ",null,null,3]
[null,"Diagnostic : ",null,5]
[null,"Commentaires : ",null,"COMMENTAIRE"]
[]
[null,"Évalué par : ","MOUER",null,null,"Date : ","2021-03-20"]

{"sheet":"Données","index":3,"n_rows":20,"n_cols":7,"rows_kept":20,"cut":false,"hidden":true,"merged":[]}
[]
[null,null,1,null,"Oui",null,"CLSC"]
["Anciens Combattants",null,2,null,"Non",null,"Domicile"]
["Assurances privées",null,3]
["Bureau de services Québec (BSQ) (CLE)",null,4]
["CNESST",null,5]
["Hors norme",null,6]
["Palliatifs",null,7]
["Régulier selon le PNOD",null,8]
["SAAQ",null,9]
[null,null,10]
[null,null,11]
["Arthabaska-et-de-l'Érable",null,12]
["Bécancour-Nicolet-Yamaska",null,13]
["Drummond",null,14]
["Vallée-de-la-Batiscan"]
["Maskinongé"]
["Trois-Rivières"]
["Centre-de-la-Mauricie"]
["Haut Saint-Maurice"]