{"text_format":"1","workbook":"xlsx","n_sheets":4,"sheets":["Interventions","CLASSES_DATAS","ELEVES_DATAS","Feuil1"],"not_rendered":{"charts":0,"images":0,"macros":1,"external_links":0,"defined_names":4,"comments":0,"pivot_tables":0},"unopened":[],"bounds":{"document_bytes":16777216,"sheet_cells":100000,"rows_first":2000,"rows_last":500,"rows_between":2000,"halvings":0,"cell_chars":16384,"cell_head_chars":4096},"cells_cut":0,"cells_raw":0,"read":"whole","date_system":"1900"}

{"sheet":"Interventions","index":0,"n_rows":106,"n_cols":15,"rows_kept":106,"cut":false,"hidden":false,"merged":[[0,1,0,2],[1,1,1,2]]}
[null,null,null,null,null,null,"Écran cassé - D3E",null,"Don 3e",null,"Restitution tablette"]
[null,null,null,null,null,null,"Autre",null,"Attribution E.C.A"]
[]
[]
["Nom & Prénom","Classe","N° Tablette","NVX N° Tablette","Motif présenté","Date","MDP Elève","Date dossier Pyth.","INC PYTH","Date Recup. ECON.","Date Retour ECON.","Manipulations","Remarques","Sortie D3E Pytheas","Restitution / Prêt"]
[{"$f":"IFERROR(INDEX(Eleves_datas[NOM],MATCH(Interventions!C6,pnd_inv,0)),\"\")&\" \"&IFERROR(INDEX(Eleves_datas[PRENOM],MATCH(Interventions!C6,pnd_inv,0)),\"\")","v":"RANDRIAMISAINA Anja"},{"$f":"IFERROR(INDEX(Eleves_datas[CLASSE],MATCH(Interventions!C6,pnd_inv,0)),\"\")","v":"3 C"},"17T000132"]
[{"$f":"IFERROR(INDEX(Eleves_datas[NOM],MATCH(Interventions!C7,pnd_inv,0)),\"\")&\" \"&IFERROR(INDEX(Eleves_datas[PRENOM],MATCH(Interventions!C7,pnd_inv,0)),\"\")","v":" "},{"$f":"IFERROR(INDEX(Eleves_datas[CLASSE],MATCH(Interventions!C7,pnd_inv,0)),\"\")","v":""}]
[{"$f":"IFERROR(INDEX(Eleves_datas[NOM],MATCH(Interventions!C8,pnd_inv,0)),\"\")&\" \"&IFERROR(INDEX(Eleves_datas[PRENOM],MATCH(Interventions!C8,pnd_inv,0)),\"\")","v":" "},{"$f":"IFERROR(INDEX(Eleves_datas[CLASSE],MATCH(Interventions!C8,pnd_inv,0)),\"\")","v":""}]
[{"$f":"IFERROR(INDEX(Eleves_datas[NOM],MATCH(Interventions!C9,pnd_inv,0)),\"\")&\" \"&IFERROR(INDEX(Eleves_datas[PRENOM],MATCH(Interventions!C9,pnd_inv,0)),\"\")","v":" "},{"$f":"IFERROR(INDEX(Eleves_datas[CLASSE],MATCH(Interventions!C9,pnd_inv,0)),\"\")","v":""}]
[{"$f":"IFERROR(INDEX(Eleves_datas[NOM],MATCH(Interventions!C10,pnd_inv,0)),\"\")&\" \"&IFERROR(INDEX(Eleves_datas[PRENOM],MATCH(Interventions!C10,pnd_inv,0)),\"\")","v":" "},{"$f":"IFERROR(INDEX(Eleves_datas[CLASSE],MATCH(Interventions!C10,pnd_inv,0)),\"\")","v":""}]
[{"$f":"IFERROR(INDEX(Eleves_datas[NOM],MATCH(Interventions!C11,pnd_inv,0)),\"\")&\" \"&IFERROR(INDEX(Eleves_datas[PRENOM],MATCH(Interventions!C11,pnd_inv,0)),\"\")","v":" "},{"$f":"IFERROR(INDEX(Eleves_datas[CLASSE],MATCH(Interventions!C11,pnd_inv,0)),\"\")","v":""}]
[{"$f":"IFERROR(INDEX(Eleves_datas[NOM],MATCH(Interventions!C12,pnd_inv,0)),\"\")&\" \"&IFERROR(INDEX(Eleves_datas[PRENOM],MATCH(Interventions!C12,pnd_inv,0)),\"\")","v":" "},{"$f":"IFERROR(INDEX(Eleves_datas[CLASSE],MATCH(Interventions!C12,pnd_inv,0)),\"\")","v":""}]
[{"$f":"IFERROR(INDEX(Eleves_datas[NOM],MATCH(Interventions!C13,pnd_inv,0)),\"\")&\" \"&IFERROR(INDEX(Eleves_datas[PRENOM],MATCH(Interventions!C13,pnd_inv,0)),\"\")","v":" "},{"$f":"IFERROR(INDEX(Eleves_datas[CLASSE],MATCH(Interventions!C13,pnd_inv,0)),\"\")","v":""}]
[{"$f":"IFERROR(INDEX(Eleves_datas[NOM],MATCH(Interventions!C14,pnd_inv,0)),\"\")&\" \"&IFERROR(INDEX(Eleves_datas[PRENOM],MATCH(Interventions!C14,pnd_inv,0)),\"\")","v":" "},{"$f":"IFERROR(INDEX(Eleves_datas[CLASSE],MATCH(Interventions!C14,pnd_inv,0)),\"\")","v":""}]
[{"$f":"IFERROR(INDEX(Eleves_datas[NOM],MATCH(Interventions!C15,pnd_inv,0)),\"\")&\" \"&IFERROR(INDEX(Eleves_datas[PRENOM],MATCH(Interventions!C15,pnd_inv,0)),\"\")","v":" "},{"$f":"IFERROR(INDEX(Eleves_datas[CLASSE],MATCH(Interventions!C15,pnd_inv,0)),\"\")","v":""}]
[{"$f":"IFERROR(INDEX(Eleves_datas[NOM],MATCH(Interventions!C16,pnd_inv,0)),\"\")&\" \"&IFERROR(INDEX(Eleves_datas[PRENOM],MATCH(Interventions!C16,pnd_inv,0)),\"\")","v":" "},{"$f":"IFERROR(INDEX(Eleves_datas[CLASSE],MATCH(Interventions!C16,pnd_inv,0)),\"\")","v":""}]
[{"$f":"IFERROR(INDEX(Eleves_datas[NOM],MATCH(Interventions!C17,pnd_inv,0)),\"\")&\" \"&IFERROR(INDEX(Eleves_datas[PRENOM],MATCH(Interventions!C17,pnd_inv,0)),\"\")","v":" "},{"$f":"IFERROR(INDEX(Eleves_datas[CLASSE],MATCH(Interventions!C17,pnd_inv,0)),\"\")","v":""}]
[{"$f":"IFERROR(INDEX(Eleves_datas[NOM],MATCH(Interventions!C18,pnd_inv,0)),\"\")&\" \"&IFERROR(INDEX(Eleves_datas[PRENOM],MATCH(Interventions!C18,pnd_inv,0)),\"\")","v":" "},{"$f":"IFERROR(INDEX(Eleves_datas[CLASSE],MATCH(Interventions!C18,pnd_inv,0)),\"\")","v":""}]
[{"$f":"IFERROR(INDEX(Eleves_datas[NOM],MATCH(Interventions!C19,pnd_inv,0)),\"\")&\" \"&IFERROR(INDEX(Eleves_datas[PRENOM],MATCH(Interventions!C19,pnd_inv,0)),\"\")","v":" "},{"$f":"IFERROR(INDEX(Eleves_datas[CLASSE],MATCH(Interventions!C19,pnd_inv,0)),\"\")","v":""}]
[{"$f":"IFERROR(INDEX(Eleves_datas[NOM],MATCH(Interventions!C20,pnd_inv,0)),\"\")&\" \"&IFERROR(INDEX(Eleves_datas[PRENOM],MATCH(Interventions!C20,pnd_inv,0)),\"\")","v":" "},{"$f":"IFERROR(INDEX(Eleves_datas[CLASSE],MATCH(Interventions!C20,pnd_inv,0)),\"\")","v":""}]
[{"$f":"IFERROR(INDEX(Eleves_datas[NOM],MATCH(Interventions!C21,pnd_inv,0)),\"\")&\" \"&IFERROR(INDEX(Eleves_datas[PRENOM],MATCH(Interventions!C21,pnd_inv,0)),\"\")","v":" "},{"$f":"IFERROR(INDEX(Eleves_datas[CLASSE],MATCH(Interventions!C21,pnd_inv,0)),\"\")","v":""}]
[{"$f":"IFERROR(INDEX(Eleves_datas[NOM],MATCH(Interventions!C22,pnd_inv,0)),\"\")&\" \"&IFERROR(INDEX(Eleves_datas[PRENOM],MATCH(Interventions!C22,pnd_inv,0)),\"\")","v":" "},{"$f":"IFERROR(INDEX(Eleves_datas[CLASSE],MATCH(Interventions!C22,pnd_inv,0)),\"\")","v":""}]
[{"$f":"IFERROR(INDEX(Eleves_datas[NOM],MATCH(Interventions!C23,pnd_inv,0)),\"\")&\" \"&IFERROR(INDEX(Eleves_datas[PRENOM],MATCH(Interventions!C23,pnd_inv,0)),\"\")","v":" "},{"$f":"IFERROR(INDEX(Eleves_datas[CLASSE],MATCH(Interventions!C23,pnd_inv,0)),\"\")","v":""}]
[{"$f":"IFERROR(INDEX(Eleves_datas[NOM],MATCH(Interventions!C24,pnd_inv,0)),\"\")&\" \"&IFERROR(INDEX(Eleves_datas[PRENOM],MATCH(Interventions!C24,pnd_inv,0)),\"\")","v":" "},{"$f":"IFERROR(INDEX(Eleves_datas[CLASSE],MATCH(Interventions!C24,pnd_inv,0)),\"\")","v":""}]
[{"$f":"IFERROR(INDEX(Eleves_datas[NOM],MATCH(Interventions!C25,pnd_inv,0)),\"\")&\" \"&IFERROR(INDEX(Eleves_datas[PRENOM],MATCH(Interventions!C25,pnd_inv,0)),\"\")","v":" "},{"$f":"IFERROR(INDEX(Eleves_datas[CLASSE],MATCH(Interventions!C25,pnd_inv,0)),\"\")","v":""}]
[{"$f":"IFERROR(INDEX(Eleves_datas[NOM],MATCH(Interventions!C26,pnd_inv,0)),\"\")&\" \"&IFERROR(INDEX(Eleves_datas[PRENOM],MATCH(Interventions!C26,pnd_inv,0)),\"\")","v":" "},{"$f":"IFERROR(INDEX(Eleves_datas[CLASSE],MATCH(Interventions!C26,pnd_inv,0)),\"\")","v":""}]
[{"$f":"IFERROR(INDEX(Eleves_datas[NOM],MATCH(Interventions!C27,pnd_inv,0)),\"\")&\" \"&IFERROR(INDEX(Eleves_datas[PRENOM],MATCH(Interventions!C27,pnd_inv,0)),\"\")","v":" "},{"$f":"IFERROR(INDEX(Eleves_datas[CLASSE],MATCH(Interventions!C27,pnd_inv,0)),\"\")","v":""}]
[{"$f":"IFERROR(INDEX(Eleves_datas[NOM],MATCH(Interventions!C28,pnd_inv,0)),\"\")&\" \"&IFERROR(INDEX(Eleves_datas[PRENOM],MATCH(Interventions!C28,pnd_inv,0)),\"\")","v":" "},{"$f":"IFERROR(INDEX(Eleves_datas[CLASSE],MATCH(Interventions!C28,pnd_inv,0)),\"\")","v":""}]
[{"$f":"IFERROR(INDEX(Eleves_datas[NOM],MATCH(Interventions!C29,pnd_inv,0)),\"\")&\" \"&IFERROR(INDEX(Eleves_datas[PRENOM],MATCH(Interventions!C29,pnd_inv,0)),\"\")","v":" "},{"$f":"IFERROR(INDEX(Eleves_datas[CLASSE],MATCH(Interventions!C29,pnd_inv,0)),\"\")","v":""}]
[{"$f":"IFERROR(INDEX(Eleves_datas[NOM],MATCH(Interventions!C30,pnd_inv,0)),\"\")&\" \"&IFERROR(INDEX(Eleves_datas[PRENOM],MATCH(Interventions!C30,pnd_inv,0)),\"\")","v":" "},{"$f":"IFERROR(INDEX(Eleves_datas[CLASSE],MATCH(Interventions!C30,pnd_inv,0)),\"\")","v":""}]
[{"$f":"IFERROR(INDEX(Eleves_datas[NOM],MATCH(Interventions!C31,pnd_inv,0)),\"\")&\" \"&IFERROR(INDEX(Eleves_datas[PRENOM],MATCH(Interventions!C31,pnd_inv,0)),\"\")","v":" "},{"$f":"IFERROR(INDEX(Eleves_datas[CLASSE],MATCH(Interventions!C31,pnd_inv,0)),\"\")","v":""}]
[{"$f":"IFERROR(INDEX(Eleves_datas[NOM],MATCH(Interventions!C32,pnd_inv,0)),\"\")&\" \"&IFERROR(INDEX(Eleves_datas[PRENOM],MATCH(Interventions!C32,pnd_inv,0)),\"\")","v":" "},{"$f":"IFERROR(INDEX(Eleves_datas[CLASSE],MATCH(Interventions!C32,pnd_inv,0)),\"\")","v":""}]
[{"$f":"IFERROR(INDEX(Eleves_datas[NOM],MATCH(Interventions!C33,pnd_inv,0)),\"\")&\" \"&IFERROR(INDEX(Eleves_datas[PRENOM],MATCH(Interventions!C33,pnd_inv,0)),\"\")","v":" "},{"$f":"IFERROR(INDEX(Eleves_datas[CLASSE],MATCH(Interventions!C33,pnd_inv,0)),\"\")","v":""}]
[{"$f":"IFERROR(INDEX(Eleves_datas[NOM],MATCH(Interventions!C34,pnd_inv,0)),\"\")&\" \"&IFERROR(INDEX(Eleves_datas[PRENOM],MATCH(Interventions!C34,pnd_inv,0)),\"\")","v":" "},{"$f":"IFERROR(INDEX(Eleves_datas[CLASSE],MATCH(Interventions!C34,pnd_inv,0)),\"\")","v":""}]
[{"$f":"IFERROR(INDEX(Eleves_datas[NOM],MATCH(Interventions!C35,pnd_inv,0)),\"\")&\" \"&IFERROR(INDEX(Eleves_datas[PRENOM],MATCH(Interventions!C35,pnd_inv,0)),\"\")","v":" "},{"$f":"IFERROR(INDEX(Eleves_datas[CLASSE],MATCH(Interventions!C35,pnd_inv,0)),\"\")","v":""}]
[{"$f":"IFERROR(INDEX(Eleves_datas[NOM],MATCH(Interventions!C36,pnd_inv,0)),\"\")&\" \"&IFERROR(INDEX(Eleves_datas[PRENOM],MATCH(Interventions!C36,pnd_inv,0)),\"\")","v":" "},{"$f":"IFERROR(INDEX(Eleves_datas[CLASSE],MATCH(Interventions!C36,pnd_inv,0)),\"\")","v":""}]
[{"$f":"IFERROR(INDEX(Eleves_datas[NOM],MATCH(Interventions!C37,pnd_inv,0)),\"\")&\" \"&IFERROR(INDEX(Eleves_datas[PRENOM],MATCH(Interventions!C37,pnd_inv,0)),\"\")","v":" "},{"$f":"IFERROR(INDEX(Eleves_datas[CLASSE],MATCH(Interventions!C37,pnd_inv,0)),\"\")","v":""}]
[{"$f":"IFERROR(INDEX(Eleves_datas[NOM],MATCH(Interventions!C38,pnd_inv,0)),\"\")&\" \"&IFERROR(INDEX(Eleves_datas[PRENOM],MATCH(Interventions!C38,pnd_inv,0)),\"\")","v":" "},{"$f":"IFERROR(INDEX(Eleves_datas[CLASSE],MATCH(Interventions!C38,pnd_inv,0)),\"\")","v":""}]
[{"$f":"IFERROR(INDEX(Eleves_datas[NOM],MATCH(Interventions!C39,pnd_inv,0)),\"\")&\" \"&IFERROR(INDEX(Eleves_datas[PRENOM],MATCH(Interventions!C39,pnd_inv,0)),\"\")","v":" "},{"$f":"IFERROR(INDEX(Eleves_datas[CLASSE],MATCH(Interventions!C39,pnd_inv,0)),\"\")","v":""}]
[{"$f":"IFERROR(INDEX(Eleves_datas[NOM],MATCH(Interventions!C40,pnd_inv,0)),\"\")&\" \"&IFERROR(INDEX(Eleves_datas[PRENOM],MATCH(Interventions!C40,pnd_inv,0)),\"\")","v":" "},{"$f":"IFERROR(INDEX(Eleves_datas[CLASSE],MATCH(Interventions!C40,pnd_inv,0)),\"\")","v":""}]
[{"$f":"IFERROR(INDEX(Eleves_datas[NOM],MATCH(Interventions!C41,pnd_inv,0)),\"\")&\" \"&IFERROR(INDEX(Eleves_datas[PRENOM],MATCH(Interventions!C41,pnd_inv,0)),\"\")","v":" "},{"$f":"IFERROR(INDEX(Eleves_datas[CLASSE],MATCH(Interventions!C41,pnd_inv,0)),\"\")","v":""}]
[{"$f":"IFERROR(INDEX(Eleves_datas[NOM],MATCH(Interventions!C42,pnd_inv,0)),\"\")&\" \"&IFERROR(INDEX(Eleves_datas[PRENOM],MATCH(Interventions!C42,pnd_inv,0)),\"\")","v":" "},{"$f":"IFERROR(INDEX(Eleves_datas[CLASSE],MATCH(Interventions!C42,pnd_inv,0)),\"\")","v":""}]
[{"$f":"IFERROR(INDEX(Eleves_datas[NOM],MATCH(Interventions!C43,pnd_inv,0)),\"\")&\" \"&IFERROR(INDEX(Eleves_datas[PRENOM],MATCH(Interventions!C43,pnd_inv,0)),\"\")","v":" "},{"$f":"IFERROR(INDEX(Eleves_datas[CLASSE],MATCH(Interventions!C43,pnd_inv,0)),\"\")","v":""}]
[{"$f":"IFERROR(INDEX(Eleves_datas[NOM],MATCH(Interventions!C44,pnd_inv,0)),\"\")&\" \"&IFERROR(INDEX(Eleves_datas[PRENOM],MATCH(Interventions!C44,pnd_inv,0)),\"\")","v":" "},{"$f":"IFERROR(INDEX(Eleves_datas[CLASSE],MATCH(Interventions!C44,pnd_inv,0)),\"\")","v":""}]
[{"$f":"IFERROR(INDEX(Eleves_datas[NOM],MATCH(Interventions!C45,pnd_inv,0)),\"\")&\" \"&IFERROR(INDEX(Eleves_datas[PRENOM],MATCH(Interventions!C45,pnd_inv,0)),\"\")","v":" "},{"$f":"IFERROR(INDEX(Eleves_datas[CLASSE],MATCH(Interventions!C45,pnd_inv,0)),\"\")","v":""}]
[{"$f":"IFERROR(INDEX(Eleves_datas[NOM],MATCH(Interventions!C46,pnd_inv,0)),\"\")&\" \"&IFERROR(INDEX(Eleves_datas[PRENOM],MATCH(Interventions!C46,pnd_inv,0)),\"\")","v":" "},{"$f":"IFERROR(INDEX(Eleves_datas[CLASSE],MATCH(Interventions!C46,pnd_inv,0)),\"\")","v":""}]
[{"$f":"IFERROR(INDEX(Eleves_datas[NOM],MATCH(Interventions!C47,pnd_inv,0)),\"\")&\" \"&IFERROR(INDEX(Eleves_datas[PRENOM],MATCH(Interventions!C47,pnd_inv,0)),\"\")","v":" "},{"$f":"IFERROR(INDEX(Eleves_datas[CLASSE],MATCH(Interventions!C47,pnd_inv,0)),\"\")","v":""}]
[{"$f":"IFERROR(INDEX(Eleves_datas[NOM],MATCH(Interventions!C48,pnd_inv,0)),\"\")&\" \"&IFERROR(INDEX(Eleves_datas[PRENOM],MATCH(Interventions!C48,pnd_inv,0)),\"\")","v":" "},{"$f":"IFERROR(INDEX(Eleves_datas[CLASSE],MATCH(Interventions!C48,pnd_inv,0)),\"\")","v":""}]
[{"$f":"IFERROR(INDEX(Eleves_datas[NOM],MATCH(Interventions!C49,pnd_inv,0)),\"\")&\" \"&IFERROR(INDEX(Eleves_datas[PRENOM],MATCH(Interventions!C49,pnd_inv,0)),\"\")","v":" "},{"$f":"IFERROR(INDEX(Eleves_datas[CLASSE],MATCH(Interventions!C49,pnd_inv,0)),\"\")","v":""}]
[{"$f":"IFERROR(INDEX(Eleves_datas[NOM],MATCH(Interventions!C50,pnd_inv,0)),\"\")&\" \"&IFERROR(INDEX(Eleves_datas[PRENOM],MATCH(Interventions!C50,pnd_inv,0)),\"\")","v":" "},{"$f":"IFERROR(INDEX(Eleves_datas[CLASSE],MATCH(Interventions!C50,pnd_inv,0)),\"\")","v":""}]
[{"$f":"IFERROR(INDEX(Eleves_datas[NOM],MATCH(Interventions!C51,pnd_inv,0)),\"\")&\" \"&IFERROR(INDEX(Eleves_datas[PRENOM],MATCH(Interventions!C51,pnd_inv,0)),\"\")","v":" "},{"$f":"IFERROR(INDEX(Eleves_datas[CLASSE],MATCH(Interventions!C51,pnd_inv,0)),\"\")","v":""}]
[{"$f":"IFERROR(INDEX(Eleves_datas[NOM],MATCH(Interventions!C52,pnd_inv,0)),\"\")&\" \"&IFERROR(INDEX(Eleves_datas[PRENOM],MATCH(Interventions!C52,pnd_inv,0)),\"\")","v":" "},{"$f":"IFERROR(INDEX(Eleves_datas[CLASSE],MATCH(Interventions!C52,pnd_inv,0)),\"\")","v":""}]
[{"$f":"IFERROR(INDEX(Eleves_datas[NOM],MATCH(Interventions!C53,pnd_inv,0)),\"\")&\" \"&IFERROR(INDEX(Eleves_datas[PRENOM],MATCH(Interventions!C53,pnd_inv,0)),\"\")","v":" "},{"$f":"IFERROR(INDEX(Eleves_datas[CLASSE],MATCH(Interventions!C53,pnd_inv,0)),\"\")","v":""}]
[{"$f":"IFERROR(INDEX(Eleves_datas[NOM],MATCH(Interventions!C54,pnd_inv,0)),\"\")&\" \"&IFERROR(INDEX(Eleves_datas[PRENOM],MATCH(Interventions!C54,pnd_inv,0)),\"\")","v":" "},{"$f":"IFERROR(INDEX(Eleves_datas[CLASSE],MATCH(Interventions!C54,pnd_inv,0)),\"\")","v":""}]
[{"$f":"IFERROR(INDEX(Eleves_datas[NOM],MATCH(Interventions!C55,pnd_inv,0)),\"\")&\" \"&IFERROR(INDEX(Eleves_datas[PRENOM],MATCH(Interventions!C55,pnd_inv,0)),\"\")","v":" "},{"$f":"IFERROR(INDEX(Eleves_datas[CLASSE],MATCH(Interventions!C55,pnd_inv,0)),\"\")","v":""}]
[{"$f":"IFERROR(INDEX(Eleves_datas[NOM],MATCH(Interventions!C56,pnd_inv,0)),\"\")&\" \"&IFERROR(INDEX(Eleves_datas[PRENOM],MATCH(Interventions!C56,pnd_inv,0)),\"\")","v":" "},{"$f":"IFERROR(INDEX(Eleves_datas[CLASSE],MATCH(Interventions!C56,pnd_inv,0)),\"\")","v":""}]
[{"$f":"IFERROR(INDEX(Eleves_datas[NOM],MATCH(Interventions!C57,pnd_inv,0)),\"\")&\" \"&IFERROR(INDEX(Eleves_datas[PRENOM],MATCH(Interventions!C57,pnd_inv,0)),\"\")","v":" "},{"$f":"IFERROR(INDEX(Eleves_datas[CLASSE],MATCH(Interventions!C57,pnd_inv,0)),\"\")","v":""}]
[{"$f":"IFERROR(INDEX(Eleves_datas[NOM],MATCH(Interventions!C58,pnd_inv,0)),\"\")&\" \"&IFERROR(INDEX(Eleves_datas[PRENOM],MATCH(Interventions!C58,pnd_inv,0)),\"\")","v":" "},{"$f":"IFERROR(INDEX(Eleves_datas[CLASSE],MATCH(Interventions!C58,pnd_inv,0)),\"\")","v":""}]
[{"$f":"IFERROR(INDEX(Eleves_datas[NOM],MATCH(Interventions!C59,pnd_inv,0)),\"\")&\" \"&IFERROR(INDEX(Eleves_datas[PRENOM],MATCH(Interventions!C59,pnd_inv,0)),\"\")","v":" "},{"$f":"IFERROR(INDEX(Eleves_datas[CLASSE],MATCH(Interventions!C59,pnd_inv,0)),\"\")","v":""}]
[{"$f":"IFERROR(INDEX(Eleves_datas[NOM],MATCH(Interventions!C60,pnd_inv,0)),\"\")&\" \"&IFERROR(INDEX(Eleves_datas[PRENOM],MATCH(Interventions!C60,pnd_inv,0)),\"\")","v":" "},{"$f":"IFERROR(INDEX(Eleves_datas[CLASSE],MATCH(Interventions!C60,pnd_inv,0)),\"\")","v":""}]
{"$rows_left_out":47}
{"sheet":"CLASSES_DATAS","index":1,"n_rows":22,"n_cols":1,"rows_kept":22,"cut":false,"hidden":false,"merged":[]}
["3 A"]
["3 B"]
["3 C"]
["3 D"]
["3 E"]
["4 A"]
["4 B"]
["4 C"]
["4 D"]
["4 E"]
["4 F"]
["5 A"]
["5 B"]
["5 C"]
["5 D"]
["5 E"]
["5 F"]
["6 A"]
["6 B"]
["6 C"]
["6 D"]
["6 E"]

{"sheet":"ELEVES_DATAS","index":2,"n_rows":250,"n_cols":8,"rows_kept":250,"cut":false,"hidden":false,"merged":[]}
["NOM","PRENOM","CLASSE","PND_INV","AD_LOGIN","AD_PWINIT","DDN","PND_CUP"]
["AIELLO","Océane","3 A","17T000001","aielloo","Rares788","2004-03-01","543075DEPOLI"]
["ALEMAN","Lorine","3 A","17T000002","alemanl3","Mutin367","2004-11-12","729326FERRES"]
["AVERSA","Laura","3 A","17T000003","aversal","Divan434","2006-02-14","441479MASQUE"]
["BAROUH","Angelina","3 A","17T000004","barouha","Liras013","2005-11-26","305689SUAGES"]
["BECK","Romain","3 A","17T000005","beckr","Nerfs120","2005-08-14","191844FLIRTS"]
["BENARD","Emilie","3 A","17T000006","benarde","Humes608","2005-09-05","175934TOISAT"]
["BONICEL","Thomas","3 A","17T000007","bonicelt1","Canot483","2005-02-08","834430PEUPLE"]
["BOUABBA Massin","Massin","3 A","17T000008","bouabbam1","Ecale600","2005-10-16","973643BLONDE"]
["BOUABBA Melissa","Melissa","3 A","17T000009","bouabbam2","Skies062","2005-04-23","786547DESUNI"]
["BRAHMI","Sofiane","3 A","17T000010","brahmis1","Flapi807","2005-08-31","991320PIBALE"]
["CANO","Elisabeth","3 A","17T000011","verele1","Jupon373","2004-09-11","?"]
["CARRIC","Tristan","3 A","17T000012","carrict","Relus607","2005-06-23","641983FLANER"]
["COUPOUX-WILMART","Nathan","3 A","17T000013","coupouxwilmartn","Agoni061","2005-05-28","883934ALIBIS"]
["DIKICI","Rose Jeannet","3 A","17T000014","dikicir","Sulky501","2005-04-12","741803GAMETS"]
["DILEO","Mary","3 A","17T000015","dileom","Cloua205","2004-04-02","909322ACCOTE"]
["FERRER","Lilian","3 A","17T000016","ferrerl8","Caser508","2005-09-30","102964GAMBES"]
["GRANGE-GUEDON","Mina","3 A","17T000017","grangeguedonm","Luire582","2005-08-15","895363LUCANE"]
["GUIRAO","Ludo","3 A","17T000018","guiraol","Viree402","2005-03-13","638884TEORBE"]
["LEONETTI","Chloe","3 A","17T000019","leonettic1","Touas766","2005-06-08","221789PENSUM"]
["LEONETTI","Emma","3 A","17T000020","leonettie","Lobby137","2005-06-08","027507EXCAVE"]
["MERAKEB","Aya","3 A","17T000021","merakeba","Canot773","2005-09-12","145679EGARES"]
["MEZQUIDA","Lea","3 A","17T000022","mezquidal1","Relus725","2005-09-16","811099PEQUIN"]
["POURTAL","Rafaël","3 A","17T000023","pourtalr","Khols675","2005-05-10","525023OPIATS"]
["RIBOUCHON","Maysan","3 A","17T000024","ribouchonm","Calez460","2005-04-10","318637POULIE"]
["RICO","Neil","3 A","17T000025","ricon1","Louve315","2005-10-14","942634CRYPTE"]
["ROCHE","Mathieu","3 A","17T000026","rochem11","Caduc883","2005-10-12","800898RIVENT"]
["SCOTO-DI-SUOCCIO","Flavie","3 A","17T000027","scotodisuocciof","Gigue578","2005-03-31","356134CARMES"]
["VOGLER","Alan","3 A","17T000028","voglera","Anion637","2005-03-07","410805TESSON"]
["WARTON","Lucas","3 A","17T000029","wartonl","Luire361","2005-02-19","212886JERKES"]
["AMAR","Danil","3 B","17T000030","amard1","Posez873","2004-08-15","324035ABJURE"]
["AMEY","Youna","3 B","17T000031","ameyy","Nomes873","2004-09-22","605438COITES"]
["BAHAMMOU","Rida","3 B","17T000032","bahammour","Neveu366","2004-08-18","718579NAPPAT"]
["BARBE","Za√Øane","3 B","17T000033","barbez","Belge452","2003-10-17","293349SAPEES"]
["BEISO DE COSTER","Jean-Charles","3 B","17T000034","beisodecosterj","Caser734","2004-03-19","026656AGACER"]
["BORDJA","Yasmine","3 B","17T000035","bordjay","Bleme312","2004-11-24","532876IRISES"]
["BOSCHER","Lorenzo","3 B","17T000036","boscherl","Vamps755","2005-11-21","840555CARTEL"]
["BOUTLIJA","Cha√Ønes","3 B","17T000037","boutlijac","Plaid278","2005-10-08","229675LAPEES"]
["BOUZIANE","Chayma","3 B","17T000038","bouzianec1","Crepu541","2005-11-22","530080KHMERE"]
["CHATEUR","Douaa","3 B","17T000039","chateurd","Monda725","2004-09-23","423257GROUPE"]
["CORSYN","Ryan","3 B","17T000040","corsynr","Pipes107","2004-10-09","727169ETUDIE"]
["CORVASCE","Clara","3 B","17T000041","corvascec","Bilai215","2004-08-01","891258REVOIE"]
["DANE","Killian","3 B","17T000042","danek","Couva023","2005-07-25","881354PONGES"]
["DE POILLOUE DE SAINT PERIER","Elisa","3 B","17T000043","depoillouedesainte","Ecale384","2005-04-17","792602FRICHE"]
["DIALLO","Ines","3 B","17T000044","dialloi2","Fuels538","2004-11-16","894026DONJON"]
["DOULIERE","Simon","3 B","17T000045","doulieres","Taque801","2005-01-28","451750FUMAIS"]
["ESSEMIRI-THIEBAUT","Jade","3 B","17T000046","essemirithiebautj","Niant326","2005-03-02","814574LOTION"]
["FRIZZI","Melina","3 B","17T000047","frizzim","Nomes550","2005-08-29","447127MINIME"]
["GIORS","Doryan","3 B","17T000048","giorsd","Khols580","2005-11-07","931986RAPAGE"]
["GIULIANO","Timothe","3 B","17T000049","giulianot","Divan872","2005-07-20","960791AIRANT"]
["GOUALA-SA√èD","Matys","3 B","17T000050","goualasaidm","Vamps617","2005-04-24","399338AGONIT"]
["GRIGY","Noah","3 B","17T000051","grigyn","Ilots178","2005-06-27","205341EMPOTE"]
["GRIMA","Julia","3 B","17T000052","grimaj","Litre824","2005-03-22","818075BLUFFA"]
["GUERARD","Julian","3 B","17T000053","guerardj","Petai824","2005-12-07","843927NIABLE"]
["GUERINI","Theo","3 B","17T000054","guerinit1","Ploye285","2005-02-01","629736LOFANT"]
["HASNAOUI","Tiziana","3 B","17T000055","hasnaouit","Ilots536","2004-04-19","981183PIQUEZ"]
["KINDERSTUTH","Fanny","3 B","17T000056","kinderstuthf","Caser263","2004-01-15","084316VENGEZ"]
["KRUOPIS","Domantas","3 B","17T000057","kruopisd","Humes314","2004-10-13","570299CASERA"]
["LATY","Trystan","3 B","17T000058","latyt","Bosse550","2005-12-30","155942GEMMER"]
["LEONARD","Lenny","3 B","17T000059","leonardl1","Khols831","2005-07-04","149772RAZZIE"]
{"$rows_left_out":191}
{"sheet":"Feuil1","index":3,"n_rows":0,"n_cols":0,"rows_kept":0,"cut":false,"hidden":false,"merged":[]}