{"text_format":"1","workbook":"xlsx","n_sheets":2,"sheets":["Tirage","Alea"],"not_rendered":{"charts":0,"images":0,"macros":1,"external_links":0,"defined_names":10,"comments":0,"pivot_tables":0},"unopened":[],"bounds":{"document_bytes":16777216,"sheet_cells":100000,"rows_first":2000,"rows_last":500,"rows_between":2000,"halvings":0,"cell_chars":16384,"cell_head_chars":4096},"cells_cut":0,"cells_raw":0,"read":"whole","date_system":"1900"}

{"sheet":"Tirage","index":0,"n_rows":2,"n_cols":5,"rows_kept":2,"cut":false,"hidden":false,"merged":[]}
[]
[{"$f":"INDEX(Alea!$A$1:$A$5,MATCH(LARGE(Alea!$B$1:$B$5,ROW()),Alea!$B$1:$B$5,0))","v":4},{"$f":"INDEX(Alea!$D$1:$D$5,MATCH(LARGE(Alea!$E$1:$E$5,ROW()),Alea!$E$1:$E$5,0))","v":2},{"$f":"INDEX(Alea!$G$1:$G$5,MATCH(LARGE(Alea!$H$1:$H$5,ROW()),Alea!$H$1:$H$5,0))","v":5},{"$f":"INDEX(Alea!$J$1:$J$5,MATCH(LARGE(Alea!$K$1:$K$5,ROW()),Alea!$K$1:$K$5,0))","v":4},{"$f":"INDEX(Alea!$M$1:$M$5,MATCH(LARGE(Alea!$N$1:$N$5,ROW()),Alea!$N$1:$N$5,0))","v":2}]

{"sheet":"Alea","index":1,"n_rows":5,"n_cols":14,"rows_kept":5,"cut":false,"hidden":false,"merged":[]}
[1,{"$f":"RAND()","v":0.26524574968517978},null,1,{"$f":"RAND()","v":0.31163894982588936},null,1,{"$f":"RAND()","v":0.66546736156457298},null,1,{"$f":"RAND()","v":0.84291663656969495},null,1,{"$f":"RAND()","v":0.16068940085089434}]
[2,7.3364543261167925E-2,null,2,{"$f":"RAND()","v":0.55168980282500624},null,2,0.49271791190157843,null,2,0.20265856561949713,null,2,0.36990487135932237]
[3,0.18377429262167666,null,3,0.9218228544129683,null,3,0.12029448131703624,null,3,0.34903276562429209,null,3,1.2774550156580133E-4]
[4,0.55804616138139285,null,4,0.2653209809736814,null,4,0.22606967409597967,null,4,0.44816413274937117,null,4,2.9245953861111063E-2]
[5,0.6925635974012605,null,5,0.43978118904269536,null,5,0.58821632887658537,null,5,0.30338918998955189,null,5,0.43959944044920984]