{"text_format":"1","workbook":"xlsx","n_sheets":28,"sheets":["Liste_Mois","données","Janvier","Février","Mars","Avril","Mai","Juin","Juillet","Août","Septembre","Octobre","Novembre","Décembre","Autres","Nouveau Officier Permanent","Feuil2","Feuil3","Feuil4","Feuil5","Feuil6","Feuil7","Feuil8","Feuil9","Feuil10","Feuil11","Feuil12","Instructions de Création"],"not_rendered":{"charts":0,"images":2,"macros":1,"external_links":0,"defined_names":6,"comments":0,"pivot_tables":0},"unopened":[],"bounds":{"document_bytes":16777216,"sheet_cells":100000,"rows_first":2000,"rows_last":500,"rows_between":2000,"halvings":0,"cell_chars":16384,"cell_head_chars":4096},"cells_cut":0,"cells_raw":0,"read":"whole","date_system":"1900"}

{"sheet":"Liste_Mois","index":0,"n_rows":35,"n_cols":16,"rows_kept":35,"cut":false,"hidden":false,"merged":[[34,5,36,9],[14,15,15,17],[20,2,22,6],[24,2,26,6],[28,2,30,6],[12,8,14,12],[16,8,18,12],[20,8,22,12],[24,8,26,12],[28,8,30,12],[2,1,6,13],[8,8,10,12],[8,2,10,6],[12,2,14,6],[16,2,18,6]]}
[]
[]
[null,{"$f":"VLOOKUP(P15,données!B3:P4,2,0)","v":"Double-Cliquez sur le mois désiré pour y afficher ses tâches"}]
[]
[]
[]
[]
[]
[null,null,{"$f":"VLOOKUP(P15,données!B3:P4,3,0)","v":"Janvier"},null,null,null,null,null,{"$f":"VLOOKUP(P15,données!B3:O4,9,0)","v":"Juillet"}]
[]
[]
[]
[null,null,{"$f":"VLOOKUP(P15,données!B3:O4,4,0)","v":"Février"},null,null,null,null,null,{"$f":"VLOOKUP(P15,données!B3:O4,10,0)","v":"Août"}]
[]
[null,null,null,null,null,null,null,null,null,null,null,null,null,null,null,"Français"]
[]
[null,null,{"$f":"VLOOKUP(P15,données!B3:O4,5,0)","v":"Mars"},null,null,null,null,null,{"$f":"VLOOKUP(P15,données!B3:O4,11,0)","v":"Septembre"}]
[]
[]
[]
{"$rows_left_out":16}
{"sheet":"données","index":1,"n_rows":8,"n_cols":16,"rows_kept":8,"cut":false,"hidden":false,"merged":[]}
[]
[null,"langue","Colonne1","Colonne2","Colonne3","Colonne4","Colonne5","Colonne6","Colonne7","Colonne8","Colonne9","Colonne10","Colonne11","Colonne12","Colonne13","Colonne14"]
[null,"Français","Double-Cliquez sur le mois désiré pour y afficher ses tâches","Janvier","Février","Mars","Avril","Mai","Juin","Juillet","Août","Septembre","Octobre","Novembre","Décembre","Autres"]
[null,"English","Double-Click on the desired month to see your tasks","January","February","March","April","May","June","July","August","September","October","November","December","Others"]
[]
[null,"langue","Colonne1","Colonne2","Colonne3","Colonne4","Colonne5","Colonne6","Colonne7","Colonne8","Colonne9","Colonne10","Colonne11","Colonne12","Colonne13","Colonne14"]
[null,"Français","Double-Cliquez ici pour retourner à la liste des mois","Janvier","Cliquez pour haut de la page","Apparaître mois de Février et Mars.","Réinitialiser","Cliquez sur la case appropriée ci-bas pour sélectionner son niveau.","Cliquez sur la case appropriée ci-bas si la tâche est complétée.","Comment modifier un commentaire d'une tâche ? Cliquez ici pour apprendre.","Cliquez sur la case appropriée ci-bas pour sélectionner un superviseur.","Date","Niveaux de tâches","Fait","Liste des tâches","Superviseur de tâche"]
[null,"English","Double-Click here to return to the list of months","January","Click for top of the page","Appear month of February and March.","Reset","Click on the appropriate box below to select its level.","Click on the appropriate box below if the task is completed.","How do I edit a comment on a task? Click here to learn.","Click on the appropriate box below to select a supervisor.","Date","Task levels","Done","To-do list","Task Supervisor"]

{"sheet":"Janvier","index":2,"n_rows":499,"n_cols":7,"rows_kept":499,"cut":false,"hidden":false,"merged":[[1,5,4,5],[6,5,7,5],[1,2,2,3]]}
[]
[null,null,{"$f":"VLOOKUP(Liste_Mois!P15,données!B7:'données'!P8,2,0)","v":"Double-Cliquez ici pour retourner à la liste des mois"},null,null,{"$f":"VLOOKUP(Liste_Mois!P15,données!B7:'données'!P8,3,0)","v":"Janvier"}]
[]
[]
[]
[]
[null,null,null,null,null,"Comment modifier un commentaire d'une tâche ? Cliquez ici pour apprendre."]
[]
[]
[]
[null,null,"Date","Niveaux des tâches","Fait","Liste des tâches","Superviseur de tâche"]
[null,null,"2021-01-06","Non déterminée",null,"Suivi Personnel Ops Air","Cmdt/A Ops Air"]
["Critique",null,"2021-01-08","Non déterminée",null,"Courriel d'appel cours Superdog","Cmdt/A Ops Air"]
["Modéré",null,"2021-01-13","Non déterminée",null,"Flight suit CIPP","Cmdt/A Ops Air"]
["Faible",null,"2021-01-13","Non déterminée",null,"T3 & finance Ops Air/CEVC","Cmdt/A Ops Air"]
["Tâche autre section devez suivre dvlpt.",null,"2021-01-15","Non déterminée",null,"Réunion 2 Div CEVC","Cmdt/A Ops Air"]
["Non déterminée",null,"2021-01-15","Non déterminée",null,"Finir mission de vol","Cmdt/A Ops Air"]
[null,null,"2021-01-15","Non déterminée",null,"Ordres de vol","Cmdt/A Ops Air"]
["Fait",null,"2021-01-16","Non déterminée",null,"Examens écrits sélection","Cmdt/A Ops Air"]
[null,null,"2021-01-20","Non déterminée",null,"Révision finances","Cmdt/A Ops Air"]
{"$rows_left_out":480}
{"sheet":"Février","index":3,"n_rows":499,"n_cols":7,"rows_kept":499,"cut":false,"hidden":true,"merged":[[1,5,4,5]]}
[]
[null,null,null,null,null,"Février"]
[]
[]
[]
[]
[]
[]
[]
[]
[null,null,"Date","Niveaux des tâches","Fait","Liste des tâches","Superviseur de tâche"]
[null,null,"2021-02-01","Non déterminée",null,"Recommandations des sites","Cmdt/A Ops Air"]
["Critique",null,"2021-02-08","Non déterminée",null,"Courriel OR/Coord recommandations sites","Cmdt/A Ops Air"]
["Modéré",null,"2021-02-10","Non déterminée",null,"Publication mission de vol","Cmdt/A Ops Air"]
["Faible",null,"2021-02-12","Non déterminée",null,"Formation OR/Coord SVC","Cmdt/A Ops Air"]
["Tâche autre section devez suivre dvlpt.",null,"2021-02-13","Non déterminée",null,"Formation OR/Coord SVC","Cmdt/A Ops Air"]
["Non déterminée",null,"2021-02-15","Non déterminée",null,"Organisation FA","Cmdt/A Ops Air"]
[null,null,"2021-02-18","Non déterminée",null,"Courriel Badges","Cmdt/A Ops Air"]
["Fait",null,"2021-02-27","Non déterminée",null,"Réunion CEC & ÉM CEVC","Cmdt/A Ops Air"]
[null,null,"2021-02-28","Non déterminée",null,"Demande réclamation FA","Cmdt/A Ops Air"]
{"$rows_left_out":480}
{"sheet":"Mars","index":4,"n_rows":499,"n_cols":7,"rows_kept":499,"cut":false,"hidden":true,"merged":[[1,5,4,5]]}
[]
[null,null,null,null,null,"Mars"]
[]
[]
[]
[]
[]
[]
[]
[]
[null,null,"Date","Niveaux des tâches","Fait","Liste des tâches","Superviseur de tâche"]
[null,null,"2021-03-08","Non déterminée",null,"Horaire mission de vol rodage SD","Cmdt/A Ops Air"]
["Critique",null,"2021-03-10","Non déterminée",null,"Préparer Modèle financier Ops Air","Cmdt/A Ops Air"]
["Modéré",null,"2021-03-14","Non déterminée",null,"AQTA","Cmdt/A Ops Air"]
["Faible",null,"2021-03-15","Non déterminée",null,"Courriel musique 438","Cmdt/A Ops Air"]
["Tâche autre section devez suivre dvlpt.",null,"2021-03-20","Non déterminée",null,"Engagement & fin. Ops Air","Cmdt/A Ops Air"]
["Non déterminée",null,"2021-03-20","Non déterminée",null,"Déploiement Rouyn","Cmdt/A Ops Air"]
[null,null,"2021-03-20","Non déterminée",null,"Déploiement Drummondville","Cmdt/A Ops Air"]
["Fait",null,"2021-03-25","Non déterminée",null,"Congés membres permanents","Cmdt/A Ops Air"]
[null,null,"mi-mars","Non déterminée",null,"RAP","Cmdt/A Ops Air"]
{"$rows_left_out":480}
{"sheet":"Avril","index":5,"n_rows":499,"n_cols":7,"rows_kept":499,"cut":false,"hidden":true,"merged":[[1,5,4,5]]}
[]
[null,null,null,null,null,"Avril"]
[]
[]
[]
[]
[]
[]
[]
[]
[null,null,"Date","Niveaux des tâches","Fait","Liste des tâches","Superviseur de tâche"]
[null,null,"2021-04-01","Non déterminée",null,"Délégation financière","Cmdt/A Ops Air"]
["Critique",null,"2021-04-07","Non déterminée",null,"Plans de voyage","Cmdt/A Ops Air"]
["Modéré",null,"2021-04-08","Non déterminée",null,"Ouvertures SVC","Cmdt/A Ops Air"]
["Faible",null,"2021-04-13","Non déterminée",null,"Déploiement treuils","Cmdt/A Ops Air"]
["Tâche autre section devez suivre dvlpt.",null,"2021-04-15","Non déterminée",null,"Visites ouvertures SVC","Cmdt/A Ops Air"]
["Non déterminée",null,"MM-JJ","Non déterminée",null,null,"Non déterminé"]
[null,null,"MM-JJ","Non déterminée",null,null,"Non déterminé"]
["Fait",null,"MM-JJ","Non déterminée",null,null,"Non déterminé"]
[null,null,"MM-JJ","Non déterminée",null,null,"Non déterminé"]
{"$rows_left_out":480}
{"sheet":"Mai","index":6,"n_rows":499,"n_cols":7,"rows_kept":499,"cut":false,"hidden":true,"merged":[[1,5,4,5]]}
[]
[null,null,null,null,null,"Mai"]
[]
[]
[]
[]
[]
[]
[]
[]
[null,null,"Date","Niveaux des tâches","Fait","Liste des tâches","Superviseur de tâche"]
[null,null,"2021-05-25","Non déterminée",null,"Préparation CIPP","Cmdt/A Ops Air"]
["Critique",null,"2021-05-27","Non déterminée",null,"Transition ZBM","Cmdt/A Ops Air"]
["Modéré",null,"MM-JJ","Non déterminée",null,null,"Non déterminé"]
["Faible",null,"MM-JJ","Non déterminée",null,null,"Non déterminé"]
["Tâche autre section devez suivre dvlpt.",null,"MM-JJ","Non déterminée",null,null,"Non déterminé"]
["Non déterminée",null,"MM-JJ","Non déterminée",null,null,"Non déterminé"]
[null,null,"MM-JJ","Non déterminée",null,null,"Non déterminé"]
["Fait",null,"MM-JJ","Non déterminée",null,null,"Non déterminé"]
[null,null,"MM-JJ","Non déterminée",null,null,"Non déterminé"]
{"$rows_left_out":480}
{"sheet":"Juin","index":7,"n_rows":499,"n_cols":7,"rows_kept":499,"cut":false,"hidden":true,"merged":[[1,5,4,5]]}
[]
[null,null,null,null,null,"Juin"]
[]
[]
[]
[]
[]
[]
[]
[]
[null,null,"Date","Niveaux des tâches","Fait","Liste des tâches","Superviseur de tâche"]
[null,null,"début juin","Non déterminée",null,"Accueil CIPP","Cmdt/A Ops Air"]
["Critique",null,"Mi juin","Non déterminée",null,"Déploiement Mont-Joli","Cmdt/A Ops Air"]
["Modéré",null,"2021-06-15","Non déterminée",null,"Réunion Cmdt Esc","Cmdt/A Ops Air"]
["Faible",null,"MM-JJ","Non déterminée",null,null,"Non déterminé"]
["Tâche autre section devez suivre dvlpt.",null,"MM-JJ","Non déterminée",null,null,"Non déterminé"]
["Non déterminée",null,"MM-JJ","Non déterminée",null,null,"Non déterminé"]
[null,null,"MM-JJ","Non déterminée",null,null,"Non déterminé"]
["Fait",null,"MM-JJ","Non déterminée",null,null,"Non déterminé"]
[null,null,"MM-JJ","Non déterminée",null,null,"Non déterminé"]
{"$rows_left_out":480}
{"sheet":"Juillet","index":8,"n_rows":499,"n_cols":7,"rows_kept":499,"cut":false,"hidden":true,"merged":[[1,5,4,5]]}
[]
[null,null,null,null,null,"Juillet"]
[]
[]
[]
[]
[]
[]
[]
[]
[null,null,"Date","Niveaux des tâches","Fait","Liste des tâches","Superviseur de tâche"]
[null,null,"MM-JJ","Non déterminée",null,"CEVC","Cmdt/A Ops Air"]
["Critique",null,"MM-JJ","Non déterminée",null,null,"Non déterminé"]
["Modéré",null,"MM-JJ","Non déterminée",null,null,"Non déterminé"]
["Faible",null,"MM-JJ","Non déterminée",null,null,"Non déterminé"]
["Tâche autre section devez suivre dvlpt.",null,"MM-JJ","Non déterminée",null,null,"Non déterminé"]
["Non déterminée",null,"MM-JJ","Non déterminée",null,null,"Non déterminé"]
[null,null,"MM-JJ","Non déterminée",null,null,"Non déterminé"]
["Fait",null,"MM-JJ","Non déterminée",null,null,"Non déterminé"]
[null,null,"MM-JJ","Non déterminée",null,null,"Non déterminé"]
{"$rows_left_out":480}
{"sheet":"Août","index":9,"n_rows":499,"n_cols":7,"rows_kept":499,"cut":false,"hidden":true,"merged":[[1,5,4,5]]}
[]
[null,null,null,null,null,"Août"]
[]
[]
[]
[]
[]
[]
[]
[]
[null,null,"Date","Niveaux des tâches","Fait","Liste des tâches","Superviseur de tâche"]
[null,null,"MM-JJ","Non déterminée",null,"CEVC","Cmdt/A Ops Air"]
["Critique",null,"2021-08-25","Non déterminée",null,"Session vol automne","Cmdt/A Ops Air"]
["Modéré",null,"2021-08-25","Non déterminée",null,"Déploiement Mont-Joli","Cmdt/A Ops Air"]
["Faible",null,"Fin août","Non déterminée",null,"Déployé Mont-Joli","Cmdt/A Ops Air"]
["Tâche autre section devez suivre dvlpt.",null,"Fin août","Non déterminée",null,"CA Vieux Mess","Cmdt/A Ops Air"]
["Non déterminée",null,"MM-JJ","Non déterminée",null,null,"Non déterminé"]
[null,null,"MM-JJ","Non déterminée",null,null,"Non déterminé"]
["Fait",null,"MM-JJ","Non déterminée",null,null,"Non déterminé"]
[null,null,"MM-JJ","Non déterminée",null,null,"Non déterminé"]
{"$rows_left_out":480}
{"sheet":"Septembre","index":10,"n_rows":499,"n_cols":7,"rows_kept":499,"cut":false,"hidden":true,"merged":[[1,5,4,5]]}
[]
[null,null,null,null,null,"Septembre"]
[]
[]
[]
[]
[]
[]
[]
[]
[null,null,"Date","Niveaux des tâches","Fait","Liste des tâches","Superviseur de tâche"]
[null,null,"2021-09-01","Non déterminée",null,"Déploiement Mont-Joli","Cmdt/A Ops Air"]
["Critique",null,"Début Sept","Non déterminée",null,"CA Vieux Mess","Cmdt/A Ops Air"]
["Modéré",null,"MM-JJ","Non déterminée",null,"Visites SVC","Cmdt/A Ops Air"]
["Faible",null,"MM-JJ","Non déterminée",null,null,"Non déterminé"]
["Tâche autre section devez suivre dvlpt.",null,"MM-JJ","Non déterminée",null,null,"Non déterminé"]
["Non déterminée",null,"MM-JJ","Non déterminée",null,null,"Non déterminé"]
[null,null,"MM-JJ","Non déterminée",null,null,"Non déterminé"]
["Fait",null,"MM-JJ","Non déterminée",null,null,"Non déterminé"]
[null,null,"MM-JJ","Non déterminée",null,null,"Non déterminé"]
{"$rows_left_out":480}
{"sheet":"Octobre","index":11,"n_rows":499,"n_cols":7,"rows_kept":499,"cut":false,"hidden":true,"merged":[[1,5,4,5]]}
[]
[null,null,null,null,null,"Octobre"]
[]
[]
[]
[]
[]
[]
[]
[]
[null,null,"Date","Niveaux des tâches","Fait","Liste des tâches","Superviseur de tâche"]
[null,null,"2021-10-01","Non déterminée",null,"Rapport fin année SVC","Cmdt/A Ops Air"]
["Critique",null,"2021-10-02","Non déterminée",null,"Fermeture SVC","Cmdt/A Ops Air"]
["Modéré",null,"2021-10-04","Tâche autre section devez suivre dvlpt.",null,"Internal audit","Cmdt/A Ops Air"]
["Faible",null,"2021-10-12","Non déterminée",null,"Vol compensatoire","Cmdt/A Ops Air"]
["Tâche autre section devez suivre dvlpt.",null,"2021-10-15","Non déterminée",null,"Réunion OR/Coord","Cmdt/A Ops Air"]
["Non déterminée",null,"2021-10-21","Non déterminée",null,"Vol compensatoire + miss. Vol","Cmdt/A Ops Air"]
[null,null,"2021-10-27","Non déterminée",null,"Réunion rétro. miss. vol","Cmdt/A Ops Air"]
["Fait",null,"MM-JJ","Non déterminée",null,null,"Non déterminé"]
[null,null,"MM-JJ","Non déterminée",null,null,"Non déterminé"]
{"$rows_left_out":480}
{"sheet":"Novembre","index":12,"n_rows":499,"n_cols":7,"rows_kept":499,"cut":false,"hidden":true,"merged":[[1,5,4,5]]}
[]
[null,null,null,null,null,"Novembre"]
[]
[]
[]
[]
[]
[]
[]
[]
[null,null,"Date","Niveaux des tâches","Fait","Liste des tâches","Superviseur de tâche"]
[null,null,"2021-11-01","Non déterminée",null,"Réunion OR/Coord","Cmdt/A Ops Air"]
["Critique",null,"2021-11-05","Non déterminée",null,"Réunion OR/Coord","Cmdt/A Ops Air"]
["Modéré",null,"2021-11-06","Non déterminée",null,"Réunion OR/Coord","Cmdt/A Ops Air"]
["Faible",null,"2021-11-06","Non déterminée",null,"Réunion OR/Coord","Cmdt/A Ops Air"]
["Tâche autre section devez suivre dvlpt.",null,"MM-JJ","Non déterminée",null,null,"Non déterminé"]
["Non déterminée",null,"MM-JJ","Non déterminée",null,null,"Non déterminé"]
[null,null,"MM-JJ","Non déterminée",null,null,"Non déterminé"]
["Fait",null,"MM-JJ","Non déterminée",null,null,"Non déterminé"]
[null,null,"MM-JJ","Non déterminée",null,null,"Non déterminé"]
{"$rows_left_out":480}
{"sheet":"Décembre","index":13,"n_rows":499,"n_cols":7,"rows_kept":499,"cut":false,"hidden":true,"merged":[[1,5,4,5]]}
[]
[null,null,null,null,null,"Décembre"]
[]
[]
[]
[]
[]
[]
[]
[]
[null,null,"Date","Niveaux des tâches","Fait","Liste des tâches","Superviseur de tâche"]
[null,null,"2021-12-01","Non déterminée",null,"Réunion OR/Coord","Cmdt/A Ops Air"]
["Critique",null,"2021-12-01","Non déterminée",null,"Mission de vol","Cmdt/A Ops Air"]
["Modéré",null,"2021-12-05","Non déterminée",null,"RDP","Cmdt/A Ops Air"]
["Faible",null,"2021-12-10","Non déterminée",null,"Mise à jour finance","Cmdt/A Ops Air"]
["Tâche autre section devez suivre dvlpt.",null,"MM-JJ","Non déterminée",null,null,"Non déterminé"]
["Non déterminée",null,"MM-JJ","Non déterminée",null,null,"Non déterminé"]
[null,null,"MM-JJ","Non déterminée",null,null,"Non déterminé"]
["Fait",null,"MM-JJ","Non déterminée",null,null,"Non déterminé"]
[null,null,"MM-JJ","Non déterminée",null,null,"Non déterminé"]
{"$rows_left_out":480}
{"sheet":"Autres","index":14,"n_rows":6,"n_cols":2,"rows_kept":6,"cut":false,"hidden":true,"merged":[[5,1,9,13]]}
[]
[]
[]
[]
[]
[null,"Autres"]

{"sheet":"Nouveau Officier Permanent","index":15,"n_rows":13,"n_cols":4,"rows_kept":13,"cut":false,"hidden":true,"merged":[[5,2,7,3],[9,2,10,3]]}
[]
[]
[]
[]
[]
[null,null,"Nouveau Officier Permanent"]
[]
[]
[]
[null,null,"Comment modifier un commentaire d'une tâche ? \nCliquez ici pour apprendre."]
[]
[]
[null,null,"Tâches","Point de contact"]

{"sheet":"Feuil2","index":16,"n_rows":6,"n_cols":2,"rows_kept":6,"cut":false,"hidden":true,"merged":[[5,1,9,13]]}
[]
[]
[]
[]
[]
[null,"Feuil2"]

{"sheet":"Feuil3","index":17,"n_rows":6,"n_cols":2,"rows_kept":6,"cut":false,"hidden":true,"merged":[[5,1,9,13]]}
[]
[]
[]
[]
[]
[null,"Feuil3"]

{"sheet":"Feuil4","index":18,"n_rows":6,"n_cols":2,"rows_kept":6,"cut":false,"hidden":true,"merged":[[5,1,9,13]]}
[]
[]
[]
[]
[]
[null,"Feuil4"]

{"sheet":"Feuil5","index":19,"n_rows":6,"n_cols":2,"rows_kept":6,"cut":false,"hidden":true,"merged":[[5,1,9,13]]}
[]
[]
[]
[]
[]
[null,"Feuil5"]

{"sheet":"Feuil6","index":20,"n_rows":6,"n_cols":2,"rows_kept":6,"cut":false,"hidden":true,"merged":[[5,1,9,13]]}
[]
[]
[]
[]
[]
[null,"Feuil6"]

{"sheet":"Feuil7","index":21,"n_rows":6,"n_cols":2,"rows_kept":6,"cut":false,"hidden":true,"merged":[[5,1,9,13]]}
[]
[]
[]
[]
[]
[null,"Feuil7"]

{"sheet":"Feuil8","index":22,"n_rows":6,"n_cols":2,"rows_kept":6,"cut":false,"hidden":true,"merged":[[5,1,9,13]]}
[]
[]
[]
[]
[]
[null,"Feuil8"]

{"sheet":"Feuil9","index":23,"n_rows":6,"n_cols":2,"rows_kept":6,"cut":false,"hidden":true,"merged":[[5,1,9,13]]}
[]
[]
[]
[]
[]
[null,"Feuil9"]

{"sheet":"Feuil10","index":24,"n_rows":6,"n_cols":2,"rows_kept":6,"cut":false,"hidden":true,"merged":[[5,1,9,13]]}
[]
[]
[]
[]
[]
[null,"Feuil10"]

{"sheet":"Feuil11","index":25,"n_rows":6,"n_cols":2,"rows_kept":6,"cut":false,"hidden":true,"merged":[[5,1,9,13]]}
[]
[]
[]
[]
[]
[null,"Feuil11"]

{"sheet":"Feuil12","index":26,"n_rows":6,"n_cols":2,"rows_kept":6,"cut":false,"hidden":true,"merged":[[5,1,9,13]]}
[]
[]
[]
[]
[]
[null,"Feuil12"]

{"sheet":"Instructions de Création","index":27,"n_rows":42,"n_cols":4,"rows_kept":42,"cut":false,"hidden":true,"merged":[[35,2,36,22],[4,1,8,13],[10,1,11,13],[41,3,41,22],[33,2,33,22],[39,2,39,22],[14,2,14,22],[21,2,21,22],[17,2,18,22],[24,2,24,22],[25,2,25,22],[26,2,26,22],[27,3,27,22],[28,3,28,22],[29,2,30,22],[31,2,32,22]]}
[]
[]
[]
[]
[null,"Instructions de Création"]
[]
[]
[]
[]
[]
[null,"Lors de la création d'un nouvel onglet, naviguer toujours entre les onglets par la liste au bas de la page. "]
[]
[]
[]
[null,"1- Nommer le bouton :"," Pour nommer le bouton de sélection, retourner sur l'onglet \"Autres\". Faite un clic droit sur le bouton désiré (en prenant note de son nom présent). Sélectionnez \"Modifier le texte\". Tapez le nom désiré, puis sélectionnez n'importe quelle cellule dans la feuille."]
[]
[]
[null,"2-  Nommer l'onglet :"," Pour nommer l'onglet, faite un clic gauche sur le bouton que vous venez de nommer. Faite un clic droit sur le nom de l'onglet que vous venez d'ouvrir au bas de la page, puis sélectionnez \"Renommer\". Tapez le même nom que vous avez donner au bouton, puis cliquez sur n'importe quelle cellule de la feuille."]
[]
[]
{"$rows_left_out":22}