{"text_format":"1","workbook":"xlsx","n_sheets":3,"sheets":["Paramètres","Tranfert_Argent","RECAPITULATIF & ANALYSE"],"not_rendered":{"charts":3,"images":5,"macros":1,"external_links":2,"defined_names":12,"comments":0,"pivot_tables":0},"unopened":[],"bounds":{"document_bytes":16777216,"sheet_cells":100000,"rows_first":2000,"rows_last":500,"rows_between":2000,"halvings":0,"cell_chars":16384,"cell_head_chars":4096},"cells_cut":0,"cells_raw":0,"read":"whole","date_system":"1900"}

{"sheet":"Paramètres","index":0,"n_rows":22,"n_cols":9,"rows_kept":22,"cut":false,"hidden":false,"merged":[[0,6,0,8]]}
["Type transaction","Type bénéficiaire","Type réseau","Type pièce","Tarifs Omoney",null,"Indicatifs"]
["Dépôt local","Client","Orange","CNI","Caisse",null,"Orange","MTN","Moov"]
["Retrait local","Fournisseur","MTN","Attestation","Banque",null,22507,22504,22501]
["Dépôt inter",null,"Moov","Passeport",null,null,22508,22505,22502]
["Retrait inter",null,null,"Permis de conduire",null,null,22509,22506,22503]
["UVE",null,null,"Carte consulaire",null,null,22547,22544,22540]
["CIE",null,null,"Autre",null,null,22548,22545,22541]
["SODECI",null,null,null,null,null,22549,22546,22542]
["Inscription",null,null,null,null,null,22557,22554,22550]
[null,null,null,null,null,null,22558,22555,22551]
[null,null,null,null,null,null,22559,22556,22552]
[null,null,null,null,null,null,22567,22564,22553]
[null,null,null,null,null,null,22568,22565,22570]
[null,null,null,null,null,null,22569,22566,22571]
[null,null,null,null,null,null,22577,22574,22572]
[null,null,null,null,null,null,22578,22575,22573]
[null,null,null,null,null,null,22579,22576]
[null,null,null,null,null,null,22587,22584]
[null,null,null,null,null,null,22588,22585]
[null,null,null,null,null,null,22589,22586]
[null,null,null,null,null,null,22597,22595]
[null,null,null,null,null,null,22598,22596]

{"sheet":"Tranfert_Argent","index":1,"n_rows":1051,"n_cols":24,"rows_kept":1051,"cut":false,"hidden":false,"merged":[[8,12,8,13],[9,12,9,13],[3,12,3,13],[4,12,4,13],[5,12,5,13],[6,12,6,13],[7,12,7,13],[7,9,7,10],[8,9,8,10],[9,9,9,10],[10,6,11,7],[3,9,3,10],[4,9,4,10],[5,9,5,10],[6,9,6,10]]}
[null,null,"Transactions -Transfert d'argent"]
[null,null,null,null,null,null,null,null,null,null,null,null,null,null,null,null,null,null,null,null,"Data Mapping"]
[null,null,null,null,null,null,null,null,null,null,null,null,null,null,null,null,null,null,null,null,"Date",4,"Nom Bénéfciaire",11]
[null,null,null,null,null,null,null,null,"Date","2021-01-26",null,"Nom Bénéfciaire","Marvine",null,null,null,null,null,null,null,"Heure",5,"Type Pièce Identité",12]
[null,null,null,null,null,null,null,null,"Heure","01:31:00",null,"Réf. Transaction",123,null,null,null,null,null,null,null,"Type Transaction",6,"N° Pièce",13]
[null,null,null,null,null,null,null,null,"Type Transaction","Dépôt local",null,"ID Transaction",321,null,null,null,null,null,null,null,"Type bénéficiaire",7,"ID Transaction",14]
[null,null,null,null,null,null,null,null,"Type Bénéficiaire","Client",null,"N° reçu",456,null,null,null,null,null,null,null,"Type Réseau",8,"Solde Compte",15]
[null,null,null,null,null,null,null,null,"Type Réseau","Orange",null,"Type Pièce","CNI",null,null,null,null,null,null,null,"N° Téléphone",9,"Monnaie à Devoir",16]
[null,null,null,null,null,null,null,null,"N° Téléphone",22507402488,null,"N° Pièce","C0025758936",null,null,null,null,null,null,null,"Montant",10,"Notes",17]
[null,null,null,"Selected row",null,null,null,null,"Montant",null,null,"Notes"]
[null,null,null,"New transact.",true,null,{"$f":"IF(J9=\"\",\"\",IF(COUNTIF(OFFSET(Paramètres!F3,,MATCH(J8,Paramètres!G2:I2,0),25,),LEFT(J9,5)*1),\"Numéro \"&J8&\" valide\",\"Numéro \"&J8&\" non valide\"&CHAR(10)&\"Veuillez saisir un numéro \"&J8& \" valide\"))","v":"Numéro Orange valide"}]
[null,null,null,"Transact. Load",false,null,null,null,null,null,null,null,null,null,null,"Fonds de caisse",300000]
[]
[null,null,null,"J4","J5","J6","J7","J8","J9","J10","M4","M5","M6","M7","M8","M9","M10"]
[null,null,"N°","Date","Heure","Type \nTransaction","Type\n Bénéficiaire","Type \nRéseau","N° Téléphone","Montant \nTransaction","Nom \nBénéficiaire","Référence \nTransaction","ID \nTransaction","N° Reçu","Type \nPièce","N° Pièce","Notes","SOLDE"]
[null,null,1,"2021-01-16","19:13:00","Dépôt local","Client","Orange",22559971489,55000,"Client 1",123456,654321,25,"CNI","C0069727506","Rien à signaler",{"$f":"IF(OR(F16=\"Dépôt local\",F16=\"Dépôt inter\",F16=\"CIE\",F16=\"SODECI\",F16=\"Inscription\"),Q12-J16,Q12+J16)","v":245000}]
[null,null,{"$f":"IF(ISBLANK(D17),\"\",C16+1)","v":2},"2021-01-22","13:55:00","Dépôt local","Client","Orange",22564270948,77500,"GNBS",123456,654321,987654,"CNI","C0069727506","RAS",{"$f":"IF(OR(F17=\"Dépôt local\",F17=\"Dépôt inter\",F16=\"CIE\",F17=\"SODECI\",F17=\"Inscription\"),R16-J17,R16+J17)","v":167500}]
[null,null,"",null,null,null,null,null,null,null,null,null,null,null,null,null,null,{"$f":"IF(OR(F18=\"Dépôt local\",F18=\"Dépôt inter\",F17=\"CIE\",F18=\" SODECI\",F18=\"Inscription\"),R17-J18,R17+J18)","v":167500}]
[null,null,"",null,null,null,null,null,null,null,null,null,null,null,null,null,null,167500]
[null,null,"",null,null,null,null,null,null,null,null,null,null,null,null,null,null,167500]
[null,null,"",null,null,null,null,null,null,null,null,null,null,null,null,null,null,167500]
[null,null,"",null,null,null,null,null,null,null,null,null,null,null,null,null,null,167500]
[null,null,"",null,null,null,null,null,null,null,null,null,null,null,null,null,null,167500]
[null,null,"",null,null,null,null,null,null,null,null,null,null,null,null,null,null,167500]
[null,null,"",null,null,null,null,null,null,null,null,null,null,null,null,null,null,167500]
[null,null,"",null,null,null,null,null,null,null,null,null,null,null,null,null,null,167500]
[null,null,"",null,null,null,null,null,null,null,null,null,null,null,null,null,null,167500]
[null,null,"",null,null,null,null,null,null,null,null,null,null,null,null,null,null,167500]
[null,null,"",null,null,null,null,null,null,null,null,null,null,null,null,null,null,167500]
[null,null,"",null,null,null,null,null,null,null,null,null,null,null,null,null,null,167500]
[null,null,"",null,null,null,null,null,null,null,null,null,null,null,null,null,null,167500]
[null,null,"",null,null,null,null,null,null,null,null,null,null,null,null,null,null,167500]
[null,null,"",null,null,null,null,null,null,null,null,null,null,null,null,null,null,167500]
[null,null,"",null,null,null,null,null,null,null,null,null,null,null,null,null,null,167500]
[null,null,"",null,null,null,null,null,null,null,null,null,null,null,null,null,null,167500]
[null,null,"",null,null,null,null,null,null,null,null,null,null,null,null,null,null,167500]
[null,null,"",null,null,null,null,null,null,null,null,null,null,null,null,null,null,167500]
[null,null,"",null,null,null,null,null,null,null,null,null,null,null,null,null,null,167500]
[null,null,"",null,null,null,null,null,null,null,null,null,null,null,null,null,null,167500]
[null,null,"",null,null,null,null,null,null,null,null,null,null,null,null,null,null,167500]
[null,null,"",null,null,null,null,null,null,null,null,null,null,null,null,null,null,167500]
[null,null,"",null,null,null,null,null,null,null,null,null,null,null,null,null,null,167500]
[null,null,"",null,null,null,null,null,null,null,null,null,null,null,null,null,null,167500]
[null,null,"",null,null,null,null,null,null,null,null,null,null,null,null,null,null,167500]
[null,null,"",null,null,null,null,null,null,null,null,null,null,null,null,null,null,167500]
[null,null,"",null,null,null,null,null,null,null,null,null,null,null,null,null,null,167500]
[null,null,"",null,null,null,null,null,null,null,null,null,null,null,null,null,null,167500]
[null,null,"",null,null,null,null,null,null,null,null,null,null,null,null,null,null,167500]
[null,null,"",null,null,null,null,null,null,null,null,null,null,null,null,null,null,167500]
[null,null,"",null,null,null,null,null,null,null,null,null,null,null,null,null,null,167500]
[null,null,"",null,null,null,null,null,null,null,null,null,null,null,null,null,null,167500]
[null,null,"",null,null,null,null,null,null,null,null,null,null,null,null,null,null,167500]
[null,null,"",null,null,null,null,null,null,null,null,null,null,null,null,null,null,167500]
[null,null,"",null,null,null,null,null,null,null,null,null,null,null,null,null,null,167500]
[null,null,"",null,null,null,null,null,null,null,null,null,null,null,null,null,null,167500]
[null,null,"",null,null,null,null,null,null,null,null,null,null,null,null,null,null,167500]
[null,null,"",null,null,null,null,null,null,null,null,null,null,null,null,null,null,167500]
[null,null,"",null,null,null,null,null,null,null,null,null,null,null,null,null,null,167500]
[null,null,{"$f":"IF(ISBLANK(D59),\"\",C58+1)","v":""},null,null,null,null,null,null,null,null,null,null,null,null,null,null,167500]
[null,null,"",null,null,null,null,null,null,null,null,null,null,null,null,null,null,167500]
[null,null,"",null,null,null,null,null,null,null,null,null,null,null,null,null,null,167500]
[null,null,"",null,null,null,null,null,null,null,null,null,null,null,null,null,null,167500]
[null,null,"",null,null,null,null,null,null,null,null,null,null,null,null,null,null,167500]
[null,null,"",null,null,null,null,null,null,null,null,null,null,null,null,null,null,167500]
[null,null,"",null,null,null,null,null,null,null,null,null,null,null,null,null,null,167500]
[null,null,"",null,null,null,null,null,null,null,null,null,null,null,null,null,null,167500]
[null,null,"",null,null,null,null,null,null,null,null,null,null,null,null,null,null,167500]
[null,null,"",null,null,null,null,null,null,null,null,null,null,null,null,null,null,{"$f":"IF(OR(F68=\"Dépôt local\",F68=\"Dépôt inter\",F67=\"CIE\",F68=\" SODECI\",F68=\"Inscription\"),R67-J68,R67+J68)","v":167500}]
[null,null,"",null,null,null,null,null,null,null,null,null,null,null,null,null,null,167500]
[null,null,"",null,null,null,null,null,null,null,null,null,null,null,null,null,null,167500]
[null,null,"",null,null,null,null,null,null,null,null,null,null,null,null,null,null,167500]
[null,null,"",null,null,null,null,null,null,null,null,null,null,null,null,null,null,167500]
[null,null,"",null,null,null,null,null,null,null,null,null,null,null,null,null,null,167500]
[null,null,"",null,null,null,null,null,null,null,null,null,null,null,null,null,null,167500]
[null,null,"",null,null,null,null,null,null,null,null,null,null,null,null,null,null,167500]
[null,null,"",null,null,null,null,null,null,null,null,null,null,null,null,null,null,167500]
[null,null,"",null,null,null,null,null,null,null,null,null,null,null,null,null,null,167500]
[null,null,"",null,null,null,null,null,null,null,null,null,null,null,null,null,null,167500]
[null,null,"",null,null,null,null,null,null,null,null,null,null,null,null,null,null,167500]
[null,null,"",null,null,null,null,null,null,null,null,null,null,null,null,null,null,167500]
[null,null,"",null,null,null,null,null,null,null,null,null,null,null,null,null,null,167500]
[null,null,"",null,null,null,null,null,null,null,null,null,null,null,null,null,null,167500]
[null,null,"",null,null,null,null,null,null,null,null,null,null,null,null,null,null,167500]
[null,null,"",null,null,null,null,null,null,null,null,null,null,null,null,null,null,167500]
[null,null,"",null,null,null,null,null,null,null,null,null,null,null,null,null,null,167500]
[null,null,"",null,null,null,null,null,null,null,null,null,null,null,null,null,null,167500]
[null,null,"",null,null,null,null,null,null,null,null,null,null,null,null,null,null,167500]
[null,null,"",null,null,null,null,null,null,null,null,null,null,null,null,null,null,167500]
[null,null,"",null,null,null,null,null,null,null,null,null,null,null,null,null,null,167500]
[null,null,"",null,null,null,null,null,null,null,null,null,null,null,null,null,null,167500]
[null,null,"",null,null,null,null,null,null,null,null,null,null,null,null,null,null,167500]
[null,null,"",null,null,null,null,null,null,null,null,null,null,null,null,null,null,167500]
[null,null,"",null,null,null,null,null,null,null,null,null,null,null,null,null,null,167500]
[null,null,"",null,null,null,null,null,null,null,null,null,null,null,null,null,null,167500]
[null,null,"",null,null,null,null,null,null,null,null,null,null,null,null,null,null,167500]
[null,null,"",null,null,null,null,null,null,null,null,null,null,null,null,null,null,167500]
[null,null,"",null,null,null,null,null,null,null,null,null,null,null,null,null,null,167500]
[null,null,"",null,null,null,null,null,null,null,null,null,null,null,null,null,null,167500]
[null,null,"",null,null,null,null,null,null,null,null,null,null,null,null,null,null,167500]
[null,null,"",null,null,null,null,null,null,null,null,null,null,null,null,null,null,167500]
[null,null,"",null,null,null,null,null,null,null,null,null,null,null,null,null,null,167500]
[null,null,"",null,null,null,null,null,null,null,null,null,null,null,null,null,null,167500]
[null,null,"",null,null,null,null,null,null,null,null,null,null,null,null,null,null,167500]
[null,null,"",null,null,null,null,null,null,null,null,null,null,null,null,null,null,167500]
[null,null,"",null,null,null,null,null,null,null,null,null,null,null,null,null,null,167500]
[null,null,"",null,null,null,null,null,null,null,null,null,null,null,null,null,null,167500]
[null,null,"",null,null,null,null,null,null,null,null,null,null,null,null,null,null,167500]
[null,null,"",null,null,null,null,null,null,null,null,null,null,null,null,null,null,167500]
[null,null,"",null,null,null,null,null,null,null,null,null,null,null,null,null,null,167500]
[null,null,"",null,null,null,null,null,null,null,null,null,null,null,null,null,null,167500]
[null,null,"",null,null,null,null,null,null,null,null,null,null,null,null,null,null,167500]
[null,null,"",null,null,null,null,null,null,null,null,null,null,null,null,null,null,167500]
[null,null,"",null,null,null,null,null,null,null,null,null,null,null,null,null,null,167500]
[null,null,"",null,null,null,null,null,null,null,null,null,null,null,null,null,null,167500]
[null,null,"",null,null,null,null,null,null,null,null,null,null,null,null,null,null,167500]
[null,null,"",null,null,null,null,null,null,null,null,null,null,null,null,null,null,167500]
[null,null,"",null,null,null,null,null,null,null,null,null,null,null,null,null,null,167500]
[null,null,"",null,null,null,null,null,null,null,null,null,null,null,null,null,null,167500]
[null,null,"",null,null,null,null,null,null,null,null,null,null,null,null,null,null,167500]
[null,null,"",null,null,null,null,null,null,null,null,null,null,null,null,null,null,167500]
[null,null,"",null,null,null,null,null,null,null,null,null,null,null,null,null,null,167500]
[null,null,"",null,null,null,null,null,null,null,null,null,null,null,null,null,null,167500]
[null,null,{"$f":"IF(ISBLANK(D123),\"\",C122+1)","v":""},null,null,null,null,null,null,null,null,null,null,null,null,null,null,167500]
[null,null,"",null,null,null,null,null,null,null,null,null,null,null,null,null,null,167500]
[null,null,"",null,null,null,null,null,null,null,null,null,null,null,null,null,null,167500]
[null,null,"",null,null,null,null,null,null,null,null,null,null,null,null,null,null,167500]
[null,null,"",null,null,null,null,null,null,null,null,null,null,null,null,null,null,167500]
[null,null,"",null,null,null,null,null,null,null,null,null,null,null,null,null,null,167500]
[null,null,"",null,null,null,null,null,null,null,null,null,null,null,null,null,null,167500]
[null,null,"",null,null,null,null,null,null,null,null,null,null,null,null,null,null,167500]
[null,null,"",null,null,null,null,null,null,null,null,null,null,null,null,null,null,167500]
[null,null,"",null,null,null,null,null,null,null,null,null,null,null,null,null,null,{"$f":"IF(OR(F132=\"Dépôt local\",F132=\"Dépôt inter\",F131=\"CIE\",F132=\" SODECI\",F132=\"Inscription\"),R131-J132,R131+J132)","v":167500}]
[null,null,"",null,null,null,null,null,null,null,null,null,null,null,null,null,null,167500]
[null,null,"",null,null,null,null,null,null,null,null,null,null,null,null,null,null,167500]
[null,null,"",null,null,null,null,null,null,null,null,null,null,null,null,null,null,167500]
[null,null,"",null,null,null,null,null,null,null,null,null,null,null,null,null,null,167500]
[null,null,"",null,null,null,null,null,null,null,null,null,null,null,null,null,null,167500]
[null,null,"",null,null,null,null,null,null,null,null,null,null,null,null,null,null,167500]
[null,null,"",null,null,null,null,null,null,null,null,null,null,null,null,null,null,167500]
[null,null,"",null,null,null,null,null,null,null,null,null,null,null,null,null,null,167500]
[null,null,"",null,null,null,null,null,null,null,null,null,null,null,null,null,null,167500]
[null,null,"",null,null,null,null,null,null,null,null,null,null,null,null,null,null,167500]
[null,null,"",null,null,null,null,null,null,null,null,null,null,null,null,null,null,167500]
[null,null,"",null,null,null,null,null,null,null,null,null,null,null,null,null,null,167500]
[null,null,"",null,null,null,null,null,null,null,null,null,null,null,null,null,null,167500]
[null,null,"",null,null,null,null,null,null,null,null,null,null,null,null,null,null,167500]
[null,null,"",null,null,null,null,null,null,null,null,null,null,null,null,null,null,167500]
[null,null,"",null,null,null,null,null,null,null,null,null,null,null,null,null,null,167500]
[null,null,"",null,null,null,null,null,null,null,null,null,null,null,null,null,null,167500]
[null,null,"",null,null,null,null,null,null,null,null,null,null,null,null,null,null,167500]
[null,null,"",null,null,null,null,null,null,null,null,null,null,null,null,null,null,167500]
[null,null,"",null,null,null,null,null,null,null,null,null,null,null,null,null,null,167500]
[null,null,"",null,null,null,null,null,null,null,null,null,null,null,null,null,null,167500]
[null,null,"",null,null,null,null,null,null,null,null,null,null,null,null,null,null,167500]
[null,null,"",null,null,null,null,null,null,null,null,null,null,null,null,null,null,167500]
[null,null,"",null,null,null,null,null,null,null,null,null,null,null,null,null,null,167500]
[null,null,"",null,null,null,null,null,null,null,null,null,null,null,null,null,null,167500]
[null,null,"",null,null,null,null,null,null,null,null,null,null,null,null,null,null,167500]
[null,null,"",null,null,null,null,null,null,null,null,null,null,null,null,null,null,167500]
[null,null,"",null,null,null,null,null,null,null,null,null,null,null,null,null,null,167500]
[null,null,"",null,null,null,null,null,null,null,null,null,null,null,null,null,null,167500]
[null,null,"",null,null,null,null,null,null,null,null,null,null,null,null,null,null,167500]
[null,null,"",null,null,null,null,null,null,null,null,null,null,null,null,null,null,167500]
[null,null,"",null,null,null,null,null,null,null,null,null,null,null,null,null,null,167500]
[null,null,"",null,null,null,null,null,null,null,null,null,null,null,null,null,null,167500]
[null,null,"",null,null,null,null,null,null,null,null,null,null,null,null,null,null,167500]
[null,null,"",null,null,null,null,null,null,null,null,null,null,null,null,null,null,167500]
[null,null,"",null,null,null,null,null,null,null,null,null,null,null,null,null,null,167500]
[null,null,"",null,null,null,null,null,null,null,null,null,null,null,null,null,null,167500]
[null,null,"",null,null,null,null,null,null,null,null,null,null,null,null,null,null,167500]
[null,null,"",null,null,null,null,null,null,null,null,null,null,null,null,null,null,167500]
[null,null,"",null,null,null,null,null,null,null,null,null,null,null,null,null,null,167500]
[null,null,"",null,null,null,null,null,null,null,null,null,null,null,null,null,null,167500]
[null,null,"",null,null,null,null,null,null,null,null,null,null,null,null,null,null,167500]
[null,null,"",null,null,null,null,null,null,null,null,null,null,null,null,null,null,167500]
[null,null,"",null,null,null,null,null,null,null,null,null,null,null,null,null,null,167500]
[null,null,"",null,null,null,null,null,null,null,null,null,null,null,null,null,null,167500]
[null,null,"",null,null,null,null,null,null,null,null,null,null,null,null,null,null,167500]
[null,null,"",null,null,null,null,null,null,null,null,null,null,null,null,null,null,167500]
[null,null,"",null,null,null,null,null,null,null,null,null,null,null,null,null,null,167500]
[null,null,"",null,null,null,null,null,null,null,null,null,null,null,null,null,null,167500]
[null,null,"",null,null,null,null,null,null,null,null,null,null,null,null,null,null,167500]
[null,null,"",null,null,null,null,null,null,null,null,null,null,null,null,null,null,167500]
[null,null,"",null,null,null,null,null,null,null,null,null,null,null,null,null,null,167500]
[null,null,"",null,null,null,null,null,null,null,null,null,null,null,null,null,null,167500]
[null,null,"",null,null,null,null,null,null,null,null,null,null,null,null,null,null,167500]
[null,null,{"$f":"IF(ISBLANK(D187),\"\",C186+1)","v":""},null,null,null,null,null,null,null,null,null,null,null,null,null,null,167500]
[null,null,"",null,null,null,null,null,null,null,null,null,null,null,null,null,null,167500]
[null,null,"",null,null,null,null,null,null,null,null,null,null,null,null,null,null,167500]
[null,null,"",null,null,null,null,null,null,null,null,null,null,null,null,null,null,167500]
[null,null,"",null,null,null,null,null,null,null,null,null,null,null,null,null,null,167500]
[null,null,"",null,null,null,null,null,null,null,null,null,null,null,null,null,null,167500]
[null,null,"",null,null,null,null,null,null,null,null,null,null,null,null,null,null,167500]
[null,null,"",null,null,null,null,null,null,null,null,null,null,null,null,null,null,167500]
[null,null,"",null,null,null,null,null,null,null,null,null,null,null,null,null,null,167500]
[null,null,"",null,null,null,null,null,null,null,null,null,null,null,null,null,null,{"$f":"IF(OR(F196=\"Dépôt local\",F196=\"Dépôt inter\",F195=\"CIE\",F196=\" SODECI\",F196=\"Inscription\"),R195-J196,R195+J196)","v":167500}]
[null,null,"",null,null,null,null,null,null,null,null,null,null,null,null,null,null,167500]
[null,null,"",null,null,null,null,null,null,null,null,null,null,null,null,null,null,167500]
[null,null,"",null,null,null,null,null,null,null,null,null,null,null,null,null,null,167500]
[null,null,"",null,null,null,null,null,null,null,null,null,null,null,null,null,null,167500]
{"$rows_left_out":852}
{"sheet":"RECAPITULATIF & ANALYSE","index":2,"n_rows":16,"n_cols":17,"rows_kept":16,"cut":false,"hidden":false,"merged":[[1,1,1,17],[2,1,2,17]]}
[" "]
[null,{"$f":"Tranfert_Argent!C1","v":"Transactions -Transfert d'argent"}]
[null,"RECAPITULATIF"]
[]
[null,null,null,"JAN","FEV","MAR","AVR","MAI","JUI","JUIL","AOU","SEP","OCT","NOV","DEC","TOTAL","%"]
[null,null,"COMMUNICATION",null,null,null,null,null,null,null,null,null,null,null,null,{"$f":"SUM(D6:O6)","v":0},{"$f":"P6/$P$16","v":{"$error":"#DIV/0!"}}]
[null,null,"REPAS",null,null,null,null,null,null,null,null,null,null,null,null,{"$f":"SUM(D7:O7)","v":0},{"$f":"P7/$P$16","v":{"$error":"#DIV/0!"}}]
[null,null,"TRANSPORT & CARBURANT",null,null,null,null,null,null,null,null,null,null,null,null,0,{"$error":"#DIV/0!"}]
[null,null,"MATERIEL",null,null,null,null,null,null,null,null,null,null,null,null,0,{"$error":"#DIV/0!"}]
[null,null,"LOCATION",null,null,null,null,null,null,null,null,null,null,null,null,0,{"$error":"#DIV/0!"}]
[null,null,"REPARATIONS & ENTRETIEN",null,null,null,null,null,null,null,null,null,null,null,null,0,{"$error":"#DIV/0!"}]
[null,null,"DIVERS",null,null,null,null,null,null,null,null,null,null,null,null,0,{"$error":"#DIV/0!"}]
[null,null,"AUTRE CATEGORIE 1",null,null,null,null,null,null,null,null,null,null,null,null,0,{"$error":"#DIV/0!"}]
[null,null,"AUTRE CATEGORIE 2",null,null,null,null,null,null,null,null,null,null,null,null,0,{"$error":"#DIV/0!"}]
[null,null,"AUTRE CATEGORIE 3",null,null,null,null,null,null,null,null,null,null,null,null,0,{"$error":"#DIV/0!"}]
[null,null,"TOTAUX",{"$f":"SUM(D6:D14)","v":0},{"$f":"SUM(E6:E14)","v":0},0,0,0,0,0,0,0,0,0,0,{"$f":"SUM(D16:O16)","v":0},{"$f":"SUM(Q6:Q14)","v":{"$error":"#DIV/0!"}}]