{"text_format":"1","workbook":"xlsx","n_sheets":29,"sheets":["Photos","Champions","Écuries","Pilotes","Melbourne","Vietnam","Chine","Hollande","Monaco","Azerbaïdjan","Canada","France","Autriche","Autriche2","Hongrie","GB","GrB","Espagne","Belgique","Italie","Toscane","Russie","Nürburgring","Portugal","Émilie-Romagne","Turquie","Bahrein","Sakhir","AbuDhabi"],"not_rendered":{"charts":0,"images":132,"macros":1,"external_links":1,"defined_names":19,"comments":0,"pivot_tables":0},"unopened":[],"bounds":{"document_bytes":16777216,"sheet_cells":100000,"rows_first":2000,"rows_last":500,"rows_between":2000,"halvings":0,"cell_chars":16384,"cell_head_chars":4096},"cells_cut":0,"cells_raw":0,"read":"whole","date_system":"1900"}

{"sheet":"Photos","index":0,"n_rows":23,"n_cols":8,"rows_kept":23,"cut":false,"hidden":false,"merged":[[1,5,1,7],[1,1,1,3]]}
[]
[null,"Photos Pilotes",null,null,null,"Photos F1"]
[null,"Noms",null,"Photos",null,"Noms",null,"Photos"]
[null,"HAMILTON Lewis",{"$f":"\"Photos!\"&ADDRESS(ROW(C4),COLUMN(D4))","v":"Photos!$D$4"},null,null,"MERCEDES",{"$f":"\"Photos!\"&ADDRESS(ROW(G4),COLUMN(H4))","v":"Photos!$H$4"}]
[null,"BOTTAS Valtteri","Photos!$D$5",null,null,"FERRARI","Photos!$H$5"]
[null,"LECLERC Charles","Photos!$D$6",null,null,"RED BULL","Photos!$H$6"]
[null,"VETTEL Sebastian","Photos!$D$7",null,null,"RACING POINT","Photos!$H$7"]
[null,"VERSTAPPEN Max","Photos!$D$8",null,null,"WILLIAMS","Photos!$H$8"]
[null,"ALBON Alexander","Photos!$D$9",null,null,"RENAULT","Photos!$H$9"]
[null,"PEREZ Sergio","Photos!$D$10",null,null,"ALPHA TAURI","Photos!$H$10"]
[null,"STROLL Lance","Photos!$D$11",null,null,"HASS","Photos!$H$11"]
[null,"RUSSELL George","Photos!$D$12",null,null,"McLAREN","Photos!$H$12"]
[null,"LATIFI Nichola","Photos!$D$13",null,null,"ALFA ROMEO","Photos!$H$13"]
[null,"RICCIARDO Daniel","Photos!$D$14"]
[null,"OCON Sebastian","Photos!$D$15"]
[null,"KVYAT Daniil","Photos!$D$16"]
[null,"GASLY Pierre","Photos!$D$17"]
[null,"GROSJEAN Romain","Photos!$D$18"]
[null,"MAGNUSSEN Kevin","Photos!$D$19"]
[null,"NORRIS Lando","Photos!$D$20"]
[null,"SAINZ.Jr Carlos","Photos!$D$21"]
[null,"RAÏKKÖNEN Kimi","Photos!$D$22"]
[null,"GIOVINAZZI Antonio ","Photos!$D$23"]

{"sheet":"Champions","index":1,"n_rows":22,"n_cols":10,"rows_kept":22,"cut":false,"hidden":false,"merged":[[1,2,1,10],[15,2,15,10],[17,5,17,7],[18,5,18,7],[3,5,3,7],[4,5,4,7],[6,1,6,3],[7,1,7,3],[6,9,6,11],[7,9,7,11],[8,9,12,11],[5,5,9,7],[8,1,12,3],[20,1,20,3],[21,1,21,3],[20,9,20,11],[21,9,21,11],[22,1,26,3],[19,5,23,7],[22,9,26,11]]}
[]
[null,null,"CHAMPIONNAT PILOTES 2020"]
[]
[null,null,null,null,null,"CHAMPION 2020"]
[null,null,null,null,null,{"$f":"IF(Pilotes!G5=1,Pilotes!B5,\"\")","v":"HAMILTON Lewis"}]
[]
[null,"DEUXIÈME",null,null,null,null,null,null,null,"TROIXIÈME"]
[null,{"$f":"IF(Pilotes!G6=2,Pilotes!B6,\"\")","v":"BOTTAS Valtteri"},null,null,null,null,null,null,null,{"$f":"IF(Pilotes!G7=3,Pilotes!B7,\"\")","v":"VERSTAPPEN Max"}]
[]
[]
[]
[]
[]
[]
[]
[null,null,"CHAMPIONNAT CONSTRUCTEURS 2020"]
[]
[null,null,null,null,null,"CHAMPION 2019"]
[null,null,null,null,null,{"$f":"IF(Écuries!F4=1,Écuries!B4,\"\")","v":"MERCEDES"}]
[]
[null,"DEUXIÈME",null,null,null,null,null,null,null,"TROIXIÈME"]
[null,{"$f":"IF(Écuries!F5=2,Écuries!B5,\"\")","v":"RED BULL"},null,null,null,null,null,null,null,{"$f":"IF(Écuries!F6=3,Écuries!B6,\"\")","v":"McLAREN"}]

{"sheet":"Écuries","index":2,"n_rows":16,"n_cols":6,"rows_kept":16,"cut":false,"hidden":false,"merged":[[0,1,0,5],[15,1,15,5]]}
[]
[]
[null,"ÉCURIES","POINTS","Écart/premier","Écart/précédent","RANG"]
[null,"MERCEDES",{"$f":"SUM(Melbourne:AbuDhabi!$G$5:$G$7)","v":533},null,null,{"$f":"IF(C4=\"\",0,(RANK(C4,$C$4:$C$13)))+COUNTIF(C$4:C4,C4)-1","v":1}]
[null,"RED BULL",{"$f":"SUM(Melbourne:AbuDhabi!$G$11:$G$13)","v":274},{"$f":"C5-C4","v":-259},{"$f":"C5-C4","v":-259},{"$f":"IF(C5=\"\",0,(RANK(C5,$C$4:$C$13)))+COUNTIF(C$4:C5,C5)-1","v":2}]
[null,"McLAREN",{"$f":"SUM(Melbourne:AbuDhabi!$G$29:$G$31)","v":171},{"$f":"C6-C4","v":-362},{"$f":"C6-C5","v":-103},{"$f":"IF(C6=\"\",0,(RANK(C6,$C$4:$C$13)))+COUNTIF(C$4:C6,C6)-1","v":3}]
[null,"RACING POINT *",{"$f":"SUM(Melbourne:AbuDhabi!$G$14:$G$16)-15","v":154},{"$f":"C7-C4","v":-379},-17,{"$f":"IF(C7=\"\",0,(RANK(C7,$C$4:$C$13)))+COUNTIF(C$4:C7,C7)-1","v":4}]
[null,"RENAULT",{"$f":"SUM(Melbourne:AbuDhabi!$G$20:$G$22)","v":144},{"$f":"C8-C4","v":-389},-10,{"$f":"IF(C8=\"\",0,(RANK(C8,$C$4:$C$13)))+COUNTIF(C$4:C8,C8)-1","v":5}]
[null,"FERRARI",{"$f":"SUM(Melbourne:AbuDhabi!$G$8:$G$10)","v":131},{"$f":"C9-C4","v":-402},-13,{"$f":"IF(C9=\"\",0,(RANK(C9,$C$4:$C$13)))+COUNTIF(C$4:C9,C9)-1","v":6}]
[null,"ALPHA TAURI",{"$f":"SUM(Melbourne:AbuDhabi!$G$23:$G$25)","v":97},{"$f":"C10-C4","v":-436},-34,{"$f":"IF(C10=\"\",0,(RANK(C10,$C$4:$C$13)))+COUNTIF(C$4:C10,C10)-1","v":7}]
[null,"ALFA ROMÉO",{"$f":"SUM(Melbourne:AbuDhabi!$G$32:$G$34)","v":8},{"$f":"C11-C4","v":-525},-89,{"$f":"IF(C11=\"\",0,(RANK(C11,$C$4:$C$13)))+COUNTIF(C$4:C11,C11)-1","v":8}]
[null,"HASS",{"$f":"SUM(Melbourne:AbuDhabi!$G$26:$G$28)","v":3},{"$f":"C12-C4","v":-530},-5,{"$f":"IF(C12=\"\",0,(RANK(C12,$C$4:$C$13)))+COUNTIF(C$4:C12,C12)-1","v":9}]
[null,"WILLIAMS",{"$f":"SUM(Melbourne:AbuDhabi!$G$17:$G$19)","v":0},{"$f":"C13-C4","v":-533},-3,{"$f":"IF(C13=\"\",0,(RANK(C13,$C$4:$C$13)))+COUNTIF(C$4:C13,C13)-1","v":10}]
[]
[]
[null,"*-15 points pour copie de frein sur Mercedes en 2019"]

{"sheet":"Pilotes","index":3,"n_rows":29,"n_cols":21,"rows_kept":29,"cut":false,"hidden":false,"merged":[[2,9,3,9],[0,0,0,7],[2,1,3,1],[2,2,3,2],[2,6,3,6],[2,3,3,3],[2,4,3,4],[2,5,3,5]]}
[]
[]
[null,"PILOTES","Points","Écart-premier","Écart/précédent","Pôle Position","Place",1,null,"Courses"]
[null,null,{"$f":"IFERROR(SUM(Melbourne!G33,[1]Bahreïn!F33),\"\")","v":0},null,null,null,{"$f":"IF(C4=0,\"\",(RANK(C4,C1:C4)))","v":""},"Pos.saison",null,{"$f":"IF(F4=0,\"\",(RANK(F4,F1:F4)))","v":""}]
[null,"HAMILTON Lewis",{"$f":"SUM(Melbourne:AbuDhabi!$G$5)","v":332},null,null,{"$f":"CalculPool(B5)","v":10},{"$f":"IF(C5=\"\",0,(RANK(C5,$C$5:$C$25)))","v":1},{"$f":"CalculPosition(B5)","v":11},{"$f":"H5/17","v":0.6470588235294118},"Melbourne","Autriche2","Hongrie","GB","Espagne","Belgique","Toscane","Nürburgring","Portugal","Émilie-Romagne","Turquie","Bahrein"]
[null,"BOTTAS Valtteri",{"$f":"SUM(Melbourne:AbuDhabi!$G$6)","v":201},{"$f":"C6-C5","v":-131},{"$f":"C6-C5","v":-131},{"$f":"CalculPool(B6)","v":3},{"$f":"IF(C6=\"\",0,(RANK(C6,$C$5:$C$25)))","v":2},{"$f":"CalculPosition(B6)","v":2},{"$f":"H6/17","v":0.11764705882352941},"Vietnam","Autriche","Russie"]
[null,"VERSTAPPEN Max",{"$f":"SUM(Melbourne:AbuDhabi!$G$11)","v":189},{"$f":"C7-C5","v":-143},{"$f":"C7-C6","v":-12},0,3,1,5.8823529411764705E-2,"Chine","GrB"]
[null,"RICCIARDO Daniel",{"$f":"SUM(Melbourne:AbuDhabi!$G$20)","v":102},{"$f":"C8-C5","v":-230},-87,{"$f":"CalculPool(B8)","v":0},4,0,0,"Hollande"]
[null,"PEREZ Sergio",{"$f":"SUM(Melbourne:AbuDhabi!$G$14)","v":100},{"$f":"C9-C5","v":-232},-2,0,5,0,0,"Monaco"]
[null,"LECLERC Charles",{"$f":"SUM(Melbourne:AbuDhabi!$G$9)","v":98},{"$f":"C10-C5","v":-234},-2,0,6,0,0,"Azerbaïdjan"]
[null,"NORRIS Lando",{"$f":"SUM(Melbourne:AbuDhabi!$G$29)","v":86},{"$f":"C11-C5","v":-246},-12,0,7,0,0,"Canada"]
[null,"SAINZ.Jr Carlos",{"$f":"SUM(Melbourne:AbuDhabi!$G$30)","v":85},{"$f":"C12-C5","v":-247},-1,0,8,0,0,"France"]
[null,"ALBON Alexander",{"$f":"SUM(Melbourne:AbuDhabi!$G$12)","v":85},{"$f":"C13-C5","v":-247},0,0,8,0,0,"Autriche"]
[null,"GASLY Pierre",{"$f":"SUM(Melbourne:AbuDhabi!$G$24)","v":71},{"$f":"C14-C5","v":-261},-14,0,10,1,5.8823529411764705E-2,"Autriche2","Italie"]
[null,"STROLL Lance",{"$f":"SUM(Melbourne:AbuDhabi!$G$15)","v":59},{"$f":"C15-C5","v":-273},-12,1,11,0,0,"Hongrie"]
[null,"OCON Sebastian",{"$f":"SUM(Melbourne:AbuDhabi!$G$21)","v":42},{"$f":"C16-C5","v":-290},-17,0,12,0,0,"GB"]
[null,"VETTEL Sebastian",{"$f":"SUM(Melbourne:AbuDhabi!$G$8)","v":33},{"$f":"C17-C5","v":-299},-9,0,13,0,0,"GrB"]
[null,"KVYAT Daniil",{"$f":"SUM(Melbourne:AbuDhabi!$G$23)","v":26},{"$f":"C18-C5","v":-306},-7,{"$f":"CalculPool(B18)","v":0},14,0,0,"Espagne"]
[null,"HULKENBERG Nico",{"$f":"SUM(Melbourne:AbuDhabi!$G$16)","v":10},{"$f":"C19-C5","v":-322},-16,0,15,0,0,"Belgique"]
[null,"GIOVINAZZI Antonio",{"$f":"SUM(Melbourne:AbuDhabi!$G$33)","v":4},{"$f":"C20-C5","v":-328},-6,0,16,0,0,"Italie"]
[null,"RAÏKKÖNEN Kimi",{"$f":"SUM(Melbourne:AbuDhabi!$G$32)","v":4},{"$f":"C21-C5","v":-328},0,0,16,0,0,"Toscane"]
[null,"GROSJEAN Romain",{"$f":"SUM(Melbourne:AbuDhabi!$G$26)","v":2},{"$f":"C22-C5","v":-330},-2,0,18,0,0,"Russie"]
[null,"MAGNUSSEN Kevin",{"$f":"SUM(Melbourne:AbuDhabi!$G$27)","v":1},{"$f":"C23-C5","v":-331},-1,0,19,0,0,"Nürburgring"]
[null,"RUSSELL George",{"$f":"SUM(Melbourne:AbuDhabi!$G$17)","v":0},{"$f":"C24-C5","v":-332},-1,0,20,0,0,"Portugal"]
[null,"LATIFI Nichola",{"$f":"SUM(Melbourne:AbuDhabi!$G$18)","v":0},{"$f":"C25-C5","v":-332},0,0,20,0,0,"Émilie-Romagne"]
[null,null,null,null,null,null,null,null,null,"Turquie"]
[null,null,null,null,null,null,null,null,null,"Bahrein"]
[null,null,null,null,null,null,null,null,null,"Sakhir"]
[null,null,null,null,null,null,null,null,null,"AbuDhabi"]

{"sheet":"Melbourne","index":4,"n_rows":34,"n_cols":11,"rows_kept":34,"cut":false,"hidden":false,"merged":[[22,2,24,2],[7,2,9,2],[10,2,12,2],[0,0,1,14],[4,2,6,2],[2,0,3,0],[2,1,3,1],[2,2,3,2],[2,3,3,3],[2,5,3,5],[2,6,3,6],[2,4,3,4],[4,1,6,1],[7,1,9,1],[10,1,12,1],[2,8,2,10],[17,8,20,12],[28,1,30,1],[31,1,33,1],[34,1,36,1],[13,1,15,1],[16,1,18,1],[19,1,21,1],[22,1,24,1],[25,1,27,1],[34,2,36,2],[31,2,33,2],[13,2,15,2],[16,2,18,2],[19,2,21,2],[28,2,30,2],[25,2,27,2]]}
["JEREZ - 26 JUILLET 2020"]
[]
["PILOTES","ECURIES","VOITURES","Finish","Pôle","Pt tour","Points",null,"CLASSEMENT"]
[null,null,null,null,null,null,null,null,"ÉCURIES","POINTS","RANG"]
["HAMILTON Lewis","MERCEDES",null,null,null,null,{"$f":"IFERROR(CHOOSE(D5,25,18,15,12,10,8,6,4,2,1)+(F5=1),\"\")","v":""},null,"MERCEDES",{"$f":"SUM($G$5:$G$7)","v":0},{"$f":"IF(J5=\"\",0,(RANK(J5,$J$5:$J$14)))+COUNTIF(J$5:J5,J5)-1","v":1}]
["BOTTAS Valtteri",null,null,null,null,null,{"$f":"IFERROR(CHOOSE(D6,25,18,15,12,10,8,6,4,2,1)+(F6=1),\"\")","v":""},null,"ALFA ROMEO",{"$f":"SUM($G$32:$G$34)","v":0},{"$f":"IF(J6=\"\",0,(RANK(J6,$J$5:$J$14)))+COUNTIF(J$5:J6,J6)-1","v":2}]
[null,null,null,null,null,null,"",null,"Mc LAREN",{"$f":"SUM($G$29:$G$31)","v":0},{"$f":"IF(J7=\"\",0,(RANK(J7,$J$5:$J$14)))+COUNTIF(J$5:J7,J7)-1","v":3}]
["VETTEL Sebastian","FERRARI",null,null,null,null,"",null,"RENAULT",{"$f":"SUM($G$20:$G$22)","v":0},{"$f":"IF(J8=\"\",0,(RANK(J8,$J$5:$J$14)))+COUNTIF(J$5:J8,J8)-1","v":4}]
["LECLERC Charles",null,null,null,null,null,"",null,"RED BULL",{"$f":"SUM($G$11:$G$13)","v":0},{"$f":"IF(J9=\"\",0,(RANK(J9,$J$5:$J$14)))+COUNTIF(J$5:J9,J9)-1","v":5}]
[null,null,null,null,null,null,"",null,"FERRARI",{"$f":"SUM($G$8:$G$10)","v":0},{"$f":"IF(J10=\"\",0,(RANK(J10,$J$5:$J$14)))+COUNTIF(J$5:J10,J10)-1","v":6}]
["VERSTAPPEN Max","RED BULL",null,null,null,null,"",null,"ALPHA TAURI",{"$f":"SUM($G$23:$G$25)","v":0},{"$f":"IF(J11=\"\",0,(RANK(J11,$J$5:$J$14)))+COUNTIF(J$5:J11,J11)-1","v":7}]
["ALBON Alexander",null,null,null,null,null,"",null,"WILLIAMS",{"$f":"SUM($G$17:$G$19)","v":0},{"$f":"IF(J12=\"\",0,(RANK(J12,$J$5:$J$14)))+COUNTIF(J$5:J12,J12)-1","v":8}]
[null,null,null,null,null,null,"",null,"RACING POINT",{"$f":"SUM($G$14:$G$16)","v":0},{"$f":"IF(J13=\"\",0,(RANK(J13,$J$5:$J$14)))+COUNTIF(J$5:J13,J13)-1","v":9}]
["PEREZ Sergio","RACING\nPOINT",null,null,null,null,"",null,"HAAS",{"$f":"SUM($G$26:$G$28)","v":0},{"$f":"IF(J14=\"\",0,(RANK(J14,$J$5:$J$14)))+COUNTIF(J$5:J14,J14)-1","v":10}]
["STROLL Lance",null,null,null,null,null,""]
[null,null,null,null,null,null,""]
["RUSSELL George","WILLIAMS",null,null,null,null,""]
["LATIFI Nichola",null,null,null,null,null,"",null,"ANNULÉ"]
[null,null,null,null,null,null,""]
["RICCIARDO Daniel","RENAULT",null,null,null,null,""]
["OCON Sebastian",null,null,null,null,null,""]
[null,null,null,null,null,null,""]
["KVYAT Daniil","ALPHA TAURI",null,null,null,null,""]
["GASLY Pierre",null,null,null,null,null,""]
[null,null,null,null,null,null,""]
["GROSJEAN Romain","HAAS",null,null,null,null,""]
["MAGNUSSEN Kevin",null,null,null,null,null,""]
[null,null,null,null,null,null,""]
["NORRIS Lando","McLAREN",null,null,null,null,""]
["SAINZ.Jr Carlos",null,null,null,null,null,""]
[null,null,null,null,null,null,""]
["RAÏKKÖNEN Kimi","ALFA ROMEO",null,null,null,null,""]
["GIOVINAZZI Antonio",null,null,null,null,null,""]
[null,null,null,null,null,null,""]

{"sheet":"Vietnam","index":5,"n_rows":34,"n_cols":13,"rows_kept":34,"cut":false,"hidden":false,"merged":[[4,1,6,1],[4,2,6,2],[7,1,9,1],[7,2,9,2],[10,1,12,1],[10,2,12,2],[2,8,2,12],[0,0,1,13],[2,1,3,1],[2,2,3,2],[2,3,3,3],[2,5,3,5],[2,6,3,6],[2,4,3,4],[2,0,3,0],[13,1,15,1],[13,2,15,2],[16,1,18,1],[16,2,18,2],[19,1,21,1],[19,2,21,2],[17,8,20,12],[34,2,36,2],[34,1,36,1],[31,1,33,1],[31,2,33,2],[22,1,24,1],[22,2,24,2],[25,1,27,1],[25,2,27,2],[28,1,30,1],[28,2,30,2]]}
["MASARYK - 9 AOUT 2020"]
[]
["PILOTES","ECURIES","VOITURES","Finish","Pôle","Pt tour","Points",null,"CLASSEMENT"]
[null,null,null,null,null,null,null,null,"ÉCURIES","POINTS","RANG","TOTAL","PONCTUEL"]
["HAMILTON Lewis","MERCEDES",null,null,null,null,{"$f":"IFERROR(CHOOSE(D5,25,18,15,12,10,8,6,4,2,1)+(F5=1),\"\")","v":""},null,"ALFA ROMEO",{"$f":"SUM($G$32:$G$34)","v":0},{"$f":"IF(J5=\"\",0,(RANK(J5,$J$5:$J$14)))+COUNTIF(J$5:J5,J5)-1","v":1},{"$f":"SUMIF(Melbourne!$J$5:$J$14,Vietnam!$J5,Melbourne!$J$5:$J$14)+$J$514","v":0},{"$f":"IF(L5=\"\",0,(RANK(L5,$L$5:$L$14)))+COUNTIF(L$5:L5,L5)-1","v":1}]
["BOTTAS Valtteri",null,null,null,null,null,{"$f":"IFERROR(CHOOSE(D6,25,18,15,12,10,8,6,4,2,1)+(F6=1),\"\")","v":""},null,"Mc LAREN",{"$f":"SUM($G$29:$G$31)","v":0},{"$f":"IF(J6=\"\",0,(RANK(J6,$J$5:$J$14)))+COUNTIF(J$5:J6,J6)-1","v":2},{"$f":"SUMIF(Melbourne!$J$5:$J$14,Vietnam!$J6,Melbourne!$J$5:$J$14)+$J$514","v":0},{"$f":"IF(L6=\"\",0,(RANK(L6,$L$5:$L$14)))+COUNTIF(L$5:L6,L6)-1","v":2}]
[null,null,null,null,null,null,"",null,"RENAULT",{"$f":"SUM($G$20:$G$22)","v":0},{"$f":"IF(J7=\"\",0,(RANK(J7,$J$5:$J$14)))+COUNTIF(J$5:J7,J7)-1","v":3},{"$f":"SUMIF(Melbourne!$J$5:$J$14,Vietnam!$J7,Melbourne!$J$5:$J$14)+$J$514","v":0},{"$f":"IF(L7=\"\",0,(RANK(L7,$L$5:$L$14)))+COUNTIF(L$5:L7,L7)-1","v":3}]
["VETTEL Sebastian","FERRARI",null,null,null,null,"",null,"RED BULL",{"$f":"SUM($G$11:$G$13)","v":0},{"$f":"IF(J8=\"\",0,(RANK(J8,$J$5:$J$14)))+COUNTIF(J$5:J8,J8)-1","v":4},{"$f":"SUMIF(Melbourne!$J$5:$J$14,Vietnam!$J8,Melbourne!$J$5:$J$14)+$J$514","v":0},{"$f":"IF(L8=\"\",0,(RANK(L8,$L$5:$L$14)))+COUNTIF(L$5:L8,L8)-1","v":4}]
["LECLERC Charles",null,null,null,null,null,"",null,"FERRARI",{"$f":"SUM($G$8:$G$10)","v":0},{"$f":"IF(J9=\"\",0,(RANK(J9,$J$5:$J$14)))+COUNTIF(J$5:J9,J9)-1","v":5},{"$f":"SUMIF(Melbourne!$J$5:$J$14,Vietnam!$J9,Melbourne!$J$5:$J$14)+$J$514","v":0},{"$f":"IF(L9=\"\",0,(RANK(L9,$L$5:$L$14)))+COUNTIF(L$5:L9,L9)-1","v":5}]
[null,null,null,null,null,null,"",null,"ALPHA TAURI",{"$f":"SUM($G$23:$G$25)","v":0},{"$f":"IF(J10=\"\",0,(RANK(J10,$J$5:$J$14)))+COUNTIF(J$5:J10,J10)-1","v":6},{"$f":"SUMIF(Melbourne!$J$5:$J$14,Vietnam!$J10,Melbourne!$J$5:$J$14)+$J$514","v":0},{"$f":"IF(L10=\"\",0,(RANK(L10,$L$5:$L$14)))+COUNTIF(L$5:L10,L10)-1","v":6}]
["VERSTAPPEN Max","RED BULL",null,null,null,null,"",null,"WILLIAMS",{"$f":"SUM($G$17:$G$19)","v":0},{"$f":"IF(J11=\"\",0,(RANK(J11,$J$5:$J$14)))+COUNTIF(J$5:J11,J11)-1","v":7},{"$f":"SUMIF(Melbourne!$J$5:$J$14,Vietnam!$J11,Melbourne!$J$5:$J$14)+$J$514","v":0},{"$f":"IF(L11=\"\",0,(RANK(L11,$L$5:$L$14)))+COUNTIF(L$5:L11,L11)-1","v":7}]
["ALBON Alexander",null,null,null,null,null,"",null,"MERCEDES",{"$f":"SUM($G$5:$G$7)","v":0},{"$f":"IF(J12=\"\",0,(RANK(J12,$J$5:$J$14)))+COUNTIF(J$5:J12,J12)-1","v":8},{"$f":"SUMIF(Melbourne!$J$5:$J$14,Vietnam!$J12,Melbourne!$J$5:$J$14)+$J$514","v":0},{"$f":"IF(L12=\"\",0,(RANK(L12,$L$5:$L$14)))+COUNTIF(L$5:L12,L12)-1","v":8}]
[null,null,null,null,null,null,"",null,"RACING POINT",{"$f":"SUM($G$14:$G$16)","v":0},{"$f":"IF(J13=\"\",0,(RANK(J13,$J$5:$J$14)))+COUNTIF(J$5:J13,J13)-1","v":9},{"$f":"SUMIF(Melbourne!$J$5:$J$14,Vietnam!$J13,Melbourne!$J$5:$J$14)+$J$514","v":0},{"$f":"IF(L13=\"\",0,(RANK(L13,$L$5:$L$14)))+COUNTIF(L$5:L13,L13)-1","v":9}]
["PEREZ Sergio","RACING\nPOINT",null,null,null,null,"",null,"HAAS",{"$f":"SUM($G$26:$G$28)","v":0},{"$f":"IF(J14=\"\",0,(RANK(J14,$J$5:$J$14)))+COUNTIF(J$5:J14,J14)-1","v":10},{"$f":"SUMIF(Melbourne!$J$5:$J$14,Vietnam!$J14,Melbourne!$J$5:$J$14)+$J$514","v":0},{"$f":"IF(L14=\"\",0,(RANK(L14,$L$5:$L$14)))+COUNTIF(L$5:L14,L14)-1","v":10}]
["STROLL Lance",null,null,null,null,null,""]
[null,null,null,null,null,null,""]
["RUSSELL George","WILLIAMS",null,null,null,null,""]
["LATIFI Nichola",null,null,null,null,null,"",null,"ANNULÉ"]
[null,null,null,null,null,null,""]
["RICCIARDO Daniel","RENAULT",null,null,null,null,""]
["OCON Sebastian",null,null,null,null,null,""]
[null,null,null,null,null,null,""]
["KVYAT Daniil","ALPHA TAURI",null,null,null,null,""]
["GASLY Pierre",null,null,null,null,null,""]
[null,null,null,null,null,null,""]
["GROSJEAN Romain","HAAS",null,null,null,null,""]
["MAGNUSSEN Kevin",null,null,null,null,null,""]
[null,null,null,null,null,null,""]
["NORRIS Lando","McLAREN",null,null,null,null,""]
["SAINZ.Jr Carlos",null,null,null,null,null,""]
[null,null,null,null,null,null,""]
["RAÏKKÖNEN Kimi","ALFA ROMEO",null,null,null,null,""]
["GIOVINAZZI Antonio",null,null,null,null,null,""]
[null,null,null,null,null,null,""]

{"sheet":"Chine","index":6,"n_rows":34,"n_cols":13,"rows_kept":34,"cut":false,"hidden":false,"merged":[[19,1,21,1],[19,2,21,2],[31,1,33,1],[31,2,33,2],[22,1,24,1],[22,2,24,2],[25,1,27,1],[25,2,27,2],[28,1,30,1],[28,2,30,2],[10,1,12,1],[10,2,12,2],[13,1,15,1],[13,2,15,2],[16,1,18,1],[16,2,18,2],[17,8,20,12],[34,1,36,1],[34,2,36,2],[0,0,1,13],[2,0,3,0],[2,1,3,1],[2,2,3,2],[2,3,3,3],[2,4,3,4],[2,5,3,5],[2,6,3,6],[2,8,2,12],[4,1,6,1],[4,2,6,2],[7,1,9,1],[7,2,9,2]]}
["SPIELBERG - 23 AOUT 2020"]
[]
["PILOTES","ECURIES","VOITURES","Finish","Pôle","Pt tour","Points",null,"CLASSEMENT"]
[null,null,null,null,null,null,null,null,"ÉCURIES","POINTS","RANG","TOTAL","PONCTUEL"]
["HAMILTON Lewis","MERCEDES",null,null,null,null,{"$f":"IFERROR(CHOOSE(D5,25,18,15,12,10,8,6,4,2,1)+(F5=1),\"\")","v":""},null,"Mc LAREN",{"$f":"SUM($G$29:$G$31)","v":0},{"$f":"IF(J5=\"\",0,(RANK(J5,$J$5:$J$14)))+COUNTIF(J$5:J5,J5)-1","v":1},{"$f":"SUMIF(Vietnam!$J$5:$J$14,Chine!$J5,Vietnam!$J$5:$J$14)+$J$14","v":0},{"$f":"IF(L5=\"\",0,(RANK(L5,$L$5:$L$14)))+COUNTIF(L$5:L5,L5)-1","v":1}]
["BOTTAS Valtteri",null,null,null,null,null,{"$f":"IFERROR(CHOOSE(D6,25,18,15,12,10,8,6,4,2,1)+(F6=1),\"\")","v":""},null,"ALFA ROMEO",{"$f":"SUM($G$32:$G$34)","v":0},{"$f":"IF(J6=\"\",0,(RANK(J6,$J$5:$J$14)))+COUNTIF(J$5:J6,J6)-1","v":2},{"$f":"SUMIF(Vietnam!$J$5:$J$14,Chine!$J6,Vietnam!$J$5:$J$14)+$J$14","v":0},{"$f":"IF(L6=\"\",0,(RANK(L6,$L$5:$L$14)))+COUNTIF(L$5:L6,L6)-1","v":2}]
[null,null,null,null,null,null,"",null,"RENAULT",{"$f":"SUM($G$20:$G$22)","v":0},{"$f":"IF(J7=\"\",0,(RANK(J7,$J$5:$J$14)))+COUNTIF(J$5:J7,J7)-1","v":3},{"$f":"SUMIF(Vietnam!$J$5:$J$14,Chine!$J7,Vietnam!$J$5:$J$14)+$J$14","v":0},{"$f":"IF(L7=\"\",0,(RANK(L7,$L$5:$L$14)))+COUNTIF(L$5:L7,L7)-1","v":3}]
["VETTEL Sebastian","FERRARI",null,null,null,null,"",null,"RED BULL",{"$f":"SUM($G$11:$G$13)","v":0},{"$f":"IF(J8=\"\",0,(RANK(J8,$J$5:$J$14)))+COUNTIF(J$5:J8,J8)-1","v":4},{"$f":"SUMIF(Vietnam!$J$5:$J$14,Chine!$J8,Vietnam!$J$5:$J$14)+$J$14","v":0},{"$f":"IF(L8=\"\",0,(RANK(L8,$L$5:$L$14)))+COUNTIF(L$5:L8,L8)-1","v":4}]
["LECLERC Charles",null,null,null,null,null,"",null,"FERRARI",{"$f":"SUM($G$8:$G$10)","v":0},{"$f":"IF(J9=\"\",0,(RANK(J9,$J$5:$J$14)))+COUNTIF(J$5:J9,J9)-1","v":5},{"$f":"SUMIF(Vietnam!$J$5:$J$14,Chine!$J9,Vietnam!$J$5:$J$14)+$J$14","v":0},{"$f":"IF(L9=\"\",0,(RANK(L9,$L$5:$L$14)))+COUNTIF(L$5:L9,L9)-1","v":5}]
[null,null,null,null,null,null,"",null,"ALPHA TAURI",{"$f":"SUM($G$23:$G$25)","v":0},{"$f":"IF(J10=\"\",0,(RANK(J10,$J$5:$J$14)))+COUNTIF(J$5:J10,J10)-1","v":6},{"$f":"SUMIF(Vietnam!$J$5:$J$14,Chine!$J10,Vietnam!$J$5:$J$14)+$J$14","v":0},{"$f":"IF(L10=\"\",0,(RANK(L10,$L$5:$L$14)))+COUNTIF(L$5:L10,L10)-1","v":6}]
["VERSTAPPEN Max","RED BULL",null,null,null,null,"",null,"WILLIAMS",{"$f":"SUM($G$17:$G$19)","v":0},{"$f":"IF(J11=\"\",0,(RANK(J11,$J$5:$J$14)))+COUNTIF(J$5:J11,J11)-1","v":7},{"$f":"SUMIF(Vietnam!$J$5:$J$14,Chine!$J11,Vietnam!$J$5:$J$14)+$J$14","v":0},{"$f":"IF(L11=\"\",0,(RANK(L11,$L$5:$L$14)))+COUNTIF(L$5:L11,L11)-1","v":7}]
["ALBON Alexander",null,null,null,null,null,"",null,"MERCEDES",{"$f":"SUM($G$5:$G$7)","v":0},{"$f":"IF(J12=\"\",0,(RANK(J12,$J$5:$J$14)))+COUNTIF(J$5:J12,J12)-1","v":8},{"$f":"SUMIF(Vietnam!$J$5:$J$14,Chine!$J12,Vietnam!$J$5:$J$14)+$J$14","v":0},{"$f":"IF(L12=\"\",0,(RANK(L12,$L$5:$L$14)))+COUNTIF(L$5:L12,L12)-1","v":8}]
[null,null,null,null,null,null,"",null,"RACING POINT",{"$f":"SUM($G$14:$G$16)","v":0},{"$f":"IF(J13=\"\",0,(RANK(J13,$J$5:$J$14)))+COUNTIF(J$5:J13,J13)-1","v":9},{"$f":"SUMIF(Vietnam!$J$5:$J$14,Chine!$J13,Vietnam!$J$5:$J$14)+$J$14","v":0},{"$f":"IF(L13=\"\",0,(RANK(L13,$L$5:$L$14)))+COUNTIF(L$5:L13,L13)-1","v":9}]
["PEREZ Sergio","RACING\nPOINT",null,null,null,null,"",null,"HAAS",{"$f":"SUM($G$26:$G$28)","v":0},{"$f":"IF(J14=\"\",0,(RANK(J14,$J$5:$J$14)))+COUNTIF(J$5:J14,J14)-1","v":10},{"$f":"SUMIF(Vietnam!$J$5:$J$14,Chine!$J14,Vietnam!$J$5:$J$14)+$J$14","v":0},{"$f":"IF(L14=\"\",0,(RANK(L14,$L$5:$L$14)))+COUNTIF(L$5:L14,L14)-1","v":10}]
["STROLL Lance",null,null,null,null,null,""]
[null,null,null,null,null,null,""]
["RUSSELL George","WILLIAMS",null,null,null,null,""]
["LATIFI Nichola",null,null,null,null,null,"",null,"ANNULÉ"]
[null,null,null,null,null,null,""]
["RICCIARDO Daniel","RENAULT",null,null,null,null,""]
["OCON Sebastian",null,null,null,null,null,""]
[null,null,null,null,null,null,""]
["KVYAT Daniil","ALPHA TAURI",null,null,null,null,""]
["GASLY Pierre",null,null,null,null,null,""]
[null,null,null,null,null,null,""]
["GROSJEAN Romain","HAAS",null,null,null,null,""]
["MAGNUSSEN Kevin",null,null,null,null,null,""]
[null,null,null,null,null,null,""]
["NORRIS Lando","McLAREN",null,null,null,null,""]
["SAINZ.Jr Carlos",null,null,null,null,null,""]
[null,null,null,null,null,null,""]
["RAÏKKÖNEN Kimi","ALFA ROMEO",null,null,null,null,""]
["GIOVINAZZI Antonio",null,null,null,null,null,""]
[null,null,null,null,null,null,""]

{"sheet":"Hollande","index":7,"n_rows":34,"n_cols":13,"rows_kept":34,"cut":false,"hidden":false,"merged":[[19,2,21,2],[4,1,6,1],[0,0,1,13],[2,1,3,1],[2,2,3,2],[2,3,3,3],[2,4,3,4],[2,5,3,5],[2,6,3,6],[4,2,6,2],[7,1,9,1],[7,2,9,2],[10,1,12,1],[10,2,12,2],[2,8,2,12],[17,8,20,12],[34,1,36,1],[34,2,36,2],[31,1,33,1],[31,2,33,2],[2,0,3,0],[22,1,24,1],[22,2,24,2],[25,1,27,1],[25,2,27,2],[28,1,30,1],[28,2,30,2],[13,1,15,1],[13,2,15,2],[16,1,18,1],[16,2,18,2],[19,1,21,1]]}
["MISANO- 13 SEPTEMBRE 2020"]
[]
["PILOTES","ECURIES","VOITURES","Finish","Pôle","Pt tour","Points",null,"CLASSEMENT"]
[null,null,null,null,null,null,null,null,"ÉCURIES","POINTS","RANG","TOTAL","PONCTUEL"]
["HAMILTON Lewis","MERCEDES",null,null,null,null,{"$f":"IFERROR(CHOOSE(D5,25,18,15,12,10,8,6,4,2,1)+(F5=1),\"\")","v":""},null,"ALPHA TAURI",{"$f":"SUM($G$23:$G$25)","v":0},{"$f":"IF(J5=\"\",0,(RANK(J5,$J$5:$J$14)))+COUNTIF(J$5:J5,J5)-1","v":1},{"$f":"SUMIF(Chine!$I$5:$I$14,Hollande!$I5,Chine!$L$5:$L$14)+$J$514","v":0},{"$f":"IF(L5=\"\",0,(RANK(L5,$L$5:$L$14)))+COUNTIF(L$5:L5,L5)-1","v":1}]
["BOTTAS Valtteri",null,null,null,null,null,{"$f":"IFERROR(CHOOSE(D6,25,18,15,12,10,8,6,4,2,1)+(F6=1),\"\")","v":""},null,"ALFA ROMEO",{"$f":"SUM($G$32:$G$34)","v":0},{"$f":"IF(J6=\"\",0,(RANK(J6,$J$5:$J$14)))+COUNTIF(J$5:J6,J6)-1","v":2},{"$f":"SUMIF(Chine!$I$5:$I$14,Hollande!$I6,Chine!$L$5:$L$14)+$J$514","v":0},{"$f":"IF(L6=\"\",0,(RANK(L6,$L$5:$L$14)))+COUNTIF(L$5:L6,L6)-1","v":2}]
[null,null,null,null,null,null,"",null,"Mc LAREN",{"$f":"SUM($G$29:$G$31)","v":0},{"$f":"IF(J7=\"\",0,(RANK(J7,$J$5:$J$14)))+COUNTIF(J$5:J7,J7)-1","v":3},{"$f":"SUMIF(Chine!$I$5:$I$14,Hollande!$I7,Chine!$L$5:$L$14)+$J$514","v":0},{"$f":"IF(L7=\"\",0,(RANK(L7,$L$5:$L$14)))+COUNTIF(L$5:L7,L7)-1","v":3}]
["VETTEL Sebastian","FERRARI",null,null,null,null,"",null,"RENAULT",{"$f":"SUM($G$20:$G$22)","v":0},{"$f":"IF(J8=\"\",0,(RANK(J8,$J$5:$J$14)))+COUNTIF(J$5:J8,J8)-1","v":4},{"$f":"SUMIF(Chine!$I$5:$I$14,Hollande!$I8,Chine!$L$5:$L$14)+$J$514","v":0},{"$f":"IF(L8=\"\",0,(RANK(L8,$L$5:$L$14)))+COUNTIF(L$5:L8,L8)-1","v":4}]
["LECLERC Charles",null,null,null,null,null,"",null,"RED BULL",{"$f":"SUM($G$11:$G$13)","v":0},{"$f":"IF(J9=\"\",0,(RANK(J9,$J$5:$J$14)))+COUNTIF(J$5:J9,J9)-1","v":5},{"$f":"SUMIF(Chine!$I$5:$I$14,Hollande!$I9,Chine!$L$5:$L$14)+$J$514","v":0},{"$f":"IF(L9=\"\",0,(RANK(L9,$L$5:$L$14)))+COUNTIF(L$5:L9,L9)-1","v":5}]
[null,null,null,null,null,null,"",null,"FERRARI",{"$f":"SUM($G$8:$G$10)","v":0},{"$f":"IF(J10=\"\",0,(RANK(J10,$J$5:$J$14)))+COUNTIF(J$5:J10,J10)-1","v":6},{"$f":"SUMIF(Chine!$I$5:$I$14,Hollande!$I10,Chine!$L$5:$L$14)+$J$514","v":0},{"$f":"IF(L10=\"\",0,(RANK(L10,$L$5:$L$14)))+COUNTIF(L$5:L10,L10)-1","v":6}]
["VERSTAPPEN Max","RED BULL",null,null,null,null,"",null,"WILLIAMS",{"$f":"SUM($G$17:$G$19)","v":0},{"$f":"IF(J11=\"\",0,(RANK(J11,$J$5:$J$14)))+COUNTIF(J$5:J11,J11)-1","v":7},{"$f":"SUMIF(Chine!$I$5:$I$14,Hollande!$I11,Chine!$L$5:$L$14)+$J$514","v":0},{"$f":"IF(L11=\"\",0,(RANK(L11,$L$5:$L$14)))+COUNTIF(L$5:L11,L11)-1","v":7}]
["ALBON Alexander",null,null,null,null,null,"",null,"MERCEDES",{"$f":"SUM($G$5:$G$7)","v":0},{"$f":"IF(J12=\"\",0,(RANK(J12,$J$5:$J$14)))+COUNTIF(J$5:J12,J12)-1","v":8},{"$f":"SUMIF(Chine!$I$5:$I$14,Hollande!$I12,Chine!$L$5:$L$14)+$J$514","v":0},{"$f":"IF(L12=\"\",0,(RANK(L12,$L$5:$L$14)))+COUNTIF(L$5:L12,L12)-1","v":8}]
[null,null,null,null,null,null,"",null,"RACING POINT",{"$f":"SUM($G$14:$G$16)","v":0},{"$f":"IF(J13=\"\",0,(RANK(J13,$J$5:$J$14)))+COUNTIF(J$5:J13,J13)-1","v":9},{"$f":"SUMIF(Chine!$I$5:$I$14,Hollande!$I13,Chine!$L$5:$L$14)+$J$514","v":0},{"$f":"IF(L13=\"\",0,(RANK(L13,$L$5:$L$14)))+COUNTIF(L$5:L13,L13)-1","v":9}]
["PEREZ Sergio","RACING\nPOINT",null,null,null,null,"",null,"HAAS",{"$f":"SUM($G$26:$G$28)","v":0},{"$f":"IF(J14=\"\",0,(RANK(J14,$J$5:$J$14)))+COUNTIF(J$5:J14,J14)-1","v":10},{"$f":"SUMIF(Chine!$I$5:$I$14,Hollande!$I14,Chine!$L$5:$L$14)+$J$514","v":0},{"$f":"IF(L14=\"\",0,(RANK(L14,$L$5:$L$14)))+COUNTIF(L$5:L14,L14)-1","v":10}]
["STROLL Lance",null,null,null,null,null,""]
[null,null,null,null,null,null,""]
["RUSSELL George","WILLIAMS",null,null,null,null,""]
["LATIFI Nichola",null,null,null,null,null,"",null,"ANNULÉ"]
[null,null,null,null,null,null,""]
["RICCIARDO Daniel","RENAULT",null,null,null,null,""]
["OCON Sebastian",null,null,null,null,null,""]
[null,null,null,null,null,null,""]
["KVYAT Daniil","ALPHA TAURI",null,null,null,null,""]
["GASLY Pierre",null,null,null,null,null,""]
[null,null,null,null,null,null,""]
["GROSJEAN Romain","HAAS",null,null,null,null,""]
["MAGNUSSEN Kevin",null,null,null,null,null,""]
[null,null,null,null,null,null,""]
["NORRIS Lando","McLAREN",null,null,null,null,""]
["SAINZ.Jr Carlos",null,null,null,null,null,""]
[null,null,null,null,null,null,""]
["RAÏKKÖNEN Kimi","ALFA ROMEO",null,null,null,null,""]
["GIOVINAZZI Antonio",null,null,null,null,null,""]
[null,null,null,null,null,null,""]

{"sheet":"Monaco","index":8,"n_rows":34,"n_cols":13,"rows_kept":34,"cut":false,"hidden":false,"merged":[[4,1,6,1],[4,2,6,2],[7,1,9,1],[7,2,9,2],[10,1,12,1],[10,2,12,2],[2,8,2,12],[0,0,1,13],[2,1,3,1],[2,2,3,2],[2,3,3,3],[2,5,3,5],[2,6,3,6],[2,4,3,4],[2,0,3,0],[13,1,15,1],[13,2,15,2],[16,1,18,1],[16,2,18,2],[19,1,21,1],[19,2,21,2],[17,8,20,12],[34,1,36,1],[34,2,36,2],[31,1,33,1],[31,2,33,2],[22,1,24,1],[22,2,24,2],[25,1,27,1],[25,2,27,2],[28,1,30,1],[28,2,30,2]]}
["BARCELONE - 28 SEPTEMBRE 2020"]
[]
["PILOTES","ECURIES","VOITURES","Finish","Pôle","Pt tour","Points",null,"CLASSEMENT"]
[null,null,null,null,null,null,null,null,"ÉCURIES","POINTS","RANG","TOTAL","PONCTUEL"]
["HAMILTON Lewis","MERCEDES",null,null,null,null,{"$f":"IFERROR(CHOOSE(D5,25,18,15,12,10,8,6,4,2,1)+(F5=1),\"\")","v":""},null,"RED BULL",{"$f":"SUM($G$11:$G$13)","v":0},{"$f":"IF(J5=\"\",0,(RANK(J5,$J$5:$J$14)))+COUNTIF(J$5:J5,J5)-1","v":1},{"$f":"SUMIF(Hollande!$I$5:$I$14,Monaco!$I5,Hollande!$L$5:$L$14)+$J$514","v":0},{"$f":"IF(L5=\"\",0,(RANK(L5,$L$5:$L$14)))+COUNTIF(L$5:L5,L5)-1","v":1}]
["BOTTAS Valtteri",null,null,null,null,null,{"$f":"IFERROR(CHOOSE(D6,25,18,15,12,10,8,6,4,2,1)+(F6=1),\"\")","v":""},null,"ALFA ROMEO",{"$f":"SUM($G$32:$G$34)","v":0},{"$f":"IF(J6=\"\",0,(RANK(J6,$J$5:$J$14)))+COUNTIF(J$5:J6,J6)-1","v":2},{"$f":"SUMIF(Hollande!$I$5:$I$14,Monaco!$I6,Hollande!$L$5:$L$14)+$J$514","v":0},{"$f":"IF(L6=\"\",0,(RANK(L6,$L$5:$L$14)))+COUNTIF(L$5:L6,L6)-1","v":2}]
[null,null,null,null,null,null,"",null,"Mc LAREN",{"$f":"SUM($G$29:$G$31)","v":0},{"$f":"IF(J7=\"\",0,(RANK(J7,$J$5:$J$14)))+COUNTIF(J$5:J7,J7)-1","v":3},{"$f":"SUMIF(Hollande!$I$5:$I$14,Monaco!$I7,Hollande!$L$5:$L$14)+$J$514","v":0},{"$f":"IF(L7=\"\",0,(RANK(L7,$L$5:$L$14)))+COUNTIF(L$5:L7,L7)-1","v":3}]
["VETTEL Sebastian","FERRARI",null,null,null,null,"",null,"RENAULT",{"$f":"SUM($G$20:$G$22)","v":0},{"$f":"IF(J8=\"\",0,(RANK(J8,$J$5:$J$14)))+COUNTIF(J$5:J8,J8)-1","v":4},{"$f":"SUMIF(Hollande!$I$5:$I$14,Monaco!$I8,Hollande!$L$5:$L$14)+$J$514","v":0},{"$f":"IF(L8=\"\",0,(RANK(L8,$L$5:$L$14)))+COUNTIF(L$5:L8,L8)-1","v":4}]
["LECLERC Charles",null,null,null,null,null,"",null,"FERRARI",{"$f":"SUM($G$8:$G$10)","v":0},{"$f":"IF(J9=\"\",0,(RANK(J9,$J$5:$J$14)))+COUNTIF(J$5:J9,J9)-1","v":5},{"$f":"SUMIF(Hollande!$I$5:$I$14,Monaco!$I9,Hollande!$L$5:$L$14)+$J$514","v":0},{"$f":"IF(L9=\"\",0,(RANK(L9,$L$5:$L$14)))+COUNTIF(L$5:L9,L9)-1","v":5}]
[null,null,null,null,null,null,"",null,"ALPHA TAURI",{"$f":"SUM($G$23:$G$25)","v":0},{"$f":"IF(J10=\"\",0,(RANK(J10,$J$5:$J$14)))+COUNTIF(J$5:J10,J10)-1","v":6},{"$f":"SUMIF(Hollande!$I$5:$I$14,Monaco!$I10,Hollande!$L$5:$L$14)+$J$514","v":0},{"$f":"IF(L10=\"\",0,(RANK(L10,$L$5:$L$14)))+COUNTIF(L$5:L10,L10)-1","v":6}]
["VERSTAPPEN Max","RED BULL",null,null,null,null,"",null,"WILLIAMS",{"$f":"SUM($G$17:$G$19)","v":0},{"$f":"IF(J11=\"\",0,(RANK(J11,$J$5:$J$14)))+COUNTIF(J$5:J11,J11)-1","v":7},{"$f":"SUMIF(Hollande!$I$5:$I$14,Monaco!$I11,Hollande!$L$5:$L$14)+$J$514","v":0},{"$f":"IF(L11=\"\",0,(RANK(L11,$L$5:$L$14)))+COUNTIF(L$5:L11,L11)-1","v":7}]
["ALBON Alexander",null,null,null,null,null,"",null,"MERCEDES",{"$f":"SUM($G$5:$G$7)","v":0},{"$f":"IF(J12=\"\",0,(RANK(J12,$J$5:$J$14)))+COUNTIF(J$5:J12,J12)-1","v":8},{"$f":"SUMIF(Hollande!$I$5:$I$14,Monaco!$I12,Hollande!$L$5:$L$14)+$J$514","v":0},{"$f":"IF(L12=\"\",0,(RANK(L12,$L$5:$L$14)))+COUNTIF(L$5:L12,L12)-1","v":8}]
[null,null,null,null,null,null,"",null,"RACING POINT",{"$f":"SUM($G$14:$G$16)","v":0},{"$f":"IF(J13=\"\",0,(RANK(J13,$J$5:$J$14)))+COUNTIF(J$5:J13,J13)-1","v":9},{"$f":"SUMIF(Hollande!$I$5:$I$14,Monaco!$I13,Hollande!$L$5:$L$14)+$J$514","v":0},{"$f":"IF(L13=\"\",0,(RANK(L13,$L$5:$L$14)))+COUNTIF(L$5:L13,L13)-1","v":9}]
["PEREZ Sergio","RACING\nPOINT",null,null,null,null,"",null,"HAAS",{"$f":"SUM($G$26:$G$28)","v":0},{"$f":"IF(J14=\"\",0,(RANK(J14,$J$5:$J$14)))+COUNTIF(J$5:J14,J14)-1","v":10},{"$f":"SUMIF(Hollande!$I$5:$I$14,Monaco!$I14,Hollande!$L$5:$L$14)+$J$514","v":0},{"$f":"IF(L14=\"\",0,(RANK(L14,$L$5:$L$14)))+COUNTIF(L$5:L14,L14)-1","v":10}]
["STROLL Lance",null,null,null,null,null,""]
[null,null,null,null,null,null,""]
["RUSSELL George","WILLIAMS",null,null,null,null,""]
["LATIFI Nichola",null,null,null,null,null,"",null,"ANNULÉ"]
[null,null,null,null,null,null,""]
["RICCIARDO Daniel","RENAULT",null,null,null,null,""]
["OCON Sebastian",null,null,null,null,null,""]
[null,null,null,null,null,null,""]
["KVYAT Daniil","ALPHA TAURI",null,null,null,null,""]
["GASLY Pierre",null,null,null,null,null,""]
[null,null,null,null,null,null,""]
["GROSJEAN Romain","HAAS",null,null,null,null,""]
["MAGNUSSEN Kevin",null,null,null,null,null,""]
[null,null,null,null,null,null,""]
["NORRIS Lando","McLAREN",null,null,null,null,""]
["SAINZ.Jr Carlos",null,null,null,null,null,""]
[null,null,null,null,null,null,""]
["RAÏKKÖNEN Kimi","ALFA ROMEO",null,null,null,null,""]
["GIOVINAZZI Antonio",null,null,null,null,null,""]
[null,null,null,null,null,null,""]

{"sheet":"Azerbaïdjan","index":9,"n_rows":34,"n_cols":13,"rows_kept":34,"cut":false,"hidden":false,"merged":[[0,0,1,13],[2,0,3,0],[2,1,3,1],[2,2,3,2],[2,3,3,3],[2,4,3,4],[2,5,3,5],[2,6,3,6],[2,8,2,12],[4,1,6,1],[4,2,6,2],[7,1,9,1],[7,2,9,2],[10,1,12,1],[10,2,12,2],[13,1,15,1],[13,2,15,2],[16,1,18,1],[16,2,18,2],[19,1,21,1],[19,2,21,2],[17,8,20,12],[31,1,33,1],[31,2,33,2],[34,1,36,1],[34,2,36,2],[22,1,24,1],[22,2,24,2],[25,1,27,1],[25,2,27,2],[28,1,30,1],[28,2,30,2]]}
["BARCELONE - 28 SEPTEMBRE 2020"]
[]
["PILOTES","ECURIES","VOITURES","Finish","Pôle","Pt tour","Points",null,"CLASSEMENT"]
[null,null,null,null,null,null,null,null,"ÉCURIES","POINTS","RANG","TOTAL","PONCTUEL"]
["HAMILTON Lewis","MERCEDES",null,null,null,null,{"$f":"IFERROR(CHOOSE(D5,25,18,15,12,10,8,6,4,2,1)+(F5=1),\"\")","v":""},null,"RED BULL",{"$f":"SUM($G$11:$G$13)","v":0},{"$f":"IF(J5=\"\",0,(RANK(J5,$J$5:$J$14)))+COUNTIF(J$5:J5,J5)-1","v":1},{"$f":"SUMIF(Monaco!$I$5:$I$14,Azerbaïdjan!$I5,Monaco!$L$5:$L$14)+$J$514","v":0},{"$f":"IF(L5=\"\",0,(RANK(L5,$L$5:$L$14)))+COUNTIF(L$5:L5,L5)-1","v":1}]
["BOTTAS Valtteri",null,null,null,null,null,{"$f":"IFERROR(CHOOSE(D6,25,18,15,12,10,8,6,4,2,1)+(F6=1),\"\")","v":""},null,"ALFA ROMEO",{"$f":"SUM($G$32:$G$34)","v":0},{"$f":"IF(J6=\"\",0,(RANK(J6,$J$5:$J$14)))+COUNTIF(J$5:J6,J6)-1","v":2},{"$f":"SUMIF(Monaco!$I$5:$I$14,Azerbaïdjan!$I6,Monaco!$L$5:$L$14)+$J$514","v":0},{"$f":"IF(L6=\"\",0,(RANK(L6,$L$5:$L$14)))+COUNTIF(L$5:L6,L6)-1","v":2}]
[null,null,null,null,null,null,"",null,"Mc LAREN",{"$f":"SUM($G$29:$G$31)","v":0},{"$f":"IF(J7=\"\",0,(RANK(J7,$J$5:$J$14)))+COUNTIF(J$5:J7,J7)-1","v":3},{"$f":"SUMIF(Monaco!$I$5:$I$14,Azerbaïdjan!$I7,Monaco!$L$5:$L$14)+$J$514","v":0},{"$f":"IF(L7=\"\",0,(RANK(L7,$L$5:$L$14)))+COUNTIF(L$5:L7,L7)-1","v":3}]
["VETTEL Sebastian","FERRARI",null,null,null,null,"",null,"RENAULT",{"$f":"SUM($G$20:$G$22)","v":0},{"$f":"IF(J8=\"\",0,(RANK(J8,$J$5:$J$14)))+COUNTIF(J$5:J8,J8)-1","v":4},{"$f":"SUMIF(Monaco!$I$5:$I$14,Azerbaïdjan!$I8,Monaco!$L$5:$L$14)+$J$514","v":0},{"$f":"IF(L8=\"\",0,(RANK(L8,$L$5:$L$14)))+COUNTIF(L$5:L8,L8)-1","v":4}]
["LECLERC Charles",null,null,null,null,null,"",null,"FERRARI",{"$f":"SUM($G$8:$G$10)","v":0},{"$f":"IF(J9=\"\",0,(RANK(J9,$J$5:$J$14)))+COUNTIF(J$5:J9,J9)-1","v":5},{"$f":"SUMIF(Monaco!$I$5:$I$14,Azerbaïdjan!$I9,Monaco!$L$5:$L$14)+$J$514","v":0},{"$f":"IF(L9=\"\",0,(RANK(L9,$L$5:$L$14)))+COUNTIF(L$5:L9,L9)-1","v":5}]
[null,null,null,null,null,null,"",null,"ALPHA TAURI",{"$f":"SUM($G$23:$G$25)","v":0},{"$f":"IF(J10=\"\",0,(RANK(J10,$J$5:$J$14)))+COUNTIF(J$5:J10,J10)-1","v":6},{"$f":"SUMIF(Monaco!$I$5:$I$14,Azerbaïdjan!$I10,Monaco!$L$5:$L$14)+$J$514","v":0},{"$f":"IF(L10=\"\",0,(RANK(L10,$L$5:$L$14)))+COUNTIF(L$5:L10,L10)-1","v":6}]
["VERSTAPPEN Max","RED BULL",null,null,null,null,"",null,"WILLIAMS",{"$f":"SUM($G$17:$G$19)","v":0},{"$f":"IF(J11=\"\",0,(RANK(J11,$J$5:$J$14)))+COUNTIF(J$5:J11,J11)-1","v":7},{"$f":"SUMIF(Monaco!$I$5:$I$14,Azerbaïdjan!$I11,Monaco!$L$5:$L$14)+$J$514","v":0},{"$f":"IF(L11=\"\",0,(RANK(L11,$L$5:$L$14)))+COUNTIF(L$5:L11,L11)-1","v":7}]
["ALBON Alexander",null,null,null,null,null,"",null,"MERCEDES",{"$f":"SUM($G$5:$G$7)","v":0},{"$f":"IF(J12=\"\",0,(RANK(J12,$J$5:$J$14)))+COUNTIF(J$5:J12,J12)-1","v":8},{"$f":"SUMIF(Monaco!$I$5:$I$14,Azerbaïdjan!$I12,Monaco!$L$5:$L$14)+$J$514","v":0},{"$f":"IF(L12=\"\",0,(RANK(L12,$L$5:$L$14)))+COUNTIF(L$5:L12,L12)-1","v":8}]
[null,null,null,null,null,null,"",null,"RACING POINT",{"$f":"SUM($G$14:$G$16)","v":0},{"$f":"IF(J13=\"\",0,(RANK(J13,$J$5:$J$14)))+COUNTIF(J$5:J13,J13)-1","v":9},{"$f":"SUMIF(Monaco!$I$5:$I$14,Azerbaïdjan!$I13,Monaco!$L$5:$L$14)+$J$514","v":0},{"$f":"IF(L13=\"\",0,(RANK(L13,$L$5:$L$14)))+COUNTIF(L$5:L13,L13)-1","v":9}]
["PEREZ Sergio","RACING\nPOINT",null,null,null,null,"",null,"HAAS",{"$f":"SUM($G$26:$G$28)","v":0},{"$f":"IF(J14=\"\",0,(RANK(J14,$J$5:$J$14)))+COUNTIF(J$5:J14,J14)-1","v":10},{"$f":"SUMIF(Monaco!$I$5:$I$14,Azerbaïdjan!$I14,Monaco!$L$5:$L$14)+$J$514","v":0},{"$f":"IF(L14=\"\",0,(RANK(L14,$L$5:$L$14)))+COUNTIF(L$5:L14,L14)-1","v":10}]
["STROLL Lance",null,null,null,null,null,""]
[null,null,null,null,null,null,""]
["RUSSELL George","WILLIAMS",null,null,null,null,""]
["LATIFI Nichola",null,null,null,null,null,"",null,"ANNULÉ"]
[null,null,null,null,null,null,""]
["RICCIARDO Daniel","RENAULT",null,null,null,null,""]
["OCON Sebastian",null,null,null,null,null,""]
[null,null,null,null,null,null,""]
["KVYAT Daniil","ALPHA TAURI",null,null,null,null,""]
["GASLY Pierre",null,null,null,null,null,""]
[null,null,null,null,null,null,""]
["GROSJEAN Romain","HAAS",null,null,null,null,""]
["MAGNUSSEN Kevin",null,null,null,null,null,""]
[null,null,null,null,null,null,""]
["NORRIS Lando","McLAREN",null,null,null,null,""]
["SAINZ.Jr Carlos",null,null,null,null,null,""]
[null,null,null,null,null,null,""]
["RAÏKKÖNEN Kimi","ALFA ROMEO",null,null,null,null,""]
["GIOVINAZZI Antonio",null,null,null,null,null,""]
[null,null,null,null,null,null,""]

{"sheet":"Canada","index":10,"n_rows":34,"n_cols":13,"rows_kept":34,"cut":false,"hidden":false,"merged":[[0,0,1,13],[2,0,3,0],[2,1,3,1],[2,2,3,2],[2,3,3,3],[2,4,3,4],[2,5,3,5],[2,6,3,6],[2,8,2,12],[4,1,6,1],[4,2,6,2],[7,1,9,1],[7,2,9,2],[10,1,12,1],[10,2,12,2],[13,1,15,1],[13,2,15,2],[16,1,18,1],[16,2,18,2],[19,1,21,1],[19,2,21,2],[17,8,20,12],[31,1,33,1],[31,2,33,2],[34,1,36,1],[34,2,36,2],[22,1,24,1],[22,2,24,2],[25,1,27,1],[25,2,27,2],[28,1,30,1],[28,2,30,2]]}
["CIRCUIT GILLES VILLENEUVE - 9 AOUT 2020"]
[]
["PILOTES","ECURIES","VOITURES","Finish","Pôle","Pt tour","Points",null,"CLASSEMENT"]
[null,null,null,null,null,null,null,null,"ÉCURIES","POINTS","RANG","TOTAL","PONCTUEL"]
["HAMILTON Lewis","MERCEDES",null,null,null,null,{"$f":"IFERROR(CHOOSE(D5,25,18,15,12,10,8,6,4,2,1)+(F5=1),\"\")","v":""},null,"RENAULT",{"$f":"SUM($G$20:$G$22)","v":0},{"$f":"IF(J5=\"\",0,(RANK(J5,$J$5:$J$14)))+COUNTIF(J$5:J5,J5)-1","v":1},{"$f":"SUMIF(Azerbaïdjan!$I$5:$I$14,Canada!$I5,Azerbaïdjan!$L$5:$L$14)+$J$514","v":0},{"$f":"IF(L5=\"\",0,(RANK(L5,$L$5:$L$14)))+COUNTIF(L$5:L5,L5)-1","v":1}]
["BOTTAS Valtteri",null,null,null,null,null,{"$f":"IFERROR(CHOOSE(D6,25,18,15,12,10,8,6,4,2,1)+(F6=1),\"\")","v":""},null,"ALFA ROMEO",{"$f":"SUM($G$32:$G$34)","v":0},{"$f":"IF(J6=\"\",0,(RANK(J6,$J$5:$J$14)))+COUNTIF(J$5:J6,J6)-1","v":2},{"$f":"SUMIF(Azerbaïdjan!$I$5:$I$14,Canada!$I6,Azerbaïdjan!$L$5:$L$14)+$J$514","v":0},{"$f":"IF(L6=\"\",0,(RANK(L6,$L$5:$L$14)))+COUNTIF(L$5:L6,L6)-1","v":2}]
[null,null,null,null,null,null,"",null,"Mc LAREN",{"$f":"SUM($G$29:$G$31)","v":0},{"$f":"IF(J7=\"\",0,(RANK(J7,$J$5:$J$14)))+COUNTIF(J$5:J7,J7)-1","v":3},{"$f":"SUMIF(Azerbaïdjan!$I$5:$I$14,Canada!$I7,Azerbaïdjan!$L$5:$L$14)+$J$514","v":0},{"$f":"IF(L7=\"\",0,(RANK(L7,$L$5:$L$14)))+COUNTIF(L$5:L7,L7)-1","v":3}]
["VETTEL Sebastian","FERRARI",null,null,null,null,"",null,"RED BULL",{"$f":"SUM($G$11:$G$13)","v":0},{"$f":"IF(J8=\"\",0,(RANK(J8,$J$5:$J$14)))+COUNTIF(J$5:J8,J8)-1","v":4},{"$f":"SUMIF(Azerbaïdjan!$I$5:$I$14,Canada!$I8,Azerbaïdjan!$L$5:$L$14)+$J$514","v":0},{"$f":"IF(L8=\"\",0,(RANK(L8,$L$5:$L$14)))+COUNTIF(L$5:L8,L8)-1","v":4}]
["LECLERC Charles",null,null,null,null,null,"",null,"FERRARI",{"$f":"SUM($G$8:$G$10)","v":0},{"$f":"IF(J9=\"\",0,(RANK(J9,$J$5:$J$14)))+COUNTIF(J$5:J9,J9)-1","v":5},{"$f":"SUMIF(Azerbaïdjan!$I$5:$I$14,Canada!$I9,Azerbaïdjan!$L$5:$L$14)+$J$514","v":0},{"$f":"IF(L9=\"\",0,(RANK(L9,$L$5:$L$14)))+COUNTIF(L$5:L9,L9)-1","v":5}]
[null,null,null,null,null,null,"",null,"ALPHA TAURI",{"$f":"SUM($G$23:$G$25)","v":0},{"$f":"IF(J10=\"\",0,(RANK(J10,$J$5:$J$14)))+COUNTIF(J$5:J10,J10)-1","v":6},{"$f":"SUMIF(Azerbaïdjan!$I$5:$I$14,Canada!$I10,Azerbaïdjan!$L$5:$L$14)+$J$514","v":0},{"$f":"IF(L10=\"\",0,(RANK(L10,$L$5:$L$14)))+COUNTIF(L$5:L10,L10)-1","v":6}]
["VERSTAPPEN Max","RED BULL",null,null,null,null,"",null,"WILLIAMS",{"$f":"SUM($G$17:$G$19)","v":0},{"$f":"IF(J11=\"\",0,(RANK(J11,$J$5:$J$14)))+COUNTIF(J$5:J11,J11)-1","v":7},{"$f":"SUMIF(Azerbaïdjan!$I$5:$I$14,Canada!$I11,Azerbaïdjan!$L$5:$L$14)+$J$514","v":0},{"$f":"IF(L11=\"\",0,(RANK(L11,$L$5:$L$14)))+COUNTIF(L$5:L11,L11)-1","v":7}]
["ALBON Alexander",null,null,null,null,null,"",null,"MERCEDES",{"$f":"SUM($G$5:$G$7)","v":0},{"$f":"IF(J12=\"\",0,(RANK(J12,$J$5:$J$14)))+COUNTIF(J$5:J12,J12)-1","v":8},{"$f":"SUMIF(Azerbaïdjan!$I$5:$I$14,Canada!$I12,Azerbaïdjan!$L$5:$L$14)+$J$514","v":0},{"$f":"IF(L12=\"\",0,(RANK(L12,$L$5:$L$14)))+COUNTIF(L$5:L12,L12)-1","v":8}]
[null,null,null,null,null,null,"",null,"RACING POINT",{"$f":"SUM($G$14:$G$16)","v":0},{"$f":"IF(J13=\"\",0,(RANK(J13,$J$5:$J$14)))+COUNTIF(J$5:J13,J13)-1","v":9},{"$f":"SUMIF(Azerbaïdjan!$I$5:$I$14,Canada!$I13,Azerbaïdjan!$L$5:$L$14)+$J$514","v":0},{"$f":"IF(L13=\"\",0,(RANK(L13,$L$5:$L$14)))+COUNTIF(L$5:L13,L13)-1","v":9}]
["PEREZ Sergio","RACING\nPOINT",null,null,null,null,"",null,"HAAS",{"$f":"SUM($G$26:$G$28)","v":0},{"$f":"IF(J14=\"\",0,(RANK(J14,$J$5:$J$14)))+COUNTIF(J$5:J14,J14)-1","v":10},{"$f":"SUMIF(Azerbaïdjan!$I$5:$I$14,Canada!$I14,Azerbaïdjan!$L$5:$L$14)+$J$514","v":0},{"$f":"IF(L14=\"\",0,(RANK(L14,$L$5:$L$14)))+COUNTIF(L$5:L14,L14)-1","v":10}]
["STROLL Lance",null,null,null,null,null,""]
[null,null,null,null,null,null,""]
["RUSSELL George","WILLIAMS",null,null,null,null,""]
["LATIFI Nichola",null,null,null,null,null,"",null,"ANNULÉ"]
[null,null,null,null,null,null,""]
["RICCIARDO Daniel","RENAULT",null,null,null,null,""]
["OCON Sebastian",null,null,null,null,null,""]
[null,null,null,null,null,null,""]
["KVYAT Daniil","ALPHA TAURI",null,null,null,null,""]
["GASLY Pierre",null,null,null,null,null,""]
[null,null,null,null,null,null,""]
["GROSJEAN Romain","HAAS",null,null,null,null,""]
["MAGNUSSEN Kevin",null,null,null,null,null,""]
[null,null,null,null,null,null,""]
["NORRIS Lando","McLAREN",null,null,null,null,""]
["SAINZ.Jr Carlos",null,null,null,null,null,""]
[null,null,null,null,null,null,""]
["RAÏKKÖNEN Kimi","ALFA ROMEO",null,null,null,null,""]
["GIOVINAZZI Antonio",null,null,null,null,null,""]
[null,null,null,null,null,null,""]

{"sheet":"France","index":11,"n_rows":34,"n_cols":13,"rows_kept":34,"cut":false,"hidden":false,"merged":[[0,0,1,13],[2,1,3,1],[2,2,3,2],[2,3,3,3],[2,5,3,5],[2,6,3,6],[2,4,3,4],[2,0,3,0],[2,8,2,12],[4,1,6,1],[4,2,6,2],[7,1,9,1],[7,2,9,2],[10,1,12,1],[10,2,12,2],[13,1,15,1],[13,2,15,2],[16,1,18,1],[16,2,18,2],[19,1,21,1],[19,2,21,2],[17,8,20,12],[34,1,36,1],[34,2,36,2],[31,1,33,1],[31,2,33,2],[22,1,24,1],[22,2,24,2],[25,1,27,1],[25,2,27,2],[28,1,30,1],[28,2,30,2]]}
["BUGATTI - 11 OCTOBRE 2020"]
[]
["PILOTES","ECURIES","VOITURES","Finish","Pôle","Pt tour","Points",null,"CLASSEMENT"]
[null,null,null,null,null,null,null,null,"ÉCURIES","POINTS","RANG","TOTAL","PONCTUEL"]
["HAMILTON Lewis","MERCEDES",null,null,null,null,{"$f":"IFERROR(CHOOSE(D5,25,18,15,12,10,8,6,4,2,1)+(F5=1),\"\")","v":""},null,"RENAULT",{"$f":"SUM($G$20:$G$22)","v":0},{"$f":"IF(J5=\"\",0,(RANK(J5,$J$5:$J$14)))+COUNTIF(J$5:J5,J5)-1","v":1},{"$f":"SUMIF(Canada!$I$5:$I$14,France!$I5,Canada!$L$5:$L$14)+$J$514","v":0},{"$f":"IF(L5=\"\",0,(RANK(L5,$L$5:$L$14)))+COUNTIF(L$5:L5,L5)-1","v":1}]
["BOTTAS Valtteri",null,null,null,null,null,{"$f":"IFERROR(CHOOSE(D6,25,18,15,12,10,8,6,4,2,1)+(F6=1),\"\")","v":""},null,"ALFA ROMEO",{"$f":"SUM($G$32:$G$34)","v":0},{"$f":"IF(J6=\"\",0,(RANK(J6,$J$5:$J$14)))+COUNTIF(J$5:J6,J6)-1","v":2},{"$f":"SUMIF(Canada!$I$5:$I$14,France!$I6,Canada!$L$5:$L$14)+$J$514","v":0},{"$f":"IF(L6=\"\",0,(RANK(L6,$L$5:$L$14)))+COUNTIF(L$5:L6,L6)-1","v":2}]
[null,null,null,null,null,null,"",null,"Mc LAREN",{"$f":"SUM($G$29:$G$31)","v":0},{"$f":"IF(J7=\"\",0,(RANK(J7,$J$5:$J$14)))+COUNTIF(J$5:J7,J7)-1","v":3},{"$f":"SUMIF(Canada!$I$5:$I$14,France!$I7,Canada!$L$5:$L$14)+$J$514","v":0},{"$f":"IF(L7=\"\",0,(RANK(L7,$L$5:$L$14)))+COUNTIF(L$5:L7,L7)-1","v":3}]
["VETTEL Sebastian","FERRARI",null,null,null,null,"",null,"RED BULL",{"$f":"SUM($G$11:$G$13)","v":0},{"$f":"IF(J8=\"\",0,(RANK(J8,$J$5:$J$14)))+COUNTIF(J$5:J8,J8)-1","v":4},{"$f":"SUMIF(Canada!$I$5:$I$14,France!$I8,Canada!$L$5:$L$14)+$J$514","v":0},{"$f":"IF(L8=\"\",0,(RANK(L8,$L$5:$L$14)))+COUNTIF(L$5:L8,L8)-1","v":4}]
["LECLERC Charles",null,null,null,null,null,"",null,"FERRARI",{"$f":"SUM($G$8:$G$10)","v":0},{"$f":"IF(J9=\"\",0,(RANK(J9,$J$5:$J$14)))+COUNTIF(J$5:J9,J9)-1","v":5},{"$f":"SUMIF(Canada!$I$5:$I$14,France!$I9,Canada!$L$5:$L$14)+$J$514","v":0},{"$f":"IF(L9=\"\",0,(RANK(L9,$L$5:$L$14)))+COUNTIF(L$5:L9,L9)-1","v":5}]
[null,null,null,null,null,null,"",null,"ALPHA TAURI",{"$f":"SUM($G$23:$G$25)","v":0},{"$f":"IF(J10=\"\",0,(RANK(J10,$J$5:$J$14)))+COUNTIF(J$5:J10,J10)-1","v":6},{"$f":"SUMIF(Canada!$I$5:$I$14,France!$I10,Canada!$L$5:$L$14)+$J$514","v":0},{"$f":"IF(L10=\"\",0,(RANK(L10,$L$5:$L$14)))+COUNTIF(L$5:L10,L10)-1","v":6}]
["VERSTAPPEN Max","RED BULL",null,null,null,null,"",null,"WILLIAMS",{"$f":"SUM($G$17:$G$19)","v":0},{"$f":"IF(J11=\"\",0,(RANK(J11,$J$5:$J$14)))+COUNTIF(J$5:J11,J11)-1","v":7},{"$f":"SUMIF(Canada!$I$5:$I$14,France!$I11,Canada!$L$5:$L$14)+$J$514","v":0},{"$f":"IF(L11=\"\",0,(RANK(L11,$L$5:$L$14)))+COUNTIF(L$5:L11,L11)-1","v":7}]
["ALBON Alexander",null,null,null,null,null,"",null,"MERCEDES",{"$f":"SUM($G$5:$G$7)","v":0},{"$f":"IF(J12=\"\",0,(RANK(J12,$J$5:$J$14)))+COUNTIF(J$5:J12,J12)-1","v":8},{"$f":"SUMIF(Canada!$I$5:$I$14,France!$I12,Canada!$L$5:$L$14)+$J$514","v":0},{"$f":"IF(L12=\"\",0,(RANK(L12,$L$5:$L$14)))+COUNTIF(L$5:L12,L12)-1","v":8}]
[null,null,null,null,null,null,"",null,"RACING POINT",{"$f":"SUM($G$14:$G$16)","v":0},{"$f":"IF(J13=\"\",0,(RANK(J13,$J$5:$J$14)))+COUNTIF(J$5:J13,J13)-1","v":9},{"$f":"SUMIF(Canada!$I$5:$I$14,France!$I13,Canada!$L$5:$L$14)+$J$514","v":0},{"$f":"IF(L13=\"\",0,(RANK(L13,$L$5:$L$14)))+COUNTIF(L$5:L13,L13)-1","v":9}]
["PEREZ Sergio","RACING\nPOINT",null,null,null,null,"",null,"HAAS",{"$f":"SUM($G$26:$G$28)","v":0},{"$f":"IF(J14=\"\",0,(RANK(J14,$J$5:$J$14)))+COUNTIF(J$5:J14,J14)-1","v":10},{"$f":"SUMIF(Canada!$I$5:$I$14,France!$I14,Canada!$L$5:$L$14)+$J$514","v":0},{"$f":"IF(L14=\"\",0,(RANK(L14,$L$5:$L$14)))+COUNTIF(L$5:L14,L14)-1","v":10}]
["STROLL Lance",null,null,null,null,null,""]
[null,null,null,null,null,null,""]
["RUSSELL George","WILLIAMS",null,null,null,null,""]
["LATIFI Nichola",null,null,null,null,null,"",null,"ANNULÉ"]
[null,null,null,null,null,null,""]
["RICCIARDO Daniel","RENAULT",null,null,null,null,""]
["OCON Sebastian",null,null,null,null,null,""]
[null,null,null,null,null,null,""]
["KVYAT Daniil","ALPHA TAURI",null,null,null,null,""]
["GASLY Pierre",null,null,null,null,null,""]
[null,null,null,null,null,null,""]
["GROSJEAN Romain","HAAS",null,null,null,null,""]
["MAGNUSSEN Kevin",null,null,null,null,null,""]
[null,null,null,null,null,null,""]
["NORRIS Lando","McLAREN",null,null,null,null,""]
["SAINZ.Jr Carlos",null,null,null,null,null,""]
[null,null,null,null,null,null,""]
["RAÏKKÖNEN Kimi","ALFA ROMEO",null,null,null,null,""]
["GIOVINAZZI Antonio",null,null,null,null,null,""]
[null,null,null,null,null,null,""]

{"sheet":"Autriche","index":12,"n_rows":34,"n_cols":13,"rows_kept":34,"cut":false,"hidden":false,"merged":[[0,0,1,13],[2,1,3,1],[2,2,3,2],[2,3,3,3],[2,5,3,5],[2,6,3,6],[2,4,3,4],[2,0,3,0],[2,8,2,12],[4,1,6,1],[4,2,6,2],[7,1,9,1],[7,2,9,2],[10,1,12,1],[10,2,12,2],[13,1,15,1],[13,2,15,2],[16,1,18,1],[16,2,18,2],[19,1,21,1],[19,2,21,2],[34,1,36,1],[34,2,36,2],[31,1,33,1],[31,2,33,2],[22,1,24,1],[22,2,24,2],[25,1,27,1],[25,2,27,2],[28,1,30,1],[28,2,30,2]]}
["SPIELBERG - 16 AOUT 2020"]
[]
["PILOTES","ECURIES","VOITURES","Finish","Pôle","Pt tour","Points",null,"CLASSEMENT"]
[null,null,null,null,null,null,null,null,"ÉCURIES","POINTS","RANG","TOTAL","PONCTUEL"]
["HAMILTON Lewis","MERCEDES",null,4,null,null,{"$f":"IFERROR(CHOOSE(D5,25,18,15,12,10,8,6,4,2,1)+(F5=1),\"\")","v":12},null,"MERCEDES",{"$f":"SUM($G$5:$G$7)","v":37},{"$f":"IF(J5=\"\",0,(RANK(J5,$J$5:$J$14)))+COUNTIF(J$5:J5,J5)-1","v":1},{"$f":"SUMIF(France!$I$5:$I$14,Autriche!$I5,France!$L$5:$L$14)+$J5","v":37},{"$f":"IF(L5=\"\",0,(RANK(L5,$L$5:$L$14)))+COUNTIF(L$5:L5,L5)-1","v":1}]
["BOTTAS Valtteri",null,null,1,null,null,{"$f":"IFERROR(CHOOSE(D6,25,18,15,12,10,8,6,4,2,1)+(F6=1),\"\")","v":25},null,"Mc LAREN",{"$f":"SUM($G$29:$G$31)","v":26},{"$f":"IF(J6=\"\",0,(RANK(J6,$J$5:$J$14)))+COUNTIF(J$5:J6,J6)-1","v":2},{"$f":"SUMIF(France!$I$5:$I$14,Autriche!$I6,France!$L$5:$L$14)+$J6","v":26},{"$f":"IF(L6=\"\",0,(RANK(L6,$L$5:$L$14)))+COUNTIF(L$5:L6,L6)-1","v":2}]
[null,null,null,null,null,null,"",null,"FERRARI",{"$f":"SUM($G$8:$G$10)","v":19},{"$f":"IF(J7=\"\",0,(RANK(J7,$J$5:$J$14)))+COUNTIF(J$5:J7,J7)-1","v":3},{"$f":"SUMIF(France!$I$5:$I$14,Autriche!$I7,France!$L$5:$L$14)+$J7","v":19},{"$f":"IF(L7=\"\",0,(RANK(L7,$L$5:$L$14)))+COUNTIF(L$5:L7,L7)-1","v":3}]
["VETTEL Sebastian","FERRARI",null,10,null,null,1,null,"RACING POINT",{"$f":"SUM($G$14:$G$16)","v":8},{"$f":"IF(J8=\"\",0,(RANK(J8,$J$5:$J$14)))+COUNTIF(J$5:J8,J8)-1","v":4},{"$f":"SUMIF(France!$I$5:$I$14,Autriche!$I8,France!$L$5:$L$14)+$J8","v":8},{"$f":"IF(L8=\"\",0,(RANK(L8,$L$5:$L$14)))+COUNTIF(L$5:L8,L8)-1","v":4}]
["LECLERC Charles",null,null,2,null,null,18,null,"ALPHA TAURI",{"$f":"SUM($G$23:$G$25)","v":6},{"$f":"IF(J9=\"\",0,(RANK(J9,$J$5:$J$14)))+COUNTIF(J$5:J9,J9)-1","v":5},{"$f":"SUMIF(France!$I$5:$I$14,Autriche!$I9,France!$L$5:$L$14)+$J9","v":6},{"$f":"IF(L9=\"\",0,(RANK(L9,$L$5:$L$14)))+COUNTIF(L$5:L9,L9)-1","v":5}]
[null,null,null,null,null,null,"",null,"RENAULT",{"$f":"SUM($G$20:$G$22)","v":4},{"$f":"IF(J10=\"\",0,(RANK(J10,$J$5:$J$14)))+COUNTIF(J$5:J10,J10)-1","v":6},{"$f":"SUMIF(France!$I$5:$I$14,Autriche!$I10,France!$L$5:$L$14)+$J10","v":4},{"$f":"IF(L10=\"\",0,(RANK(L10,$L$5:$L$14)))+COUNTIF(L$5:L10,L10)-1","v":6}]
["VERSTAPPEN Max","RED BULL",null,"OUT",null,null,"",null,"ALFA ROMEO",{"$f":"SUM($G$32:$G$34)","v":2},{"$f":"IF(J11=\"\",0,(RANK(J11,$J$5:$J$14)))+COUNTIF(J$5:J11,J11)-1","v":7},{"$f":"SUMIF(France!$I$5:$I$14,Autriche!$I11,France!$L$5:$L$14)+$J11","v":2},{"$f":"IF(L11=\"\",0,(RANK(L11,$L$5:$L$14)))+COUNTIF(L$5:L11,L11)-1","v":7}]
["ALBON Alexander",null,null,13,null,null,"",null,"RED BULL",{"$f":"SUM($G$11:$G$13)","v":0},{"$f":"IF(J12=\"\",0,(RANK(J12,$J$5:$J$14)))+COUNTIF(J$5:J12,J12)-1","v":8},{"$f":"SUMIF(France!$I$5:$I$14,Autriche!$I12,France!$L$5:$L$14)+$J12","v":0},{"$f":"IF(L12=\"\",0,(RANK(L12,$L$5:$L$14)))+COUNTIF(L$5:L12,L12)-1","v":8}]
[null,null,null,null,null,null,"",null,"WILLIAMS",{"$f":"SUM($G$17:$G$19)","v":0},{"$f":"IF(J13=\"\",0,(RANK(J13,$J$5:$J$14)))+COUNTIF(J$5:J13,J13)-1","v":9},{"$f":"SUMIF(France!$I$5:$I$14,Autriche!$I13,France!$L$5:$L$14)+$J13","v":0},{"$f":"IF(L13=\"\",0,(RANK(L13,$L$5:$L$14)))+COUNTIF(L$5:L13,L13)-1","v":9}]
["PEREZ Sergio","RACING\nPOINT",null,6,null,null,8,null,"HAAS",{"$f":"SUM($G$26:$G$28)","v":0},{"$f":"IF(J14=\"\",0,(RANK(J14,$J$5:$J$14)))+COUNTIF(J$5:J14,J14)-1","v":10},{"$f":"SUMIF(France!$I$5:$I$14,Autriche!$I14,France!$L$5:$L$14)+$J14","v":0},{"$f":"IF(L14=\"\",0,(RANK(L14,$L$5:$L$14)))+COUNTIF(L$5:L14,L14)-1","v":10}]
["STROLL Lance",null,null,"OUT",null,null,""]
[null,null,null,null,null,null,""]
["RUSSELL George","WILLIAMS",null,"OUT",null,null,""]
["LATIFI Nichola",null,null,11,null,null,""]
[null,null,null,null,null,null,""]
["RICCIARDO Daniel","RENAULT",null,"OUT",null,null,""]
["OCON Sebastian",null,null,8,null,null,4]
[null,null,null,null,null,null,""]
["KVYAT Daniil","ALPHA TAURI",null,12,null,null,""]
["GASLY Pierre",null,null,7,null,null,6]
[null,null,null,null,null,null,""]
["GROSJEAN Romain","HAAS",null,"OUT",null,null,""]
["MAGNUSSEN Kevin",null,null,"OUT",null,null,""]
[null,null,null,null,null,null,""]
["NORRIS Lando","McLAREN",null,3,null,1,16]
["SAINZ.Jr Carlos",null,null,5,null,null,10]
[null,null,null,null,null,null,""]
["RAÏKKÖNEN Kimi","ALFA ROMEO",null,"OUT",null,null,""]
["GIOVINAZZI Antonio",null,null,9,null,null,2]
[null,null,null,null,null,null,""]

{"sheet":"Autriche2","index":13,"n_rows":34,"n_cols":13,"rows_kept":34,"cut":false,"hidden":false,"merged":[[0,0,1,13],[2,0,3,0],[2,1,3,1],[2,2,3,2],[2,3,3,3],[2,4,3,4],[2,5,3,5],[2,6,3,6],[2,8,2,12],[4,1,6,1],[4,2,6,2],[7,1,9,1],[7,2,9,2],[10,1,12,1],[10,2,12,2],[13,1,15,1],[13,2,15,2],[16,1,18,1],[16,2,18,2],[19,1,21,1],[19,2,21,2],[31,1,33,1],[31,2,33,2],[22,1,24,1],[22,2,24,2],[25,1,27,1],[25,2,27,2],[28,1,30,1],[28,2,30,2]]}
["SPIELBERG - 12 JUILLET 2020"]
[]
["PILOTES","ECURIES","VOITURES","Finish","Pôle","Pt tour","Points",null,"CLASSEMENT"]
[null,null,null,null,null,null,null,null,"ÉCURIES","POINTS","RANG","TOTAL","PONCTUEL"]
["HAMILTON Lewis","MERCEDES",null,1,1,null,{"$f":"IFERROR(CHOOSE(D5,25,18,15,12,10,8,6,4,2,1)+(F5=1),\"\")","v":25},null,"MERCEDES",{"$f":"SUM($G$5:$G$7)","v":43},{"$f":"IF(J5=\"\",0,(RANK(J5,$J$5:$J$14)))+COUNTIF(J$5:J5,J5)-1","v":1},{"$f":"SUMIF(Autriche!$I$5:$I$14,Autriche2!$I5,Autriche!$L$5:$L$14)+$J5","v":80},{"$f":"IF(L5=\"\",0,(RANK(L5,$L$5:$L$14)))+COUNTIF(L$5:L5,L5)-1","v":1}]
["BOTTAS Valtteri",null,null,2,null,null,{"$f":"IFERROR(CHOOSE(D6,25,18,15,12,10,8,6,4,2,1)+(F6=1),\"\")","v":18},null,"RED BULL",{"$f":"SUM($G$11:$G$13)","v":27},{"$f":"IF(J6=\"\",0,(RANK(J6,$J$5:$J$14)))+COUNTIF(J$5:J6,J6)-1","v":2},{"$f":"SUMIF(Autriche!$I$5:$I$14,Autriche2!$I6,Autriche!$L$5:$L$14)+$J6","v":27},{"$f":"IF(L6=\"\",0,(RANK(L6,$L$5:$L$14)))+COUNTIF(L$5:L6,L6)-1","v":3}]
[null,null,null,null,null,null,"",null,"RACING POINT",{"$f":"SUM($G$14:$G$16)","v":14},{"$f":"IF(J7=\"\",0,(RANK(J7,$J$5:$J$14)))+COUNTIF(J$5:J7,J7)-1","v":3},{"$f":"SUMIF(Autriche!$I$5:$I$14,Autriche2!$I7,Autriche!$L$5:$L$14)+$J7","v":22},{"$f":"IF(L7=\"\",0,(RANK(L7,$L$5:$L$14)))+COUNTIF(L$5:L7,L7)-1","v":4}]
["VETTEL Sebastian","FERRARI",null,"OUT",null,null,"",null,"Mc LAREN",{"$f":"SUM($G$29:$G$31)","v":13},{"$f":"IF(J8=\"\",0,(RANK(J8,$J$5:$J$14)))+COUNTIF(J$5:J8,J8)-1","v":4},{"$f":"SUMIF(Autriche!$I$5:$I$14,Autriche2!$I8,Autriche!$L$5:$L$14)+$J8","v":39},{"$f":"IF(L8=\"\",0,(RANK(L8,$L$5:$L$14)))+COUNTIF(L$5:L8,L8)-1","v":2}]
["LECLERC Charles",null,null,"OUT",null,null,"",null,"RENAULT",{"$f":"SUM($G$20:$G$22)","v":4},{"$f":"IF(J9=\"\",0,(RANK(J9,$J$5:$J$14)))+COUNTIF(J$5:J9,J9)-1","v":5},{"$f":"SUMIF(Autriche!$I$5:$I$14,Autriche2!$I9,Autriche!$L$5:$L$14)+$J9","v":8},{"$f":"IF(L9=\"\",0,(RANK(L9,$L$5:$L$14)))+COUNTIF(L$5:L9,L9)-1","v":6}]
[null,null,null,null,null,null,"",null,"ALPHA TAURI",{"$f":"SUM($G$23:$G$25)","v":1},{"$f":"IF(J10=\"\",0,(RANK(J10,$J$5:$J$14)))+COUNTIF(J$5:J10,J10)-1","v":6},{"$f":"SUMIF(Autriche!$I$5:$I$14,Autriche2!$I10,Autriche!$L$5:$L$14)+$J10","v":7},{"$f":"IF(L10=\"\",0,(RANK(L10,$L$5:$L$14)))+COUNTIF(L$5:L10,L10)-1","v":7}]
["VERSTAPPEN Max","RED BULL",null,3,null,null,15,null,"FERRARI",{"$f":"SUM($G$8:$G$10)","v":0},{"$f":"IF(J11=\"\",0,(RANK(J11,$J$5:$J$14)))+COUNTIF(J$5:J11,J11)-1","v":7},{"$f":"SUMIF(Autriche!$I$5:$I$14,Autriche2!$I11,Autriche!$L$5:$L$14)+$J11","v":19},{"$f":"IF(L11=\"\",0,(RANK(L11,$L$5:$L$14)))+COUNTIF(L$5:L11,L11)-1","v":5}]
["ALBON Alexander",null,null,4,null,null,12,null,"HAAS",{"$f":"SUM($G$26:$G$28)","v":0},{"$f":"IF(J12=\"\",0,(RANK(J12,$J$5:$J$14)))+COUNTIF(J$5:J12,J12)-1","v":8},{"$f":"SUMIF(Autriche!$I$5:$I$14,Autriche2!$I12,Autriche!$L$5:$L$14)+$J12","v":0},{"$f":"IF(L12=\"\",0,(RANK(L12,$L$5:$L$14)))+COUNTIF(L$5:L12,L12)-1","v":9}]
[null,null,null,null,null,null,"",null,"WILLIAMS",{"$f":"SUM($G$17:$G$19)","v":0},{"$f":"IF(J13=\"\",0,(RANK(J13,$J$5:$J$14)))+COUNTIF(J$5:J13,J13)-1","v":9},{"$f":"SUMIF(Autriche!$I$5:$I$14,Autriche2!$I13,Autriche!$L$5:$L$14)+$J13","v":0},{"$f":"IF(L13=\"\",0,(RANK(L13,$L$5:$L$14)))+COUNTIF(L$5:L13,L13)-1","v":10}]
["PEREZ Sergio","RACING\nPOINT",null,6,null,null,8,null,"ALFA ROMEO",{"$f":"SUM($G$32:$G$34)","v":0},{"$f":"IF(J14=\"\",0,(RANK(J14,$J$5:$J$14)))+COUNTIF(J$5:J14,J14)-1","v":10},{"$f":"SUMIF(Autriche!$I$5:$I$14,Autriche2!$I14,Autriche!$L$5:$L$14)+$J14","v":2},{"$f":"IF(L14=\"\",0,(RANK(L14,$L$5:$L$14)))+COUNTIF(L$5:L14,L14)-1","v":8}]
["STROLL Lance",null,null,7,null,null,6]
[null,null,null,null,null,null,""]
["RUSSELL George","WILLIAMS",null,16,null,null,""]
["LATIFI Nichola",null,null,17,null,null,""]
[null,null,null,null,null,null,""]
["RICCIARDO Daniel","RENAULT",null,8,null,null,4]
["OCON Sebastian",null,null,"OUT",null,null,""]
[null,null,null,null,null,null,""]
["KVYAT Daniil","ALPHA TAURI",null,10,null,null,1]
["GASLY Pierre",null,null,15,null,null,""]
[null,null,null,null,null,null,""]
["GROSJEAN Romain","HAAS",null,13,null,null,""]
["MAGNUSSEN Kevin",null,null,12,null,null,""]
[null,null,null,null,null,null,""]
["NORRIS Lando","McLAREN",null,5,null,null,10]
["SAINZ.Jr Carlos",null,null,9,null,1,3]
[null,null,null,null,null,null,""]
["RAÏKKÖNEN Kimi","ALFA ROMEO",null,11,null,null,""]
["GIOVINAZZI Antonio",null,null,14,null,null,""]
[null,null,null,null,null,null,""]

{"sheet":"Hongrie","index":14,"n_rows":34,"n_cols":13,"rows_kept":34,"cut":false,"hidden":false,"merged":[[0,0,1,13],[2,0,3,0],[2,1,3,1],[2,2,3,2],[2,3,3,3],[2,4,3,4],[2,5,3,5],[2,6,3,6],[2,8,2,12],[4,1,6,1],[4,2,6,2],[7,1,9,1],[7,2,9,2],[10,1,12,1],[10,2,12,2],[13,1,15,1],[13,2,15,2],[16,1,18,1],[16,2,18,2],[19,1,21,1],[19,2,21,2],[31,1,33,1],[31,2,33,2],[34,1,36,1],[34,2,36,2],[22,1,24,1],[22,2,24,2],[25,1,27,1],[25,2,27,2],[28,1,30,1],[28,2,30,2]]}
["HUNGARORING - 19 JUILLET 2020"]
[]
["PILOTES","ECURIES","VOITURES","Finish","Pôle","Pt tour","Points",null,"CLASSEMENT"]
[null,null,null,null,null,null,null,null,"ÉCURIES","POINTS","RANG","TOTAL","PONCTUEL"]
["HAMILTON Lewis","MERCEDES",null,1,1,1,{"$f":"IFERROR(CHOOSE(D5,25,18,15,12,10,8,6,4,2,1)+(F5=1),\"\")","v":26},null,"MERCEDES",{"$f":"SUM($G$5:$G$7)","v":41},{"$f":"IF(J5=\"\",0,(RANK(J5,$J$5:$J$14)))+COUNTIF(J$5:J5,J5)-1","v":1},{"$f":"SUMIF(Autriche2!$I$5:$I$14,Hongrie!$I5,Autriche2!$L$5:$L$14)+$J5","v":121},{"$f":"IF(L5=\"\",0,(RANK(L5,$L$5:$L$14)))+COUNTIF(L$5:L5,L5)-1","v":1}]
["BOTTAS Valtteri",null,null,3,null,null,{"$f":"IFERROR(CHOOSE(D6,25,18,15,12,10,8,6,4,2,1)+(F6=1),\"\")","v":15},null,"RED BULL",{"$f":"SUM($G$11:$G$13)","v":28},{"$f":"IF(J6=\"\",0,(RANK(J6,$J$5:$J$14)))+COUNTIF(J$5:J6,J6)-1","v":2},{"$f":"SUMIF(Autriche2!$I$5:$I$14,Hongrie!$I6,Autriche2!$L$5:$L$14)+$J6","v":55},{"$f":"IF(L6=\"\",0,(RANK(L6,$L$5:$L$14)))+COUNTIF(L$5:L6,L6)-1","v":2}]
[null,null,null,null,null,null,"",null,"RACING POINT",{"$f":"SUM($G$14:$G$16)","v":18},{"$f":"IF(J7=\"\",0,(RANK(J7,$J$5:$J$14)))+COUNTIF(J$5:J7,J7)-1","v":3},{"$f":"SUMIF(Autriche2!$I$5:$I$14,Hongrie!$I7,Autriche2!$L$5:$L$14)+$J7","v":40},{"$f":"IF(L7=\"\",0,(RANK(L7,$L$5:$L$14)))+COUNTIF(L$5:L7,L7)-1","v":4}]
["VETTEL Sebastian","FERRARI",null,6,null,null,8,null,"FERRARI",{"$f":"SUM($G$8:$G$10)","v":8},{"$f":"IF(J8=\"\",0,(RANK(J8,$J$5:$J$14)))+COUNTIF(J$5:J8,J8)-1","v":4},{"$f":"SUMIF(Autriche2!$I$5:$I$14,Hongrie!$I8,Autriche2!$L$5:$L$14)+$J8","v":27},{"$f":"IF(L8=\"\",0,(RANK(L8,$L$5:$L$14)))+COUNTIF(L$5:L8,L8)-1","v":5}]
["LECLERC Charles",null,null,11,null,null,"",null,"RENAULT",{"$f":"SUM($G$20:$G$22)","v":4},{"$f":"IF(J9=\"\",0,(RANK(J9,$J$5:$J$14)))+COUNTIF(J$5:J9,J9)-1","v":5},{"$f":"SUMIF(Autriche2!$I$5:$I$14,Hongrie!$I9,Autriche2!$L$5:$L$14)+$J9","v":12},{"$f":"IF(L9=\"\",0,(RANK(L9,$L$5:$L$14)))+COUNTIF(L$5:L9,L9)-1","v":6}]
[null,null,null,null,null,null,"",null,"Mc LAREN",{"$f":"SUM($G$29:$G$31)","v":2},{"$f":"IF(J10=\"\",0,(RANK(J10,$J$5:$J$14)))+COUNTIF(J$5:J10,J10)-1","v":6},{"$f":"SUMIF(Autriche2!$I$5:$I$14,Hongrie!$I10,Autriche2!$L$5:$L$14)+$J10","v":41},{"$f":"IF(L10=\"\",0,(RANK(L10,$L$5:$L$14)))+COUNTIF(L$5:L10,L10)-1","v":3}]
["VERSTAPPEN Max","RED BULL",null,2,null,null,18,null,"HAAS",{"$f":"SUM($G$26:$G$28)","v":1},{"$f":"IF(J11=\"\",0,(RANK(J11,$J$5:$J$14)))+COUNTIF(J$5:J11,J11)-1","v":7},{"$f":"SUMIF(Autriche2!$I$5:$I$14,Hongrie!$I11,Autriche2!$L$5:$L$14)+$J11","v":1},{"$f":"IF(L11=\"\",0,(RANK(L11,$L$5:$L$14)))+COUNTIF(L$5:L11,L11)-1","v":9}]
["ALBON Alexander",null,null,5,null,null,10,null,"ALPHA TAURI",{"$f":"SUM($G$23:$G$25)","v":0},{"$f":"IF(J12=\"\",0,(RANK(J12,$J$5:$J$14)))+COUNTIF(J$5:J12,J12)-1","v":8},{"$f":"SUMIF(Autriche2!$I$5:$I$14,Hongrie!$I12,Autriche2!$L$5:$L$14)+$J12","v":7},{"$f":"IF(L12=\"\",0,(RANK(L12,$L$5:$L$14)))+COUNTIF(L$5:L12,L12)-1","v":7}]
[null,null,null,null,null,null,"",null,"WILLIAMS",{"$f":"SUM($G$17:$G$19)","v":0},{"$f":"IF(J13=\"\",0,(RANK(J13,$J$5:$J$14)))+COUNTIF(J$5:J13,J13)-1","v":9},{"$f":"SUMIF(Autriche2!$I$5:$I$14,Hongrie!$I13,Autriche2!$L$5:$L$14)+$J13","v":0},{"$f":"IF(L13=\"\",0,(RANK(L13,$L$5:$L$14)))+COUNTIF(L$5:L13,L13)-1","v":10}]
["PEREZ Sergio","RACING\nPOINT",null,7,null,null,6,null,"ALFA ROMEO",{"$f":"SUM($G$32:$G$34)","v":0},{"$f":"IF(J14=\"\",0,(RANK(J14,$J$5:$J$14)))+COUNTIF(J$5:J14,J14)-1","v":10},{"$f":"SUMIF(Autriche2!$I$5:$I$14,Hongrie!$I14,Autriche2!$L$5:$L$14)+$J14","v":2},{"$f":"IF(L14=\"\",0,(RANK(L14,$L$5:$L$14)))+COUNTIF(L$5:L14,L14)-1","v":8}]
["STROLL Lance",null,null,4,null,null,12]
[null,null,null,null,null,null,""]
["RUSSELL George","WILLIAMS",null,18,null,null,""]
["LATIFI Nichola",null,null,19,null,null,""]
[null,null,null,null,null,null,""]
["RICCIARDO Daniel","RENAULT",null,8,null,null,4]
["OCON Sebastian",null,null,14,null,null,""]
[null,null,null,null,null,null,""]
["KVYAT Daniil","ALPHA TAURI",null,12,null,null,""]
["GASLY Pierre",null,null,"OUT",null,null,""]
[null,null,null,null,null,null,""]
["GROSJEAN Romain","HAAS",null,16,null,null,""]
["MAGNUSSEN Kevin",null,null,10,null,null,1]
[null,null,null,null,null,null,""]
["NORRIS Lando","McLAREN",null,13,null,null,""]
["SAINZ.Jr Carlos",null,null,9,null,null,2]
[null,null,null,null,null,null,""]
["RAÏKKÖNEN Kimi","ALFA ROMEO",null,15,null,null,""]
["GIOVINAZZI Antonio",null,null,17,null,null,""]
[null,null,null,null,null,null,""]

{"sheet":"GB","index":15,"n_rows":34,"n_cols":13,"rows_kept":34,"cut":false,"hidden":false,"merged":[[0,0,1,13],[2,0,3,0],[2,1,3,1],[2,2,3,2],[2,3,3,3],[2,4,3,4],[2,5,3,5],[2,6,3,6],[2,8,2,12],[4,1,6,1],[4,2,6,2],[7,1,9,1],[7,2,9,2],[10,1,12,1],[10,2,12,2],[13,1,15,1],[13,2,15,2],[16,1,18,1],[16,2,18,2],[19,1,21,1],[19,2,21,2],[31,1,33,1],[31,2,33,2],[34,1,36,1],[34,2,36,2],[22,1,24,1],[22,2,24,2],[25,1,27,1],[25,2,27,2],[28,1,30,1],[28,2,30,2]]}
["SILVERSTONE - 19 JUILLET 2020"]
[]
["PILOTES","ECURIES","VOITURES","Finish","Pôle","Pt tour","Points",null,"CLASSEMENT"]
[null,null,null,null,null,null,null,null,"ÉCURIES","POINTS","RANG","TOTAL","PONCTUEL"]
["HAMILTON Lewis","MERCEDES",null,1,1,null,{"$f":"IFERROR(CHOOSE(D5,25,18,15,12,10,8,6,4,2,1)+(F5=1),\"\")","v":25},null,"MERCEDES",{"$f":"SUM($G$5:$G$7)","v":25},{"$f":"IF(J5=\"\",0,(RANK(J5,$J$5:$J$14)))+COUNTIF(J$5:J5,J5)-1","v":1},{"$f":"SUMIF(Hongrie!$I$5:$I$14,GB!$I5,Hongrie!$L$5:$L$14)+$J5","v":146},{"$f":"IF(L5=\"\",0,(RANK(L5,$L$5:$L$14)))+COUNTIF(L$5:L5,L5)-1","v":1}]
["BOTTAS Valtteri",null,null,11,null,null,{"$f":"IFERROR(CHOOSE(D6,25,18,15,12,10,8,6,4,2,1)+(F6=1),\"\")","v":""},null,"RED BULL",{"$f":"SUM($G$11:$G$13)","v":23},{"$f":"IF(J6=\"\",0,(RANK(J6,$J$5:$J$14)))+COUNTIF(J$5:J6,J6)-1","v":2},{"$f":"SUMIF(Hongrie!$I$5:$I$14,GB!$I6,Hongrie!$L$5:$L$14)+$J6","v":78},{"$f":"IF(L6=\"\",0,(RANK(L6,$L$5:$L$14)))+COUNTIF(L$5:L6,L6)-1","v":2}]
[null,null,null,null,null,null,"",null,"RENAULT",{"$f":"SUM($G$20:$G$22)","v":20},{"$f":"IF(J7=\"\",0,(RANK(J7,$J$5:$J$14)))+COUNTIF(J$5:J7,J7)-1","v":3},{"$f":"SUMIF(Hongrie!$I$5:$I$14,GB!$I7,Hongrie!$L$5:$L$14)+$J7","v":32},{"$f":"IF(L7=\"\",0,(RANK(L7,$L$5:$L$14)))+COUNTIF(L$5:L7,L7)-1","v":6}]
["VETTEL Sebastian","FERRARI",null,10,null,null,1,null,"FERRARI",{"$f":"SUM($G$8:$G$10)","v":16},{"$f":"IF(J8=\"\",0,(RANK(J8,$J$5:$J$14)))+COUNTIF(J$5:J8,J8)-1","v":4},{"$f":"SUMIF(Hongrie!$I$5:$I$14,GB!$I8,Hongrie!$L$5:$L$14)+$J8","v":43},{"$f":"IF(L8=\"\",0,(RANK(L8,$L$5:$L$14)))+COUNTIF(L$5:L8,L8)-1","v":4}]
["LECLERC Charles",null,null,3,null,null,15,null,"Mc LAREN",{"$f":"SUM($G$29:$G$31)","v":10},{"$f":"IF(J9=\"\",0,(RANK(J9,$J$5:$J$14)))+COUNTIF(J$5:J9,J9)-1","v":5},{"$f":"SUMIF(Hongrie!$I$5:$I$14,GB!$I9,Hongrie!$L$5:$L$14)+$J9","v":51},{"$f":"IF(L9=\"\",0,(RANK(L9,$L$5:$L$14)))+COUNTIF(L$5:L9,L9)-1","v":3}]
[null,null,null,null,null,null,"",null,"ALPHA TAURI",{"$f":"SUM($G$23:$G$25)","v":6},{"$f":"IF(J10=\"\",0,(RANK(J10,$J$5:$J$14)))+COUNTIF(J$5:J10,J10)-1","v":6},{"$f":"SUMIF(Hongrie!$I$5:$I$14,GB!$I10,Hongrie!$L$5:$L$14)+$J10","v":13},{"$f":"IF(L10=\"\",0,(RANK(L10,$L$5:$L$14)))+COUNTIF(L$5:L10,L10)-1","v":7}]
["VERSTAPPEN Max","RED BULL",null,2,null,1,19,null,"RACING POINT",{"$f":"SUM($G$14:$G$16)","v":2},{"$f":"IF(J11=\"\",0,(RANK(J11,$J$5:$J$14)))+COUNTIF(J$5:J11,J11)-1","v":7},{"$f":"SUMIF(Hongrie!$I$5:$I$14,GB!$I11,Hongrie!$L$5:$L$14)+$J11","v":42},{"$f":"IF(L11=\"\",0,(RANK(L11,$L$5:$L$14)))+COUNTIF(L$5:L11,L11)-1","v":5}]
["ALBON Alexander",null,null,8,null,null,4,null,"HAAS",{"$f":"SUM($G$26:$G$28)","v":0},{"$f":"IF(J12=\"\",0,(RANK(J12,$J$5:$J$14)))+COUNTIF(J$5:J12,J12)-1","v":8},{"$f":"SUMIF(Hongrie!$I$5:$I$14,GB!$I12,Hongrie!$L$5:$L$14)+$J12","v":1},{"$f":"IF(L12=\"\",0,(RANK(L12,$L$5:$L$14)))+COUNTIF(L$5:L12,L12)-1","v":9}]
[null,null,null,null,null,null,"",null,"WILLIAMS",{"$f":"SUM($G$17:$G$19)","v":0},{"$f":"IF(J13=\"\",0,(RANK(J13,$J$5:$J$14)))+COUNTIF(J$5:J13,J13)-1","v":9},{"$f":"SUMIF(Hongrie!$I$5:$I$14,GB!$I13,Hongrie!$L$5:$L$14)+$J13","v":0},{"$f":"IF(L13=\"\",0,(RANK(L13,$L$5:$L$14)))+COUNTIF(L$5:L13,L13)-1","v":10}]
["PEREZ Sergio","RACING\nPOINT",null,"NC",null,null,"",null,"ALFA ROMEO",{"$f":"SUM($G$32:$G$34)","v":0},{"$f":"IF(J14=\"\",0,(RANK(J14,$J$5:$J$14)))+COUNTIF(J$5:J14,J14)-1","v":10},{"$f":"SUMIF(Hongrie!$I$5:$I$14,GB!$I14,Hongrie!$L$5:$L$14)+$J14","v":2},{"$f":"IF(L14=\"\",0,(RANK(L14,$L$5:$L$14)))+COUNTIF(L$5:L14,L14)-1","v":8}]
["STROLL Lance",null,null,9,null,null,2]
["HULKENBERG Nico",null,null,"OUT",null,null,""]
["RUSSELL George","WILLIAMS",null,12,null,null,""]
["LATIFI Nichola",null,null,15,null,null,""]
[null,null,null,null,null,null,""]
["RICCIARDO Daniel","RENAULT",null,4,null,null,12]
["OCON Sebastian",null,null,6,null,null,8]
[null,null,null,null,null,null,""]
["KVYAT Daniil","ALPHA TAURI",null,"OUT",null,null,""]
["GASLY Pierre",null,null,7,null,null,6]
[null,null,null,null,null,null,""]
["GROSJEAN Romain","HAAS",null,16,null,null,""]
["MAGNUSSEN Kevin",null,null,"OUT",null,null,""]
[null,null,null,null,null,null,""]
["NORRIS Lando","McLAREN",null,5,null,null,10]
["SAINZ.Jr Carlos",null,null,13,null,null,""]
[null,null,null,null,null,null,""]
["RAÏKKÖNEN Kimi","ALFA ROMEO",null,17,null,null,""]
["GIOVINAZZI Antonio",null,null,14,null,null,""]
[null,null,null,null,null,null,""]

{"sheet":"GrB","index":16,"n_rows":34,"n_cols":13,"rows_kept":34,"cut":false,"hidden":false,"merged":[[0,0,1,13],[2,0,3,0],[2,1,3,1],[2,2,3,2],[2,3,3,3],[2,4,3,4],[2,5,3,5],[2,6,3,6],[2,8,2,12],[4,1,6,1],[4,2,6,2],[7,1,9,1],[7,2,9,2],[10,1,12,1],[10,2,12,2],[13,1,15,1],[13,2,15,2],[16,1,18,1],[16,2,18,2],[19,1,21,1],[19,2,21,2],[31,1,33,1],[31,2,33,2],[34,1,36,1],[34,2,36,2],[22,1,24,1],[22,2,24,2],[25,1,27,1],[25,2,27,2],[28,1,30,1],[28,2,30,2]]}
["SILVERSTONE - 9 AOUT 2020"]
[]
["PILOTES","ECURIES","VOITURES","Finish","Pôle","Pt tour","Points",null,"CLASSEMENT"]
[null,null,null,null,null,null,null,null,"ÉCURIES","POINTS","RANG","TOTAL","PONCTUEL"]
["HAMILTON Lewis","MERCEDES",null,2,null,1,{"$f":"IFERROR(CHOOSE(D5,25,18,15,12,10,8,6,4,2,1)+(F5=1),\"\")","v":19},null,"RED BULL",{"$f":"SUM($G$11:$G$13)","v":35},{"$f":"IF(J5=\"\",0,(RANK(J5,$J$5:$J$14)))+COUNTIF(J$5:J5,J5)-1","v":1},{"$f":"SUMIF(GB!$I$5:$I$14,GrB!$I5,GB!$L$5:$L$14)+$J5","v":113},{"$f":"IF(L5=\"\",0,(RANK(L5,$L$5:$L$14)))+COUNTIF(L$5:L5,L5)-1","v":2}]
["BOTTAS Valtteri",null,null,3,1,null,{"$f":"IFERROR(CHOOSE(D6,25,18,15,12,10,8,6,4,2,1)+(F6=1),\"\")","v":15},null,"MERCEDES",{"$f":"SUM($G$5:$G$7)","v":34},{"$f":"IF(J6=\"\",0,(RANK(J6,$J$5:$J$14)))+COUNTIF(J$5:J6,J6)-1","v":2},{"$f":"SUMIF(GB!$I$5:$I$14,GrB!$I6,GB!$L$5:$L$14)+$J6","v":180},{"$f":"IF(L6=\"\",0,(RANK(L6,$L$5:$L$14)))+COUNTIF(L$5:L6,L6)-1","v":1}]
[null,null,null,null,null,null,"",null,"RACING POINT",{"$f":"SUM($G$14:$G$16)","v":14},{"$f":"IF(J7=\"\",0,(RANK(J7,$J$5:$J$14)))+COUNTIF(J$5:J7,J7)-1","v":3},{"$f":"SUMIF(GB!$I$5:$I$14,GrB!$I7,GB!$L$5:$L$14)+$J7","v":56},{"$f":"IF(L7=\"\",0,(RANK(L7,$L$5:$L$14)))+COUNTIF(L$5:L7,L7)-1","v":3}]
["VETTEL Sebastian","FERRARI",null,12,null,null,"",null,"FERRARI",{"$f":"SUM($G$8:$G$10)","v":12},{"$f":"IF(J8=\"\",0,(RANK(J8,$J$5:$J$14)))+COUNTIF(J$5:J8,J8)-1","v":4},{"$f":"SUMIF(GB!$I$5:$I$14,GrB!$I8,GB!$L$5:$L$14)+$J8","v":55},{"$f":"IF(L8=\"\",0,(RANK(L8,$L$5:$L$14)))+COUNTIF(L$5:L8,L8)-1","v":4}]
["LECLERC Charles",null,null,4,null,null,12,null,"RENAULT",{"$f":"SUM($G$20:$G$22)","v":4},{"$f":"IF(J9=\"\",0,(RANK(J9,$J$5:$J$14)))+COUNTIF(J$5:J9,J9)-1","v":5},{"$f":"SUMIF(GB!$I$5:$I$14,GrB!$I9,GB!$L$5:$L$14)+$J9","v":36},{"$f":"IF(L9=\"\",0,(RANK(L9,$L$5:$L$14)))+COUNTIF(L$5:L9,L9)-1","v":6}]
[null,null,null,null,null,null,"",null,"Mc LAREN",{"$f":"SUM($G$29:$G$31)","v":2},{"$f":"IF(J10=\"\",0,(RANK(J10,$J$5:$J$14)))+COUNTIF(J$5:J10,J10)-1","v":6},{"$f":"SUMIF(GB!$I$5:$I$14,GrB!$I10,GB!$L$5:$L$14)+$J10","v":53},{"$f":"IF(L10=\"\",0,(RANK(L10,$L$5:$L$14)))+COUNTIF(L$5:L10,L10)-1","v":5}]
["VERSTAPPEN Max","RED BULL",null,1,null,null,25,null,"ALPHA TAURI",{"$f":"SUM($G$23:$G$25)","v":1},{"$f":"IF(J11=\"\",0,(RANK(J11,$J$5:$J$14)))+COUNTIF(J$5:J11,J11)-1","v":7},{"$f":"SUMIF(GB!$I$5:$I$14,GrB!$I11,GB!$L$5:$L$14)+$J11","v":14},{"$f":"IF(L11=\"\",0,(RANK(L11,$L$5:$L$14)))+COUNTIF(L$5:L11,L11)-1","v":7}]
["ALBON Alexander",null,null,5,null,null,10,null,"HAAS",{"$f":"SUM($G$26:$G$28)","v":0},{"$f":"IF(J12=\"\",0,(RANK(J12,$J$5:$J$14)))+COUNTIF(J$5:J12,J12)-1","v":8},{"$f":"SUMIF(GB!$I$5:$I$14,GrB!$I12,GB!$L$5:$L$14)+$J12","v":1},{"$f":"IF(L12=\"\",0,(RANK(L12,$L$5:$L$14)))+COUNTIF(L$5:L12,L12)-1","v":9}]
[null,null,null,null,null,null,"",null,"WILLIAMS",{"$f":"SUM($G$17:$G$19)","v":0},{"$f":"IF(J13=\"\",0,(RANK(J13,$J$5:$J$14)))+COUNTIF(J$5:J13,J13)-1","v":9},{"$f":"SUMIF(GB!$I$5:$I$14,GrB!$I13,GB!$L$5:$L$14)+$J13","v":0},{"$f":"IF(L13=\"\",0,(RANK(L13,$L$5:$L$14)))+COUNTIF(L$5:L13,L13)-1","v":10}]
["PEREZ Sergio","RACING\nPOINT",null,"NC",null,null,"",null,"ALFA ROMEO",{"$f":"SUM($G$32:$G$34)","v":0},{"$f":"IF(J14=\"\",0,(RANK(J14,$J$5:$J$14)))+COUNTIF(J$5:J14,J14)-1","v":10},{"$f":"SUMIF(GB!$I$5:$I$14,GrB!$I14,GB!$L$5:$L$14)+$J14","v":2},{"$f":"IF(L14=\"\",0,(RANK(L14,$L$5:$L$14)))+COUNTIF(L$5:L14,L14)-1","v":8}]
["STROLL Lance",null,null,6,null,null,8]
["HULKENBERG Nico",null,null,7,null,null,6]
["RUSSELL George","WILLIAMS",null,18,null,null,""]
["LATIFI Nichola",null,null,19,null,null,""]
[null,null,null,null,null,null,""]
["RICCIARDO Daniel","RENAULT",null,14,null,null,""]
["OCON Sebastian",null,null,8,null,null,4]
[null,null,null,null,null,null,""]
["KVYAT Daniil","ALPHA TAURI",null,10,null,null,1]
["GASLY Pierre",null,null,11,null,null,""]
[null,null,null,null,null,null,""]
["GROSJEAN Romain","HAAS",null,16,null,null,""]
["MAGNUSSEN Kevin",null,null,"OUT",null,null,""]
[null,null,null,null,null,null,""]
["NORRIS Lando","McLAREN",null,9,null,null,2]
["SAINZ.Jr Carlos",null,null,13,null,null,""]
[null,null,null,null,null,null,""]
["RAÏKKÖNEN Kimi","ALFA ROMEO",null,15,null,null,""]
["GIOVINAZZI Antonio",null,null,17,null,null,""]
[null,null,null,null,null,null,""]

{"sheet":"Espagne","index":17,"n_rows":34,"n_cols":13,"rows_kept":34,"cut":false,"hidden":false,"merged":[[0,0,1,13],[2,1,3,1],[2,2,3,2],[2,3,3,3],[2,5,3,5],[2,6,3,6],[2,4,3,4],[2,0,3,0],[2,8,2,12],[4,2,6,2],[7,1,9,1],[7,2,9,2],[10,1,12,1],[10,2,12,2],[4,1,6,1],[31,1,33,1],[31,2,33,2],[22,1,24,1],[22,2,24,2],[25,1,27,1],[25,2,27,2],[28,1,30,1],[28,2,30,2],[13,1,15,1],[13,2,15,2],[16,1,18,1],[16,2,18,2],[19,1,21,1],[19,2,21,2]]}
["BARCELONE- 16AOUT 2020"]
[]
["PILOTES","ECURIES","VOITURES","Finish","Pôle","Pt tour","Points",null,"CLASSEMENT"]
[null,null,null,null,null,null,null,null,"ÉCURIES","POINTS","RANG","TOTAL","PONCTUEL"]
["HAMILTON Lewis","MERCEDES",null,1,1,null,{"$f":"IFERROR(CHOOSE(D5,25,18,15,12,10,8,6,4,2,1)+(F5=1),\"\")","v":25},null,"MERCEDES",{"$f":"SUM($G$5:$G$7)","v":41},{"$f":"IF(J5=\"\",0,(RANK(J5,$J$5:$J$14)))+COUNTIF(J$5:J5,J5)-1","v":1},{"$f":"SUMIF(GrB!$I$5:$I$14,Espagne!$I5,GrB!$L$5:$L$14)+$J5","v":221},{"$f":"IF(L5=\"\",0,(RANK(L5,$L$5:$L$14)))+COUNTIF(L$5:L5,L5)-1","v":1}]
["BOTTAS Valtteri",null,null,3,null,1,{"$f":"IFERROR(CHOOSE(D6,25,18,15,12,10,8,6,4,2,1)+(F6=1),\"\")","v":16},null,"RED BULL",{"$f":"SUM($G$11:$G$13)","v":22},{"$f":"IF(J6=\"\",0,(RANK(J6,$J$5:$J$14)))+COUNTIF(J$5:J6,J6)-1","v":2},{"$f":"SUMIF(GrB!$I$5:$I$14,Espagne!$I6,GrB!$L$5:$L$14)+$J6","v":135},{"$f":"IF(L6=\"\",0,(RANK(L6,$L$5:$L$14)))+COUNTIF(L$5:L6,L6)-1","v":2}]
[null,null,null,null,null,null,"",null,"RACING POINT",{"$f":"SUM($G$14:$G$16)","v":22},{"$f":"IF(J7=\"\",0,(RANK(J7,$J$5:$J$14)))+COUNTIF(J$5:J7,J7)-1","v":3},{"$f":"SUMIF(GrB!$I$5:$I$14,Espagne!$I7,GrB!$L$5:$L$14)+$J7","v":78},{"$f":"IF(L7=\"\",0,(RANK(L7,$L$5:$L$14)))+COUNTIF(L$5:L7,L7)-1","v":3}]
["VETTEL Sebastian","FERRARI",null,7,null,null,6,null,"Mc LAREN",{"$f":"SUM($G$29:$G$31)","v":9},{"$f":"IF(J8=\"\",0,(RANK(J8,$J$5:$J$14)))+COUNTIF(J$5:J8,J8)-1","v":4},{"$f":"SUMIF(GrB!$I$5:$I$14,Espagne!$I8,GrB!$L$5:$L$14)+$J8","v":62},{"$f":"IF(L8=\"\",0,(RANK(L8,$L$5:$L$14)))+COUNTIF(L$5:L8,L8)-1","v":4}]
["LECLERC Charles",null,null,"OUT",null,null,"",null,"FERRARI",{"$f":"SUM($G$8:$G$10)","v":6},{"$f":"IF(J9=\"\",0,(RANK(J9,$J$5:$J$14)))+COUNTIF(J$5:J9,J9)-1","v":5},{"$f":"SUMIF(GrB!$I$5:$I$14,Espagne!$I9,GrB!$L$5:$L$14)+$J9","v":61},{"$f":"IF(L9=\"\",0,(RANK(L9,$L$5:$L$14)))+COUNTIF(L$5:L9,L9)-1","v":5}]
[null,null,null,null,null,null,"",null,"ALPHA TAURI",{"$f":"SUM($G$23:$G$25)","v":2},{"$f":"IF(J10=\"\",0,(RANK(J10,$J$5:$J$14)))+COUNTIF(J$5:J10,J10)-1","v":6},{"$f":"SUMIF(GrB!$I$5:$I$14,Espagne!$I10,GrB!$L$5:$L$14)+$J10","v":16},{"$f":"IF(L10=\"\",0,(RANK(L10,$L$5:$L$14)))+COUNTIF(L$5:L10,L10)-1","v":7}]
["VERSTAPPEN Max","RED BULL",null,2,null,null,18,null,"RENAULT",{"$f":"SUM($G$20:$G$22)","v":0},{"$f":"IF(J11=\"\",0,(RANK(J11,$J$5:$J$14)))+COUNTIF(J$5:J11,J11)-1","v":7},{"$f":"SUMIF(GrB!$I$5:$I$14,Espagne!$I11,GrB!$L$5:$L$14)+$J11","v":36},{"$f":"IF(L11=\"\",0,(RANK(L11,$L$5:$L$14)))+COUNTIF(L$5:L11,L11)-1","v":6}]
["ALBON Alexander",null,null,8,null,null,4,null,"HAAS",{"$f":"SUM($G$26:$G$28)","v":0},{"$f":"IF(J12=\"\",0,(RANK(J12,$J$5:$J$14)))+COUNTIF(J$5:J12,J12)-1","v":8},{"$f":"SUMIF(GrB!$I$5:$I$14,Espagne!$I12,GrB!$L$5:$L$14)+$J12","v":1},{"$f":"IF(L12=\"\",0,(RANK(L12,$L$5:$L$14)))+COUNTIF(L$5:L12,L12)-1","v":9}]
[null,null,null,null,null,null,"",null,"WILLIAMS",{"$f":"SUM($G$17:$G$19)","v":0},{"$f":"IF(J13=\"\",0,(RANK(J13,$J$5:$J$14)))+COUNTIF(J$5:J13,J13)-1","v":9},{"$f":"SUMIF(GrB!$I$5:$I$14,Espagne!$I13,GrB!$L$5:$L$14)+$J13","v":0},{"$f":"IF(L13=\"\",0,(RANK(L13,$L$5:$L$14)))+COUNTIF(L$5:L13,L13)-1","v":10}]
["PEREZ Sergio","RACING\nPOINT",null,5,null,null,10,null,"ALFA ROMEO",{"$f":"SUM($G$32:$G$34)","v":0},{"$f":"IF(J14=\"\",0,(RANK(J14,$J$5:$J$14)))+COUNTIF(J$5:J14,J14)-1","v":10},{"$f":"SUMIF(GrB!$I$5:$I$14,Espagne!$I14,GrB!$L$5:$L$14)+$J14","v":2},{"$f":"IF(L14=\"\",0,(RANK(L14,$L$5:$L$14)))+COUNTIF(L$5:L14,L14)-1","v":8}]
["STROLL Lance",null,null,4,null,null,12]
[null,null,null,null,null,null,""]
["RUSSELL George","WILLIAMS",null,17,null,null,""]
["LATIFI Nichola",null,null,18,null,null,""]
[null,null,null,null,null,null,""]
["RICCIARDO Daniel","RENAULT",null,11,null,null,""]
["OCON Sebastian",null,null,13,null,null,""]
[null,null,null,null,null,null,""]
["KVYAT Daniil","ALPHA TAURI",null,12,null,null,""]
["GASLY Pierre",null,null,9,null,null,2]
[null,null,null,null,null,null,""]
["GROSJEAN Romain","HAAS",null,19,null,null,""]
["MAGNUSSEN Kevin",null,null,15,null,null,""]
[null,null,null,null,null,null,""]
["NORRIS Lando","McLAREN",null,10,null,null,1]
["SAINZ.Jr Carlos",null,null,6,null,null,8]
[null,null,null,null,null,null,""]
["RAÏKKÖNEN Kimi","ALFA ROMEO",null,14,null,null,""]
["GIOVINAZZI Antonio",null,null,16,null,null,""]
[null,null,null,null,null,null,""]

{"sheet":"Belgique","index":18,"n_rows":34,"n_cols":13,"rows_kept":34,"cut":false,"hidden":false,"merged":[[0,0,1,13],[2,0,3,0],[2,1,3,1],[2,2,3,2],[2,3,3,3],[2,4,3,4],[2,5,3,5],[2,6,3,6],[2,8,2,12],[4,1,6,1],[4,2,6,2],[7,1,9,1],[7,2,9,2],[10,1,12,1],[10,2,12,2],[13,1,15,1],[13,2,15,2],[16,1,18,1],[16,2,18,2],[19,1,21,1],[19,2,21,2],[31,1,33,1],[31,2,33,2],[22,1,24,1],[22,2,24,2],[25,1,27,1],[25,2,27,2],[28,1,30,1],[28,2,30,2]]}
["SPA FRANCORCHAMPS - 30 AOUT 2020"]
[]
["PILOTES","ECURIES","VOITURES","Finish","Pôle","Pt tour","Points",null,"CLASSEMENT"]
[null,null,null,null,null,null,null,null,"ÉCURIES","POINTS","RANG","TOTAL","PONCTUEL"]
["HAMILTON Lewis","MERCEDES",null,1,1,null,{"$f":"IFERROR(CHOOSE(D5,25,18,15,12,10,8,6,4,2,1)+(F5=1),\"\")","v":25},null,"MERCEDES",{"$f":"SUM($G$5:$G$7)","v":43},{"$f":"IF(J5=\"\",0,(RANK(J5,$J$5:$J$14)))+COUNTIF(J$5:J5,J5)-1","v":1},{"$f":"SUMIF(Espagne!$I$5:$I$14,Belgique!$I5,Espagne!$L$5:$L$14)+$J5","v":264},{"$f":"IF(L5=\"\",0,(RANK(L5,$L$5:$L$14)))+COUNTIF(L$5:L5,L5)-1","v":1}]
["BOTTAS Valtteri",null,null,2,null,null,{"$f":"IFERROR(CHOOSE(D6,25,18,15,12,10,8,6,4,2,1)+(F6=1),\"\")","v":18},null,"RED BULL",{"$f":"SUM($G$11:$G$13)","v":23},{"$f":"IF(J6=\"\",0,(RANK(J6,$J$5:$J$14)))+COUNTIF(J$5:J6,J6)-1","v":2},{"$f":"SUMIF(Espagne!$I$5:$I$14,Belgique!$I6,Espagne!$L$5:$L$14)+$J6","v":158},{"$f":"IF(L6=\"\",0,(RANK(L6,$L$5:$L$14)))+COUNTIF(L$5:L6,L6)-1","v":2}]
[null,null,null,null,null,null,"",null,"RENAULT",{"$f":"SUM($G$20:$G$22)","v":23},{"$f":"IF(J7=\"\",0,(RANK(J7,$J$5:$J$14)))+COUNTIF(J$5:J7,J7)-1","v":3},{"$f":"SUMIF(Espagne!$I$5:$I$14,Belgique!$I7,Espagne!$L$5:$L$14)+$J7","v":59},{"$f":"IF(L7=\"\",0,(RANK(L7,$L$5:$L$14)))+COUNTIF(L$5:L7,L7)-1","v":6}]
["VETTEL Sebastian","FERRARI",null,13,null,null,"",null,"Mc LAREN",{"$f":"SUM($G$29:$G$31)","v":6},{"$f":"IF(J8=\"\",0,(RANK(J8,$J$5:$J$14)))+COUNTIF(J$5:J8,J8)-1","v":4},{"$f":"SUMIF(Espagne!$I$5:$I$14,Belgique!$I8,Espagne!$L$5:$L$14)+$J8","v":68},{"$f":"IF(L8=\"\",0,(RANK(L8,$L$5:$L$14)))+COUNTIF(L$5:L8,L8)-1","v":4}]
["LECLERC Charles",null,null,14,null,null,"",null,"ALPHA TAURI",{"$f":"SUM($G$23:$G$25)","v":4},{"$f":"IF(J9=\"\",0,(RANK(J9,$J$5:$J$14)))+COUNTIF(J$5:J9,J9)-1","v":5},{"$f":"SUMIF(Espagne!$I$5:$I$14,Belgique!$I9,Espagne!$L$5:$L$14)+$J9","v":20},{"$f":"IF(L9=\"\",0,(RANK(L9,$L$5:$L$14)))+COUNTIF(L$5:L9,L9)-1","v":7}]
[null,null,null,null,null,null,"",null,"RACING POINT",{"$f":"SUM($G$14:$G$16)","v":3},{"$f":"IF(J10=\"\",0,(RANK(J10,$J$5:$J$14)))+COUNTIF(J$5:J10,J10)-1","v":6},{"$f":"SUMIF(Espagne!$I$5:$I$14,Belgique!$I10,Espagne!$L$5:$L$14)+$J10","v":81},{"$f":"IF(L10=\"\",0,(RANK(L10,$L$5:$L$14)))+COUNTIF(L$5:L10,L10)-1","v":3}]
["VERSTAPPEN Max","RED BULL",null,3,null,null,15,null,"FERRARI",{"$f":"SUM($G$8:$G$10)","v":0},{"$f":"IF(J11=\"\",0,(RANK(J11,$J$5:$J$14)))+COUNTIF(J$5:J11,J11)-1","v":7},{"$f":"SUMIF(Espagne!$I$5:$I$14,Belgique!$I11,Espagne!$L$5:$L$14)+$J11","v":61},{"$f":"IF(L11=\"\",0,(RANK(L11,$L$5:$L$14)))+COUNTIF(L$5:L11,L11)-1","v":5}]
["ALBON Alexander",null,null,6,null,null,8,null,"HAAS",{"$f":"SUM($G$26:$G$28)","v":0},{"$f":"IF(J12=\"\",0,(RANK(J12,$J$5:$J$14)))+COUNTIF(J$5:J12,J12)-1","v":8},{"$f":"SUMIF(Espagne!$I$5:$I$14,Belgique!$I12,Espagne!$L$5:$L$14)+$J12","v":1},{"$f":"IF(L12=\"\",0,(RANK(L12,$L$5:$L$14)))+COUNTIF(L$5:L12,L12)-1","v":9}]
[null,null,null,null,null,null,"",null,"WILLIAMS",{"$f":"SUM($G$17:$G$19)","v":0},{"$f":"IF(J13=\"\",0,(RANK(J13,$J$5:$J$14)))+COUNTIF(J$5:J13,J13)-1","v":9},{"$f":"SUMIF(Espagne!$I$5:$I$14,Belgique!$I13,Espagne!$L$5:$L$14)+$J13","v":0},{"$f":"IF(L13=\"\",0,(RANK(L13,$L$5:$L$14)))+COUNTIF(L$5:L13,L13)-1","v":10}]
["PEREZ Sergio","RACING\nPOINT",null,10,null,null,1,null,"ALFA ROMEO",{"$f":"SUM($G$32:$G$34)","v":0},{"$f":"IF(J14=\"\",0,(RANK(J14,$J$5:$J$14)))+COUNTIF(J$5:J14,J14)-1","v":10},{"$f":"SUMIF(Espagne!$I$5:$I$14,Belgique!$I14,Espagne!$L$5:$L$14)+$J14","v":2},{"$f":"IF(L14=\"\",0,(RANK(L14,$L$5:$L$14)))+COUNTIF(L$5:L14,L14)-1","v":8}]
["STROLL Lance",null,null,9,null,null,2]
[null,null,null,null,null,null,""]
["RUSSELL George","WILLIAMS",null,"OUT",null,null,""]
["LATIFI Nichola",null,null,16,null,null,""]
[null,null,null,null,null,null,""]
["RICCIARDO Daniel","RENAULT",null,4,null,1,13]
["OCON Sebastian",null,null,5,null,null,10]
[null,null,null,null,null,null,""]
["KVYAT Daniil","ALPHA TAURI",null,11,null,null,""]
["GASLY Pierre",null,null,8,null,null,4]
[null,null,null,null,null,null,""]
["GROSJEAN Romain","HAAS",null,15,null,null,""]
["MAGNUSSEN Kevin",null,null,17,null,null,""]
[null,null,null,null,null,null,""]
["NORRIS Lando","McLAREN",null,7,null,null,6]
["SAINZ.Jr Carlos",null,null,"OUT",null,null,""]
[null,null,null,null,null,null,""]
["RAÏKKÖNEN Kimi","ALFA ROMEO",null,12,null,null,""]
["GIOVINAZZI Antonio",null,null,"OUT",null,null,""]
[null,null,null,null,null,null,""]

{"sheet":"Italie","index":19,"n_rows":34,"n_cols":13,"rows_kept":34,"cut":false,"hidden":false,"merged":[[0,0,1,13],[2,0,3,0],[2,1,3,1],[2,2,3,2],[2,3,3,3],[2,4,3,4],[2,5,3,5],[2,6,3,6],[2,8,2,12],[4,1,6,1],[4,2,6,2],[7,1,9,1],[7,2,9,2],[10,1,12,1],[10,2,12,2],[13,1,15,1],[13,2,15,2],[16,1,18,1],[16,2,18,2],[19,1,21,1],[19,2,21,2],[31,1,33,1],[31,2,33,2],[22,1,24,1],[22,2,24,2],[25,1,27,1],[25,2,27,2],[28,1,30,1],[28,2,30,2]]}
["MONZA - 6 SEPTEMBRE 2020"]
[]
["PILOTES","ECURIES","VOITURES","Finish","Pôle","Pt tour","Points",null,"CLASSEMENT"]
[null,null,null,null,null,null,null,null,"ÉCURIES","POINTS","RANG","TOTAL","PONCTUEL"]
["HAMILTON Lewis","MERCEDES",null,7,1,1,{"$f":"IFERROR(CHOOSE(D5,25,18,15,12,10,8,6,4,2,1)+(F5=1),\"\")","v":7},null,"Mc LAREN",{"$f":"SUM($G$29:$G$31)","v":30},{"$f":"IF(J5=\"\",0,(RANK(J5,$J$5:$J$14)))+COUNTIF(J$5:J5,J5)-1","v":1},{"$f":"SUMIF(Belgique!$I$5:$I$14,Italie!$I5,Belgique!$L$5:$L$14)+$J5","v":98},{"$f":"IF(L5=\"\",0,(RANK(L5,$L$5:$L$14)))+COUNTIF(L$5:L5,L5)-1","v":3}]
["BOTTAS Valtteri",null,null,5,null,null,{"$f":"IFERROR(CHOOSE(D6,25,18,15,12,10,8,6,4,2,1)+(F6=1),\"\")","v":10},null,"ALPHA TAURI",{"$f":"SUM($G$23:$G$25)","v":27},{"$f":"IF(J6=\"\",0,(RANK(J6,$J$5:$J$14)))+COUNTIF(J$5:J6,J6)-1","v":2},{"$f":"SUMIF(Belgique!$I$5:$I$14,Italie!$I6,Belgique!$L$5:$L$14)+$J6","v":47},{"$f":"IF(L6=\"\",0,(RANK(L6,$L$5:$L$14)))+COUNTIF(L$5:L6,L6)-1","v":7}]
[null,null,null,null,null,null,"",null,"MERCEDES",{"$f":"SUM($G$5:$G$7)","v":17},{"$f":"IF(J7=\"\",0,(RANK(J7,$J$5:$J$14)))+COUNTIF(J$5:J7,J7)-1","v":3},{"$f":"SUMIF(Belgique!$I$5:$I$14,Italie!$I7,Belgique!$L$5:$L$14)+$J7","v":281},{"$f":"IF(L7=\"\",0,(RANK(L7,$L$5:$L$14)))+COUNTIF(L$5:L7,L7)-1","v":1}]
["VETTEL Sebastian","FERRARI",null,"OUT",null,null,{"$f":"IFERROR(CHOOSE(D8,25,18,15,12,10,8,6,4,2,1)+(F8=1),\"\")","v":""},null,"RACING POINT",{"$f":"SUM($G$14:$G$16)","v":16},{"$f":"IF(J8=\"\",0,(RANK(J8,$J$5:$J$14)))+COUNTIF(J$5:J8,J8)-1","v":4},{"$f":"SUMIF(Belgique!$I$5:$I$14,Italie!$I8,Belgique!$L$5:$L$14)+$J8","v":97},{"$f":"IF(L8=\"\",0,(RANK(L8,$L$5:$L$14)))+COUNTIF(L$5:L8,L8)-1","v":4}]
["LECLERC Charles",null,null,"OUT",null,null,"",null,"RENAULT",{"$f":"SUM($G$20:$G$22)","v":12},{"$f":"IF(J9=\"\",0,(RANK(J9,$J$5:$J$14)))+COUNTIF(J$5:J9,J9)-1","v":5},{"$f":"SUMIF(Belgique!$I$5:$I$14,Italie!$I9,Belgique!$L$5:$L$14)+$J9","v":71},{"$f":"IF(L9=\"\",0,(RANK(L9,$L$5:$L$14)))+COUNTIF(L$5:L9,L9)-1","v":5}]
[null,null,null,null,null,null,"",null,"RED BULL",{"$f":"SUM($G$11:$G$13)","v":0},{"$f":"IF(J10=\"\",0,(RANK(J10,$J$5:$J$14)))+COUNTIF(J$5:J10,J10)-1","v":6},{"$f":"SUMIF(Belgique!$I$5:$I$14,Italie!$I10,Belgique!$L$5:$L$14)+$J10","v":158},{"$f":"IF(L10=\"\",0,(RANK(L10,$L$5:$L$14)))+COUNTIF(L$5:L10,L10)-1","v":2}]
["VERSTAPPEN Max","RED BULL",null,"OUT",null,null,"",null,"FERRARI",{"$f":"SUM($G$8:$G$10)","v":0},{"$f":"IF(J11=\"\",0,(RANK(J11,$J$5:$J$14)))+COUNTIF(J$5:J11,J11)-1","v":7},{"$f":"SUMIF(Belgique!$I$5:$I$14,Italie!$I11,Belgique!$L$5:$L$14)+$J11","v":61},{"$f":"IF(L11=\"\",0,(RANK(L11,$L$5:$L$14)))+COUNTIF(L$5:L11,L11)-1","v":6}]
["ALBON Alexander",null,null,15,null,null,{"$f":"IFERROR(CHOOSE(D12,25,18,15,12,10,8,6,4,2,1)+(F12=1),\"\")","v":""},null,"HAAS",{"$f":"SUM($G$26:$G$28)","v":0},{"$f":"IF(J12=\"\",0,(RANK(J12,$J$5:$J$14)))+COUNTIF(J$5:J12,J12)-1","v":8},{"$f":"SUMIF(Belgique!$I$5:$I$14,Italie!$I12,Belgique!$L$5:$L$14)+$J12","v":1},{"$f":"IF(L12=\"\",0,(RANK(L12,$L$5:$L$14)))+COUNTIF(L$5:L12,L12)-1","v":9}]
[null,null,null,null,null,null,"",null,"WILLIAMS",{"$f":"SUM($G$17:$G$19)","v":0},{"$f":"IF(J13=\"\",0,(RANK(J13,$J$5:$J$14)))+COUNTIF(J$5:J13,J13)-1","v":9},{"$f":"SUMIF(Belgique!$I$5:$I$14,Italie!$I13,Belgique!$L$5:$L$14)+$J13","v":0},{"$f":"IF(L13=\"\",0,(RANK(L13,$L$5:$L$14)))+COUNTIF(L$5:L13,L13)-1","v":10}]
["PEREZ Sergio","RACING\nPOINT",null,10,null,null,1,null,"ALFA ROMEO",{"$f":"SUM($G$32:$G$34)","v":0},{"$f":"IF(J14=\"\",0,(RANK(J14,$J$5:$J$14)))+COUNTIF(J$5:J14,J14)-1","v":10},{"$f":"SUMIF(Belgique!$I$5:$I$14,Italie!$I14,Belgique!$L$5:$L$14)+$J14","v":2},{"$f":"IF(L14=\"\",0,(RANK(L14,$L$5:$L$14)))+COUNTIF(L$5:L14,L14)-1","v":8}]
["STROLL Lance",null,null,3,null,null,15]
[null,null,null,null,null,null,""]
["RUSSELL George","WILLIAMS",null,14,null,null,""]
["LATIFI Nichola",null,null,11,null,null,""]
[null,null,null,null,null,null,""]
["RICCIARDO Daniel","RENAULT",null,6,null,null,8]
["OCON Sebastian",null,null,8,null,null,4]
[null,null,null,null,null,null,""]
["KVYAT Daniil","ALPHA TAURI",null,9,null,null,2]
["GASLY Pierre",null,null,1,null,null,25]
[null,null,null,null,null,null,""]
["GROSJEAN Romain","HAAS",null,12,null,null,""]
["MAGNUSSEN Kevin",null,null,"OUT",null,null,""]
[null,null,null,null,null,null,""]
["NORRIS Lando","McLAREN",null,4,null,null,12]
["SAINZ.Jr Carlos",null,null,2,null,null,18]
[null,null,null,null,null,null,""]
["RAÏKKÖNEN Kimi","ALFA ROMEO",null,13,null,null,""]
["GIOVINAZZI Antonio",null,null,16,null,null,""]
[null,null,null,null,null,null,""]

{"sheet":"Toscane","index":20,"n_rows":34,"n_cols":13,"rows_kept":34,"cut":false,"hidden":false,"merged":[[0,0,1,13],[2,0,3,0],[2,1,3,1],[2,2,3,2],[2,3,3,3],[2,4,3,4],[2,5,3,5],[2,6,3,6],[2,8,2,12],[4,1,6,1],[4,2,6,2],[7,1,9,1],[7,2,9,2],[10,1,12,1],[10,2,12,2],[13,1,15,1],[13,2,15,2],[16,1,18,1],[16,2,18,2],[19,1,21,1],[19,2,21,2],[31,1,33,1],[31,2,33,2],[22,1,24,1],[22,2,24,2],[25,1,27,1],[25,2,27,2],[28,1,30,1],[28,2,30,2]]}
["MUGELLO - 6 SEPTEMBRE 2020"]
[]
["PILOTES","ECURIES","VOITURES","Finish","Pôle","Pt tour","Points",null,"CLASSEMENT"]
[null,null,null,null,null,null,null,null,"ÉCURIES","POINTS","RANG","TOTAL","PONCTUEL"]
["HAMILTON Lewis","MERCEDES",null,1,1,1,{"$f":"IFERROR(CHOOSE(D5,25,18,15,12,10,8,6,4,2,1)+(F5=1),\"\")","v":26},null,"MERCEDES",{"$f":"SUM($G$5:$G$7)","v":44},{"$f":"IF(J5=\"\",0,(RANK(J5,$J$5:$J$14)))+COUNTIF(J$5:J5,J5)-1","v":1},{"$f":"SUMIF(Italie!$I$5:$I$14,Toscane!$I5,Italie!$L$5:$L$14)+$J5","v":325},{"$f":"IF(L5=\"\",0,(RANK(L5,$L$5:$L$14)))+COUNTIF(L$5:L5,L5)-1","v":1}]
["BOTTAS Valtteri",null,null,2,null,null,{"$f":"IFERROR(CHOOSE(D6,25,18,15,12,10,8,6,4,2,1)+(F6=1),\"\")","v":18},null,"RED BULL",{"$f":"SUM($G$11:$G$13)","v":15},{"$f":"IF(J6=\"\",0,(RANK(J6,$J$5:$J$14)))+COUNTIF(J$5:J6,J6)-1","v":2},{"$f":"SUMIF(Italie!$I$5:$I$14,Toscane!$I6,Italie!$L$5:$L$14)+$J6","v":173},{"$f":"IF(L6=\"\",0,(RANK(L6,$L$5:$L$14)))+COUNTIF(L$5:L6,L6)-1","v":2}]
[null,null,null,null,null,null,"",null,"RENAULT",{"$f":"SUM($G$20:$G$22)","v":12},{"$f":"IF(J7=\"\",0,(RANK(J7,$J$5:$J$14)))+COUNTIF(J$5:J7,J7)-1","v":3},{"$f":"SUMIF(Italie!$I$5:$I$14,Toscane!$I7,Italie!$L$5:$L$14)+$J7","v":83},{"$f":"IF(L7=\"\",0,(RANK(L7,$L$5:$L$14)))+COUNTIF(L$5:L7,L7)-1","v":5}]
["VETTEL Sebastian","FERRARI",null,10,null,null,1,null,"RACING POINT",{"$f":"SUM($G$14:$G$16)","v":10},{"$f":"IF(J8=\"\",0,(RANK(J8,$J$5:$J$14)))+COUNTIF(J$5:J8,J8)-1","v":4},{"$f":"SUMIF(Italie!$I$5:$I$14,Toscane!$I8,Italie!$L$5:$L$14)+$J8","v":107},{"$f":"IF(L8=\"\",0,(RANK(L8,$L$5:$L$14)))+COUNTIF(L$5:L8,L8)-1","v":3}]
["LECLERC Charles",null,null,8,null,null,4,null,"Mc LAREN",{"$f":"SUM($G$29:$G$31)","v":8},{"$f":"IF(J9=\"\",0,(RANK(J9,$J$5:$J$14)))+COUNTIF(J$5:J9,J9)-1","v":5},{"$f":"SUMIF(Italie!$I$5:$I$14,Toscane!$I9,Italie!$L$5:$L$14)+$J9","v":106},{"$f":"IF(L9=\"\",0,(RANK(L9,$L$5:$L$14)))+COUNTIF(L$5:L9,L9)-1","v":4}]
[null,null,null,null,null,null,"",null,"ALPHA TAURI",{"$f":"SUM($G$23:$G$25)","v":6},{"$f":"IF(J10=\"\",0,(RANK(J10,$J$5:$J$14)))+COUNTIF(J$5:J10,J10)-1","v":6},{"$f":"SUMIF(Italie!$I$5:$I$14,Toscane!$I10,Italie!$L$5:$L$14)+$J10","v":53},{"$f":"IF(L10=\"\",0,(RANK(L10,$L$5:$L$14)))+COUNTIF(L$5:L10,L10)-1","v":7}]
["VERSTAPPEN Max","RED BULL",null,"OUT",null,null,"",null,"FERRARI",{"$f":"SUM($G$8:$G$10)","v":5},{"$f":"IF(J11=\"\",0,(RANK(J11,$J$5:$J$14)))+COUNTIF(J$5:J11,J11)-1","v":7},{"$f":"SUMIF(Italie!$I$5:$I$14,Toscane!$I11,Italie!$L$5:$L$14)+$J11","v":66},{"$f":"IF(L11=\"\",0,(RANK(L11,$L$5:$L$14)))+COUNTIF(L$5:L11,L11)-1","v":6}]
["ALBON Alexander",null,null,3,null,null,15,null,"ALFA ROMEO",{"$f":"SUM($G$32:$G$34)","v":2},{"$f":"IF(J12=\"\",0,(RANK(J12,$J$5:$J$14)))+COUNTIF(J$5:J12,J12)-1","v":8},{"$f":"SUMIF(Italie!$I$5:$I$14,Toscane!$I12,Italie!$L$5:$L$14)+$J12","v":4},{"$f":"IF(L12=\"\",0,(RANK(L12,$L$5:$L$14)))+COUNTIF(L$5:L12,L12)-1","v":8}]
[null,null,null,null,null,null,"",null,"HAAS",{"$f":"SUM($G$26:$G$28)","v":0},{"$f":"IF(J13=\"\",0,(RANK(J13,$J$5:$J$14)))+COUNTIF(J$5:J13,J13)-1","v":9},{"$f":"SUMIF(Italie!$I$5:$I$14,Toscane!$I13,Italie!$L$5:$L$14)+$J13","v":1},{"$f":"IF(L13=\"\",0,(RANK(L13,$L$5:$L$14)))+COUNTIF(L$5:L13,L13)-1","v":9}]
["PEREZ Sergio","RACING\nPOINT",null,5,null,null,10,null,"WILLIAMS",{"$f":"SUM($G$17:$G$19)","v":0},{"$f":"IF(J14=\"\",0,(RANK(J14,$J$5:$J$14)))+COUNTIF(J$5:J14,J14)-1","v":10},{"$f":"SUMIF(Italie!$I$5:$I$14,Toscane!$I14,Italie!$L$5:$L$14)+$J14","v":0},{"$f":"IF(L14=\"\",0,(RANK(L14,$L$5:$L$14)))+COUNTIF(L$5:L14,L14)-1","v":10}]
["STROLL Lance",null,null,"OUT",null,null,""]
[null,null,null,null,null,null,""]
["RUSSELL George","WILLIAMS",null,11,null,null,""]
["LATIFI Nichola",null,null,"OUT",null,null,""]
[null,null,null,null,null,null,""]
["RICCIARDO Daniel","RENAULT",null,4,null,null,12]
["OCON Sebastian",null,null,"OUT",null,null,""]
[null,null,null,null,null,null,""]
["KVYAT Daniil","ALPHA TAURI",null,7,null,null,6]
["GASLY Pierre",null,null,"OUT",null,null,""]
[null,null,null,null,null,null,""]
["GROSJEAN Romain","HAAS",null,12,null,null,""]
["MAGNUSSEN Kevin",null,null,"OUT",null,null,""]
[null,null,null,null,null,null,""]
["NORRIS Lando","McLAREN",null,6,null,null,8]
["SAINZ.Jr Carlos",null,null,"OUT",null,null,""]
[null,null,null,null,null,null,""]
["RAÏKKÖNEN Kimi","ALFA ROMEO",null,9,null,null,2]
["GIOVINAZZI Antonio",null,null,"OUT",null,null,""]
[null,null,null,null,null,null,""]

{"sheet":"Russie","index":21,"n_rows":34,"n_cols":13,"rows_kept":34,"cut":false,"hidden":false,"merged":[[0,0,1,13],[2,0,3,0],[2,1,3,1],[2,2,3,2],[2,3,3,3],[2,4,3,4],[2,5,3,5],[2,6,3,6],[2,8,2,12],[4,1,6,1],[4,2,6,2],[7,1,9,1],[7,2,9,2],[10,1,12,1],[10,2,12,2],[13,1,15,1],[13,2,15,2],[16,1,18,1],[16,2,18,2],[19,1,21,1],[19,2,21,2],[31,1,33,1],[31,2,33,2],[22,1,24,1],[22,2,24,2],[25,1,27,1],[25,2,27,2],[28,1,30,1],[28,2,30,2]]}
["SOTCHI - 27 SEPTEMBRE 2020"]
[]
["PILOTES","ECURIES","VOITURES","Finish","Pôle","Pt tour","Points",null,"CLASSEMENT"]
[null,null,null,null,null,null,null,null,"ÉCURIES","POINTS","RANG","TOTAL","PONCTUEL"]
["HAMILTON Lewis","MERCEDES",null,3,1,null,{"$f":"IFERROR(CHOOSE(D5,25,18,15,12,10,8,6,4,2,1)+(F5=1),\"\")","v":15},null,"MERCEDES",{"$f":"SUM($G$5:$G$7)","v":41},{"$f":"IF(J5=\"\",0,(RANK(J5,$J$5:$J$14)))+COUNTIF(J$5:J5,J5)-1","v":1},{"$f":"SUMIF(Toscane!$I$5:$I$14,Russie!$I5,Toscane!$L$5:$L$14)+$J5","v":366},{"$f":"IF(L5=\"\",0,(RANK(L5,$L$5:$L$14)))+COUNTIF(L$5:L5,L5)-1","v":1}]
["BOTTAS Valtteri",null,null,1,null,1,{"$f":"IFERROR(CHOOSE(D6,25,18,15,12,10,8,6,4,2,1)+(F6=1),\"\")","v":26},null,"RED BULL",{"$f":"SUM($G$11:$G$13)","v":19},{"$f":"IF(J6=\"\",0,(RANK(J6,$J$5:$J$14)))+COUNTIF(J$5:J6,J6)-1","v":2},{"$f":"SUMIF(Toscane!$I$5:$I$14,Russie!$I6,Toscane!$L$5:$L$14)+$J6","v":192},{"$f":"IF(L6=\"\",0,(RANK(L6,$L$5:$L$14)))+COUNTIF(L$5:L6,L6)-1","v":2}]
[null,null,null,null,null,null,"",null,"RENAULT",{"$f":"SUM($G$20:$G$22)","v":16},{"$f":"IF(J7=\"\",0,(RANK(J7,$J$5:$J$14)))+COUNTIF(J$5:J7,J7)-1","v":3},{"$f":"SUMIF(Toscane!$I$5:$I$14,Russie!$I7,Toscane!$L$5:$L$14)+$J7","v":99},{"$f":"IF(L7=\"\",0,(RANK(L7,$L$5:$L$14)))+COUNTIF(L$5:L7,L7)-1","v":5}]
["VETTEL Sebastian","FERRARI",null,13,null,null,"",null,"RACING POINT",{"$f":"SUM($G$14:$G$16)","v":12},{"$f":"IF(J8=\"\",0,(RANK(J8,$J$5:$J$14)))+COUNTIF(J$5:J8,J8)-1","v":4},{"$f":"SUMIF(Toscane!$I$5:$I$14,Russie!$I8,Toscane!$L$5:$L$14)+$J8","v":119},{"$f":"IF(L8=\"\",0,(RANK(L8,$L$5:$L$14)))+COUNTIF(L$5:L8,L8)-1","v":3}]
["LECLERC Charles",null,null,6,null,null,8,null,"FERRARI",{"$f":"SUM($G$8:$G$10)","v":8},{"$f":"IF(J9=\"\",0,(RANK(J9,$J$5:$J$14)))+COUNTIF(J$5:J9,J9)-1","v":5},{"$f":"SUMIF(Toscane!$I$5:$I$14,Russie!$I9,Toscane!$L$5:$L$14)+$J9","v":74},{"$f":"IF(L9=\"\",0,(RANK(L9,$L$5:$L$14)))+COUNTIF(L$5:L9,L9)-1","v":6}]
[null,null,null,null,null,null,"",null,"ALPHA TAURI",{"$f":"SUM($G$23:$G$25)","v":6},{"$f":"IF(J10=\"\",0,(RANK(J10,$J$5:$J$14)))+COUNTIF(J$5:J10,J10)-1","v":6},{"$f":"SUMIF(Toscane!$I$5:$I$14,Russie!$I10,Toscane!$L$5:$L$14)+$J10","v":59},{"$f":"IF(L10=\"\",0,(RANK(L10,$L$5:$L$14)))+COUNTIF(L$5:L10,L10)-1","v":7}]
["VERSTAPPEN Max","RED BULL",null,2,null,null,18,null,"Mc LAREN",{"$f":"SUM($G$29:$G$31)","v":0},{"$f":"IF(J11=\"\",0,(RANK(J11,$J$5:$J$14)))+COUNTIF(J$5:J11,J11)-1","v":7},{"$f":"SUMIF(Toscane!$I$5:$I$14,Russie!$I11,Toscane!$L$5:$L$14)+$J11","v":106},{"$f":"IF(L11=\"\",0,(RANK(L11,$L$5:$L$14)))+COUNTIF(L$5:L11,L11)-1","v":4}]
["ALBON Alexander",null,null,10,null,null,1,null,"ALFA ROMEO",{"$f":"SUM($G$32:$G$34)","v":0},{"$f":"IF(J12=\"\",0,(RANK(J12,$J$5:$J$14)))+COUNTIF(J$5:J12,J12)-1","v":8},{"$f":"SUMIF(Toscane!$I$5:$I$14,Russie!$I12,Toscane!$L$5:$L$14)+$J12","v":4},{"$f":"IF(L12=\"\",0,(RANK(L12,$L$5:$L$14)))+COUNTIF(L$5:L12,L12)-1","v":8}]
[null,null,null,null,null,null,"",null,"HAAS",{"$f":"SUM($G$26:$G$28)","v":0},{"$f":"IF(J13=\"\",0,(RANK(J13,$J$5:$J$14)))+COUNTIF(J$5:J13,J13)-1","v":9},{"$f":"SUMIF(Toscane!$I$5:$I$14,Russie!$I13,Toscane!$L$5:$L$14)+$J13","v":1},{"$f":"IF(L13=\"\",0,(RANK(L13,$L$5:$L$14)))+COUNTIF(L$5:L13,L13)-1","v":9}]
["PEREZ Sergio","RACING\nPOINT",null,4,null,null,12,null,"WILLIAMS",{"$f":"SUM($G$17:$G$19)","v":0},{"$f":"IF(J14=\"\",0,(RANK(J14,$J$5:$J$14)))+COUNTIF(J$5:J14,J14)-1","v":10},{"$f":"SUMIF(Toscane!$I$5:$I$14,Russie!$I14,Toscane!$L$5:$L$14)+$J14","v":0},{"$f":"IF(L14=\"\",0,(RANK(L14,$L$5:$L$14)))+COUNTIF(L$5:L14,L14)-1","v":10}]
["STROLL Lance",null,null,"OUT",null,null,""]
[null,null,null,null,null,null,""]
["RUSSELL George","WILLIAMS",null,18,null,null,""]
["LATIFI Nichola",null,null,16,null,null,""]
[null,null,null,null,null,null,""]
["RICCIARDO Daniel","RENAULT",null,5,null,null,10]
["OCON Sebastian",null,null,7,null,null,6]
[null,null,null,null,null,null,""]
["KVYAT Daniil","ALPHA TAURI",null,8,null,null,4]
["GASLY Pierre",null,null,9,null,null,2]
[null,null,null,null,null,null,""]
["GROSJEAN Romain","HAAS",null,17,null,null,""]
["MAGNUSSEN Kevin",null,null,12,null,null,""]
[null,null,null,null,null,null,""]
["NORRIS Lando","McLAREN",null,15,null,null,""]
["SAINZ.Jr Carlos",null,null,"OUT",null,null,""]
[null,null,null,null,null,null,""]
["RAÏKKÖNEN Kimi","ALFA ROMEO",null,14,null,null,""]
["GIOVINAZZI Antonio",null,null,11,null,null,""]
[null,null,null,null,null,null,""]

{"sheet":"Nürburgring","index":22,"n_rows":34,"n_cols":13,"rows_kept":34,"cut":false,"hidden":false,"merged":[[0,0,1,13],[2,0,3,0],[2,1,3,1],[2,2,3,2],[2,3,3,3],[2,4,3,4],[2,5,3,5],[2,6,3,6],[2,8,2,12],[4,1,6,1],[4,2,6,2],[7,1,9,1],[7,2,9,2],[10,1,12,1],[10,2,12,2],[13,1,15,1],[13,2,15,2],[16,1,18,1],[16,2,18,2],[19,1,21,1],[19,2,21,2],[31,1,33,1],[31,2,33,2],[22,1,24,1],[22,2,24,2],[25,1,27,1],[25,2,27,2],[28,1,30,1],[28,2,30,2]]}
["EIFEL - 11 OCTOBRE 2020"]
[]
["PILOTES","ECURIES","VOITURES","Finish","Pôle","Pt tour","Points",null,"CLASSEMENT"]
[null,null,null,null,null,null,null,null,"ÉCURIES","POINTS","RANG","TOTAL","PONCTUEL"]
["HAMILTON Lewis","MERCEDES",null,1,null,null,{"$f":"IFERROR(CHOOSE(D5,25,18,15,12,10,8,6,4,2,1)+(F5=1),\"\")","v":25},null,"MERCEDES",{"$f":"SUM($G$5:$G$7)","v":25},{"$f":"IF(J5=\"\",0,(RANK(J5,$J$5:$J$14)))+COUNTIF(J$5:J5,J5)-1","v":1},{"$f":"SUMIF(Russie!$I$5:$I$14,Nürburgring!$I5,Russie!$L$5:$L$14)+$J5","v":391},{"$f":"IF(L5=\"\",0,(RANK(L5,$L$5:$L$14)))+COUNTIF(L$5:L5,L5)-1","v":1}]
["BOTTAS Valtteri",null,null,"OUT",1,null,{"$f":"IFERROR(CHOOSE(D6,25,18,15,12,10,8,6,4,2,1)+(F6=1),\"\")","v":""},null,"RED BULL",{"$f":"SUM($G$11:$G$13)","v":19},{"$f":"IF(J6=\"\",0,(RANK(J6,$J$5:$J$14)))+COUNTIF(J$5:J6,J6)-1","v":2},{"$f":"SUMIF(Russie!$I$5:$I$14,Nürburgring!$I6,Russie!$L$5:$L$14)+$J6","v":211},{"$f":"IF(L6=\"\",0,(RANK(L6,$L$5:$L$14)))+COUNTIF(L$5:L6,L6)-1","v":2}]
[null,null,null,null,null,null,"",null,"RACING POINT",{"$f":"SUM($G$14:$G$16)","v":16},{"$f":"IF(J7=\"\",0,(RANK(J7,$J$5:$J$14)))+COUNTIF(J$5:J7,J7)-1","v":3},{"$f":"SUMIF(Russie!$I$5:$I$14,Nürburgring!$I7,Russie!$L$5:$L$14)+$J7","v":135},{"$f":"IF(L7=\"\",0,(RANK(L7,$L$5:$L$14)))+COUNTIF(L$5:L7,L7)-1","v":3}]
["VETTEL Sebastian","FERRARI",null,11,null,null,"",null,"RENAULT",{"$f":"SUM($G$20:$G$22)","v":15},{"$f":"IF(J8=\"\",0,(RANK(J8,$J$5:$J$14)))+COUNTIF(J$5:J8,J8)-1","v":4},{"$f":"SUMIF(Russie!$I$5:$I$14,Nürburgring!$I8,Russie!$L$5:$L$14)+$J8","v":114},{"$f":"IF(L8=\"\",0,(RANK(L8,$L$5:$L$14)))+COUNTIF(L$5:L8,L8)-1","v":5}]
["LECLERC Charles",null,null,7,null,null,6,null,"Mc LAREN",{"$f":"SUM($G$29:$G$31)","v":10},{"$f":"IF(J9=\"\",0,(RANK(J9,$J$5:$J$14)))+COUNTIF(J$5:J9,J9)-1","v":5},{"$f":"SUMIF(Russie!$I$5:$I$14,Nürburgring!$I9,Russie!$L$5:$L$14)+$J9","v":116},{"$f":"IF(L9=\"\",0,(RANK(L9,$L$5:$L$14)))+COUNTIF(L$5:L9,L9)-1","v":4}]
[null,null,null,null,null,null,"",null,"ALPHA TAURI",{"$f":"SUM($G$23:$G$25)","v":8},{"$f":"IF(J10=\"\",0,(RANK(J10,$J$5:$J$14)))+COUNTIF(J$5:J10,J10)-1","v":6},{"$f":"SUMIF(Russie!$I$5:$I$14,Nürburgring!$I10,Russie!$L$5:$L$14)+$J10","v":67},{"$f":"IF(L10=\"\",0,(RANK(L10,$L$5:$L$14)))+COUNTIF(L$5:L10,L10)-1","v":7}]
["VERSTAPPEN Max","RED BULL",null,2,null,1,19,null,"FERRARI",{"$f":"SUM($G$8:$G$10)","v":6},{"$f":"IF(J11=\"\",0,(RANK(J11,$J$5:$J$14)))+COUNTIF(J$5:J11,J11)-1","v":7},{"$f":"SUMIF(Russie!$I$5:$I$14,Nürburgring!$I11,Russie!$L$5:$L$14)+$J11","v":80},{"$f":"IF(L11=\"\",0,(RANK(L11,$L$5:$L$14)))+COUNTIF(L$5:L11,L11)-1","v":6}]
["ALBON Alexander",null,null,"OUT",null,null,"",null,"HAAS",{"$f":"SUM($G$26:$G$28)","v":2},{"$f":"IF(J12=\"\",0,(RANK(J12,$J$5:$J$14)))+COUNTIF(J$5:J12,J12)-1","v":8},{"$f":"SUMIF(Russie!$I$5:$I$14,Nürburgring!$I12,Russie!$L$5:$L$14)+$J12","v":3},{"$f":"IF(L12=\"\",0,(RANK(L12,$L$5:$L$14)))+COUNTIF(L$5:L12,L12)-1","v":9}]
[null,null,null,null,null,null,"",null,"ALFA ROMEO",{"$f":"SUM($G$32:$G$34)","v":1},{"$f":"IF(J13=\"\",0,(RANK(J13,$J$5:$J$14)))+COUNTIF(J$5:J13,J13)-1","v":9},{"$f":"SUMIF(Russie!$I$5:$I$14,Nürburgring!$I13,Russie!$L$5:$L$14)+$J13","v":5},{"$f":"IF(L13=\"\",0,(RANK(L13,$L$5:$L$14)))+COUNTIF(L$5:L13,L13)-1","v":8}]
["PEREZ Sergio","RACING\nPOINT",null,4,null,null,12,null,"WILLIAMS",{"$f":"SUM($G$17:$G$19)","v":0},{"$f":"IF(J14=\"\",0,(RANK(J14,$J$5:$J$14)))+COUNTIF(J$5:J14,J14)-1","v":10},{"$f":"SUMIF(Russie!$I$5:$I$14,Nürburgring!$I14,Russie!$L$5:$L$14)+$J14","v":0},{"$f":"IF(L14=\"\",0,(RANK(L14,$L$5:$L$14)))+COUNTIF(L$5:L14,L14)-1","v":10}]
["STROLL Lance",null,null,null,null,null,""]
["HULKENBERG Nico",null,null,8,null,null,4]
["RUSSELL George","WILLIAMS",null,"OUT",null,null,""]
["LATIFI Nichola",null,null,14,null,null,""]
[null,null,null,null,null,null,""]
["RICCIARDO Daniel","RENAULT",null,3,null,null,15]
["OCON Sebastian",null,null,"OUT",null,null,""]
[null,null,null,null,null,null,""]
["KVYAT Daniil","ALPHA TAURI",null,15,null,null,""]
["GASLY Pierre",null,null,6,null,null,8]
[null,null,null,null,null,null,""]
["GROSJEAN Romain","HAAS",null,9,null,null,2]
["MAGNUSSEN Kevin",null,null,13,null,null,""]
[null,null,null,null,null,null,""]
["NORRIS Lando","McLAREN",null,"OUT",null,null,""]
["SAINZ.Jr Carlos",null,null,5,null,null,10]
[null,null,null,null,null,null,""]
["RAÏKKÖNEN Kimi","ALFA ROMEO",null,12,null,null,""]
["GIOVINAZZI Antonio",null,null,10,null,null,1]
[null,null,null,null,null,null,""]

{"sheet":"Portugal","index":23,"n_rows":34,"n_cols":19,"rows_kept":34,"cut":false,"hidden":false,"merged":[[19,1,21,1],[19,2,21,2],[31,1,33,1],[31,2,33,2],[22,1,24,1],[22,2,24,2],[25,1,27,1],[25,2,27,2],[28,1,30,1],[28,2,30,2],[10,1,12,1],[10,2,12,2],[13,1,15,1],[13,2,15,2],[16,1,18,1],[16,2,18,2],[16,8,16,12],[34,2,36,2],[34,1,36,1],[0,0,1,13],[2,0,3,0],[2,1,3,1],[2,2,3,2],[2,3,3,3],[2,4,3,4],[2,5,3,5],[2,6,3,6],[2,8,2,12],[4,1,6,1],[4,2,6,2],[7,1,9,1],[7,2,9,2]]}
["PORTIMAO - 25 OCTOBRE 2020"]
[]
["PILOTES","ECURIES","VOITURES","Finish","Pôle","Pt tour","Points",null,"CLASSEMENT"]
[null,null,null,null,null,null,null,null,"ÉCURIES","POINTS","RANG","TOTAL","PONCTUEL"]
["HAMILTON Lewis","MERCEDES",null,1,1,1,{"$f":"IFERROR(CHOOSE(D5,25,18,15,12,10,8,6,4,2,1)+(F5=1),\"\")","v":26},null,"MERCEDES",{"$f":"SUM($G$5:$G$7)","v":44},{"$f":"IF(J5=\"\",0,(RANK(J5,$J$5:$J$14)))+COUNTIF(J$5:J5,J5)-1","v":1},{"$f":"SUMIF(Nürburgring!$I$5:$I$14,Portugal!$I5,Nürburgring!$L$5:$L$14)+$J5","v":435},{"$f":"IF(L5=\"\",0,(RANK(L5,$L$5:$L$14)))+COUNTIF(L$5:L5,L5)-1","v":1}]
["BOTTAS Valtteri",null,null,2,null,null,{"$f":"IFERROR(CHOOSE(D6,25,18,15,12,10,8,6,4,2,1)+(F6=1),\"\")","v":18},null,"RED BULL",{"$f":"SUM($G$11:$G$13)","v":15},{"$f":"IF(J6=\"\",0,(RANK(J6,$J$5:$J$14)))+COUNTIF(J$5:J6,J6)-1","v":2},{"$f":"SUMIF(Nürburgring!$I$5:$I$14,Portugal!$I6,Nürburgring!$L$5:$L$14)+$J6","v":226},{"$f":"IF(L6=\"\",0,(RANK(L6,$L$5:$L$14)))+COUNTIF(L$5:L6,L6)-1","v":2}]
[null,null,null,null,null,null,"",null,"FERRARI",{"$f":"SUM($G$8:$G$10)","v":13},{"$f":"IF(J7=\"\",0,(RANK(J7,$J$5:$J$14)))+COUNTIF(J$5:J7,J7)-1","v":3},{"$f":"SUMIF(Nürburgring!$I$5:$I$14,Portugal!$I7,Nürburgring!$L$5:$L$14)+$J7","v":93},{"$f":"IF(L7=\"\",0,(RANK(L7,$L$5:$L$14)))+COUNTIF(L$5:L7,L7)-1","v":6}]
["VETTEL Sebastian","FERRARI",null,10,null,null,1,null,"ALPHA TAURI",{"$f":"SUM($G$23:$G$25)","v":10},{"$f":"IF(J8=\"\",0,(RANK(J8,$J$5:$J$14)))+COUNTIF(J$5:J8,J8)-1","v":4},{"$f":"SUMIF(Nürburgring!$I$5:$I$14,Portugal!$I8,Nürburgring!$L$5:$L$14)+$J8","v":77},{"$f":"IF(L8=\"\",0,(RANK(L8,$L$5:$L$14)))+COUNTIF(L$5:L8,L8)-1","v":7}]
["LECLERC Charles",null,null,4,null,null,12,null,"Mc LAREN",{"$f":"SUM($G$29:$G$31)","v":8},{"$f":"IF(J9=\"\",0,(RANK(J9,$J$5:$J$14)))+COUNTIF(J$5:J9,J9)-1","v":5},{"$f":"SUMIF(Nürburgring!$I$5:$I$14,Portugal!$I9,Nürburgring!$L$5:$L$14)+$J9","v":124},{"$f":"IF(L9=\"\",0,(RANK(L9,$L$5:$L$14)))+COUNTIF(L$5:L9,L9)-1","v":4}]
[null,null,null,null,null,null,"",null,"RACING POINT",{"$f":"SUM($G$14:$G$16)","v":6},{"$f":"IF(J10=\"\",0,(RANK(J10,$J$5:$J$14)))+COUNTIF(J$5:J10,J10)-1","v":6},{"$f":"SUMIF(Nürburgring!$I$5:$I$14,Portugal!$I10,Nürburgring!$L$5:$L$14)+$J10","v":141},{"$f":"IF(L10=\"\",0,(RANK(L10,$L$5:$L$14)))+COUNTIF(L$5:L10,L10)-1","v":3}]
["VERSTAPPEN Max","RED BULL",null,3,null,null,15,null,"RENAULT",{"$f":"SUM($G$20:$G$22)","v":6},{"$f":"IF(J11=\"\",0,(RANK(J11,$J$5:$J$14)))+COUNTIF(J$5:J11,J11)-1","v":7},{"$f":"SUMIF(Nürburgring!$I$5:$I$14,Portugal!$I11,Nürburgring!$L$5:$L$14)+$J11","v":120},{"$f":"IF(L11=\"\",0,(RANK(L11,$L$5:$L$14)))+COUNTIF(L$5:L11,L11)-1","v":5}]
["ALBON Alexander",null,null,12,null,null,"",null,"HAAS",{"$f":"SUM($G$26:$G$28)","v":0},{"$f":"IF(J12=\"\",0,(RANK(J12,$J$5:$J$14)))+COUNTIF(J$5:J12,J12)-1","v":8},{"$f":"SUMIF(Nürburgring!$I$5:$I$14,Portugal!$I12,Nürburgring!$L$5:$L$14)+$J12","v":3},{"$f":"IF(L12=\"\",0,(RANK(L12,$L$5:$L$14)))+COUNTIF(L$5:L12,L12)-1","v":9}]
[null,null,null,null,null,null,"",null,"ALFA ROMEO",{"$f":"SUM($G$32:$G$34)","v":0},{"$f":"IF(J13=\"\",0,(RANK(J13,$J$5:$J$14)))+COUNTIF(J$5:J13,J13)-1","v":9},{"$f":"SUMIF(Nürburgring!$I$5:$I$14,Portugal!$I13,Nürburgring!$L$5:$L$14)+$J13","v":5},{"$f":"IF(L13=\"\",0,(RANK(L13,$L$5:$L$14)))+COUNTIF(L$5:L13,L13)-1","v":8}]
["PEREZ Sergio","RACING\nPOINT",null,7,null,null,6,null,"WILLIAMS",{"$f":"SUM($G$17:$G$19)","v":0},{"$f":"IF(J14=\"\",0,(RANK(J14,$J$5:$J$14)))+COUNTIF(J$5:J14,J14)-1","v":10},{"$f":"SUMIF(Nürburgring!$I$5:$I$14,Portugal!$I14,Nürburgring!$L$5:$L$14)+$J14","v":0},{"$f":"IF(L14=\"\",0,(RANK(L14,$L$5:$L$14)))+COUNTIF(L$5:L14,L14)-1","v":10}]
["STROLL Lance",null,null,"OUT",null,null,""]
[null,null,null,null,null,null,""]
["RUSSELL George","WILLIAMS",null,14,null,null,"",null,"Avec 94 victoires, Hamilton détient le nouveau record",null,null,null,null,null,null,null,null,null," "]
["LATIFI Nichola",null,null,18,null,null,""]
[null,null,null,null,null,null,""]
["RICCIARDO Daniel","RENAULT",null,9,null,null,2]
["OCON Sebastian",null,null,8,null,null,4]
[null,null,null,null,null,null,""]
["KVYAT Daniil","ALPHA TAURI",null,19,null,null,""]
["GASLY Pierre",null,null,5,null,null,10]
[null,null,null,null,null,null,""]
["GROSJEAN Romain","HAAS",null,17,null,null,""]
["MAGNUSSEN Kevin",null,null,16,null,null,""]
[null,null,null,null,null,null,""]
["NORRIS Lando","McLAREN",null,13,null,null,""]
["SAINZ.Jr Carlos",null,null,6,null,null,8]
[null,null,null,null,null,null,""]
["RAÏKKÖNEN Kimi","ALFA ROMEO",null,11,null,null,""]
["GIOVINAZZI Antonio",null,null,15,null,null,""]
[null,null,null,null,null,null,""]

{"sheet":"Émilie-Romagne","index":24,"n_rows":34,"n_cols":13,"rows_kept":34,"cut":false,"hidden":false,"merged":[[19,1,21,1],[19,2,21,2],[31,1,33,1],[31,2,33,2],[22,1,24,1],[22,2,24,2],[25,1,27,1],[25,2,27,2],[28,1,30,1],[28,2,30,2],[10,2,12,2],[13,1,15,1],[13,2,15,2],[16,1,18,1],[16,2,18,2],[34,1,36,1],[34,2,36,2],[0,0,1,13],[2,0,3,0],[2,1,3,1],[2,2,3,2],[2,3,3,3],[2,4,3,4],[2,5,3,5],[2,6,3,6],[2,8,2,12],[4,1,6,1],[4,2,6,2],[7,1,9,1],[7,2,9,2],[10,1,12,1]]}
["IMOLA - 1er NOVEMBRE 2020"]
[]
["PILOTES","ECURIES","VOITURES","Finish","Pôle","Pt tour","Points",null,"CLASSEMENT"]
[null,null,null,null,null,null,null,null,"ÉCURIES","POINTS","RANG","TOTAL","PONCTUEL"]
["HAMILTON Lewis","MERCEDES",null,1,null,1,{"$f":"IFERROR(CHOOSE(D5,25,18,15,12,10,8,6,4,2,1)+(F5=1),\"\")","v":26},null,"MERCEDES",{"$f":"SUM($G$5:$G$7)","v":44},{"$f":"IF(J5=\"\",0,(RANK(J5,$J$5:$J$14)))+COUNTIF(J$5:J5,J5)-1","v":1},{"$f":"SUMIF(Portugal!$I$5:$I$14,'Émilie-Romagne'!$I5,Portugal!$L$5:$L$14)+$J5","v":479},{"$f":"IF(L5=\"\",0,(RANK(L5,$L$5:$L$14)))+COUNTIF(L$5:L5,L5)-1","v":1}]
["BOTTAS Valtteri",null,null,2,1,null,{"$f":"IFERROR(CHOOSE(D6,25,18,15,12,10,8,6,4,2,1)+(F6=1),\"\")","v":18},null,"RENAULT",{"$f":"SUM($G$20:$G$22)","v":15},{"$f":"IF(J6=\"\",0,(RANK(J6,$J$5:$J$14)))+COUNTIF(J$5:J6,J6)-1","v":2},{"$f":"SUMIF(Portugal!$I$5:$I$14,'Émilie-Romagne'!$I6,Portugal!$L$5:$L$14)+$J6","v":135},{"$f":"IF(L6=\"\",0,(RANK(L6,$L$5:$L$14)))+COUNTIF(L$5:L6,L6)-1","v":4}]
[null,null,null,null,null,null,"",null,"ALPHA TAURI",{"$f":"SUM($G$23:$G$25)","v":12},{"$f":"IF(J7=\"\",0,(RANK(J7,$J$5:$J$14)))+COUNTIF(J$5:J7,J7)-1","v":3},{"$f":"SUMIF(Portugal!$I$5:$I$14,'Émilie-Romagne'!$I7,Portugal!$L$5:$L$14)+$J7","v":89},{"$f":"IF(L7=\"\",0,(RANK(L7,$L$5:$L$14)))+COUNTIF(L$5:L7,L7)-1","v":7}]
["VETTEL Sebastian","FERRARI",null,12,null,null,"",null,"FERRARI",{"$f":"SUM($G$8:$G$10)","v":10},{"$f":"IF(J8=\"\",0,(RANK(J8,$J$5:$J$14)))+COUNTIF(J$5:J8,J8)-1","v":4},{"$f":"SUMIF(Portugal!$I$5:$I$14,'Émilie-Romagne'!$I8,Portugal!$L$5:$L$14)+$J8","v":103},{"$f":"IF(L8=\"\",0,(RANK(L8,$L$5:$L$14)))+COUNTIF(L$5:L8,L8)-1","v":6}]
["LECLERC Charles",null,null,5,null,null,10,null,"Mc LAREN",{"$f":"SUM($G$29:$G$31)","v":10},{"$f":"IF(J9=\"\",0,(RANK(J9,$J$5:$J$14)))+COUNTIF(J$5:J9,J9)-1","v":5},{"$f":"SUMIF(Portugal!$I$5:$I$14,'Émilie-Romagne'!$I9,Portugal!$L$5:$L$14)+$J9","v":134},{"$f":"IF(L9=\"\",0,(RANK(L9,$L$5:$L$14)))+COUNTIF(L$5:L9,L9)-1","v":5}]
[null,null,null,null,null,null,"",null,"RACING POINT",{"$f":"SUM($G$14:$G$16)","v":8},{"$f":"IF(J10=\"\",0,(RANK(J10,$J$5:$J$14)))+COUNTIF(J$5:J10,J10)-1","v":6},{"$f":"SUMIF(Portugal!$I$5:$I$14,'Émilie-Romagne'!$I10,Portugal!$L$5:$L$14)+$J10","v":149},{"$f":"IF(L10=\"\",0,(RANK(L10,$L$5:$L$14)))+COUNTIF(L$5:L10,L10)-1","v":3}]
["VERSTAPPEN Max","RED BULL",null,"OUT",null,null,"",null,"ALFA ROMEO",{"$f":"SUM($G$32:$G$34)","v":3},{"$f":"IF(J11=\"\",0,(RANK(J11,$J$5:$J$14)))+COUNTIF(J$5:J11,J11)-1","v":7},{"$f":"SUMIF(Portugal!$I$5:$I$14,'Émilie-Romagne'!$I11,Portugal!$L$5:$L$14)+$J11","v":8},{"$f":"IF(L11=\"\",0,(RANK(L11,$L$5:$L$14)))+COUNTIF(L$5:L11,L11)-1","v":8}]
["ALBON Alexander",null,null,15,null,null,"",null,"RED BULL",{"$f":"SUM($G$11:$G$13)","v":0},{"$f":"IF(J12=\"\",0,(RANK(J12,$J$5:$J$14)))+COUNTIF(J$5:J12,J12)-1","v":8},{"$f":"SUMIF(Portugal!$I$5:$I$14,'Émilie-Romagne'!$I12,Portugal!$L$5:$L$14)+$J12","v":226},{"$f":"IF(L12=\"\",0,(RANK(L12,$L$5:$L$14)))+COUNTIF(L$5:L12,L12)-1","v":2}]
[null,null,null,null,null,null,"",null,"HAAS",{"$f":"SUM($G$26:$G$28)","v":0},{"$f":"IF(J13=\"\",0,(RANK(J13,$J$5:$J$14)))+COUNTIF(J$5:J13,J13)-1","v":9},{"$f":"SUMIF(Portugal!$I$5:$I$14,'Émilie-Romagne'!$I13,Portugal!$L$5:$L$14)+$J13","v":3},{"$f":"IF(L13=\"\",0,(RANK(L13,$L$5:$L$14)))+COUNTIF(L$5:L13,L13)-1","v":9}]
["PEREZ Sergio","RACING\nPOINT",null,6,null,null,8,null,"WILLIAMS",{"$f":"SUM($G$17:$G$19)","v":0},{"$f":"IF(J14=\"\",0,(RANK(J14,$J$5:$J$14)))+COUNTIF(J$5:J14,J14)-1","v":10},{"$f":"SUMIF(Portugal!$I$5:$I$14,'Émilie-Romagne'!$I14,Portugal!$L$5:$L$14)+$J14","v":0},{"$f":"IF(L14=\"\",0,(RANK(L14,$L$5:$L$14)))+COUNTIF(L$5:L14,L14)-1","v":10}]
["STROLL Lance",null,null,13,null,null,""]
[null,null,null,null,null,null,""]
["RUSSELL George","WILLIAMS",null,"OUT",null,null,""]
["LATIFI Nichola",null,null,11,null,null,""]
[null,null,null,null,null,null,""]
["RICCIARDO Daniel","RENAULT",null,3,null,null,15]
["OCON Sebastian",null,null,"OUT",null,null,""]
[null,null,null,null,null,null,""]
["KVYAT Daniil","ALPHA TAURI",null,4,null,null,12]
["GASLY Pierre",null,null,"OUT",null,null,""]
[null,null,null,null,null,null,""]
["GROSJEAN Romain","HAAS",null,14,null,null,""]
["MAGNUSSEN Kevin",null,null,"OUT",null,null,""]
[null,null,null,null,null,null,""]
["NORRIS Lando","McLAREN",null,8,null,null,4]
["SAINZ.Jr Carlos",null,null,7,null,null,6]
[null,null,null,null,null,null,""]
["RAÏKKÖNEN Kimi","ALFA ROMEO",null,9,null,null,2]
["GIOVINAZZI Antonio",null,null,10,null,null,1]
[null,null,null,null,null,null,""]

{"sheet":"Turquie","index":25,"n_rows":34,"n_cols":13,"rows_kept":34,"cut":false,"hidden":false,"merged":[[4,1,6,1],[4,2,6,2],[7,1,9,1],[7,2,9,2],[10,1,12,1],[10,2,12,2],[0,0,1,13],[2,1,3,1],[2,2,3,2],[2,3,3,3],[2,5,3,5],[2,6,3,6],[2,4,3,4],[2,0,3,0],[2,8,2,12],[13,1,15,1],[13,2,15,2],[16,1,18,1],[16,2,18,2],[19,1,21,1],[19,2,21,2],[16,8,16,12],[34,1,36,1],[31,1,33,1],[31,2,33,2],[22,1,24,1],[22,2,24,2],[25,1,27,1],[25,2,27,2],[28,1,30,1],[28,2,30,2],[34,2,36,2]]}
["ISTANBUL - 15 NOVEMBRE 2020"]
[]
["PILOTES","ECURIES","VOITURES","Finish","Pôle","Pt tour","Points",null,"CLASSEMENT"]
[null,null,null,null,null,null,null,null,"ÉCURIES","POINTS","RANG","TOTAL","PONCTUEL"]
["HAMILTON Lewis","MERCEDES",null,1,null,null,{"$f":"IFERROR(CHOOSE(D5,25,18,15,12,10,8,6,4,2,1)+(F5=1),\"\")","v":25},null,"MERCEDES",{"$f":"SUM($G$5:$G$7)","v":25},{"$f":"IF(J5=\"\",0,(RANK(J5,$J$5:$J$14)))+COUNTIF(J$5:J5,J5)-1","v":2},{"$f":"SUMIF('Émilie-Romagne'!$I$5:$I$14,Turquie!$I5,'Émilie-Romagne'!$L$5:$L$14)+$J5","v":504},{"$f":"IF(L5=\"\",0,(RANK(L5,$L$5:$L$14)))+COUNTIF(L$5:L5,L5)-1","v":1}]
["BOTTAS Valtteri",null,null,14,null,null,{"$f":"IFERROR(CHOOSE(D6,25,18,15,12,10,8,6,4,2,1)+(F6=1),\"\")","v":""},null,"ALPHA TAURI",{"$f":"SUM($G$23:$G$25)","v":0},{"$f":"IF(J6=\"\",0,(RANK(J6,$J$5:$J$14)))+COUNTIF(J$5:J6,J6)-1","v":7},{"$f":"SUMIF('Émilie-Romagne'!$I$5:$I$14,Turquie!$I6,'Émilie-Romagne'!$L$5:$L$14)+$J6","v":89},{"$f":"IF(L6=\"\",0,(RANK(L6,$L$5:$L$14)))+COUNTIF(L$5:L6,L6)-1","v":7}]
[null,null,null,null,null,null,"",null,"ALFA ROMEO",{"$f":"SUM($G$32:$G$34)","v":0},{"$f":"IF(J7=\"\",0,(RANK(J7,$J$5:$J$14)))+COUNTIF(J$5:J7,J7)-1","v":8},{"$f":"SUMIF('Émilie-Romagne'!$I$5:$I$14,Turquie!$I7,'Émilie-Romagne'!$L$5:$L$14)+$J7","v":8},{"$f":"IF(L7=\"\",0,(RANK(L7,$L$5:$L$14)))+COUNTIF(L$5:L7,L7)-1","v":8}]
["VETTEL Sebastian","FERRARI",null,3,null,null,15,null,"Mc LAREN",{"$f":"SUM($G$29:$G$31)","v":15},{"$f":"IF(J8=\"\",0,(RANK(J8,$J$5:$J$14)))+COUNTIF(J$5:J8,J8)-1","v":4},{"$f":"SUMIF('Émilie-Romagne'!$I$5:$I$14,Turquie!$I8,'Émilie-Romagne'!$L$5:$L$14)+$J8","v":149},{"$f":"IF(L8=\"\",0,(RANK(L8,$L$5:$L$14)))+COUNTIF(L$5:L8,L8)-1","v":4}]
["LECLERC Charles",null,null,4,null,null,12,null,"RENAULT",{"$f":"SUM($G$20:$G$22)","v":1},{"$f":"IF(J9=\"\",0,(RANK(J9,$J$5:$J$14)))+COUNTIF(J$5:J9,J9)-1","v":6},{"$f":"SUMIF('Émilie-Romagne'!$I$5:$I$14,Turquie!$I9,'Émilie-Romagne'!$L$5:$L$14)+$J9","v":136},{"$f":"IF(L9=\"\",0,(RANK(L9,$L$5:$L$14)))+COUNTIF(L$5:L9,L9)-1","v":5}]
[null,null,null,null,null,null,"",null,"RED BULL",{"$f":"SUM($G$11:$G$13)","v":14},{"$f":"IF(J10=\"\",0,(RANK(J10,$J$5:$J$14)))+COUNTIF(J$5:J10,J10)-1","v":5},{"$f":"SUMIF('Émilie-Romagne'!$I$5:$I$14,Turquie!$I10,'Émilie-Romagne'!$L$5:$L$14)+$J10","v":240},{"$f":"IF(L10=\"\",0,(RANK(L10,$L$5:$L$14)))+COUNTIF(L$5:L10,L10)-1","v":2}]
["VERSTAPPEN Max","RED BULL",null,6,null,null,8,null,"FERRARI",{"$f":"SUM($G$8:$G$10)","v":27},{"$f":"IF(J11=\"\",0,(RANK(J11,$J$5:$J$14)))+COUNTIF(J$5:J11,J11)-1","v":1},{"$f":"SUMIF('Émilie-Romagne'!$I$5:$I$14,Turquie!$I11,'Émilie-Romagne'!$L$5:$L$14)+$J11","v":130},{"$f":"IF(L11=\"\",0,(RANK(L11,$L$5:$L$14)))+COUNTIF(L$5:L11,L11)-1","v":6}]
["ALBON Alexander",null,null,7,null,null,6,null,"WILLIAMS",{"$f":"SUM($G$17:$G$19)","v":0},{"$f":"IF(J12=\"\",0,(RANK(J12,$J$5:$J$14)))+COUNTIF(J$5:J12,J12)-1","v":9},{"$f":"SUMIF('Émilie-Romagne'!$I$5:$I$14,Turquie!$I12,'Émilie-Romagne'!$L$5:$L$14)+$J12","v":0},{"$f":"IF(L12=\"\",0,(RANK(L12,$L$5:$L$14)))+COUNTIF(L$5:L12,L12)-1","v":10}]
[null,null,null,null,null,null,"",null,"RACING POINT",{"$f":"SUM($G$14:$G$16)","v":20},{"$f":"IF(J13=\"\",0,(RANK(J13,$J$5:$J$14)))+COUNTIF(J$5:J13,J13)-1","v":3},{"$f":"SUMIF('Émilie-Romagne'!$I$5:$I$14,Turquie!$I13,'Émilie-Romagne'!$L$5:$L$14)+$J13","v":169},{"$f":"IF(L13=\"\",0,(RANK(L13,$L$5:$L$14)))+COUNTIF(L$5:L13,L13)-1","v":3}]
["PEREZ Sergio","RACING\nPOINT",null,2,null,null,18,null,"HAAS",{"$f":"SUM($G$26:$G$28)","v":0},{"$f":"IF(J14=\"\",0,(RANK(J14,$J$5:$J$14)))+COUNTIF(J$5:J14,J14)-1","v":10},{"$f":"SUMIF('Émilie-Romagne'!$I$5:$I$14,Turquie!$I14,'Émilie-Romagne'!$L$5:$L$14)+$J14","v":3},{"$f":"IF(L14=\"\",0,(RANK(L14,$L$5:$L$14)))+COUNTIF(L$5:L14,L14)-1","v":9}]
["STROLL Lance",null,null,9,1,null,2]
[null,null,null,null,null,null,""]
["RUSSELL George","WILLIAMS",null,16,null,null,"",null,"HAMILTON champion du monde avec son 7ième titre"]
["LATIFI Nichola",null,null,"OUT",null,null,""]
[null,null,null,null,null,null,""]
["RICCIARDO Daniel","RENAULT",null,10,null,null,1]
["OCON Sebastian",null,null,11,null,null,""]
[null,null,null,null,null,null,""]
["KVYAT Daniil","ALPHA TAURI",null,12,null,null,""]
["GASLY Pierre",null,null,13,null,null,""]
[null,null,null,null,null,null,""]
["GROSJEAN Romain","HAAS",null,"OUT",null,null,""]
["MAGNUSSEN Kevin",null,null,"OUT",null,null,""]
[null,null,null,null,null,null,""]
["NORRIS Lando","McLAREN",null,8,null,1,5]
["SAINZ.Jr Carlos",null,null,5,null,null,10]
[null,null,null,null,null,null,""]
["RAÏKKÖNEN Kimi","ALFA ROMEO",null,15,null,null,""]
["GIOVINAZZI Antonio",null,null,"OUT",null,null,""]
[null,null,null,null,null,null,""]

{"sheet":"Bahrein","index":26,"n_rows":34,"n_cols":13,"rows_kept":34,"cut":false,"hidden":false,"merged":[[0,0,1,13],[2,1,3,1],[2,2,3,2],[2,3,3,3],[2,5,3,5],[2,6,3,6],[2,4,3,4],[2,0,3,0],[2,8,2,12],[4,1,6,1],[4,2,6,2],[7,1,9,1],[7,2,9,2],[10,1,12,1],[10,2,12,2],[13,1,15,1],[13,2,15,2],[16,1,18,1],[16,2,18,2],[19,1,21,1],[19,2,21,2],[34,1,36,1],[31,1,33,1],[31,2,33,2],[22,1,24,1],[22,2,24,2],[25,1,27,1],[25,2,27,2],[28,1,30,1],[28,2,30,2],[34,2,36,2]]}
["SAKHIR - 6 DÉCEMBRE 2020"]
[]
["PILOTES","ECURIES","VOITURES","Finish","Pôle","Pt tour","Points",null,"CLASSEMENT"]
[null,null,null,null,null,null,null,null,"ÉCURIES","POINTS","RANG","TOTAL","PONCTUEL"]
["HAMILTON Lewis","MERCEDES",null,1,1,null,{"$f":"IFERROR(CHOOSE(D5,25,18,15,12,10,8,6,4,2,1)+(F5=1),\"\")","v":25},null,"ALFA ROMEO",{"$f":"SUM($G$32:$G$34)","v":0},{"$f":"IF(J5=\"\",0,(RANK(J5,$J$5:$J$14)))+COUNTIF(J$5:J5,J5)-1","v":7},{"$f":"SUMIF(Turquie!$I$5:$I$14,Bahrein!$I5,Turquie!$L$5:$L$14)+$J$514","v":8},{"$f":"IF(L5=\"\",0,(RANK(L5,$L$5:$L$14)))+COUNTIF(L$5:L5,L5)-1","v":8}]
["BOTTAS Valtteri",null,null,8,null,null,{"$f":"IFERROR(CHOOSE(D6,25,18,15,12,10,8,6,4,2,1)+(F6=1),\"\")","v":4},null,"Mc LAREN",{"$f":"SUM($G$29:$G$31)","v":22},{"$f":"IF(J6=\"\",0,(RANK(J6,$J$5:$J$14)))+COUNTIF(J$5:J6,J6)-1","v":3},{"$f":"SUMIF(Turquie!$I$5:$I$14,Bahrein!$I6,Turquie!$L$5:$L$14)+$J$514","v":149},{"$f":"IF(L6=\"\",0,(RANK(L6,$L$5:$L$14)))+COUNTIF(L$5:L6,L6)-1","v":4}]
[null,null,null,null,null,null,"",null,"RENAULT",{"$f":"SUM($G$20:$G$22)","v":8},{"$f":"IF(J7=\"\",0,(RANK(J7,$J$5:$J$14)))+COUNTIF(J$5:J7,J7)-1","v":4},{"$f":"SUMIF(Turquie!$I$5:$I$14,Bahrein!$I7,Turquie!$L$5:$L$14)+$J$514","v":136},{"$f":"IF(L7=\"\",0,(RANK(L7,$L$5:$L$14)))+COUNTIF(L$5:L7,L7)-1","v":5}]
["VETTEL Sebastian","FERRARI",null,13,null,null,"",null,"RED BULL",{"$f":"SUM($G$11:$G$13)","v":34},{"$f":"IF(J8=\"\",0,(RANK(J8,$J$5:$J$14)))+COUNTIF(J$5:J8,J8)-1","v":1},{"$f":"SUMIF(Turquie!$I$5:$I$14,Bahrein!$I8,Turquie!$L$5:$L$14)+$J$514","v":240},{"$f":"IF(L8=\"\",0,(RANK(L8,$L$5:$L$14)))+COUNTIF(L$5:L8,L8)-1","v":2}]
["LECLERC Charles",null,null,10,null,null,1,null,"FERRARI",{"$f":"SUM($G$8:$G$10)","v":1},{"$f":"IF(J9=\"\",0,(RANK(J9,$J$5:$J$14)))+COUNTIF(J$5:J9,J9)-1","v":6},{"$f":"SUMIF(Turquie!$I$5:$I$14,Bahrein!$I9,Turquie!$L$5:$L$14)+$J$514","v":130},{"$f":"IF(L9=\"\",0,(RANK(L9,$L$5:$L$14)))+COUNTIF(L$5:L9,L9)-1","v":6}]
[null,null,null,null,null,null,"",null,"ALPHA TAURI",{"$f":"SUM($G$23:$G$25)","v":8},{"$f":"IF(J10=\"\",0,(RANK(J10,$J$5:$J$14)))+COUNTIF(J$5:J10,J10)-1","v":5},{"$f":"SUMIF(Turquie!$I$5:$I$14,Bahrein!$I10,Turquie!$L$5:$L$14)+$J$514","v":89},{"$f":"IF(L10=\"\",0,(RANK(L10,$L$5:$L$14)))+COUNTIF(L$5:L10,L10)-1","v":7}]
["VERSTAPPEN Max","RED BULL",null,2,null,1,19,null,"WILLIAMS",{"$f":"SUM($G$17:$G$19)","v":0},{"$f":"IF(J11=\"\",0,(RANK(J11,$J$5:$J$14)))+COUNTIF(J$5:J11,J11)-1","v":8},{"$f":"SUMIF(Turquie!$I$5:$I$14,Bahrein!$I11,Turquie!$L$5:$L$14)+$J$514","v":0},{"$f":"IF(L11=\"\",0,(RANK(L11,$L$5:$L$14)))+COUNTIF(L$5:L11,L11)-1","v":10}]
["ALBON Alexander",null,null,3,null,null,15,null,"MERCEDES",{"$f":"SUM($G$5:$G$7)","v":29},{"$f":"IF(J12=\"\",0,(RANK(J12,$J$5:$J$14)))+COUNTIF(J$5:J12,J12)-1","v":2},{"$f":"SUMIF(Turquie!$I$5:$I$14,Bahrein!$I12,Turquie!$L$5:$L$14)+$J$514","v":504},{"$f":"IF(L12=\"\",0,(RANK(L12,$L$5:$L$14)))+COUNTIF(L$5:L12,L12)-1","v":1}]
[null,null,null,null,null,null,"",null,"RACING POINT",{"$f":"SUM($G$14:$G$16)","v":0},{"$f":"IF(J13=\"\",0,(RANK(J13,$J$5:$J$14)))+COUNTIF(J$5:J13,J13)-1","v":9},{"$f":"SUMIF(Turquie!$I$5:$I$14,Bahrein!$I13,Turquie!$L$5:$L$14)+$J$514","v":169},{"$f":"IF(L13=\"\",0,(RANK(L13,$L$5:$L$14)))+COUNTIF(L$5:L13,L13)-1","v":3}]
["PEREZ Sergio","RACING\nPOINT",null,"OUT",null,null,"",null,"HAAS",{"$f":"SUM($G$26:$G$28)","v":0},{"$f":"IF(J14=\"\",0,(RANK(J14,$J$5:$J$14)))+COUNTIF(J$5:J14,J14)-1","v":10},{"$f":"SUMIF(Turquie!$I$5:$I$14,Bahrein!$I14,Turquie!$L$5:$L$14)+$J$514","v":3},{"$f":"IF(L14=\"\",0,(RANK(L14,$L$5:$L$14)))+COUNTIF(L$5:L14,L14)-1","v":9}]
["STROLL Lance",null,null,"OUT",null,null,""]
[null,null,null,null,null,null,""]
["RUSSELL George","WILLIAMS",null,12,null,null,""]
["LATIFI Nichola",null,null,14,null,null,""]
[null,null,null,null,null,null,""]
["RICCIARDO Daniel","RENAULT",null,7,null,null,6]
["OCON Sebastian",null,null,9,null,null,2]
[null,null,null,null,null,null,""]
["KVYAT Daniil","ALPHA TAURI",null,11,null,null,""]
["GASLY Pierre",null,null,6,null,null,8]
[null,null,null,null,null,null,""]
["GROSJEAN Romain","HAAS",null,"OUT",null,null,""]
["MAGNUSSEN Kevin",null,null,16,null,null,""]
[null,null,null,null,null,null,""]
["NORRIS Lando","McLAREN",null,4,null,null,12]
["SAINZ.Jr Carlos",null,null,5,null,null,10]
[null,null,null,null,null,null,""]
["RAÏKKÖNEN Kimi","ALFA ROMEO",null,15,null,null,""]
["GIOVINAZZI Antonio",null,null,null,null,null,""]
[null,null,null,null,null,null,""]

{"sheet":"Sakhir","index":27,"n_rows":34,"n_cols":13,"rows_kept":34,"cut":false,"hidden":false,"merged":[[0,0,1,13],[2,1,3,1],[2,2,3,2],[2,3,3,3],[2,5,3,5],[2,6,3,6],[2,4,3,4],[2,0,3,0],[2,8,2,12],[4,1,6,1],[4,2,6,2],[7,1,9,1],[7,2,9,2],[10,1,12,1],[10,2,12,2],[13,1,15,1],[13,2,15,2],[16,1,18,1],[16,2,18,2],[19,1,21,1],[19,2,21,2],[34,1,36,1],[31,1,33,1],[31,2,33,2],[22,1,24,1],[22,2,24,2],[25,1,27,1],[25,2,27,2],[28,1,30,1],[28,2,30,2],[34,2,36,2]]}
["SAKHIR - 6 DÉCEMBRE 2020"]
[]
["PILOTES","ECURIES","VOITURES","Finish","Pôle","Pt tour","Points",null,"CLASSEMENT"]
[null,null,null,null,null,null,null,null,"ÉCURIES","POINTS","RANG","TOTAL","PONCTUEL"]
["HAMILTON Lewis","MERCEDES",null,null,null,null,{"$f":"IFERROR(CHOOSE(D5,25,18,15,12,10,8,6,4,2,1)+(F5=1),\"\")","v":""},null,"ALFA ROMEO",{"$f":"SUM($G$32:$G$34)","v":0},{"$f":"IF(J5=\"\",0,(RANK(J5,$J$5:$J$14)))+COUNTIF(J$5:J5,J5)-1","v":1},{"$f":"SUMIF(Bahrein!$I$5:$I$14,Sakhir!$I5,Bahrein!$L$5:$L$14)+$J$514","v":8},{"$f":"IF(L5=\"\",0,(RANK(L5,$L$5:$L$14)))+COUNTIF(L$5:L5,L5)-1","v":8}]
["BOTTAS Valtteri",null,null,null,null,null,{"$f":"IFERROR(CHOOSE(D6,25,18,15,12,10,8,6,4,2,1)+(F6=1),\"\")","v":""},null,"Mc LAREN",{"$f":"SUM($G$29:$G$31)","v":0},{"$f":"IF(J6=\"\",0,(RANK(J6,$J$5:$J$14)))+COUNTIF(J$5:J6,J6)-1","v":2},{"$f":"SUMIF(Bahrein!$I$5:$I$14,Sakhir!$I6,Bahrein!$L$5:$L$14)+$J$514","v":149},{"$f":"IF(L6=\"\",0,(RANK(L6,$L$5:$L$14)))+COUNTIF(L$5:L6,L6)-1","v":4}]
[null,null,null,null,null,null,"",null,"RENAULT",{"$f":"SUM($G$20:$G$22)","v":0},{"$f":"IF(J7=\"\",0,(RANK(J7,$J$5:$J$14)))+COUNTIF(J$5:J7,J7)-1","v":3},{"$f":"SUMIF(Bahrein!$I$5:$I$14,Sakhir!$I7,Bahrein!$L$5:$L$14)+$J$514","v":136},{"$f":"IF(L7=\"\",0,(RANK(L7,$L$5:$L$14)))+COUNTIF(L$5:L7,L7)-1","v":5}]
["VETTEL Sebastian","FERRARI",null,null,null,null,"",null,"RED BULL",{"$f":"SUM($G$11:$G$13)","v":0},{"$f":"IF(J8=\"\",0,(RANK(J8,$J$5:$J$14)))+COUNTIF(J$5:J8,J8)-1","v":4},{"$f":"SUMIF(Bahrein!$I$5:$I$14,Sakhir!$I8,Bahrein!$L$5:$L$14)+$J$514","v":240},{"$f":"IF(L8=\"\",0,(RANK(L8,$L$5:$L$14)))+COUNTIF(L$5:L8,L8)-1","v":2}]
["LECLERC Charles",null,null,null,null,null,"",null,"FERRARI",{"$f":"SUM($G$8:$G$10)","v":0},{"$f":"IF(J9=\"\",0,(RANK(J9,$J$5:$J$14)))+COUNTIF(J$5:J9,J9)-1","v":5},{"$f":"SUMIF(Bahrein!$I$5:$I$14,Sakhir!$I9,Bahrein!$L$5:$L$14)+$J$514","v":130},{"$f":"IF(L9=\"\",0,(RANK(L9,$L$5:$L$14)))+COUNTIF(L$5:L9,L9)-1","v":6}]
[null,null,null,null,null,null,"",null,"ALPHA TAURI",{"$f":"SUM($G$23:$G$25)","v":0},{"$f":"IF(J10=\"\",0,(RANK(J10,$J$5:$J$14)))+COUNTIF(J$5:J10,J10)-1","v":6},{"$f":"SUMIF(Bahrein!$I$5:$I$14,Sakhir!$I10,Bahrein!$L$5:$L$14)+$J$514","v":89},{"$f":"IF(L10=\"\",0,(RANK(L10,$L$5:$L$14)))+COUNTIF(L$5:L10,L10)-1","v":7}]
["VERSTAPPEN Max","RED BULL",null,null,null,null,"",null,"WILLIAMS",{"$f":"SUM($G$17:$G$19)","v":0},{"$f":"IF(J11=\"\",0,(RANK(J11,$J$5:$J$14)))+COUNTIF(J$5:J11,J11)-1","v":7},{"$f":"SUMIF(Bahrein!$I$5:$I$14,Sakhir!$I11,Bahrein!$L$5:$L$14)+$J$514","v":0},{"$f":"IF(L11=\"\",0,(RANK(L11,$L$5:$L$14)))+COUNTIF(L$5:L11,L11)-1","v":10}]
["ALBON Alexander",null,null,null,null,null,"",null,"MERCEDES",{"$f":"SUM($G$5:$G$7)","v":0},{"$f":"IF(J12=\"\",0,(RANK(J12,$J$5:$J$14)))+COUNTIF(J$5:J12,J12)-1","v":8},{"$f":"SUMIF(Bahrein!$I$5:$I$14,Sakhir!$I12,Bahrein!$L$5:$L$14)+$J$514","v":504},{"$f":"IF(L12=\"\",0,(RANK(L12,$L$5:$L$14)))+COUNTIF(L$5:L12,L12)-1","v":1}]
[null,null,null,null,null,null,"",null,"RACING POINT",{"$f":"SUM($G$14:$G$16)","v":0},{"$f":"IF(J13=\"\",0,(RANK(J13,$J$5:$J$14)))+COUNTIF(J$5:J13,J13)-1","v":9},{"$f":"SUMIF(Bahrein!$I$5:$I$14,Sakhir!$I13,Bahrein!$L$5:$L$14)+$J$514","v":169},{"$f":"IF(L13=\"\",0,(RANK(L13,$L$5:$L$14)))+COUNTIF(L$5:L13,L13)-1","v":3}]
["PEREZ Sergio","RACING\nPOINT",null,null,null,null,"",null,"HAAS",{"$f":"SUM($G$26:$G$28)","v":0},{"$f":"IF(J14=\"\",0,(RANK(J14,$J$5:$J$14)))+COUNTIF(J$5:J14,J14)-1","v":10},{"$f":"SUMIF(Bahrein!$I$5:$I$14,Sakhir!$I14,Bahrein!$L$5:$L$14)+$J$514","v":3},{"$f":"IF(L14=\"\",0,(RANK(L14,$L$5:$L$14)))+COUNTIF(L$5:L14,L14)-1","v":9}]
["STROLL Lance",null,null,null,null,null,""]
[null,null,null,null,null,null,""]
["RUSSELL George","WILLIAMS",null,null,null,null,""]
["LATIFI Nichola",null,null,null,null,null,""]
[null,null,null,null,null,null,""]
["RICCIARDO Daniel","RENAULT",null,null,null,null,""]
["OCON Sebastian",null,null,null,null,null,""]
[null,null,null,null,null,null,""]
["KVYAT Daniil","ALPHA TAURI",null,null,null,null,""]
["GASLY Pierre",null,null,null,null,null,""]
[null,null,null,null,null,null,""]
["GROSJEAN Romain","HAAS",null,null,null,null,""]
["MAGNUSSEN Kevin",null,null,null,null,null,""]
[null,null,null,null,null,null,""]
["NORRIS Lando","McLAREN",null,null,null,null,""]
["SAINZ.Jr Carlos",null,null,null,null,null,""]
[null,null,null,null,null,null,""]
["RAÏKKÖNEN Kimi","ALFA ROMEO",null,null,null,null,""]
["GIOVINAZZI Antonio",null,null,null,null,null,""]
[null,null,null,null,null,null,""]

{"sheet":"AbuDhabi","index":28,"n_rows":34,"n_cols":13,"rows_kept":34,"cut":false,"hidden":false,"merged":[[0,0,1,13],[2,1,3,1],[2,2,3,2],[2,3,3,3],[2,5,3,5],[2,6,3,6],[2,4,3,4],[2,0,3,0],[2,8,2,12],[4,1,6,1],[4,2,6,2],[7,1,9,1],[7,2,9,2],[10,1,12,1],[10,2,12,2],[13,1,15,1],[13,2,15,2],[16,1,18,1],[16,2,18,2],[19,1,21,1],[19,2,21,2],[34,1,36,1],[31,1,33,1],[31,2,33,2],[22,1,24,1],[22,2,24,2],[25,1,27,1],[25,2,27,2],[28,1,30,1],[28,2,30,2],[34,2,36,2]]}
["YAS MARINA - 13 DÉCEMBRE 2020"]
[]
["PILOTES","ECURIES","VOITURES","Finish","Pôle","Pt tour","Points",null,"CLASSEMENT"]
[null,null,null,null,null,null,null,null,"ÉCURIES","POINTS","RANG","TOTAL","PONCTUEL"]
["HAMILTON Lewis","MERCEDES",null,null,null,null,{"$f":"IFERROR(CHOOSE(D5,25,18,15,12,10,8,6,4,2,1)+(F5=1),\"\")","v":""},null,"ALFA ROMEO",{"$f":"SUM($G$32:$G$34)","v":0},{"$f":"IF(J5=\"\",0,(RANK(J5,$J$5:$J$14)))+COUNTIF(J$5:J5,J5)-1","v":1},{"$f":"SUMIF(Sakhir!$I$5:$I$14,AbuDhabi!$I5,Sakhir!$L$5:$L$14)+$J$514","v":8},{"$f":"IF(L5=\"\",0,(RANK(L5,$L$5:$L$14)))+COUNTIF(L$5:L5,L5)-1","v":8}]
["BOTTAS Valtteri",null,null,null,null,null,{"$f":"IFERROR(CHOOSE(D6,25,18,15,12,10,8,6,4,2,1)+(F6=1),\"\")","v":""},null,"Mc LAREN",{"$f":"SUM($G$29:$G$31)","v":0},{"$f":"IF(J6=\"\",0,(RANK(J6,$J$5:$J$14)))+COUNTIF(J$5:J6,J6)-1","v":2},{"$f":"SUMIF(Sakhir!$I$5:$I$14,AbuDhabi!$I6,Sakhir!$L$5:$L$14)+$J$514","v":149},{"$f":"IF(L6=\"\",0,(RANK(L6,$L$5:$L$14)))+COUNTIF(L$5:L6,L6)-1","v":4}]
[null,null,null,null,null,null,"",null,"RENAULT",{"$f":"SUM($G$20:$G$22)","v":0},{"$f":"IF(J7=\"\",0,(RANK(J7,$J$5:$J$14)))+COUNTIF(J$5:J7,J7)-1","v":3},{"$f":"SUMIF(Sakhir!$I$5:$I$14,AbuDhabi!$I7,Sakhir!$L$5:$L$14)+$J$514","v":136},{"$f":"IF(L7=\"\",0,(RANK(L7,$L$5:$L$14)))+COUNTIF(L$5:L7,L7)-1","v":5}]
["VETTEL Sebastian","FERRARI",null,null,null,null,"",null,"RED BULL",{"$f":"SUM($G$11:$G$13)","v":0},{"$f":"IF(J8=\"\",0,(RANK(J8,$J$5:$J$14)))+COUNTIF(J$5:J8,J8)-1","v":4},{"$f":"SUMIF(Sakhir!$I$5:$I$14,AbuDhabi!$I8,Sakhir!$L$5:$L$14)+$J$514","v":240},{"$f":"IF(L8=\"\",0,(RANK(L8,$L$5:$L$14)))+COUNTIF(L$5:L8,L8)-1","v":2}]
["LECLERC Charles",null,null,null,null,null,"",null,"FERRARI",{"$f":"SUM($G$8:$G$10)","v":0},{"$f":"IF(J9=\"\",0,(RANK(J9,$J$5:$J$14)))+COUNTIF(J$5:J9,J9)-1","v":5},{"$f":"SUMIF(Sakhir!$I$5:$I$14,AbuDhabi!$I9,Sakhir!$L$5:$L$14)+$J$514","v":130},{"$f":"IF(L9=\"\",0,(RANK(L9,$L$5:$L$14)))+COUNTIF(L$5:L9,L9)-1","v":6}]
[null,null,null,null,null,null,"",null,"ALPHA TAURI",{"$f":"SUM($G$23:$G$25)","v":0},{"$f":"IF(J10=\"\",0,(RANK(J10,$J$5:$J$14)))+COUNTIF(J$5:J10,J10)-1","v":6},{"$f":"SUMIF(Sakhir!$I$5:$I$14,AbuDhabi!$I10,Sakhir!$L$5:$L$14)+$J$514","v":89},{"$f":"IF(L10=\"\",0,(RANK(L10,$L$5:$L$14)))+COUNTIF(L$5:L10,L10)-1","v":7}]
["VERSTAPPEN Max","RED BULL",null,null,null,null,"",null,"WILLIAMS",{"$f":"SUM($G$17:$G$19)","v":0},{"$f":"IF(J11=\"\",0,(RANK(J11,$J$5:$J$14)))+COUNTIF(J$5:J11,J11)-1","v":7},{"$f":"SUMIF(Sakhir!$I$5:$I$14,AbuDhabi!$I11,Sakhir!$L$5:$L$14)+$J$514","v":0},{"$f":"IF(L11=\"\",0,(RANK(L11,$L$5:$L$14)))+COUNTIF(L$5:L11,L11)-1","v":10}]
["ALBON Alexander",null,null,null,null,null,"",null,"MERCEDES",{"$f":"SUM($G$5:$G$7)","v":0},{"$f":"IF(J12=\"\",0,(RANK(J12,$J$5:$J$14)))+COUNTIF(J$5:J12,J12)-1","v":8},{"$f":"SUMIF(Sakhir!$I$5:$I$14,AbuDhabi!$I12,Sakhir!$L$5:$L$14)+$J$514","v":504},{"$f":"IF(L12=\"\",0,(RANK(L12,$L$5:$L$14)))+COUNTIF(L$5:L12,L12)-1","v":1}]
[null,null,null,null,null,null,"",null,"RACING POINT",{"$f":"SUM($G$14:$G$16)","v":0},{"$f":"IF(J13=\"\",0,(RANK(J13,$J$5:$J$14)))+COUNTIF(J$5:J13,J13)-1","v":9},{"$f":"SUMIF(Sakhir!$I$5:$I$14,AbuDhabi!$I13,Sakhir!$L$5:$L$14)+$J$514","v":169},{"$f":"IF(L13=\"\",0,(RANK(L13,$L$5:$L$14)))+COUNTIF(L$5:L13,L13)-1","v":3}]
["PEREZ Sergio","RACING\nPOINT",null,null,null,null,"",null,"HAAS",{"$f":"SUM($G$26:$G$28)","v":0},{"$f":"IF(J14=\"\",0,(RANK(J14,$J$5:$J$14)))+COUNTIF(J$5:J14,J14)-1","v":10},{"$f":"SUMIF(Sakhir!$I$5:$I$14,AbuDhabi!$I14,Sakhir!$L$5:$L$14)+$J$514","v":3},{"$f":"IF(L14=\"\",0,(RANK(L14,$L$5:$L$14)))+COUNTIF(L$5:L14,L14)-1","v":9}]
["STROLL Lance",null,null,null,null,null,""]
[null,null,null,null,null,null,""]
["RUSSELL George","WILLIAMS",null,null,null,null,""]
["LATIFI Nichola",null,null,null,null,null,""]
[null,null,null,null,null,null,""]
["RICCIARDO Daniel","RENAULT",null,null,null,null,""]
["OCON Sebastian",null,null,null,null,null,""]
[null,null,null,null,null,null,""]
["KVYAT Daniil","ALPHA TAURI",null,null,null,null,""]
["GASLY Pierre",null,null,null,null,null,""]
[null,null,null,null,null,null,""]
["GROSJEAN Romain","HAAS",null,null,null,null,""]
["MAGNUSSEN Kevin",null,null,null,null,null,""]
[null,null,null,null,null,null,""]
["NORRIS Lando","McLAREN",null,null,null,null,""]
["SAINZ.Jr Carlos",null,null,null,null,null,""]
[null,null,null,null,null,null,""]
["RAÏKKÖNEN Kimi","ALFA ROMEO",null,null,null,null,""]
["GIOVINAZZI Antonio",null,null,null,null,null,""]
[null,null,null,null,null,null,""]