{"text_format":"1","workbook":"xlsx","n_sheets":18,"sheets":["Photos","Champions","Écuries","Pilotes","Espagne","Andalousie","Tchèque","Autriche","Styrie","Saint-Marin","Emilie-Romagne","Catalogne","France","Aragon","Teruel","Europe","Valence","Portugal"],"not_rendered":{"charts":0,"images":91,"macros":1,"external_links":1,"defined_names":7,"comments":0,"pivot_tables":0},"unopened":[],"bounds":{"document_bytes":16777216,"sheet_cells":100000,"rows_first":2000,"rows_last":500,"rows_between":2000,"halvings":0,"cell_chars":16384,"cell_head_chars":4096},"cells_cut":0,"cells_raw":0,"read":"whole","date_system":"1900"}

{"sheet":"Photos","index":0,"n_rows":26,"n_cols":8,"rows_kept":26,"cut":false,"hidden":false,"merged":[[1,5,1,7],[1,1,1,3]]}
[]
[null,"Photos Pilotes",null,null,null,"Photos Motos"]
[null,"Noms",null,"Photos",null,"Noms",null,"Photos"]
[null,"DEVIZIOSO Andrea",{"$f":"\"Photos!\"&ADDRESS(ROW(C4),COLUMN(D4))","v":"Photos!$D$4"},null,null,"DUCATI TEAM",{"$f":"\"Photos!\"&ADDRESS(ROW(G4),COLUMN(H4))","v":"Photos!$H$4"}]
[null,"PETRUCCI Danielo",{"$f":"\"Photos!\"&ADDRESS(ROW(C5),COLUMN(D5))","v":"Photos!$D$5"},null,null,"APRILIA RACING",{"$f":"\"Photos!\"&ADDRESS(ROW(G5),COLUMN(H5))","v":"Photos!$H$5"}]
[null,"VINALES Maverick","Photos!$D$6",null,null,"AVINTIA RACING","Photos!$H$6"]
[null,"ABRAHAM Karel","Photos!$D$7",null,null,"HONDA REPSOL","Photos!$H$7"]
[null,"QUARTARARO Fabio","Photos!$D$8",null,null,"KTM FACTORY","Photos!$H$8"]
[null,"MORBIDELLI Franco","Photos!$D$9",null,null,"KTM TECH3","Photos!$H$9"]
[null,"LEKUONA Iker","Photos!$D$10",null,null,"SUZUKI TEAM","Photos!$H$10"]
[null,"IANNONE Andrea","Photos!$D$11",null,null,"YAMAHA FACTORY","Photos!$H$11"]
[null,"NAKAGAMI Takaaki","Photos!$D$12",null,null,"YAMAHA PETRONAS","Photos!$H$12"]
[null,"BINDER Brad","Photos!$D$13",null,null,"HONDA LCR","Photos!$H$13"]
[null,"CRUTCHLOW Cal","Photos!$D$14",null,null,"DUCATI PRAMAC"]
[null,"MIR Joan","Photos!$D$15"]
[null,"ESPARGARO Aleix","Photos!$D$16"]
[null,"RINS Alex","Photos!$D$17"]
[null,"MILLER Jack","Photos!$D$18"]
[null,"ESPARGARO Pol","Photos!$D$19"]
[null,"ROSSI Valentino","Photos!$D$20"]
[null,"RABAT Tito","Photos!$D$21"]
[null,"BAGNAIA Pecco",{"$f":"\"Photos!\"&ADDRESS(ROW(C22),COLUMN(D22))","v":"Photos!$D$22"}]
[null,"MARQUES Alex","Photos!$D$23"]
[null,"OLIVEIRA Miguel","Photos!$D$24"]
[null,"MARQUES Alex","Photos!$D$25"]
[null,"MARQUES Marc","Photos!$D$26"]

{"sheet":"Champions","index":1,"n_rows":22,"n_cols":10,"rows_kept":22,"cut":false,"hidden":false,"merged":[[19,5,24,7],[22,9,27,11],[22,1,27,3],[20,1,20,3],[21,1,21,3],[20,9,20,11],[21,9,21,11],[1,2,1,10],[15,2,15,10],[17,5,17,7],[18,5,18,7],[3,5,3,7],[4,5,4,7],[6,1,6,3],[7,1,7,3],[6,9,6,11],[7,9,7,11],[8,1,13,3],[8,9,13,11],[5,5,10,7]]}
[]
[null,null,"CHAMPIONNAT PILOTES 2020"]
[]
[null,null,null,null,null,"CHAMPION 2020"]
[null,null,null,null,null,{"$f":"IF(Pilotes!G5=1,Pilotes!B5,\"\")","v":"QUARTARARO Fabio"}]
[]
[null,"DEUXIÈME",null,null,null,null,null,null,null,"TROIXIÈME"]
[null,{"$f":"IF(Pilotes!G6=2,Pilotes!B6,\"\")","v":"MIR Joan"},null,null,null,null,null,null,null,{"$f":"IF(Pilotes!G7=3,Pilotes!B7,\"\")","v":"DEVIZIOSO Andrea"}]
[]
[]
[]
[]
[]
[]
[]
[null,null,"CHAMPIONNAT CONSTRUCTEURS 2020"]
[]
[null,null,null,null,null,"CHAMPION 2019"]
[null,null,null,null,null,{"$f":"IF(Écuries!F4=1,Écuries!B4,\"\")","v":"YAMAHA PETRONAS"}]
[]
[null,"DEUXIÈME",null,null,null,null,null,null,null,"TROIXIÈME"]
[null,{"$f":"IF(Écuries!F5=2,Écuries!B5,\"\")","v":"DUCATI TEAM"},null,null,null,null,null,null,null,{"$f":"IF(Écuries!F6=3,Écuries!B6,\"\")","v":""}]

{"sheet":"Écuries","index":2,"n_rows":14,"n_cols":6,"rows_kept":14,"cut":false,"hidden":false,"merged":[[0,1,0,5]]}
[]
[]
[null,"ÉCURIES","POINTS","Écart/premier","Écart/précédent","RANG"]
[null,"YAMAHA PETRONAS",{"$f":"SUM(Espagne:Portugal!$G$35:$G$37)","v":192},null,null,{"$f":"IF(C4=\"\",0,(RANK(C4,$C$4:$C$14)))","v":1}]
[null,"DUCATI TEAM",{"$f":"SUM(Espagne:Portugal!$G$8:$G$10)","v":165},{"$f":"C5-C4","v":-27},{"$f":"C5-C4","v":-27},2]
[null,"SUZUKI TEAM",{"$f":"SUM(Espagne:Portugal!$G$29:$G$31)","v":165},{"$f":"C6-C4","v":-27},{"$f":"C6-C5","v":0},2]
[null,"YAMAHA FACTORY",{"$f":"SUM(Espagne:Portugal!$G$32:$G$34)","v":154},{"$f":"C7-C4","v":-38},-11,4]
[null,"KTM FACTORY",{"$f":"SUM(Espagne:Portugal!$G$23:$G$25)","v":135},{"$f":"C8-C4","v":-57},-19,5]
[null,"DUCATI PRAMAC",{"$f":"SUM(Espagne:Portugal!$G$14:$G$16)","v":117},{"$f":"C9-C4","v":-75},-18,6]
[null,"HONDA LCR",{"$f":"SUM(Espagne:Portugal!$G$20:$G$22)","v":94},{"$f":"C10-C4","v":-98},-23,7]
[null,"KTM TECH3",{"$f":"SUM(Espagne:Portugal!$G$26:$G$28)","v":86},{"$f":"C11-C4","v":-106},-8,8]
[null,"AVINTIA RACING",{"$f":"SUM(Espagne:Portugal!$G$11:$G$13)","v":55},{"$f":"C12-C4","v":-137},-31,9]
[null,"HONDA REPSOL",{"$f":"SUM(Espagne:Portugal!$G$17:$G$19)","v":55},{"$f":"C13-C4","v":-137},0,9]
[null,"APRILIA RACING",{"$f":"SUM(Espagne:Portugal!$G$5:$G$7)","v":35},{"$f":"C14-C5","v":-130},{"$f":"C14-C13","v":-20},11]

{"sheet":"Pilotes","index":3,"n_rows":30,"n_cols":10,"rows_kept":30,"cut":false,"hidden":false,"merged":[[2,9,3,9],[0,0,0,7],[2,1,3,1],[2,2,3,2],[2,6,3,6],[2,3,3,3],[2,4,3,4],[2,5,3,5]]}
[]
[]
[null,"PILOTES","Points","Écart-premier","Écart/précédent","Pôle Position","Place",1,null,"Courses"]
[null,null,{"$f":"IFERROR(SUM(Andalousie!G33,[1]Bahreïn!F33),\"\")","v":20},null,null,null,{"$f":"IF(C4=0,\"\",(RANK(C4,C1:C4)))","v":1},"Pos.saison",null,{"$f":"IF(F4=0,\"\",(RANK(F4,F1:F4)))","v":""}]
[null,"QUARTARARO Fabio",{"$f":"SUM(Espagne:Portugal!$G$35)","v":115},null,null,{"$f":"CalculPool(B5)","v":4},{"$f":"IF(C5=\"\",0,(RANK(C5,$C$5:$C$30)))","v":1},{"$f":"CalculPosition(B5)","v":3},null,"Espagne"]
[null,"MIR Joan",{"$f":"SUM(Espagne:Portugal!$G$29)","v":105},{"$f":"C6-C5","v":-10},{"$f":"C5-C6","v":10},{"$f":"CalculPool(B6)","v":0},{"$f":"IF(C6=\"\",0,(RANK(C6,$C$5:$C$30)))","v":2},{"$f":"CalculPosition(B6)","v":0},null,"Andalousie"]
[null,"DEVIZIOSO Andrea",{"$f":"SUM(Espagne:Portugal!$G$9)","v":97},{"$f":"C7-C5","v":-18},{"$f":"C6-C7","v":8},0,3,1,null,"Tchèque"]
[null,"VINALES Maverick",{"$f":"SUM(Espagne:Portugal!$G$33)","v":96},{"$f":"C8-C5","v":-19},{"$f":"C7-C8","v":1},{"$f":"CalculPool(B8)","v":3},4,1,null,"Autriche"]
[null,"NAKAGAMI Takaaki",{"$f":"SUM(Espagne:Portugal!$G$21)","v":81},{"$f":"C9-C5","v":-34},{"$f":"C8-C9","v":15},0,5,0,null,"Styrie"]
[null,"MORBIDELLI Franco",{"$f":"SUM(Espagne:Portugal!$G$36)","v":77},{"$f":"C10-C5","v":-38},{"$f":"C9-C10","v":4},1,6,1,null,"Saint-Marin"]
[null,"MILLER Jack",{"$f":"SUM(Espagne:Portugal!$G$15)","v":75},{"$f":"C11-C5","v":-40},{"$f":"C10-C11","v":2},0,7,0,null,"Emilie-Romagne"]
[null,"ESPARGARO Pol",{"$f":"SUM(Espagne:Portugal!$G$24)","v":73},{"$f":"C12-C5","v":-42},2,1,8,0,null,"Catalogne"]
[null,"OLIVEIRA Miguel",{"$f":"SUM(Espagne:Portugal!$G$27)","v":69},{"$f":"C13-C5","v":-46},4,0,9,1,null,"France"]
[null,"PETRUCCI Danielo",{"$f":"SUM(Espagne:Portugal!$G$8)","v":64},{"$f":"C14-C5","v":-51},5,0,10,1,null,"Aragon"]
[null,"BINDER Brad",{"$f":"SUM(Espagne:Portugal!$G$23)","v":62},{"$f":"C15-C5","v":-53},2,0,11,1,null,"Teruel"]
[null,"RINS Alex",{"$f":"SUM(Espagne:Portugal!$G$30)","v":60},{"$f":"C16-C5","v":-55},2,0,12,0,null,"Europe"]
[null,"ROSSI Valentino",{"$f":"SUM(Espagne:Portugal!$G$32)","v":58},{"$f":"C17-C5","v":-57},2,0,13,0,null,"Valence"]
[null,"ZARCO Johann",{"$f":"SUM(Espagne:Portugal!$G$11)","v":47},{"$f":"C18-C5","v":-68},11,{"$f":"CalculPool(B18)","v":1},14,0,null,"Portugal"]
[null,"MARQUES Alex",{"$f":"SUM(Espagne:Portugal!$G$17)","v":47},{"$f":"C19-C5","v":-68},0,0,14,0]
[null,"MARQUES Alex",{"$f":"SUM(Espagne:Portugal!$G$17)","v":47},{"$f":"C20-C5","v":-68},0,0,14,0]
[null,"BAGNAIA Pecco",{"$f":"SUM(Espagne:Portugal!$G$14)","v":42},{"$f":"C21-C5","v":-73},5,0,17,0]
[null,"ESPARGARO Aleix",{"$f":"SUM(Espagne:Portugal!$G$6)","v":24},{"$f":"C22-C5","v":-91},18,0,18,0]
[null,"LEKUONA Iker",{"$f":"SUM(Espagne:Portugal!$G$26)","v":17},{"$f":"C23-C5","v":-98},{"$f":"C22-C23","v":7},0,19,0]
[null,"CRUTCHLOW Cal",{"$f":"SUM(Espagne:Portugal!$G$20)","v":13},{"$f":"C24-C5","v":-102},4,0,20,0]
[null,"BRADLEY Smith",{"$f":"SUM(Espagne:Portugal!$G$7)","v":11},{"$f":"C25-C5","v":-104},2,0,{"$f":"IF(C25=\"\",0,(RANK(C25,$C$5:$C$30)))","v":21},0]
[null,"RABAT Tito",{"$f":"SUM(Espagne:Portugal!$G$12)","v":8},{"$f":"C26-C6","v":-97},3,0,{"$f":"IF(C26=\"\",0,(RANK(C26,$C$5:$C$30)))","v":22},0]
[null,"BRADL Stephan",{"$f":"SUM(Espagne:Portugal!$G$19)","v":8},{"$f":"C27-C7","v":-89},{"$f":"C26-C27","v":0},{"$f":"CalculPool(B27)","v":0},22,0]
[null,"PIRRO Michele",{"$f":"SUM(Espagne:Portugal!$G$10)","v":4},{"$f":"C28-C8","v":-92},{"$f":"C27-C28","v":4},{"$f":"CalculPool(B28)","v":0},24,0]
[null,"IANNONE Andrea",{"$f":"SUM(Espagne:Portugal!$G$55)","v":0},-81,4,0,{"$f":"IF(C29=\"\",0,(RANK(C29,$C$5:$C$30)))","v":25},0]
[null,"MARQUES Marc",{"$f":"SUM(Espagne:Portugal!$G$18)","v":0},-77,0,0,{"$f":"IF(C30=\"\",0,(RANK(C30,$C$5:$C$30)))","v":25},0]

{"sheet":"Espagne","index":4,"n_rows":37,"n_cols":11,"rows_kept":37,"cut":false,"hidden":false,"merged":[[34,1,36,1],[34,2,36,2],[2,8,2,10],[31,1,33,1],[31,2,33,2],[22,1,24,1],[22,2,24,2],[25,1,27,1],[25,2,27,2],[28,1,30,1],[28,2,30,2],[13,1,15,1],[13,2,15,2],[16,1,18,1],[16,2,18,2],[19,1,21,1],[19,2,21,2],[4,1,6,1],[4,2,6,2],[7,1,9,1],[7,2,9,2],[10,1,12,1],[10,2,12,2],[0,0,1,13],[2,1,3,1],[2,2,3,2],[2,3,3,3],[2,5,3,5],[2,6,3,6],[2,4,3,4],[2,0,3,0]]}
["JEREZ - 19 JUILLET 2020"]
[]
["PILOTES","ECURIES","MOTOS","Finish","Pôle","Pt tour","Points",null,"CLASSEMENT"]
[null,null,null,null,null,null,null,{"$f":"IF(G4=\"\",\"\",(RANK(G4,G4:G23)))","v":""},"ÉCURIES","POINTS","RANG"]
["IANNONE Andrea","APRILIA RACING",null,null,null,null,{"$f":"IFERROR(CHOOSE(D5,25,20,16,13,11,10,9,8,7,6,5,4,3,2,1)+(F5=1),\"\")","v":""},null,"YAMAHA PETRONAS",{"$f":"SUM($G$35:$G$37)","v":36},{"$f":"IF(J5=\"\",0,(RANK(J5,$J$5:$J$15)))+COUNTIF(J$5:J5,J5)-1","v":1}]
["ESPARGARO Aleix",null,null,"OUT",null,null,{"$f":"IFERROR(CHOOSE(D6,25,20,16,13,11,10,9,8,7,6,5,4,3,2,1)+(F6=1),\"\")","v":""},null,"DUCATI TEAM",{"$f":"SUM($G$8:$G$10)","v":23},{"$f":"IF(J6=\"\",0,(RANK(J6,$J$5:$J$15)))+COUNTIF(J$5:J6,J6)-1","v":2}]
["BRADLEY Smitth",null,null,15,null,null,1,null,"DUCATI PRAMAC",{"$f":"SUM($G$14:$G$16)","v":22},{"$f":"IF(J7=\"\",0,(RANK(J7,$J$5:$J$15)))+COUNTIF(J$5:J7,J7)-1","v":3}]
["PETRUCCI Danielo","DUCATI TEAM",null,9,null,null,7,null,"YAMAHA FACTORY",{"$f":"SUM($G$31:$G$33)","v":20},{"$f":"IF(J8=\"\",0,(RANK(J8,$J$5:$J$15)))+COUNTIF(J$5:J8,J8)-1","v":4}]
["DEVIZIOSO Andrea",null,null,3,null,null,16,null,"KTM FACTORY",{"$f":"SUM($G$23:$G$25)","v":13},{"$f":"IF(J9=\"\",0,(RANK(J9,$J$5:$J$15)))+COUNTIF(J$5:J9,J9)-1","v":5}]
["PIRRO Michele",null,null,null,null,null,"",null,"KTM TECH3",{"$f":"SUM($G$26:$G$28)","v":8},{"$f":"IF(J10=\"\",0,(RANK(J10,$J$5:$J$15)))+COUNTIF(J$5:J10,J10)-1","v":6}]
["ZARCO Johann","AVINTIA RACING",null,11,null,null,5,null,"AVINTIA RACING",{"$f":"SUM($G$11:$G$13)","v":7},{"$f":"IF(J11=\"\",0,(RANK(J11,$J$5:$J$15)))+COUNTIF(J$5:J11,J11)-1","v":7}]
["RABAT Tito",null,null,14,null,null,2,null,"HONDA LCR",{"$f":"SUM($G$20:$G$22)","v":6},{"$f":"IF(J12=\"\",0,(RANK(J12,$J$5:$J$15)))+COUNTIF(J$5:J12,J12)-1","v":8}]
[null,null,null,null,null,null,"",null,"HONDA REPSOL",{"$f":"SUM($G$17:$G$19)","v":4},{"$f":"IF(J13=\"\",0,(RANK(J13,$J$5:$J$15)))+COUNTIF(J$5:J13,J13)-1","v":9}]
["BAGNAIA Pecco","DUCATI PRAMAC",null,7,null,null,9,null,"APRILIA RACING",{"$f":"SUM($G$5:$G$7)","v":1},{"$f":"IF(J14=\"\",0,(RANK(J14,$J$5:$J$15)))+COUNTIF(J$5:J14,J14)-1","v":10}]
["MILLER Jack",null,null,4,null,null,13,null,"SUZUKI TEAM",{"$f":"SUM($G$29:$G$31)","v":0},{"$f":"IF(J15=\"\",0,(RANK(J15,$J$5:$J$15)))+COUNTIF(J$5:J15,J15)-1","v":11}]
[null,null,null,null,null,null,""]
["MARQUES Alex","HONDA REPSOL",null,12,null,null,4]
["MARQUES Marc",null,null,"OUT",null,null,""]
["BRADL Stephan",null,null,"OUT",null,null,""]
["CRUTCHLOW Cal","HONDA LCR",null,"OUT",null,null,""]
["NAKAGAMI Takaaki",null,null,10,null,null,6]
[null,null,null,null,null,null,""]
["BINDER Brad","KTM FACTORY",null,13,null,null,3]
["ESPARGARO Pol",null,null,6,null,null,10]
[null,null,null,null,null,null,""]
["LEKUONA Iker","KTM TECH3",null,"OUT",null,null,""]
["OLIVEIRA Miguel",null,null,8,null,null,8]
[null,null,null,null,null,null,""]
["MIR Joan","SUZUKI TEAM",null,"OUT",null,null,""]
["RINS Alex",null,null,"OUT",null,null,""]
[null,null,null,null,null,null,""]
["ROSSI Valentino","YAMAHA FACTORY",null,"OUT",null,null,""]
["VINALES Maverick",null,null,2,null,null,20]
[null,null,null,null,null,null,""]
["QUARTARARO Fabio","YAMAHA PETRONAS",null,1,1,null,25]
["MORBIDELLI Franco",null,null,5,null,null,11]
[null,null,null,null,null,null,""]

{"sheet":"Andalousie","index":5,"n_rows":37,"n_cols":13,"rows_kept":37,"cut":false,"hidden":false,"merged":[[28,1,30,1],[31,1,33,1],[34,1,36,1],[13,1,15,1],[16,1,18,1],[19,1,21,1],[22,1,24,1],[25,1,27,1],[34,2,36,2],[31,2,33,2],[13,2,15,2],[16,2,18,2],[19,2,21,2],[28,2,30,2],[25,2,27,2],[22,2,24,2],[7,2,9,2],[10,2,12,2],[0,0,1,14],[4,2,6,2],[2,0,3,0],[2,1,3,1],[2,2,3,2],[2,3,3,3],[2,5,3,5],[2,6,3,6],[2,4,3,4],[2,8,2,12],[4,1,6,1],[7,1,9,1],[10,1,12,1]]}
["JEREZ - 26 JUILLET 2020"]
[]
["PILOTES","ECURIES","MOTOS","Finish","Pôle","Pt tour","Points",null,"CLASSEMENT"]
[null,null,null,null,null,null,null,null,"ÉCURIES","POINTS","RANG","TOTAL","PONCTUEL"]
["IANNONE Andrea","APRILIA RACING",null,null,null,null,{"$f":"IFERROR(CHOOSE(D5,25,20,16,13,11,10,9,8,7,6,5,4,3,2,1)+(F5=1),\"\")","v":""},null,"YAMAHA FACTORY",{"$f":"SUM($G$32:$G$34)","v":36},{"$f":"IF(J5=\"\",0,(RANK(J5,$J$5:$J$15)))+COUNTIF(J$5:J5,J5)-1","v":1},{"$f":"SUMIF(Espagne!$I$5:$I$15,Andalousie!$I5,Espagne!$J$5:$J$15)+$J$5","v":56},{"$f":"IF(L5=\"\",0,(RANK(L5,$L$5:$L$15)))+COUNTIF(L$5:L5,L5)-1","v":2}]
["ESPARGARO Aleix",null,null,"OUT",null,null,{"$f":"IFERROR(CHOOSE(D6,25,20,16,13,11,10,9,8,7,6,5,4,3,2,1)+(F6=1),\"\")","v":""},null,"YAMAHA PETRONAS",{"$f":"SUM($G$35:$G$37)","v":25},{"$f":"IF(J6=\"\",0,(RANK(J6,$J$5:$J$15)))+COUNTIF(J$5:J6,J6)-1","v":2},{"$f":"SUMIF(Espagne!$I$5:$I$15,Andalousie!$I6,Espagne!$J$5:$J$15)+$J$6","v":61},{"$f":"IF(L6=\"\",0,(RANK(L6,$L$5:$L$15)))+COUNTIF(L$5:L6,L6)-1","v":1}]
["BRADLEY Smitth",null,null,12,null,null,4,null,"SUZUKI TEAM",{"$f":"SUM($G$29:$G$31)","v":17},{"$f":"IF(J7=\"\",0,(RANK(J7,$J$5:$J$15)))+COUNTIF(J$5:J7,J7)-1","v":3},{"$f":"SUMIF(Espagne!$I$5:$I$15,Andalousie!$I7,Espagne!$J$5:$J$15)+$J$7","v":17},{"$f":"IF(L7=\"\",0,(RANK(L7,$L$5:$L$15)))+COUNTIF(L$5:L7,L7)-1","v":8}]
["PETRUCCI Danielo","DUCATI TEAM",null,"OUT",null,null,"",null,"HONDA LCR",{"$f":"SUM($G$20:$G$22)","v":16},{"$f":"IF(J8=\"\",0,(RANK(J8,$J$5:$J$15)))+COUNTIF(J$5:J8,J8)-1","v":4},{"$f":"SUMIF(Espagne!$I$5:$I$15,Andalousie!$I8,Espagne!$J$5:$J$15)+$J$8","v":22},{"$f":"IF(L8=\"\",0,(RANK(L8,$L$5:$L$15)))+COUNTIF(L$5:L8,L8)-1","v":4}]
["DEVIZIOSO Andrea",null,null,6,null,null,10,null,"AVINTIA RACING",{"$f":"SUM($G$11:$G$13)","v":12},{"$f":"IF(J9=\"\",0,(RANK(J9,$J$5:$J$15)))+COUNTIF(J$5:J9,J9)-1","v":5},{"$f":"SUMIF(Espagne!$I$5:$I$15,Andalousie!$I9,Espagne!$J$5:$J$15)+$J$9","v":19},{"$f":"IF(L9=\"\",0,(RANK(L9,$L$5:$L$15)))+COUNTIF(L$5:L9,L9)-1","v":7}]
["PIRRO Michele",null,null,null,null,null,"",null,"DUCATI TEAM",{"$f":"SUM($G$8:$G$10)","v":10},{"$f":"IF(J10=\"\",0,(RANK(J10,$J$5:$J$15)))+COUNTIF(J$5:J10,J10)-1","v":6},{"$f":"SUMIF(Espagne!$I$5:$I$15,Andalousie!$I10,Espagne!$J$5:$J$15)+$J$10","v":33},{"$f":"IF(L10=\"\",0,(RANK(L10,$L$5:$L$15)))+COUNTIF(L$5:L10,L10)-1","v":3}]
["ZARCO Johann","AVINTIA RACING",null,9,null,null,7,null,"KTM FACTORY",{"$f":"SUM($G$23:$G$25)","v":9},{"$f":"IF(J11=\"\",0,(RANK(J11,$J$5:$J$15)))+COUNTIF(J$5:J11,J11)-1","v":7},{"$f":"SUMIF(Espagne!$I$5:$I$15,Andalousie!$I11,Espagne!$J$5:$J$15)+$J$11","v":22},{"$f":"IF(L11=\"\",0,(RANK(L11,$L$5:$L$15)))+COUNTIF(L$5:L11,L11)-1","v":5}]
["RABAT Tito",null,null,11,null,null,5,null,"HONDA REPSOL",{"$f":"SUM($G$17:$G$19)","v":8},{"$f":"IF(J12=\"\",0,(RANK(J12,$J$5:$J$15)))+COUNTIF(J$5:J12,J12)-1","v":8},{"$f":"SUMIF(Espagne!$I$5:$I$15,Andalousie!$I12,Espagne!$J$5:$J$15)+$J$12","v":12},{"$f":"IF(L12=\"\",0,(RANK(L12,$L$5:$L$15)))+COUNTIF(L$5:L12,L12)-1","v":9}]
[null,null,null,null,null,null,"",null,"APRILIA RACING",{"$f":"SUM($G$5:$G$7)","v":4},{"$f":"IF(J13=\"\",0,(RANK(J13,$J$5:$J$15)))+COUNTIF(J$5:J13,J13)-1","v":9},{"$f":"SUMIF(Espagne!$I$5:$I$15,Andalousie!$I13,Espagne!$J$5:$J$15)+$J$13","v":5},{"$f":"IF(L13=\"\",0,(RANK(L13,$L$5:$L$15)))+COUNTIF(L$5:L13,L13)-1","v":11}]
["BAGNAIA Pecco","DUCATI PRAMAC",null,"OUT",null,null,"",null,"DUCATI PRAMAC",{"$f":"SUM($G$14:$G$16)","v":0},{"$f":"IF(J14=\"\",0,(RANK(J14,$J$5:$J$15)))+COUNTIF(J$5:J14,J14)-1","v":10},{"$f":"SUMIF(Espagne!$I$5:$I$15,Andalousie!$I14,Espagne!$J$5:$J$15)+$J$14","v":22},{"$f":"IF(L14=\"\",0,(RANK(L14,$L$5:$L$15)))+COUNTIF(L$5:L14,L14)-1","v":6}]
["MILLER Jack",null,null,"OUT",null,null,"",null,"KTM TECH3",{"$f":"SUM($G$26:$G$28)","v":0},{"$f":"IF(J15=\"\",0,(RANK(J15,$J$5:$J$15)))+COUNTIF(J$5:J15,J15)-1","v":11},{"$f":"SUMIF(Espagne!$I$5:$I$15,Andalousie!$I15,Espagne!$J$5:$J$15)+$J$15","v":8},{"$f":"IF(L15=\"\",0,(RANK(L15,$L$5:$L$15)))+COUNTIF(L$5:L15,L15)-1","v":10}]
[null,null,null,null,null,null,""]
["MARQUES Alex","HONDA REPSOL",null,8,null,null,8]
["MARQUES Marc",null,null,null,null,null,""]
["BRADL Stephan",null,null,null,null,null,""]
["CRUTCHLOW Cal","HONDA LCR",null,13,null,null,3]
["NAKAGAMI Takaaki",null,null,4,null,null,13]
[null,null,null,null,null,null,""]
["BINDER Brad","KTM FACTORY",null,"OUT",null,null,""]
["ESPARGARO Pol",null,null,7,null,null,9]
[null,null,null,null,null,null,""]
["LEKUONA Iker","KTM TECH3",null,"OUT",null,null,""]
["OLIVEIRA Miguel",null,null,"OUT",null,null,""]
[null,null,null,null,null,null,""]
["MIR Joan","SUZUKI TEAM",null,5,null,null,11]
["RINS Alex",null,null,10,null,null,6]
[null,null,null,null,null,null,""]
["ROSSI Valentino","YAMAHA FACTORY",null,3,null,null,16]
["VINALES Maverick",null,null,2,null,null,20]
[null,null,null,null,null,null,""]
["QUARTARARO Fabio","YAMAHA PETRONAS",null,1,1,null,25]
["MORBIDELLI Franco",null,null,"OUT",null,null,""]
[null,null,null,null,null,null,""]

{"sheet":"Tchèque","index":6,"n_rows":37,"n_cols":13,"rows_kept":37,"cut":false,"hidden":false,"merged":[[34,2,36,2],[34,1,36,1],[31,1,33,1],[31,2,33,2],[22,1,24,1],[22,2,24,2],[25,1,27,1],[25,2,27,2],[28,1,30,1],[28,2,30,2],[13,1,15,1],[13,2,15,2],[16,1,18,1],[16,2,18,2],[19,1,21,1],[19,2,21,2],[2,8,2,12],[0,0,1,13],[2,1,3,1],[2,2,3,2],[2,3,3,3],[2,5,3,5],[2,6,3,6],[2,4,3,4],[2,0,3,0],[4,1,6,1],[4,2,6,2],[7,1,9,1],[7,2,9,2],[10,1,12,1],[10,2,12,2]]}
["MASARYK - 9 AOUT 2020"]
[]
["PILOTES","ECURIES","MOTOS","Finish","Pôle","Pt tour","Points",null,"CLASSEMENT"]
[null,null,null,null,null,null,null,{"$f":"IF(G4=\"\",\"\",(RANK(G4,G4:G23)))","v":""},"ÉCURIES","POINTS","RANG","TOTAL","PONCTUEL"]
["IANNONE Andrea","APRILIA RACING",null,null,null,null,{"$f":"IFERROR(CHOOSE(D5,25,20,16,13,11,10,9,8,7,6,5,4,3,2,1)+(F5=1),\"\")","v":""},null,"YAMAHA PETRONAS",{"$f":"SUM($G$35:$G$37)","v":29},{"$f":"IF(J5=\"\",0,(RANK(J5,$J$5:$J$15)))+COUNTIF(J$5:J5,J5)-1","v":1},{"$f":"SUMIF(Andalousie!$I$5:$I$15,Tchèque!$I5,Andalousie!$L$5:$L$15)+$J5","v":90},{"$f":"IF(L5=\"\",0,(RANK(L5,$L$5:$L$15)))+COUNTIF(L$5:L5,L5)-1","v":1}]
["ESPARGARO Aleix",null,null,10,null,null,{"$f":"IFERROR(CHOOSE(D6,25,20,16,13,11,10,9,8,7,6,5,4,3,2,1)+(F6=1),\"\")","v":6},null,"KTM FACTORY",{"$f":"SUM($G$23:$G$25)","v":25},{"$f":"IF(J6=\"\",0,(RANK(J6,$J$5:$J$15)))+COUNTIF(J$5:J6,J6)-1","v":2},{"$f":"SUMIF(Andalousie!$I$5:$I$15,Tchèque!$I6,Andalousie!$L$5:$L$15)+$J6","v":47},{"$f":"IF(L6=\"\",0,(RANK(L6,$L$5:$L$15)))+COUNTIF(L$5:L6,L6)-1","v":3}]
["BRADLEY Smitth",null,null,"OUT",null,null,"",null,"AVINTIA RACING",{"$f":"SUM($G$11:$G$13)","v":16},{"$f":"IF(J7=\"\",0,(RANK(J7,$J$5:$J$15)))+COUNTIF(J$5:J7,J7)-1","v":3},{"$f":"SUMIF(Andalousie!$I$5:$I$15,Tchèque!$I7,Andalousie!$L$5:$L$15)+$J7","v":35},{"$f":"IF(L7=\"\",0,(RANK(L7,$L$5:$L$15)))+COUNTIF(L$5:L7,L7)-1","v":5}]
["PETRUCCI Danielo","DUCATI TEAM",null,12,null,null,4,null,"YAMAHA FACTORY",{"$f":"SUM($G$32:$G$34)","v":13},{"$f":"IF(J8=\"\",0,(RANK(J8,$J$5:$J$15)))+COUNTIF(J$5:J8,J8)-1","v":4},{"$f":"SUMIF(Andalousie!$I$5:$I$15,Tchèque!$I8,Andalousie!$L$5:$L$15)+$J8","v":69},{"$f":"IF(L8=\"\",0,(RANK(L8,$L$5:$L$15)))+COUNTIF(L$5:L8,L8)-1","v":2}]
["DEVIZIOSO Andrea",null,null,11,null,null,5,null,"SUZUKI TEAM",{"$f":"SUM($G$29:$G$31)","v":13},{"$f":"IF(J9=\"\",0,(RANK(J9,$J$5:$J$15)))+COUNTIF(J$5:J9,J9)-1","v":5},{"$f":"SUMIF(Andalousie!$I$5:$I$15,Tchèque!$I9,Andalousie!$L$5:$L$15)+$J9","v":30},{"$f":"IF(L9=\"\",0,(RANK(L9,$L$5:$L$15)))+COUNTIF(L$5:L9,L9)-1","v":7}]
["PIRRO Michele",null,null,null,null,null,"",null,"HONDA LCR",{"$f":"SUM($G$20:$G$22)","v":11},{"$f":"IF(J10=\"\",0,(RANK(J10,$J$5:$J$15)))+COUNTIF(J$5:J10,J10)-1","v":6},{"$f":"SUMIF(Andalousie!$I$5:$I$15,Tchèque!$I10,Andalousie!$L$5:$L$15)+$J10","v":33},{"$f":"IF(L10=\"\",0,(RANK(L10,$L$5:$L$15)))+COUNTIF(L$5:L10,L10)-1","v":6}]
["ZARCO Johann","AVINTIA RACING",null,3,1,null,16,null,"KTM TECH3",{"$f":"SUM($G$26:$G$28)","v":10},{"$f":"IF(J11=\"\",0,(RANK(J11,$J$5:$J$15)))+COUNTIF(J$5:J11,J11)-1","v":7},{"$f":"SUMIF(Andalousie!$I$5:$I$15,Tchèque!$I11,Andalousie!$L$5:$L$15)+$J11","v":18},{"$f":"IF(L11=\"\",0,(RANK(L11,$L$5:$L$15)))+COUNTIF(L$5:L11,L11)-1","v":9}]
["RABAT Tito",null,null,"OUT",null,null,"",null,"DUCATI TEAM",{"$f":"SUM($G$8:$G$10)","v":9},{"$f":"IF(J12=\"\",0,(RANK(J12,$J$5:$J$15)))+COUNTIF(J$5:J12,J12)-1","v":8},{"$f":"SUMIF(Andalousie!$I$5:$I$15,Tchèque!$I12,Andalousie!$L$5:$L$15)+$J12","v":42},{"$f":"IF(L12=\"\",0,(RANK(L12,$L$5:$L$15)))+COUNTIF(L$5:L12,L12)-1","v":4}]
[null,null,null,null,null,null,"",null,"DUCATI PRAMAC",{"$f":"SUM($G$14:$G$16)","v":7},{"$f":"IF(J13=\"\",0,(RANK(J13,$J$5:$J$15)))+COUNTIF(J$5:J13,J13)-1","v":9},{"$f":"SUMIF(Andalousie!$I$5:$I$15,Tchèque!$I13,Andalousie!$L$5:$L$15)+$J13","v":29},{"$f":"IF(L13=\"\",0,(RANK(L13,$L$5:$L$15)))+COUNTIF(L$5:L13,L13)-1","v":8}]
["BAGNAIA Pecco","DUCATI PRAMAC",null,"OUT",null,null,"",null,"APRILIA RACING",{"$f":"SUM($G$5:$G$7)","v":6},{"$f":"IF(J14=\"\",0,(RANK(J14,$J$5:$J$15)))+COUNTIF(J$5:J14,J14)-1","v":10},{"$f":"SUMIF(Andalousie!$I$5:$I$15,Tchèque!$I14,Andalousie!$L$5:$L$15)+$J14","v":11},{"$f":"IF(L14=\"\",0,(RANK(L14,$L$5:$L$15)))+COUNTIF(L$5:L14,L14)-1","v":11}]
["MILLER Jack",null,null,9,null,null,7,null,"HONDA REPSOL",{"$f":"SUM($G$17:$G$19)","v":1},{"$f":"IF(J15=\"\",0,(RANK(J15,$J$5:$J$15)))+COUNTIF(J$5:J15,J15)-1","v":11},{"$f":"SUMIF(Andalousie!$I$5:$I$15,Tchèque!$I15,Andalousie!$L$5:$L$15)+$J15","v":13},{"$f":"IF(L15=\"\",0,(RANK(L15,$L$5:$L$15)))+COUNTIF(L$5:L15,L15)-1","v":10}]
[null,null,null,null,null,null,""]
["MARQUES Alex","HONDA REPSOL",null,15,null,null,1]
["MARQUES Marc",null,null,null,null,null,""]
["BRADL Stephan",null,null,null,null,null,""]
["CRUTCHLOW Cal","HONDA LCR",null,13,null,null,3]
["NAKAGAMI Takaaki",null,null,8,null,null,8]
[null,null,null,null,null,null,""]
["BINDER Brad","KTM FACTORY",null,1,null,null,25]
["ESPARGARO Pol",null,null,"OUT",null,null,""]
[null,null,null,null,null,null,""]
["LEKUONA Iker","KTM TECH3",null,"OUT",null,null,""]
["OLIVEIRA Miguel",null,null,6,null,null,10]
[null,null,null,null,null,null,""]
["MIR Joan","SUZUKI TEAM",null,"OUT",null,null,""]
["RINS Alex",null,null,4,null,null,13]
[null,null,null,null,null,null,""]
["ROSSI Valentino","YAMAHA FACTORY",null,5,null,null,11]
["VINALES Maverick",null,null,14,null,null,2]
[null,null,null,null,null,null,""]
["QUARTARARO Fabio","YAMAHA PETRONAS",null,7,null,null,9]
["MORBIDELLI Franco",null,null,2,null,null,20]
[null,null,null,null,null,null,""]

{"sheet":"Autriche","index":7,"n_rows":37,"n_cols":13,"rows_kept":37,"cut":false,"hidden":false,"merged":[[34,1,36,1],[34,2,36,2],[31,1,33,1],[31,2,33,2],[22,1,24,1],[22,2,24,2],[25,1,27,1],[25,2,27,2],[28,1,30,1],[28,2,30,2],[13,1,15,1],[13,2,15,2],[16,1,18,1],[16,2,18,2],[19,1,21,1],[19,2,21,2],[4,1,6,1],[4,2,6,2],[7,1,9,1],[7,2,9,2],[10,1,12,1],[10,2,12,2],[0,0,1,13],[2,1,3,1],[2,2,3,2],[2,3,3,3],[2,5,3,5],[2,6,3,6],[2,4,3,4],[2,0,3,0],[2,8,2,12]]}
["SPIELBERG - 16 AOUT 2020"]
[]
["PILOTES","ECURIES","MOTOS","Finish","Pôle","Pt tour","Points",null,"CLASSEMENT"]
[null,null,null,null,null,null,null,{"$f":"IF(G4=\"\",\"\",(RANK(G4,G4:G23)))","v":""},"ÉCURIES","POINTS","RANG","TOTAL","PONCTUEL"]
["IANNONE Andrea","APRILIA RACING",null,null,null,null,{"$f":"IFERROR(CHOOSE(D5,25,20,16,13,11,10,9,8,7,6,5,4,3,2,1)+(F5=1),\"\")","v":""},null,"DUCATI TEAM",{"$f":"SUM($G$8:$G$10)","v":38},{"$f":"IF(J5=\"\",0,(RANK(J5,$J$5:$J$15)))+COUNTIF(J$5:J5,J5)-1","v":1},{"$f":"SUMIF(Tchèque!$I$5:$I$15,Autriche!$I5,Tchèque!$L$5:$L$15)+$J5","v":80},{"$f":"IF(L5=\"\",0,(RANK(L5,$L$5:$L$15)))+COUNTIF(L$5:L5,L5)-1","v":3}]
["ESPARGARO Aleix",null,null,11,null,null,{"$f":"IFERROR(CHOOSE(D6,25,20,16,13,11,10,9,8,7,6,5,4,3,2,1)+(F6=1),\"\")","v":5},null,"SUZUKI TEAM",{"$f":"SUM($G$29:$G$31)","v":20},{"$f":"IF(J6=\"\",0,(RANK(J6,$J$5:$J$15)))+COUNTIF(J$5:J6,J6)-1","v":2},{"$f":"SUMIF(Tchèque!$I$5:$I$15,Autriche!$I6,Tchèque!$L$5:$L$15)+$J6","v":50},{"$f":"IF(L6=\"\",0,(RANK(L6,$L$5:$L$15)))+COUNTIF(L$5:L6,L6)-1","v":5}]
["BRADLEY Smitth",null,null,13,null,null,3,null,"YAMAHA FACTORY",{"$f":"SUM($G$32:$G$34)","v":17},{"$f":"IF(J7=\"\",0,(RANK(J7,$J$5:$J$15)))+COUNTIF(J$5:J7,J7)-1","v":3},{"$f":"SUMIF(Tchèque!$I$5:$I$15,Autriche!$I7,Tchèque!$L$5:$L$15)+$J7","v":86},{"$f":"IF(L7=\"\",0,(RANK(L7,$L$5:$L$15)))+COUNTIF(L$5:L7,L7)-1","v":2}]
["PETRUCCI Danielo","DUCATI TEAM",null,7,null,null,9,null,"DUCATI PRAMAC",{"$f":"SUM($G$14:$G$16)","v":16},{"$f":"IF(J8=\"\",0,(RANK(J8,$J$5:$J$15)))+COUNTIF(J$5:J8,J8)-1","v":4},{"$f":"SUMIF(Tchèque!$I$5:$I$15,Autriche!$I8,Tchèque!$L$5:$L$15)+$J8","v":45},{"$f":"IF(L8=\"\",0,(RANK(L8,$L$5:$L$15)))+COUNTIF(L$5:L8,L8)-1","v":6}]
["DEVIZIOSO Andrea",null,null,1,null,null,25,null,"KTM FACTORY",{"$f":"SUM($G$23:$G$25)","v":13},{"$f":"IF(J9=\"\",0,(RANK(J9,$J$5:$J$15)))+COUNTIF(J$5:J9,J9)-1","v":5},{"$f":"SUMIF(Tchèque!$I$5:$I$15,Autriche!$I9,Tchèque!$L$5:$L$15)+$J9","v":60},{"$f":"IF(L9=\"\",0,(RANK(L9,$L$5:$L$15)))+COUNTIF(L$5:L9,L9)-1","v":4}]
["PIRRO Michele",null,null,12,null,null,4,null,"HONDA LCR",{"$f":"SUM($G$20:$G$22)","v":11},{"$f":"IF(J10=\"\",0,(RANK(J10,$J$5:$J$15)))+COUNTIF(J$5:J10,J10)-1","v":6},{"$f":"SUMIF(Tchèque!$I$5:$I$15,Autriche!$I10,Tchèque!$L$5:$L$15)+$J10","v":44},{"$f":"IF(L10=\"\",0,(RANK(L10,$L$5:$L$15)))+COUNTIF(L$5:L10,L10)-1","v":7}]
["ZARCO Johann","AVINTIA RACING",null,"OUT",null,null,"",null,"APRILIA RACING",{"$f":"SUM($G$5:$G$7)","v":8},{"$f":"IF(J11=\"\",0,(RANK(J11,$J$5:$J$15)))+COUNTIF(J$5:J11,J11)-1","v":7},{"$f":"SUMIF(Tchèque!$I$5:$I$15,Autriche!$I11,Tchèque!$L$5:$L$15)+$J11","v":19},{"$f":"IF(L11=\"\",0,(RANK(L11,$L$5:$L$15)))+COUNTIF(L$5:L11,L11)-1","v":10}]
["RABAT Tito",null,null,"OUT",null,null,"",null,"YAMAHA PETRONAS",{"$f":"SUM($G$35:$G$37)","v":8},{"$f":"IF(J12=\"\",0,(RANK(J12,$J$5:$J$15)))+COUNTIF(J$5:J12,J12)-1","v":8},{"$f":"SUMIF(Tchèque!$I$5:$I$15,Autriche!$I12,Tchèque!$L$5:$L$15)+$J12","v":98},{"$f":"IF(L12=\"\",0,(RANK(L12,$L$5:$L$15)))+COUNTIF(L$5:L12,L12)-1","v":1}]
[null,null,null,null,null,null,"",null,"KTM TECH3",{"$f":"SUM($G$26:$G$28)","v":7},{"$f":"IF(J13=\"\",0,(RANK(J13,$J$5:$J$15)))+COUNTIF(J$5:J13,J13)-1","v":9},{"$f":"SUMIF(Tchèque!$I$5:$I$15,Autriche!$I13,Tchèque!$L$5:$L$15)+$J13","v":25},{"$f":"IF(L13=\"\",0,(RANK(L13,$L$5:$L$15)))+COUNTIF(L$5:L13,L13)-1","v":9}]
["BAGNAIA Pecco","DUCATI PRAMAC",null,"OUT",null,null,"",null,"HONDA REPSOL",{"$f":"SUM($G$17:$G$19)","v":2},{"$f":"IF(J14=\"\",0,(RANK(J14,$J$5:$J$15)))+COUNTIF(J$5:J14,J14)-1","v":10},{"$f":"SUMIF(Tchèque!$I$5:$I$15,Autriche!$I14,Tchèque!$L$5:$L$15)+$J14","v":15},{"$f":"IF(L14=\"\",0,(RANK(L14,$L$5:$L$15)))+COUNTIF(L$5:L14,L14)-1","v":11}]
["MILLER Jack",null,null,3,null,null,16,null,"AVINTIA RACING",{"$f":"SUM($G$11:$G$13)","v":0},{"$f":"IF(J15=\"\",0,(RANK(J15,$J$5:$J$15)))+COUNTIF(J$5:J15,J15)-1","v":11},{"$f":"SUMIF(Tchèque!$I$5:$I$15,Autriche!$I15,Tchèque!$L$5:$L$15)+$J15","v":35},{"$f":"IF(L15=\"\",0,(RANK(L15,$L$5:$L$15)))+COUNTIF(L$5:L15,L15)-1","v":8}]
[null,null,null,null,null,null,""]
["MARQUES Alex","HONDA REPSOL",null,14,null,null,2]
["MARQUES Marc",null,null,null,null,null,""]
["BRADL Stephan",null,null,null,null,null,""]
["CRUTCHLOW Cal","HONDA LCR",null,15,null,null,1]
["NAKAGAMI Takaaki",null,null,6,null,null,10]
[null,null,null,null,null,null,""]
["BINDER Brad","KTM FACTORY",null,4,null,null,13]
["ESPARGARO Pol",null,null,"OUT",null,null,""]
[null,null,null,null,null,null,""]
["LEKUONA Iker","KTM TECH3",null,9,null,null,7]
["OLIVEIRA Miguel",null,null,"OUT",null,null,""]
[null,null,null,null,null,null,""]
["MIR Joan","SUZUKI TEAM",null,2,null,null,20]
["RINS Alex",null,null,"OUT",null,null,""]
[null,null,null,null,null,null,""]
["ROSSI Valentino","YAMAHA FACTORY",null,5,null,null,11]
["VINALES Maverick",null,null,10,1,null,6]
[null,null,null,null,null,null,""]
["QUARTARARO Fabio","YAMAHA PETRONAS",null,8,null,null,8]
["MORBIDELLI Franco",null,null,"OUT",null,null,""]
[null,null,null,null,null,null,""]

{"sheet":"Styrie","index":8,"n_rows":37,"n_cols":13,"rows_kept":37,"cut":false,"hidden":false,"merged":[[34,1,36,1],[34,2,36,2],[0,0,1,13],[2,0,3,0],[2,1,3,1],[2,2,3,2],[2,3,3,3],[2,4,3,4],[2,5,3,5],[2,6,3,6],[2,8,2,12],[4,1,6,1],[4,2,6,2],[7,1,9,1],[7,2,9,2],[10,1,12,1],[10,2,12,2],[13,1,15,1],[13,2,15,2],[16,1,18,1],[16,2,18,2],[19,1,21,1],[19,2,21,2],[31,1,33,1],[31,2,33,2],[22,1,24,1],[22,2,24,2],[25,1,27,1],[25,2,27,2],[28,1,30,1],[28,2,30,2]]}
["SPIELBERG - 23 AOUT 2020"]
[]
["PILOTES","ECURIES","MOTOS","Finish","Pôle","Pt tour","Points",null,"CLASSEMENT"]
[null,null,null,null,null,null,null,{"$f":"IF(G4=\"\",\"\",(RANK(G4,G4:G23)))","v":""},"ÉCURIES","POINTS","RANG","TOTAL","PONCTUEL"]
["IANNONE Andrea","APRILIA RACING",null,null,null,null,{"$f":"IFERROR(CHOOSE(D5,25,20,16,13,11,10,9,8,7,6,5,4,3,2,1)+(F5=1),\"\")","v":""},null,"KTM TECH3",{"$f":"SUM($G$26:$G$28)","v":31},{"$f":"IF(J5=\"\",0,(RANK(J5,$J$5:$J$15)))+COUNTIF(J$5:J5,J5)-1","v":1},{"$f":"SUMIF(Autriche!$I$5:$I$15,Styrie!$I5,Autriche!$L$5:$L$15)+$J5","v":56},{"$f":"IF(L5=\"\",0,(RANK(L5,$L$5:$L$15)))+COUNTIF(L$5:L5,L5)-1","v":7}]
["ESPARGARO Aleix",null,null,12,null,null,{"$f":"IFERROR(CHOOSE(D6,25,20,16,13,11,10,9,8,7,6,5,4,3,2,1)+(F6=1),\"\")","v":4},null,"KTM FACTORY",{"$f":"SUM($G$23:$G$25)","v":24},{"$f":"IF(J6=\"\",0,(RANK(J6,$J$5:$J$15)))+COUNTIF(J$5:J6,J6)-1","v":2},{"$f":"SUMIF(Autriche!$I$5:$I$15,Styrie!$I6,Autriche!$L$5:$L$15)+$J6","v":84},{"$f":"IF(L6=\"\",0,(RANK(L6,$L$5:$L$15)))+COUNTIF(L$5:L6,L6)-1","v":4}]
["BRADLEY Smitth",null,null,"OUT",null,null,"",null,"SUZUKI TEAM",{"$f":"SUM($G$29:$G$31)","v":23},{"$f":"IF(J7=\"\",0,(RANK(J7,$J$5:$J$15)))+COUNTIF(J$5:J7,J7)-1","v":3},{"$f":"SUMIF(Autriche!$I$5:$I$15,Styrie!$I7,Autriche!$L$5:$L$15)+$J7","v":73},{"$f":"IF(L7=\"\",0,(RANK(L7,$L$5:$L$15)))+COUNTIF(L$5:L7,L7)-1","v":5}]
["PETRUCCI Danielo","DUCATI TEAM",null,11,null,null,5,null,"DUCATI PRAMAC",{"$f":"SUM($G$14:$G$16)","v":20},{"$f":"IF(J8=\"\",0,(RANK(J8,$J$5:$J$15)))+COUNTIF(J$5:J8,J8)-1","v":4},{"$f":"SUMIF(Autriche!$I$5:$I$15,Styrie!$I8,Autriche!$L$5:$L$15)+$J8","v":65},{"$f":"IF(L8=\"\",0,(RANK(L8,$L$5:$L$15)))+COUNTIF(L$5:L8,L8)-1","v":6}]
["DEVIZIOSO Andrea",null,null,5,null,null,11,null,"DUCATI TEAM",{"$f":"SUM($G$8:$G$10)","v":16},{"$f":"IF(J9=\"\",0,(RANK(J9,$J$5:$J$15)))+COUNTIF(J$5:J9,J9)-1","v":5},{"$f":"SUMIF(Autriche!$I$5:$I$15,Styrie!$I9,Autriche!$L$5:$L$15)+$J9","v":96},{"$f":"IF(L9=\"\",0,(RANK(L9,$L$5:$L$15)))+COUNTIF(L$5:L9,L9)-1","v":2}]
["PIRRO Michele",null,null,null,null,null,"",null,"HONDA LCR",{"$f":"SUM($G$20:$G$22)","v":9},{"$f":"IF(J10=\"\",0,(RANK(J10,$J$5:$J$15)))+COUNTIF(J$5:J10,J10)-1","v":6},{"$f":"SUMIF(Autriche!$I$5:$I$15,Styrie!$I10,Autriche!$L$5:$L$15)+$J10","v":53},{"$f":"IF(L10=\"\",0,(RANK(L10,$L$5:$L$15)))+COUNTIF(L$5:L10,L10)-1","v":8}]
["ZARCO Johann","AVINTIA RACING",null,14,null,null,2,null,"YAMAHA FACTORY",{"$f":"SUM($G$32:$G$34)","v":7},{"$f":"IF(J11=\"\",0,(RANK(J11,$J$5:$J$15)))+COUNTIF(J$5:J11,J11)-1","v":7},{"$f":"SUMIF(Autriche!$I$5:$I$15,Styrie!$I11,Autriche!$L$5:$L$15)+$J11","v":93},{"$f":"IF(L11=\"\",0,(RANK(L11,$L$5:$L$15)))+COUNTIF(L$5:L11,L11)-1","v":3}]
["RABAT Tito",null,null,"OUT",null,null,"",null,"APRILIA RACING",{"$f":"SUM($G$5:$G$7)","v":4},{"$f":"IF(J12=\"\",0,(RANK(J12,$J$5:$J$15)))+COUNTIF(J$5:J12,J12)-1","v":8},{"$f":"SUMIF(Autriche!$I$5:$I$15,Styrie!$I12,Autriche!$L$5:$L$15)+$J12","v":23},{"$f":"IF(L12=\"\",0,(RANK(L12,$L$5:$L$15)))+COUNTIF(L$5:L12,L12)-1","v":10}]
[null,null,null,null,null,null,"",null,"YAMAHA PETRONAS",{"$f":"SUM($G$35:$G$37)","v":4},{"$f":"IF(J13=\"\",0,(RANK(J13,$J$5:$J$15)))+COUNTIF(J$5:J13,J13)-1","v":9},{"$f":"SUMIF(Autriche!$I$5:$I$15,Styrie!$I13,Autriche!$L$5:$L$15)+$J13","v":102},{"$f":"IF(L13=\"\",0,(RANK(L13,$L$5:$L$15)))+COUNTIF(L$5:L13,L13)-1","v":1}]
["BAGNAIA Pecco","DUCATI PRAMAC",null,"OUT",null,null,"",null,"AVINTIA RACING",{"$f":"SUM($G$11:$G$13)","v":2},{"$f":"IF(J14=\"\",0,(RANK(J14,$J$5:$J$15)))+COUNTIF(J$5:J14,J14)-1","v":10},{"$f":"SUMIF(Autriche!$I$5:$I$15,Styrie!$I14,Autriche!$L$5:$L$15)+$J14","v":37},{"$f":"IF(L14=\"\",0,(RANK(L14,$L$5:$L$15)))+COUNTIF(L$5:L14,L14)-1","v":9}]
["MILLER Jack",null,null,2,null,null,20,null,"HONDA REPSOL",{"$f":"SUM($G$17:$G$19)","v":0},{"$f":"IF(J15=\"\",0,(RANK(J15,$J$5:$J$15)))+COUNTIF(J$5:J15,J15)-1","v":11},{"$f":"SUMIF(Autriche!$I$5:$I$15,Styrie!$I15,Autriche!$L$5:$L$15)+$J15","v":15},{"$f":"IF(L15=\"\",0,(RANK(L15,$L$5:$L$15)))+COUNTIF(L$5:L15,L15)-1","v":11}]
[null,null,null,null,null,null,""]
["MARQUES Alex","HONDA REPSOL",null,"OUT",null,null,""]
["MARQUES Marc",null,null,null,null,null,""]
["BRADL Stephan",null,null,null,null,null,""]
["CRUTCHLOW Cal","HONDA LCR",null,"OUT",null,null,""]
["NAKAGAMI Takaaki",null,null,7,null,null,9]
[null,null,null,null,null,null,""]
["BINDER Brad","KTM FACTORY",null,8,null,null,8]
["ESPARGARO Pol",null,null,3,1,null,16]
[null,null,null,null,null,null,""]
["LEKUONA Iker","KTM TECH3",null,10,null,null,6]
["OLIVEIRA Miguel",null,null,1,null,null,25]
[null,null,null,null,null,null,""]
["MIR Joan","SUZUKI TEAM",null,4,null,null,13]
["RINS Alex",null,null,6,null,null,10]
[null,null,null,null,null,null,""]
["ROSSI Valentino","YAMAHA FACTORY",null,9,null,null,7]
["VINALES Maverick",null,null,"OUT",null,null,""]
[null,null,null,null,null,null,""]
["QUARTARARO Fabio","YAMAHA PETRONAS",null,13,null,null,3]
["MORBIDELLI Franco",null,null,15,null,null,1]
[null,null,null,"OUT",null,null,""]

{"sheet":"Saint-Marin","index":9,"n_rows":37,"n_cols":13,"rows_kept":37,"cut":false,"hidden":false,"merged":[[34,1,36,1],[34,2,36,2],[31,1,33,1],[31,2,33,2],[2,0,3,0],[22,1,24,1],[22,2,24,2],[25,1,27,1],[25,2,27,2],[28,1,30,1],[28,2,30,2],[13,1,15,1],[13,2,15,2],[16,1,18,1],[16,2,18,2],[19,1,21,1],[19,2,21,2],[4,1,6,1],[0,0,1,13],[2,1,3,1],[2,2,3,2],[2,3,3,3],[2,4,3,4],[2,5,3,5],[2,6,3,6],[4,2,6,2],[7,1,9,1],[7,2,9,2],[10,1,12,1],[10,2,12,2],[2,8,2,12]]}
["MISANO- 13 SEPTEMBRE 2020"]
[]
["PILOTES","ECURIES","MOTOS","Finish","Pôle","Pt tour","Points",null,"CLASSEMENT"]
[null,null,null,null,null,null,null,{"$f":"IF(G4=\"\",\"\",(RANK(G4,G4:G23)))","v":""},"ÉCURIES","POINTS","RANG","TOTAL","PONCTUEL"]
["IANNONE Andrea","APRILIA RACING",null,null,null,null,{"$f":"IFERROR(CHOOSE(D5,25,20,16,13,11,10,9,8,7,6,5,4,3,2,1)+(F5=1),\"\")","v":""},null,"DUCATI PRAMAC",{"$f":"SUM($G$14:$G$16)","v":28},{"$f":"IF(J5=\"\",0,(RANK(J5,$J$5:$J$15)))+COUNTIF(J$5:J5,J5)-1","v":1},{"$f":"SUMIF(Styrie!$I$5:$I$15,'Saint-Marin'!$I5,Styrie!$L$5:$L$15)+$J5","v":93},{"$f":"IF(L5=\"\",0,(RANK(L5,$L$5:$L$15)))+COUNTIF(L$5:L5,L5)-1","v":6}]
["ESPARGARO Aleix",null,null,13,null,null,{"$f":"IFERROR(CHOOSE(D6,25,20,16,13,11,10,9,8,7,6,5,4,3,2,1)+(F6=1),\"\")","v":3},null,"SUZUKI TEAM",{"$f":"SUM($G$29:$G$31)","v":27},{"$f":"IF(J6=\"\",0,(RANK(J6,$J$5:$J$15)))+COUNTIF(J$5:J6,J6)-1","v":2},{"$f":"SUMIF(Styrie!$I$5:$I$15,'Saint-Marin'!$I6,Styrie!$L$5:$L$15)+$J6","v":100},{"$f":"IF(L6=\"\",0,(RANK(L6,$L$5:$L$15)))+COUNTIF(L$5:L6,L6)-1","v":4}]
["BRADLEY Smitth",null,null,"OUT",null,null,"",null,"YAMAHA PETRONAS",{"$f":"SUM($G$35:$G$37)","v":25},{"$f":"IF(J7=\"\",0,(RANK(J7,$J$5:$J$15)))+COUNTIF(J$5:J7,J7)-1","v":3},{"$f":"SUMIF(Styrie!$I$5:$I$15,'Saint-Marin'!$I7,Styrie!$L$5:$L$15)+$J7","v":127},{"$f":"IF(L7=\"\",0,(RANK(L7,$L$5:$L$15)))+COUNTIF(L$5:L7,L7)-1","v":1}]
["PETRUCCI Danielo","DUCATI TEAM",null,"OUT",null,null,"",null,"YAMAHA FACTORY",{"$f":"SUM($G$32:$G$34)","v":23},{"$f":"IF(J8=\"\",0,(RANK(J8,$J$5:$J$15)))+COUNTIF(J$5:J8,J8)-1","v":4},{"$f":"SUMIF(Styrie!$I$5:$I$15,'Saint-Marin'!$I8,Styrie!$L$5:$L$15)+$J8","v":116},{"$f":"IF(L8=\"\",0,(RANK(L8,$L$5:$L$15)))+COUNTIF(L$5:L8,L8)-1","v":2}]
["DEVIZIOSO Andrea",null,null,7,null,null,9,null,"KTM FACTORY",{"$f":"SUM($G$23:$G$25)","v":10},{"$f":"IF(J9=\"\",0,(RANK(J9,$J$5:$J$15)))+COUNTIF(J$5:J9,J9)-1","v":5},{"$f":"SUMIF(Styrie!$I$5:$I$15,'Saint-Marin'!$I9,Styrie!$L$5:$L$15)+$J9","v":94},{"$f":"IF(L9=\"\",0,(RANK(L9,$L$5:$L$15)))+COUNTIF(L$5:L9,L9)-1","v":5}]
["PIRRO Michele",null,null,null,null,null,"",null,"DUCATI TEAM",{"$f":"SUM($G$8:$G$10)","v":9},{"$f":"IF(J10=\"\",0,(RANK(J10,$J$5:$J$15)))+COUNTIF(J$5:J10,J10)-1","v":6},{"$f":"SUMIF(Styrie!$I$5:$I$15,'Saint-Marin'!$I10,Styrie!$L$5:$L$15)+$J10","v":105},{"$f":"IF(L10=\"\",0,(RANK(L10,$L$5:$L$15)))+COUNTIF(L$5:L10,L10)-1","v":3}]
["ZARCO Johann","AVINTIA RACING",null,15,null,null,1,null,"HONDA LCR",{"$f":"SUM($G$20:$G$22)","v":7},{"$f":"IF(J11=\"\",0,(RANK(J11,$J$5:$J$15)))+COUNTIF(J$5:J11,J11)-1","v":7},{"$f":"SUMIF(Styrie!$I$5:$I$15,'Saint-Marin'!$I11,Styrie!$L$5:$L$15)+$J11","v":60},{"$f":"IF(L11=\"\",0,(RANK(L11,$L$5:$L$15)))+COUNTIF(L$5:L11,L11)-1","v":8}]
["RABAT Tito",null,null,"OUT",null,null,"",null,"KTM TECH3",{"$f":"SUM($G$20:$G$22)","v":7},{"$f":"IF(J12=\"\",0,(RANK(J12,$J$5:$J$15)))+COUNTIF(J$5:J12,J12)-1","v":8},{"$f":"SUMIF(Styrie!$I$5:$I$15,'Saint-Marin'!$I12,Styrie!$L$5:$L$15)+$J12","v":63},{"$f":"IF(L12=\"\",0,(RANK(L12,$L$5:$L$15)))+COUNTIF(L$5:L12,L12)-1","v":7}]
[null,null,null,null,null,null,"",null,"APRILIA RACING",{"$f":"SUM($G$5:$G$7)","v":3},{"$f":"IF(J13=\"\",0,(RANK(J13,$J$5:$J$15)))+COUNTIF(J$5:J13,J13)-1","v":9},{"$f":"SUMIF(Styrie!$I$5:$I$15,'Saint-Marin'!$I13,Styrie!$L$5:$L$15)+$J13","v":26},{"$f":"IF(L13=\"\",0,(RANK(L13,$L$5:$L$15)))+COUNTIF(L$5:L13,L13)-1","v":10}]
["BAGNAIA Pecco","DUCATI PRAMAC",null,2,null,null,20,null,"AVINTIA RACING",{"$f":"SUM($G$11:$G$13)","v":1},{"$f":"IF(J14=\"\",0,(RANK(J14,$J$5:$J$15)))+COUNTIF(J$5:J14,J14)-1","v":10},{"$f":"SUMIF(Styrie!$I$5:$I$15,'Saint-Marin'!$I14,Styrie!$L$5:$L$15)+$J14","v":38},{"$f":"IF(L14=\"\",0,(RANK(L14,$L$5:$L$15)))+COUNTIF(L$5:L14,L14)-1","v":9}]
["MILLER Jack",null,null,8,null,null,8,null,"HONDA REPSOL",{"$f":"SUM($G$17:$G$19)","v":0},{"$f":"IF(J15=\"\",0,(RANK(J15,$J$5:$J$15)))+COUNTIF(J$5:J15,J15)-1","v":11},{"$f":"SUMIF(Styrie!$I$5:$I$15,'Saint-Marin'!$I15,Styrie!$L$5:$L$15)+$J15","v":15},{"$f":"IF(L15=\"\",0,(RANK(L15,$L$5:$L$15)))+COUNTIF(L$5:L15,L15)-1","v":11}]
[null,null,null,null,null,null,""]
["MARQUES Alex","HONDA REPSOL",null,"OUT",null,null,""]
["MARQUES Marc",null,null,null,null,null,""]
["BRADL Stephan",null,null,null,null,null,""]
["CRUTCHLOW Cal","HONDA LCR",null,"OUT",null,null,""]
["NAKAGAMI Takaaki",null,null,9,null,null,7]
[null,null,null,null,null,null,""]
["BINDER Brad","KTM FACTORY",null,12,null,null,4]
["ESPARGARO Pol",null,null,10,null,null,6]
[null,null,null,null,null,null,""]
["LEKUONA Iker","KTM TECH3",null,14,null,null,2]
["OLIVEIRA Miguel",null,null,11,null,null,5]
[null,null,null,null,null,null,""]
["MIR Joan","SUZUKI TEAM",null,3,null,null,16]
["RINS Alex",null,null,5,null,null,11]
[null,null,null,null,null,null,""]
["ROSSI Valentino","YAMAHA FACTORY",null,4,null,null,13]
["VINALES Maverick",null,null,6,1,null,10]
[null,null,null,null,null,null,""]
["QUARTARARO Fabio","YAMAHA PETRONAS",null,"OUT",null,null,""]
["MORBIDELLI Franco",null,null,1,null,null,25]
[null,null,null,null,null,null,""]

{"sheet":"Emilie-Romagne","index":10,"n_rows":37,"n_cols":13,"rows_kept":37,"cut":false,"hidden":false,"merged":[[34,1,36,1],[34,2,36,2],[0,0,1,13],[2,0,3,0],[2,1,3,1],[2,2,3,2],[2,3,3,3],[2,4,3,4],[2,5,3,5],[2,6,3,6],[2,8,2,12],[4,1,6,1],[4,2,6,2],[7,1,9,1],[7,2,9,2],[10,1,12,1],[10,2,12,2],[13,1,15,1],[13,2,15,2],[16,1,18,1],[16,2,18,2],[19,1,21,1],[19,2,21,2],[31,1,33,1],[31,2,33,2],[22,1,24,1],[22,2,24,2],[25,1,27,1],[25,2,27,2],[28,1,30,1],[28,2,30,2]]}
["MISANO - 20 SEPTEMBRE 2020"]
[]
["PILOTES","ECURIES","MOTOS","Finish","Pôle","Pt tour","Points",null,"CLASSEMENT"]
[null,null,null,null,null,null,null,{"$f":"IF(G4=\"\",\"\",(RANK(G4,G4:G23)))","v":""},"ÉCURIES","POINTS","RANG","TOTAL","PONCTUEL"]
["IANNONE Andrea","APRILIA RACING",null,null,null,null,{"$f":"IFERROR(CHOOSE(D5,25,20,16,13,11,10,9,8,7,6,5,4,3,2,1)+(F5=1),\"\")","v":""},null,"YAMAHA FACTORY",{"$f":"SUM($G$32:$G$34)","v":25},{"$f":"IF(J5=\"\",0,(RANK(J5,$J$5:$J$15)))+COUNTIF(J$5:J5,J5)-1","v":1},{"$f":"SUMIF('Saint-Marin'!$I$5:$I$15,'Emilie-Romagne'!$I5,'Saint-Marin'!$L$5:$L$15)+$J5","v":141},{"$f":"IF(L5=\"\",0,(RANK(L5,$L$5:$L$15)))+COUNTIF(L$5:L5,L5)-1","v":2}]
["ESPARGARO Aleix",null,null,"OUT",null,null,{"$f":"IFERROR(CHOOSE(D6,25,20,16,13,11,10,9,8,7,6,5,4,3,2,1)+(F6=1),\"\")","v":""},null,"SUZUKI TEAM",{"$f":"SUM($G$29:$G$31)","v":24},{"$f":"IF(J6=\"\",0,(RANK(J6,$J$5:$J$15)))+COUNTIF(J$5:J6,J6)-1","v":2},{"$f":"SUMIF('Saint-Marin'!$I$5:$I$15,'Emilie-Romagne'!$I6,'Saint-Marin'!$L$5:$L$15)+$J6","v":124},{"$f":"IF(L6=\"\",0,(RANK(L6,$L$5:$L$15)))+COUNTIF(L$5:L6,L6)-1","v":3}]
["BRADLEY Smitth",null,null,13,null,null,3,null,"YAMAHA PETRONAS",{"$f":"SUM($G$35:$G$37)","v":20},{"$f":"IF(J7=\"\",0,(RANK(J7,$J$5:$J$15)))+COUNTIF(J$5:J7,J7)-1","v":3},{"$f":"SUMIF('Saint-Marin'!$I$5:$I$15,'Emilie-Romagne'!$I7,'Saint-Marin'!$L$5:$L$15)+$J7","v":147},{"$f":"IF(L7=\"\",0,(RANK(L7,$L$5:$L$15)))+COUNTIF(L$5:L7,L7)-1","v":1}]
["PETRUCCI Danielo","DUCATI TEAM",null,10,null,null,6,null,"KTM FACTORY",{"$f":"SUM($G$23:$G$25)","v":16},{"$f":"IF(J8=\"\",0,(RANK(J8,$J$5:$J$15)))+COUNTIF(J$5:J8,J8)-1","v":4},{"$f":"SUMIF('Saint-Marin'!$I$5:$I$15,'Emilie-Romagne'!$I8,'Saint-Marin'!$L$5:$L$15)+$J8","v":110},{"$f":"IF(L8=\"\",0,(RANK(L8,$L$5:$L$15)))+COUNTIF(L$5:L8,L8)-1","v":5}]
["DEVIZIOSO Andrea",null,null,8,null,null,8,null,"DUCATI TEAM",{"$f":"SUM($G$8:$G$10)","v":14},{"$f":"IF(J9=\"\",0,(RANK(J9,$J$5:$J$15)))+COUNTIF(J$5:J9,J9)-1","v":5},{"$f":"SUMIF('Saint-Marin'!$I$5:$I$15,'Emilie-Romagne'!$I9,'Saint-Marin'!$L$5:$L$15)+$J9","v":119},{"$f":"IF(L9=\"\",0,(RANK(L9,$L$5:$L$15)))+COUNTIF(L$5:L9,L9)-1","v":4}]
["PIRRO Michele",null,null,null,null,null,"",null,"KTM TECH3",{"$f":"SUM($G$26:$G$28)","v":11},{"$f":"IF(J10=\"\",0,(RANK(J10,$J$5:$J$15)))+COUNTIF(J$5:J10,J10)-1","v":6},{"$f":"SUMIF('Saint-Marin'!$I$5:$I$15,'Emilie-Romagne'!$I10,'Saint-Marin'!$L$5:$L$15)+$J10","v":74},{"$f":"IF(L10=\"\",0,(RANK(L10,$L$5:$L$15)))+COUNTIF(L$5:L10,L10)-1","v":7}]
["ZARCO Johann","AVINTIA RACING",null,11,null,null,5,null,"HONDA LCR",{"$f":"SUM($G$20:$G$22)","v":10},{"$f":"IF(J11=\"\",0,(RANK(J11,$J$5:$J$15)))+COUNTIF(J$5:J11,J11)-1","v":7},{"$f":"SUMIF('Saint-Marin'!$I$5:$I$15,'Emilie-Romagne'!$I11,'Saint-Marin'!$L$5:$L$15)+$J11","v":70},{"$f":"IF(L11=\"\",0,(RANK(L11,$L$5:$L$15)))+COUNTIF(L$5:L11,L11)-1","v":8}]
["RABAT Tito",null,null,"OUT",null,null,"",null,"HONDA REPSOL",{"$f":"SUM($G$17:$G$19)","v":9},{"$f":"IF(J12=\"\",0,(RANK(J12,$J$5:$J$15)))+COUNTIF(J$5:J12,J12)-1","v":8},{"$f":"SUMIF('Saint-Marin'!$I$5:$I$15,'Emilie-Romagne'!$I12,'Saint-Marin'!$L$5:$L$15)+$J12","v":24},{"$f":"IF(L12=\"\",0,(RANK(L12,$L$5:$L$15)))+COUNTIF(L$5:L12,L12)-1","v":11}]
[null,null,null,null,null,null,"",null,"AVINTIA RACING",{"$f":"SUM($G$11:$G$13)","v":5},{"$f":"IF(J13=\"\",0,(RANK(J13,$J$5:$J$15)))+COUNTIF(J$5:J13,J13)-1","v":9},{"$f":"SUMIF('Saint-Marin'!$I$5:$I$15,'Emilie-Romagne'!$I13,'Saint-Marin'!$L$5:$L$15)+$J13","v":43},{"$f":"IF(L13=\"\",0,(RANK(L13,$L$5:$L$15)))+COUNTIF(L$5:L13,L13)-1","v":9}]
["BAGNAIA Pecco","DUCATI PRAMAC",null,"OUT",null,null,"",null,"APRILIA RACING",{"$f":"SUM($G$5:$G$7)","v":3},{"$f":"IF(J14=\"\",0,(RANK(J14,$J$5:$J$15)))+COUNTIF(J$5:J14,J14)-1","v":10},{"$f":"SUMIF('Saint-Marin'!$I$5:$I$15,'Emilie-Romagne'!$I14,'Saint-Marin'!$L$5:$L$15)+$J14","v":29},{"$f":"IF(L14=\"\",0,(RANK(L14,$L$5:$L$15)))+COUNTIF(L$5:L14,L14)-1","v":10}]
["MILLER Jack",null,null,"OUT",null,null,"",null,"DUCATI PRAMAC",{"$f":"SUM($G$14:$G$16)","v":0},{"$f":"IF(J15=\"\",0,(RANK(J15,$J$5:$J$15)))+COUNTIF(J$5:J15,J15)-1","v":11},{"$f":"SUMIF('Saint-Marin'!$I$5:$I$15,'Emilie-Romagne'!$I15,'Saint-Marin'!$L$5:$L$15)+$J15","v":93},{"$f":"IF(L15=\"\",0,(RANK(L15,$L$5:$L$15)))+COUNTIF(L$5:L15,L15)-1","v":6}]
[null,null,null,null,null,null,""]
["MARQUES Alex","HONDA REPSOL",null,7,null,null,9]
["MARQUES Marc",null,null,null,null,null,""]
["BRADL Stephan",null,null,null,null,null,""]
["CRUTCHLOW Cal","HONDA LCR",null,"OUT",null,null,""]
["NAKAGAMI Takaaki",null,null,6,null,null,10]
[null,null,null,null,null,null,""]
["BINDER Brad","KTM FACTORY",null,"OUT",null,null,""]
["ESPARGARO Pol",null,null,3,null,null,16]
[null,null,null,null,null,null,""]
["LEKUONA Iker","KTM TECH3",null,"OUT",null,null,""]
["OLIVEIRA Miguel",null,null,5,null,null,11]
[null,null,null,null,null,null,""]
["MIR Joan","SUZUKI TEAM",null,2,null,null,20]
["RINS Alex",null,null,12,null,null,4]
[null,null,null,null,null,null,""]
["ROSSI Valentino","YAMAHA FACTORY",null,"OUT",null,null,""]
["VINALES Maverick",null,null,1,1,null,25]
[null,null,null,null,null,null,""]
["QUARTARARO Fabio","YAMAHA PETRONAS",null,4,null,null,13]
["MORBIDELLI Franco",null,null,9,null,null,7]
[null,null,null,null,null,null,""]

{"sheet":"Catalogne","index":11,"n_rows":37,"n_cols":13,"rows_kept":37,"cut":false,"hidden":false,"merged":[[34,1,36,1],[34,2,36,2],[31,1,33,1],[31,2,33,2],[22,1,24,1],[22,2,24,2],[25,1,27,1],[25,2,27,2],[28,1,30,1],[28,2,30,2],[13,1,15,1],[13,2,15,2],[16,1,18,1],[16,2,18,2],[19,1,21,1],[19,2,21,2],[2,8,2,12],[0,0,1,13],[2,1,3,1],[2,2,3,2],[2,3,3,3],[2,5,3,5],[2,6,3,6],[2,4,3,4],[2,0,3,0],[4,1,6,1],[4,2,6,2],[7,1,9,1],[7,2,9,2],[10,1,12,1],[10,2,12,2]]}
["BARCELONE - 28 SEPTEMBRE 2020"]
[]
["PILOTES","ECURIES","MOTOS","Finish","Pôle","Pt tour","Points",null,"CLASSEMENT"]
[null,null,null,null,null,null,null,{"$f":"IF(G4=\"\",\"\",(RANK(G4,G4:G23)))","v":""},"ÉCURIES","POINTS","RANG","TOTAL","PONCTUEL"]
["IANNONE Andrea","APRILIA RACING",null,null,null,null,{"$f":"IFERROR(CHOOSE(D5,25,20,16,13,11,10,9,8,7,6,5,4,3,2,1)+(F5=1),\"\")","v":""},null,"YAMAHA PETRONAS",{"$f":"SUM($G$35:$G$37)","v":38},{"$f":"IF(J5=\"\",0,(RANK(J5,$J$5:$J$15)))+COUNTIF(J$5:J5,J5)-1","v":1},{"$f":"SUMIF('Emilie-Romagne'!$I$5:$I$15,Catalogne!$I5,'Emilie-Romagne'!$L$5:$L$15)+$J5","v":185},{"$f":"IF(L5=\"\",0,(RANK(L5,$L$5:$L$15)))+COUNTIF(L$5:L5,L5)-1","v":1}]
["ESPARGARO Aleix",null,null,12,null,null,{"$f":"IFERROR(CHOOSE(D6,25,20,16,13,11,10,9,8,7,6,5,4,3,2,1)+(F6=1),\"\")","v":4},null,"SUZUKI TEAM",{"$f":"SUM($G$29:$G$31)","v":36},{"$f":"IF(J6=\"\",0,(RANK(J6,$J$5:$J$15)))+COUNTIF(J$5:J6,J6)-1","v":2},{"$f":"SUMIF('Emilie-Romagne'!$I$5:$I$15,Catalogne!$I6,'Emilie-Romagne'!$L$5:$L$15)+$J6","v":160},{"$f":"IF(L6=\"\",0,(RANK(L6,$L$5:$L$15)))+COUNTIF(L$5:L6,L6)-1","v":2}]
["BRADLEY Smitth",null,null,"OUT",null,null,"",null,"DUCATI PRAMAC",{"$f":"SUM($G$14:$G$16)","v":21},{"$f":"IF(J7=\"\",0,(RANK(J7,$J$5:$J$15)))+COUNTIF(J$5:J7,J7)-1","v":3},{"$f":"SUMIF('Emilie-Romagne'!$I$5:$I$15,Catalogne!$I7,'Emilie-Romagne'!$L$5:$L$15)+$J7","v":114},{"$f":"IF(L7=\"\",0,(RANK(L7,$L$5:$L$15)))+COUNTIF(L$5:L7,L7)-1","v":6}]
["PETRUCCI Danielo","DUCATI TEAM",null,8,null,null,8,null,"HONDA LCR",{"$f":"SUM($G$20:$G$22)","v":15},{"$f":"IF(J8=\"\",0,(RANK(J8,$J$5:$J$15)))+COUNTIF(J$5:J8,J8)-1","v":4},{"$f":"SUMIF('Emilie-Romagne'!$I$5:$I$15,Catalogne!$I8,'Emilie-Romagne'!$L$5:$L$15)+$J8","v":85},{"$f":"IF(L8=\"\",0,(RANK(L8,$L$5:$L$15)))+COUNTIF(L$5:L8,L8)-1","v":7}]
["DEVIZIOSO Andrea",null,null,"OUT",null,null,"",null,"DUCATI TEAM",{"$f":"SUM($G$8:$G$10)","v":8},{"$f":"IF(J9=\"\",0,(RANK(J9,$J$5:$J$15)))+COUNTIF(J$5:J9,J9)-1","v":5},{"$f":"SUMIF('Emilie-Romagne'!$I$5:$I$15,Catalogne!$I9,'Emilie-Romagne'!$L$5:$L$15)+$J9","v":127},{"$f":"IF(L9=\"\",0,(RANK(L9,$L$5:$L$15)))+COUNTIF(L$5:L9,L9)-1","v":4}]
["PIRRO Michele",null,null,null,null,null,"",null,"YAMAHA FACTORY",{"$f":"SUM($G$32:$G$34)","v":7},{"$f":"IF(J10=\"\",0,(RANK(J10,$J$5:$J$15)))+COUNTIF(J$5:J10,J10)-1","v":6},{"$f":"SUMIF('Emilie-Romagne'!$I$5:$I$15,Catalogne!$I10,'Emilie-Romagne'!$L$5:$L$15)+$J10","v":148},{"$f":"IF(L10=\"\",0,(RANK(L10,$L$5:$L$15)))+COUNTIF(L$5:L10,L10)-1","v":3}]
["ZARCO Johann","AVINTA RACING",null,"OUT",null,null,"",null,"KTM FACTORY",{"$f":"SUM($G$23:$G$25)","v":5},{"$f":"IF(J11=\"\",0,(RANK(J11,$J$5:$J$15)))+COUNTIF(J$5:J11,J11)-1","v":7},{"$f":"SUMIF('Emilie-Romagne'!$I$5:$I$15,Catalogne!$I11,'Emilie-Romagne'!$L$5:$L$15)+$J11","v":115},{"$f":"IF(L11=\"\",0,(RANK(L11,$L$5:$L$15)))+COUNTIF(L$5:L11,L11)-1","v":5}]
["RABAT Tito",null,null,15,null,null,1,null,"APRILIA RACING",{"$f":"SUM($G$5:$G$7)","v":4},{"$f":"IF(J12=\"\",0,(RANK(J12,$J$5:$J$15)))+COUNTIF(J$5:J12,J12)-1","v":8},{"$f":"SUMIF('Emilie-Romagne'!$I$5:$I$15,Catalogne!$I12,'Emilie-Romagne'!$L$5:$L$15)+$J12","v":33},{"$f":"IF(L12=\"\",0,(RANK(L12,$L$5:$L$15)))+COUNTIF(L$5:L12,L12)-1","v":10}]
[null,null,null,null,null,null,"",null,"HONDA REPSOL",{"$f":"SUM($G$17:$G$19)","v":3},{"$f":"IF(J13=\"\",0,(RANK(J13,$J$5:$J$15)))+COUNTIF(J$5:J13,J13)-1","v":9},{"$f":"SUMIF('Emilie-Romagne'!$I$5:$I$15,Catalogne!$I13,'Emilie-Romagne'!$L$5:$L$15)+$J13","v":27},{"$f":"IF(L13=\"\",0,(RANK(L13,$L$5:$L$15)))+COUNTIF(L$5:L13,L13)-1","v":11}]
["BAGNAIA Pecco","DUCATI PRAMAC",null,6,null,null,10,null,"KTM TECH3",{"$f":"SUM($G$26:$G$28)","v":2},{"$f":"IF(J14=\"\",0,(RANK(J14,$J$5:$J$15)))+COUNTIF(J$5:J14,J14)-1","v":10},{"$f":"SUMIF('Emilie-Romagne'!$I$5:$I$15,Catalogne!$I14,'Emilie-Romagne'!$L$5:$L$15)+$J14","v":76},{"$f":"IF(L14=\"\",0,(RANK(L14,$L$5:$L$15)))+COUNTIF(L$5:L14,L14)-1","v":8}]
["MILLER Jack",null,null,5,null,null,11,null,"AVINTIA RACING",{"$f":"SUM($G$11:$G$13)","v":1},{"$f":"IF(J15=\"\",0,(RANK(J15,$J$5:$J$15)))+COUNTIF(J$5:J15,J15)-1","v":11},{"$f":"SUMIF('Emilie-Romagne'!$I$5:$I$15,Catalogne!$I15,'Emilie-Romagne'!$L$5:$L$15)+$J15","v":44},{"$f":"IF(L15=\"\",0,(RANK(L15,$L$5:$L$15)))+COUNTIF(L$5:L15,L15)-1","v":9}]
[null,null,null,null,null,null,""]
["MARQUES Alex","HONDA REPSOL",null,13,null,null,3]
["MARQUES Marc",null,null,null,null,null,""]
["BRADL Stephan",null,null,null,null,null,""]
["CRUTCHLOW Cal","HONDA LCR",null,10,null,null,6]
["NAKAGAMI Takaaki",null,null,7,null,null,9]
[null,null,null,null,null,null,""]
["BINDER Brad","KTM FACTORY",null,11,null,null,5]
["ESPARGARO Pol",null,null,"OUT",null,null,""]
[null,null,null,null,null,null,""]
["LEKUONA Iker","KTM TECH3",null,14,null,null,2]
["OLIVEIRA Miguel",null,null,null,null,null,""]
[null,null,null,null,null,null,""]
["MIR Joan","SUZUKI TEAM",null,2,null,null,20]
["RINS Alex",null,null,3,null,null,16]
[null,null,null,null,null,null,""]
["ROSSI Valentino","YAMAHA FACTORY",null,"OUT",null,null,""]
["VINALES Maverick",null,null,9,null,null,7]
[null,null,null,null,null,null,""]
["QUARTARARO Fabio","YAMAHA PETRONAS",null,1,null,null,25]
["MORBIDELLI Franco",null,null,4,1,null,13]
[null,null,null,null,null,null,""]

{"sheet":"France","index":12,"n_rows":37,"n_cols":13,"rows_kept":37,"cut":false,"hidden":false,"merged":[[34,1,36,1],[34,2,36,2],[31,1,33,1],[31,2,33,2],[22,1,24,1],[22,2,24,2],[25,1,27,1],[25,2,27,2],[28,1,30,1],[28,2,30,2],[13,1,15,1],[13,2,15,2],[16,1,18,1],[16,2,18,2],[19,1,21,1],[19,2,21,2],[4,1,6,1],[4,2,6,2],[7,1,9,1],[7,2,9,2],[10,1,12,1],[10,2,12,2],[0,0,1,13],[2,1,3,1],[2,2,3,2],[2,3,3,3],[2,5,3,5],[2,6,3,6],[2,4,3,4],[2,0,3,0],[2,8,2,12]]}
["BUGATTI - 11 OCTOBRE 2020"]
[]
["PILOTES","ECURIES","MOTOS","Finish","Pôle","Pt tour","Points",null,"CLASSEMENT"]
[null,null,null,null,null,null,null,{"$f":"IF(G4=\"\",\"\",(RANK(G4,G4:G23)))","v":""},"ÉCURIES","POINTS","RANG","TOTAL","PONCTUEL"]
["IANNONE Andrea","APRILIA RACING",null,null,null,null,{"$f":"IFERROR(CHOOSE(D5,25,20,16,13,11,10,9,8,7,6,5,4,3,2,1)+(F5=1),\"\")","v":""},null,"DUCATI TEAM",{"$f":"SUM($G$8:$G$10)","v":38},{"$f":"IF(J5=\"\",0,(RANK(J5,$J$5:$J$15)))+COUNTIF(J$5:J5,J5)-1","v":1},{"$f":"SUMIF(Catalogne!$I$5:$I$15,France!$I5,Catalogne!$L$5:$L$14)+$J5","v":165},{"$f":"IF(L5=\"\",0,(RANK(L5,$L$5:$L$15)))+COUNTIF(L$5:L5,L5)-1","v":2}]
["ESPARGARO Aleix",null,null,14,null,null,{"$f":"IFERROR(CHOOSE(D6,25,20,16,13,11,10,9,8,7,6,5,4,3,2,1)+(F6=1),\"\")","v":2},null,"HONDA REPSOL",{"$f":"SUM($G$17:$G$19)","v":28},{"$f":"IF(J6=\"\",0,(RANK(J6,$J$5:$J$15)))+COUNTIF(J$5:J6,J6)-1","v":2},{"$f":"SUMIF(Catalogne!$I$5:$I$15,France!$I6,Catalogne!$L$5:$L$14)+$J6","v":55},{"$f":"IF(L6=\"\",0,(RANK(L6,$L$5:$L$15)))+COUNTIF(L$5:L6,L6)-1","v":9}]
["BRADLEY Smitth",null,null,"OUT",null,null,"",null,"KTM FACTORY",{"$f":"SUM($G$23:$G$25)","v":20},{"$f":"IF(J7=\"\",0,(RANK(J7,$J$5:$J$15)))+COUNTIF(J$5:J7,J7)-1","v":3},{"$f":"SUMIF(Catalogne!$I$5:$I$15,France!$I7,Catalogne!$L$5:$L$14)+$J7","v":135},{"$f":"IF(L7=\"\",0,(RANK(L7,$L$5:$L$15)))+COUNTIF(L$5:L7,L7)-1","v":5}]
["PETRUCCI Danielo","DUCATI TEAM",null,1,null,null,25,null,"AVINTIA RACING",{"$f":"SUM($G$11:$G$13)","v":11},{"$f":"IF(J8=\"\",0,(RANK(J8,$J$5:$J$15)))+COUNTIF(J$5:J8,J8)-1","v":4},{"$f":"SUMIF(Catalogne!$I$5:$I$15,France!$I8,Catalogne!$L$5:$L$14)+$J8","v":55},{"$f":"IF(L8=\"\",0,(RANK(L8,$L$5:$L$15)))+COUNTIF(L$5:L8,L8)-1","v":10}]
["DEVIZIOSO Andrea",null,null,4,null,null,13,null,"KTM TECH3",{"$f":"SUM($G$26:$G$28)","v":10},{"$f":"IF(J9=\"\",0,(RANK(J9,$J$5:$J$15)))+COUNTIF(J$5:J9,J9)-1","v":5},{"$f":"SUMIF(Catalogne!$I$5:$I$15,France!$I9,Catalogne!$L$5:$L$14)+$J9","v":86},{"$f":"IF(L9=\"\",0,(RANK(L9,$L$5:$L$15)))+COUNTIF(L$5:L9,L9)-1","v":8}]
["PIRRO Michele",null,null,null,null,null,"",null,"HONDA LCR",{"$f":"SUM($G$20:$G$22)","v":9},{"$f":"IF(J10=\"\",0,(RANK(J10,$J$5:$J$15)))+COUNTIF(J$5:J10,J10)-1","v":6},{"$f":"SUMIF(Catalogne!$I$5:$I$15,France!$I10,Catalogne!$L$5:$L$14)+$J10","v":94},{"$f":"IF(L10=\"\",0,(RANK(L10,$L$5:$L$15)))+COUNTIF(L$5:L10,L10)-1","v":7}]
["ZARCO Johann","AVINTIA RACING",null,5,null,null,11,null,"YAMAHA PETRONAS",{"$f":"SUM($G$35:$G$37)","v":7},{"$f":"IF(J11=\"\",0,(RANK(J11,$J$5:$J$15)))+COUNTIF(J$5:J11,J11)-1","v":7},{"$f":"SUMIF(Catalogne!$I$5:$I$15,France!$I11,Catalogne!$L$5:$L$14)+$J11","v":192},{"$f":"IF(L11=\"\",0,(RANK(L11,$L$5:$L$15)))+COUNTIF(L$5:L11,L11)-1","v":1}]
["RABAT Tito",null,null,"OUT",null,null,"",null,"YAMAHA FACTORY",{"$f":"SUM($G$32:$G$34)","v":6},{"$f":"IF(J12=\"\",0,(RANK(J12,$J$5:$J$15)))+COUNTIF(J$5:J12,J12)-1","v":8},{"$f":"SUMIF(Catalogne!$I$5:$I$15,France!$I12,Catalogne!$L$5:$L$14)+$J12","v":154},{"$f":"IF(L12=\"\",0,(RANK(L12,$L$5:$L$15)))+COUNTIF(L$5:L12,L12)-1","v":4}]
[null,null,null,null,null,null,"",null,"SUZUKI TEAM",{"$f":"SUM($G$29:$G$31)","v":5},{"$f":"IF(J13=\"\",0,(RANK(J13,$J$5:$J$15)))+COUNTIF(J$5:J13,J13)-1","v":9},{"$f":"SUMIF(Catalogne!$I$5:$I$15,France!$I13,Catalogne!$L$5:$L$14)+$J13","v":165},{"$f":"IF(L13=\"\",0,(RANK(L13,$L$5:$L$15)))+COUNTIF(L$5:L13,L13)-1","v":3}]
["BAGNAIA Pecco","DUCATI PRAMAC",null,13,null,null,3,null,"DUCATI PRAMAC",{"$f":"SUM($G$14:$G$16)","v":3},{"$f":"IF(J14=\"\",0,(RANK(J14,$J$5:$J$15)))+COUNTIF(J$5:J14,J14)-1","v":10},{"$f":"SUMIF(Catalogne!$I$5:$I$15,France!$I14,Catalogne!$L$5:$L$14)+$J14","v":117},{"$f":"IF(L14=\"\",0,(RANK(L14,$L$5:$L$15)))+COUNTIF(L$5:L14,L14)-1","v":6}]
["MILLER Jack",null,null,"OUT",null,null,"",null,"APRILIA RACING",{"$f":"SUM($G$5:$G$7)","v":2},{"$f":"IF(J15=\"\",0,(RANK(J15,$J$5:$J$15)))+COUNTIF(J$5:J15,J15)-1","v":11},{"$f":"SUMIF(Catalogne!$I$5:$I$15,France!$I15,Catalogne!$L$5:$L$14)+$J15","v":35},{"$f":"IF(L15=\"\",0,(RANK(L15,$L$5:$L$15)))+COUNTIF(L$5:L15,L15)-1","v":11}]
[null,null,null,null,null,null,""]
["MARQUES Alex","HONDA REPSOL",null,2,null,null,20]
["MARQUES Marc",null,null,null,null,null,""]
["BRADL Stephan",null,null,8,null,null,8]
["CRUTCHLOW Cal","HONDA LCR",null,"OUT",null,null,""]
["NAKAGAMI Takaaki",null,null,7,null,null,9]
[null,null,null,null,null,null,""]
["BINDER Brad","KTM FACTORY",null,12,null,null,4]
["ESPARGARO Pol",null,null,3,null,null,16]
[null,null,null,null,null,null,""]
["LEKUONA Iker","KTM TECH3",null,16,null,null,""]
["OLIVEIRA Miguel",null,null,6,null,null,10]
[null,null,null,null,null,null,""]
["MIR Joan","SUZUKI TEAM",null,11,null,null,5]
["RINS Alex",null,null,16,null,null,""]
[null,null,null,null,null,null,""]
["ROSSI Valentino","YAMAHA FACTORY",null,"OUT",null,null,""]
["VINALES Maverick",null,null,10,null,null,6]
[null,null,null,null,null,null,""]
["QUARTARARO Fabio","YAMAHA PETRONAS",null,9,1,null,7]
["MORBIDELLI Franco",null,null,"OUT",null,null,""]
[null,null,null,null,null,null,""]

{"sheet":"Aragon","index":13,"n_rows":37,"n_cols":13,"rows_kept":37,"cut":false,"hidden":false,"merged":[[34,1,36,1],[31,1,33,1],[31,2,33,2],[22,1,24,1],[22,2,24,2],[25,1,27,1],[25,2,27,2],[28,1,30,1],[28,2,30,2],[34,2,36,2],[13,1,15,1],[13,2,15,2],[16,1,18,1],[16,2,18,2],[19,1,21,1],[19,2,21,2],[0,0,1,13],[2,1,3,1],[2,2,3,2],[2,3,3,3],[2,5,3,5],[2,6,3,6],[2,4,3,4],[2,0,3,0],[4,1,6,1],[4,2,6,2],[7,1,9,1],[7,2,9,2],[10,1,12,1],[10,2,12,2]]}
["ARAGON - 18 OCTOBRE 2020"]
[]
["PILOTES","ECURIES","MOTOS","Finish","Pôle","Pt tour","Points",null,"CLASSEMENT"]
[null,null,null,null,null,null,null,{"$f":"IF(G4=\"\",\"\",(RANK(G4,G4:G23)))","v":""},"ÉCURIES","POINTS","RANG","TOTAL","PONCTUEL"]
["IANNONE Andrea","APRILIA RACING",null,null,null,null,{"$f":"IFERROR(CHOOSE(D5,25,20,16,13,11,10,9,8,7,6,5,4,3,2,1)+(F5=1),\"\")","v":""},null,"YAMAHA PETRONAS",{"$f":"SUM($G$35:$G$37)","v":0},{"$f":"IF(J5=\"\",0,(RANK(J5,$J$5:$J$14)))+COUNTIF(J$5:J5,J5)-1","v":1},{"$f":"SUMIF(France!$I$5:$I$15,Aragon!$I5,France!$L$5:$L$14)+$J5","v":192},{"$f":"IF(L5=\"\",0,(RANK(L5,$L$5:$L$15)))+COUNTIF(L$5:L5,L5)-1","v":1}]
["ESPARGARO Aleix",null,null,null,null,null,{"$f":"IFERROR(CHOOSE(D6,25,20,16,13,11,10,9,8,7,6,5,4,3,2,1)+(F6=1),\"\")","v":""},null,"DUCATI TEAM",{"$f":"SUM($G$8:$G$10)","v":0},{"$f":"IF(J6=\"\",0,(RANK(J6,$J$5:$J$14)))+COUNTIF(J$5:J6,J6)-1","v":2},{"$f":"SUMIF(France!$I$5:$I$15,Aragon!$I6,France!$L$5:$L$14)+$J6","v":165},{"$f":"IF(L6=\"\",0,(RANK(L6,$L$5:$L$15)))+COUNTIF(L$5:L6,L6)-1","v":2}]
["BRADLEY Smitth",null,null,null,null,null,"",null,"DUCATI PRAMAC",{"$f":"SUM($G$14:$G$16)","v":0},{"$f":"IF(J7=\"\",0,(RANK(J7,$J$5:$J$14)))+COUNTIF(J$5:J7,J7)-1","v":3},{"$f":"SUMIF(France!$I$5:$I$15,Aragon!$I7,France!$L$5:$L$14)+$J7","v":117},{"$f":"IF(L7=\"\",0,(RANK(L7,$L$5:$L$15)))+COUNTIF(L$5:L7,L7)-1","v":6}]
["PETRUCCI Danielo","DUCATI TEAM",null,null,null,null,"",null,"YAMAHA FACTORY",{"$f":"SUM($G$32:$G$34)","v":0},{"$f":"IF(J8=\"\",0,(RANK(J8,$J$5:$J$14)))+COUNTIF(J$5:J8,J8)-1","v":4},{"$f":"SUMIF(France!$I$5:$I$15,Aragon!$I8,France!$L$5:$L$14)+$J8","v":154},{"$f":"IF(L8=\"\",0,(RANK(L8,$L$5:$L$15)))+COUNTIF(L$5:L8,L8)-1","v":4}]
["DEVIZIOSO Andrea",null,null,null,null,null,"",null,"KTM FACTORY",{"$f":"SUM($G$14:$G$16)","v":0},{"$f":"IF(J9=\"\",0,(RANK(J9,$J$5:$J$14)))+COUNTIF(J$5:J9,J9)-1","v":5},{"$f":"SUMIF(France!$I$5:$I$15,Aragon!$I9,France!$L$5:$L$14)+$J9","v":135},{"$f":"IF(L9=\"\",0,(RANK(L9,$L$5:$L$15)))+COUNTIF(L$5:L9,L9)-1","v":5}]
["PIRRO Michele",null,null,null,null,null,"",null,"KTM TECH3",{"$f":"SUM($G$26:$G$28)","v":0},{"$f":"IF(J10=\"\",0,(RANK(J10,$J$5:$J$14)))+COUNTIF(J$5:J10,J10)-1","v":6},{"$f":"SUMIF(France!$I$5:$I$15,Aragon!$I10,France!$L$5:$L$14)+$J10","v":86},{"$f":"IF(L10=\"\",0,(RANK(L10,$L$5:$L$15)))+COUNTIF(L$5:L10,L10)-1","v":8}]
["ZARCO Johann","AVINTIA RACING",null,null,null,null,"",null,"HONDA LCR",{"$f":"SUM($G$20:$G$22)","v":0},{"$f":"IF(J11=\"\",0,(RANK(J11,$J$5:$J$14)))+COUNTIF(J$5:J11,J11)-1","v":7},{"$f":"SUMIF(France!$I$5:$I$15,Aragon!$I11,France!$L$5:$L$14)+$J11","v":94},{"$f":"IF(L11=\"\",0,(RANK(L11,$L$5:$L$15)))+COUNTIF(L$5:L11,L11)-1","v":7}]
["RABAT Tito",null,null,null,null,null,"",null,"HONDA REPSOL",{"$f":"SUM($G$17:$G$19)","v":0},{"$f":"IF(J12=\"\",0,(RANK(J12,$J$5:$J$14)))+COUNTIF(J$5:J12,J12)-1","v":8},{"$f":"SUMIF(France!$I$5:$I$15,Aragon!$I12,France!$L$5:$L$14)+$J12","v":55},{"$f":"IF(L12=\"\",0,(RANK(L12,$L$5:$L$15)))+COUNTIF(L$5:L12,L12)-1","v":9}]
[null,null,null,null,null,null,"",null,"AVINTIA RACING",{"$f":"SUM($G$11:$G$13)","v":0},{"$f":"IF(J13=\"\",0,(RANK(J13,$J$5:$J$14)))+COUNTIF(J$5:J13,J13)-1","v":9},{"$f":"SUMIF(France!$I$5:$I$15,Aragon!$I13,France!$L$5:$L$14)+$J13","v":55},{"$f":"IF(L13=\"\",0,(RANK(L13,$L$5:$L$15)))+COUNTIF(L$5:L13,L13)-1","v":10}]
["BAGNAIA Pecco","DUCATI PRAMAC",null,null,null,null,"",null,"APRILIA RACING",{"$f":"SUM($G$5:$G$7)","v":0},{"$f":"IF(J14=\"\",0,(RANK(J14,$J$5:$J$14)))+COUNTIF(J$5:J14,J14)-1","v":10},{"$f":"SUMIF(France!$I$5:$I$15,Aragon!$I14,France!$L$5:$L$14)+$J14","v":35},{"$f":"IF(L14=\"\",0,(RANK(L14,$L$5:$L$15)))+COUNTIF(L$5:L14,L14)-1","v":11}]
["MILLER Jack",null,null,null,null,null,"",null,"SUZUKI TEAM",{"$f":"SUM($G$29:$G$31)","v":0},{"$f":"IF(J15=\"\",0,(RANK(J15,$J$5:$J$14)))+COUNTIF(J$5:J15,J15)-1","v":11},{"$f":"SUMIF(France!$I$5:$I$15,Aragon!$I15,France!$L$5:$L$14)+$J15","v":165},{"$f":"IF(L15=\"\",0,(RANK(L15,$L$5:$L$15)))+COUNTIF(L$5:L15,L15)-1","v":3}]
[null,null,null,null,null,null,""]
["MARQUES Alex","HONDA REPSOL",null,null,null,null,""]
["MARQUES Marc",null,null,null,null,null,""]
["BRADL Stephan",null,null,null,null,null,""]
["CRUTCHLOW Cal","HONDA LCR",null,null,null,null,""]
["NAKAGAMI Takaaki",null,null,null,null,null,""]
[null,null,null,null,null,null,""]
["BINDER Brad","KTM FACTORY",null,null,null,null,""]
["ESPARGARO Pol",null,null,null,null,null,""]
[null,null,null,null,null,null,""]
["LEKUONA Iker","KTM TECH3",null,null,null,null,""]
["OLIVEIRA Miguel",null,null,null,null,null,""]
[null,null,null,null,null,null,""]
["MIR Joan","SUZUKI TEAM",null,null,null,null,""]
["RINS Alex",null,null,null,null,null,""]
[null,null,null,null,null,null,""]
["ROSSI Valentino","YAMAHA FACTORY",null,null,null,null,""]
["VINALES Maverick",null,null,null,null,null,""]
[null,null,null,null,null,null,""]
["QUARTARARO Fabio","YAMAHA PETRONAS",null,null,1,null,""]
["MORBIDELLI Franco",null,null,null,null,null,""]
[null,null,null,null,null,null,{"$f":"IFERROR(CHOOSE(D37,25,20,16,13,11,10,9,8,7,6,5,4,3,2,1)+(F37=1),\"\")","v":""}]

{"sheet":"Teruel","index":14,"n_rows":37,"n_cols":13,"rows_kept":37,"cut":false,"hidden":false,"merged":[[34,1,36,1],[31,1,33,1],[31,2,33,2],[22,1,24,1],[22,2,24,2],[25,1,27,1],[25,2,27,2],[28,1,30,1],[28,2,30,2],[34,2,36,2],[13,1,15,1],[13,2,15,2],[16,1,18,1],[16,2,18,2],[19,1,21,1],[19,2,21,2],[4,1,6,1],[4,2,6,2],[7,1,9,1],[7,2,9,2],[10,1,12,1],[10,2,12,2],[0,0,1,13],[2,1,3,1],[2,2,3,2],[2,3,3,3],[2,5,3,5],[2,6,3,6],[2,4,3,4],[2,0,3,0],[2,8,2,12]]}
["ARAGON - 25 OCTOBRE 2020"]
[]
["PILOTES","ECURIES","MOTOS","Finish","Pôle","Pt tour","Points",null,"CLASSEMENT"]
[null,null,null,null,null,null,null,{"$f":"IF(G4=\"\",\"\",(RANK(G4,G4:G23)))","v":""},"ÉCURIES","POINTS","RANG","TOTAL","PONCTUEL"]
["IANNONE Andrea","APRILIA RACING",null,null,null,null,{"$f":"IFERROR(CHOOSE(D5,25,20,16,13,11,10,9,8,7,6,5,4,3,2,1)+(F5=1),\"\")","v":""},null,"YAMAHA PETRONAS",{"$f":"SUM($G$35:$G$37)","v":0},{"$f":"IF(J5=\"\",0,(RANK(J5,$J$5:$J$15)))+COUNTIF(J$5:J5,J5)-1","v":1},{"$f":"SUMIF(Aragon!$I$5:$I$15,Teruel!$I5,Aragon!$L$5:$L$15)+$J5","v":192},{"$f":"IF(L5=\"\",0,(RANK(L5,$L$5:$L$15)))+COUNTIF(L$5:L5,L5)-1","v":1}]
["ESPARGARO Aleix",null,null,null,null,null,{"$f":"IFERROR(CHOOSE(D6,25,20,16,13,11,10,9,8,7,6,5,4,3,2,1)+(F6=1),\"\")","v":""},null,"DUCATI TEAM",{"$f":"SUM($G$5:$G$7)","v":0},{"$f":"IF(J6=\"\",0,(RANK(J6,$J$5:$J$15)))+COUNTIF(J$5:J6,J6)-1","v":2},{"$f":"SUMIF(Aragon!$I$5:$I$15,Teruel!$I6,Aragon!$L$5:$L$15)+$J6","v":165},{"$f":"IF(L6=\"\",0,(RANK(L6,$L$5:$L$15)))+COUNTIF(L$5:L6,L6)-1","v":2}]
["BRADLEY Smitth",null,null,null,null,null,"",null,"DUCATI PRAMAC",{"$f":"SUM($G$8:$G$10)","v":0},{"$f":"IF(J7=\"\",0,(RANK(J7,$J$5:$J$15)))+COUNTIF(J$5:J7,J7)-1","v":3},{"$f":"SUMIF(Aragon!$I$5:$I$15,Teruel!$I7,Aragon!$L$5:$L$15)+$J7","v":117},{"$f":"IF(L7=\"\",0,(RANK(L7,$L$5:$L$15)))+COUNTIF(L$5:L7,L7)-1","v":6}]
["PETRUCCI Danielo","DUCATI TEAM",null,null,null,null,"",null,"YAMAHA FACTORY",{"$f":"SUM($G$11:$G$13)","v":0},{"$f":"IF(J8=\"\",0,(RANK(J8,$J$5:$J$15)))+COUNTIF(J$5:J8,J8)-1","v":4},{"$f":"SUMIF(Aragon!$I$5:$I$15,Teruel!$I8,Aragon!$L$5:$L$15)+$J8","v":154},{"$f":"IF(L8=\"\",0,(RANK(L8,$L$5:$L$15)))+COUNTIF(L$5:L8,L8)-1","v":4}]
["DEVIZIOSO Andrea",null,null,null,null,null,"",null,"KTM FACTORY",{"$f":"SUM($G$14:$G$16)","v":0},{"$f":"IF(J9=\"\",0,(RANK(J9,$J$5:$J$15)))+COUNTIF(J$5:J9,J9)-1","v":5},{"$f":"SUMIF(Aragon!$I$5:$I$15,Teruel!$I9,Aragon!$L$5:$L$15)+$J9","v":135},{"$f":"IF(L9=\"\",0,(RANK(L9,$L$5:$L$15)))+COUNTIF(L$5:L9,L9)-1","v":5}]
["PIRRO Michele",null,null,null,null,null,"",null,"KTM TECH3",{"$f":"SUM($G$20:$G$22)","v":0},{"$f":"IF(J10=\"\",0,(RANK(J10,$J$5:$J$15)))+COUNTIF(J$5:J10,J10)-1","v":6},{"$f":"SUMIF(Aragon!$I$5:$I$15,Teruel!$I10,Aragon!$L$5:$L$15)+$J10","v":86},{"$f":"IF(L10=\"\",0,(RANK(L10,$L$5:$L$15)))+COUNTIF(L$5:L10,L10)-1","v":8}]
["ZARCO Johann","AVINTIA RACING",null,null,null,null,"",null,"HONDA LCR",{"$f":"SUM($G$23:$G$25)","v":0},{"$f":"IF(J11=\"\",0,(RANK(J11,$J$5:$J$15)))+COUNTIF(J$5:J11,J11)-1","v":7},{"$f":"SUMIF(Aragon!$I$5:$I$15,Teruel!$I11,Aragon!$L$5:$L$15)+$J11","v":94},{"$f":"IF(L11=\"\",0,(RANK(L11,$L$5:$L$15)))+COUNTIF(L$5:L11,L11)-1","v":7}]
["RABAT Tito",null,null,null,null,null,"",null,"HONDA REPSOL",{"$f":"SUM($G$26:$G$28)","v":0},{"$f":"IF(J12=\"\",0,(RANK(J12,$J$5:$J$15)))+COUNTIF(J$5:J12,J12)-1","v":8},{"$f":"SUMIF(Aragon!$I$5:$I$15,Teruel!$I12,Aragon!$L$5:$L$15)+$J12","v":55},{"$f":"IF(L12=\"\",0,(RANK(L12,$L$5:$L$15)))+COUNTIF(L$5:L12,L12)-1","v":9}]
[null,null,null,null,null,null,"",null,"APRILIA RACING",{"$f":"SUM($G$29:$G$31)","v":0},{"$f":"IF(J13=\"\",0,(RANK(J13,$J$5:$J$15)))+COUNTIF(J$5:J13,J13)-1","v":9},{"$f":"SUMIF(Aragon!$I$5:$I$15,Teruel!$I13,Aragon!$L$5:$L$15)+$J13","v":35},{"$f":"IF(L13=\"\",0,(RANK(L13,$L$5:$L$15)))+COUNTIF(L$5:L13,L13)-1","v":11}]
["BAGNAIA Pecco","DUCATI PRAMAC",null,null,null,null,"",null,"AVINTIA RACING",{"$f":"SUM($G$32:$G$34)","v":0},{"$f":"IF(J14=\"\",0,(RANK(J14,$J$5:$J$15)))+COUNTIF(J$5:J14,J14)-1","v":10},{"$f":"SUMIF(Aragon!$I$5:$I$15,Teruel!$I14,Aragon!$L$5:$L$15)+$J14","v":55},{"$f":"IF(L14=\"\",0,(RANK(L14,$L$5:$L$15)))+COUNTIF(L$5:L14,L14)-1","v":10}]
["MILLER Jack",null,null,null,null,null,"",null,"SUZUKI TEAM",{"$f":"SUM($G$32:$G$34)","v":0},{"$f":"IF(J15=\"\",0,(RANK(J15,$J$5:$J$15)))+COUNTIF(J$5:J15,J15)-1","v":11},{"$f":"SUMIF(Aragon!$I$5:$I$15,Teruel!$I15,Aragon!$L$5:$L$15)+$J15","v":165},{"$f":"IF(L15=\"\",0,(RANK(L15,$L$5:$L$15)))+COUNTIF(L$5:L15,L15)-1","v":3}]
[null,null,null,null,null,null,""]
["MARQUES Alex","HONDA REPSOL",null,null,null,null,""]
["MARQUES Marc",null,null,null,null,null,""]
["BRADL Stephan",null,null,null,null,null,""]
["CRUTCHLOW Cal","HONDA LCR",null,null,null,null,""]
["NAKAGAMI Takaaki",null,null,null,null,null,""]
[null,null,null,null,null,null,""]
["BINDER Brad","KTM FACTORY",null,null,null,null,""]
["ESPARGARO Pol",null,null,null,null,null,""]
[null,null,null,null,null,null,""]
["LEKUONA Iker","KTM TECH3",null,null,null,null,""]
["OLIVEIRA Miguel",null,null,null,null,null,""]
[null,null,null,null,null,null,""]
["MIR Joan","SUZUKI TEAM",null,null,null,null,""]
["RINS Alex",null,null,null,null,null,""]
[null,null,null,null,null,null,""]
["ROSSI Valentino","YAMAHA FACTORY",null,null,null,null,""]
["VINALES Maverick",null,null,null,null,null,""]
[null,null,null,null,null,null,""]
["QUARTARARO Fabio","YAMAHA PETRONAS",null,null,null,null,""]
["MORBIDELLI Franco",null,null,null,null,null,""]
[null,null,null,null,null,null,""]

{"sheet":"Europe","index":15,"n_rows":37,"n_cols":13,"rows_kept":37,"cut":false,"hidden":false,"merged":[[34,1,36,1],[31,1,33,1],[31,2,33,2],[22,1,24,1],[22,2,24,2],[25,1,27,1],[25,2,27,2],[28,1,30,1],[28,2,30,2],[34,2,36,2],[13,1,15,1],[13,2,15,2],[16,1,18,1],[16,2,18,2],[19,1,21,1],[19,2,21,2],[4,1,6,1],[4,2,6,2],[7,1,9,1],[7,2,9,2],[10,1,12,1],[10,2,12,2],[0,0,1,13],[2,1,3,1],[2,2,3,2],[2,3,3,3],[2,5,3,5],[2,6,3,6],[2,4,3,4],[2,0,3,0],[2,8,2,12]]}
["VALENCE - 08 NOVEMBRE 2020"]
[]
["PILOTES","ECURIES","MOTOS","Finish","Pôle","Pt tour","Points",null,"CLASSEMENT"]
[null,null,null,null,null,null,null,{"$f":"IF(G4=\"\",\"\",(RANK(G4,G4:G23)))","v":""},"ÉCURIES","POINTS","RANG","TOTAL","PONCTUEL"]
["IANNONE Andrea","APRILIA RACING",null,null,null,null,{"$f":"IFERROR(CHOOSE(D5,25,20,16,13,11,10,9,8,7,6,5,4,3,2,1)+(F5=1),\"\")","v":""},null,"YAMAHA PETRONAS",{"$f":"SUM($G$17:$G$19)","v":0},{"$f":"IF(J5=\"\",0,(RANK(J5,$J$5:$J$15)))+COUNTIF(J$5:J5,J5)-1","v":1},{"$f":"SUMIF(Teruel!$I$5:$I$15,Europe!$I5,Teruel!$L$5:$L$15)+$J5","v":192},{"$f":"IF(L5=\"\",0,(RANK(L5,$L$5:$L$15)))+COUNTIF(L$5:L5,L5)-1","v":1}]
["ESPARGARO Aleix",null,null,null,null,null,{"$f":"IFERROR(CHOOSE(D6,25,20,16,13,11,10,9,8,7,6,5,4,3,2,1)+(F6=1),\"\")","v":""},null,"DUCATI TEAM",{"$f":"SUM($G$5:$G$7)","v":0},{"$f":"IF(J6=\"\",0,(RANK(J6,$J$5:$J$15)))+COUNTIF(J$5:J6,J6)-1","v":2},{"$f":"SUMIF(Teruel!$I$5:$I$15,Europe!$I6,Teruel!$L$5:$L$15)+$J6","v":165},{"$f":"IF(L6=\"\",0,(RANK(L6,$L$5:$L$15)))+COUNTIF(L$5:L6,L6)-1","v":2}]
["BRADLEY Smitth",null,null,null,null,null,"",null,"DUCATI PRAMAC",{"$f":"SUM($G$8:$G$10)","v":0},{"$f":"IF(J7=\"\",0,(RANK(J7,$J$5:$J$15)))+COUNTIF(J$5:J7,J7)-1","v":3},{"$f":"SUMIF(Teruel!$I$5:$I$15,Europe!$I7,Teruel!$L$5:$L$15)+$J7","v":117},{"$f":"IF(L7=\"\",0,(RANK(L7,$L$5:$L$15)))+COUNTIF(L$5:L7,L7)-1","v":6}]
["PETRUCCI Danielo","DUCATI TEAM",null,null,null,null,"",null,"YAMAHA FACTORY",{"$f":"SUM($G$11:$G$13)","v":0},{"$f":"IF(J8=\"\",0,(RANK(J8,$J$5:$J$15)))+COUNTIF(J$5:J8,J8)-1","v":4},{"$f":"SUMIF(Teruel!$I$5:$I$15,Europe!$I8,Teruel!$L$5:$L$15)+$J8","v":154},{"$f":"IF(L8=\"\",0,(RANK(L8,$L$5:$L$15)))+COUNTIF(L$5:L8,L8)-1","v":4}]
["DEVIZIOSO Andrea",null,null,null,null,null,"",null,"KTM FACTORY",{"$f":"SUM($G$14:$G$16)","v":0},{"$f":"IF(J9=\"\",0,(RANK(J9,$J$5:$J$15)))+COUNTIF(J$5:J9,J9)-1","v":5},{"$f":"SUMIF(Teruel!$I$5:$I$15,Europe!$I9,Teruel!$L$5:$L$15)+$J9","v":135},{"$f":"IF(L9=\"\",0,(RANK(L9,$L$5:$L$15)))+COUNTIF(L$5:L9,L9)-1","v":5}]
["PIRRO Michele",null,null,null,null,null,"",null,"KTM TECH3",{"$f":"SUM($G$20:$G$22)","v":0},{"$f":"IF(J10=\"\",0,(RANK(J10,$J$5:$J$15)))+COUNTIF(J$5:J10,J10)-1","v":6},{"$f":"SUMIF(Teruel!$I$5:$I$15,Europe!$I10,Teruel!$L$5:$L$15)+$J10","v":86},{"$f":"IF(L10=\"\",0,(RANK(L10,$L$5:$L$15)))+COUNTIF(L$5:L10,L10)-1","v":8}]
["ZARCO Johann","AVINTIA RACING",null,null,null,null,"",null,"HONDA LCR",{"$f":"SUM($G$23:$G$25)","v":0},{"$f":"IF(J11=\"\",0,(RANK(J11,$J$5:$J$15)))+COUNTIF(J$5:J11,J11)-1","v":7},{"$f":"SUMIF(Teruel!$I$5:$I$15,Europe!$I11,Teruel!$L$5:$L$15)+$J11","v":94},{"$f":"IF(L11=\"\",0,(RANK(L11,$L$5:$L$15)))+COUNTIF(L$5:L11,L11)-1","v":7}]
["RABAT Tito",null,null,null,null,null,"",null,"HONDA REPSOL",{"$f":"SUM($G$26:$G$28)","v":0},{"$f":"IF(J12=\"\",0,(RANK(J12,$J$5:$J$15)))+COUNTIF(J$5:J12,J12)-1","v":8},{"$f":"SUMIF(Teruel!$I$5:$I$15,Europe!$I12,Teruel!$L$5:$L$15)+$J12","v":55},{"$f":"IF(L12=\"\",0,(RANK(L12,$L$5:$L$15)))+COUNTIF(L$5:L12,L12)-1","v":9}]
[null,null,null,null,null,null,"",null,"AVINTIA RACING",{"$f":"SUM($G$29:$G$31)","v":0},{"$f":"IF(J13=\"\",0,(RANK(J13,$J$5:$J$15)))+COUNTIF(J$5:J13,J13)-1","v":9},{"$f":"SUMIF(Teruel!$I$5:$I$15,Europe!$I13,Teruel!$L$5:$L$15)+$J13","v":55},{"$f":"IF(L13=\"\",0,(RANK(L13,$L$5:$L$15)))+COUNTIF(L$5:L13,L13)-1","v":10}]
["BAGNAIA Pecco","DUCATI PRAMAC",null,null,null,null,"",null,"APRILIA RACING",{"$f":"SUM($G$32:$G$34)","v":0},{"$f":"IF(J14=\"\",0,(RANK(J14,$J$5:$J$15)))+COUNTIF(J$5:J14,J14)-1","v":10},{"$f":"SUMIF(Teruel!$I$5:$I$15,Europe!$I14,Teruel!$L$5:$L$15)+$J14","v":35},{"$f":"IF(L14=\"\",0,(RANK(L14,$L$5:$L$15)))+COUNTIF(L$5:L14,L14)-1","v":11}]
["MILLER Jack",null,null,null,null,null,"",null,"SUZUKI TEAM",{"$f":"SUM($G$32:$G$34)","v":0},{"$f":"IF(J15=\"\",0,(RANK(J15,$J$5:$J$15)))+COUNTIF(J$5:J15,J15)-1","v":11},{"$f":"SUMIF(Teruel!$I$5:$I$15,Europe!$I15,Teruel!$L$5:$L$15)+$J15","v":165},{"$f":"IF(L15=\"\",0,(RANK(L15,$L$5:$L$15)))+COUNTIF(L$5:L15,L15)-1","v":3}]
[null,null,null,null,null,null,""]
["MARQUES Alex","HONDA REPSOL",null,null,null,null,""]
["MARQUES Marc",null,null,null,null,null,""]
["BRADL Stephan",null,null,null,null,null,""]
["CRUTCHLOW Cal","HONDA LCR",null,null,null,null,""]
["NAKAGAMI Takaaki",null,null,null,null,null,""]
[null,null,null,null,null,null,""]
["BINDER Brad","KTM FACTORY",null,null,null,null,""]
["ESPARGARO Pol",null,null,null,null,null,""]
[null,null,null,null,null,null,""]
["LEKUONA Iker","KTM TECH3",null,null,null,null,""]
["OLIVEIRA Miguel",null,null,null,null,null,""]
[null,null,null,null,null,null,""]
["MIR Joan","SUZUKI TEAM",null,null,null,null,""]
["RINS Alex",null,null,null,null,null,""]
[null,null,null,null,null,null,""]
["ROSSI Valentino","YAMAHA FACTORY",null,null,null,null,""]
["VINALES Maverick",null,null,null,null,null,""]
[null,null,null,null,null,null,""]
["QUARTARARO Fabio","YAMAHA PETRONAS",null,null,null,null,""]
["MORBIDELLI Franco",null,null,null,null,null,""]
[null,null,null,null,null,null,""]

{"sheet":"Valence","index":16,"n_rows":37,"n_cols":13,"rows_kept":37,"cut":false,"hidden":false,"merged":[[34,1,36,1],[31,1,33,1],[31,2,33,2],[22,1,24,1],[22,2,24,2],[25,1,27,1],[25,2,27,2],[28,1,30,1],[28,2,30,2],[34,2,36,2],[13,1,15,1],[13,2,15,2],[16,1,18,1],[16,2,18,2],[19,1,21,1],[19,2,21,2],[4,1,6,1],[4,2,6,2],[7,1,9,1],[7,2,9,2],[10,1,12,1],[10,2,12,2],[0,0,1,13],[2,1,3,1],[2,2,3,2],[2,3,3,3],[2,5,3,5],[2,6,3,6],[2,4,3,4],[2,0,3,0],[2,8,2,12]]}
["VALENCE - 15 NOVEMBRE 2020"]
[]
["PILOTES","ECURIES","MOTOS","Finish","Pôle","Pt tour","Points",null,"CLASSEMENT"]
[null,null,null,null,null,null,null,{"$f":"IF(G4=\"\",\"\",(RANK(G4,G4:G23)))","v":""},"ÉCURIES","POINTS","RANG","TOTAL","PONCTUEL"]
["IANNONE Andrea","APRILIA RACING",null,null,null,null,{"$f":"IFERROR(CHOOSE(D5,25,20,16,13,11,10,9,8,7,6,5,4,3,2,1)+(F5=1),\"\")","v":""},null,"YAMAHA PETRONAS",{"$f":"SUM($G$17:$G$19)","v":0},{"$f":"IF(J5=\"\",0,(RANK(J5,$J$5:$J$15)))+COUNTIF(J$5:J5,J5)-1","v":1},{"$f":"SUMIF(Europe!$I$5:$I$15,Valence!$I5,Europe!$L$5:$L$15)+$J5","v":192},{"$f":"IF(L5=\"\",0,(RANK(L5,$L$5:$L$15)))+COUNTIF(L$5:L5,L5)-1","v":1}]
["ESPARGARO Aleix",null,null,null,null,null,{"$f":"IFERROR(CHOOSE(D6,25,20,16,13,11,10,9,8,7,6,5,4,3,2,1)+(F6=1),\"\")","v":""},null,"DUCATI TEAM",{"$f":"SUM($G$5:$G$7)","v":0},{"$f":"IF(J6=\"\",0,(RANK(J6,$J$5:$J$15)))+COUNTIF(J$5:J6,J6)-1","v":2},{"$f":"SUMIF(Europe!$I$5:$I$15,Valence!$I6,Europe!$L$5:$L$15)+$J6","v":165},{"$f":"IF(L6=\"\",0,(RANK(L6,$L$5:$L$15)))+COUNTIF(L$5:L6,L6)-1","v":2}]
["BRADLEY Smitth",null,null,null,null,null,"",null,"DUCATI PRAMAC",{"$f":"SUM($G$8:$G$10)","v":0},{"$f":"IF(J7=\"\",0,(RANK(J7,$J$5:$J$15)))+COUNTIF(J$5:J7,J7)-1","v":3},{"$f":"SUMIF(Europe!$I$5:$I$15,Valence!$I7,Europe!$L$5:$L$15)+$J7","v":117},{"$f":"IF(L7=\"\",0,(RANK(L7,$L$5:$L$15)))+COUNTIF(L$5:L7,L7)-1","v":6}]
["PETRUCCI Danielo","DUCATI TEAM",null,null,null,null,"",null,"YAMAHA FACTORY",{"$f":"SUM($G$11:$G$13)","v":0},{"$f":"IF(J8=\"\",0,(RANK(J8,$J$5:$J$15)))+COUNTIF(J$5:J8,J8)-1","v":4},{"$f":"SUMIF(Europe!$I$5:$I$15,Valence!$I8,Europe!$L$5:$L$15)+$J8","v":154},{"$f":"IF(L8=\"\",0,(RANK(L8,$L$5:$L$15)))+COUNTIF(L$5:L8,L8)-1","v":4}]
["DEVIZIOSO Andrea",null,null,null,null,null,"",null,"KTM FACTORY",{"$f":"SUM($G$14:$G$16)","v":0},{"$f":"IF(J9=\"\",0,(RANK(J9,$J$5:$J$15)))+COUNTIF(J$5:J9,J9)-1","v":5},{"$f":"SUMIF(Europe!$I$5:$I$15,Valence!$I9,Europe!$L$5:$L$15)+$J9","v":135},{"$f":"IF(L9=\"\",0,(RANK(L9,$L$5:$L$15)))+COUNTIF(L$5:L9,L9)-1","v":5}]
["PIRRO Michele",null,null,null,null,null,"",null,"KTM TECH3",{"$f":"SUM($G$20:$G$22)","v":0},{"$f":"IF(J10=\"\",0,(RANK(J10,$J$5:$J$15)))+COUNTIF(J$5:J10,J10)-1","v":6},{"$f":"SUMIF(Europe!$I$5:$I$15,Valence!$I10,Europe!$L$5:$L$15)+$J10","v":86},{"$f":"IF(L10=\"\",0,(RANK(L10,$L$5:$L$15)))+COUNTIF(L$5:L10,L10)-1","v":8}]
["ZARCO Johann","AVINTIA RACING",null,null,null,null,"",null,"HONDA LCR",{"$f":"SUM($G$23:$G$25)","v":0},{"$f":"IF(J11=\"\",0,(RANK(J11,$J$5:$J$15)))+COUNTIF(J$5:J11,J11)-1","v":7},{"$f":"SUMIF(Europe!$I$5:$I$15,Valence!$I11,Europe!$L$5:$L$15)+$J11","v":94},{"$f":"IF(L11=\"\",0,(RANK(L11,$L$5:$L$15)))+COUNTIF(L$5:L11,L11)-1","v":7}]
["RABAT Tito",null,null,null,null,null,"",null,"HONDA REPSOL",{"$f":"SUM($G$26:$G$28)","v":0},{"$f":"IF(J12=\"\",0,(RANK(J12,$J$5:$J$15)))+COUNTIF(J$5:J12,J12)-1","v":8},{"$f":"SUMIF(Europe!$I$5:$I$15,Valence!$I12,Europe!$L$5:$L$15)+$J12","v":55},{"$f":"IF(L12=\"\",0,(RANK(L12,$L$5:$L$15)))+COUNTIF(L$5:L12,L12)-1","v":9}]
[null,null,null,null,null,null,"",null,"AVINTIA RACING",{"$f":"SUM($G$29:$G$31)","v":0},{"$f":"IF(J13=\"\",0,(RANK(J13,$J$5:$J$15)))+COUNTIF(J$5:J13,J13)-1","v":9},{"$f":"SUMIF(Europe!$I$5:$I$15,Valence!$I13,Europe!$L$5:$L$15)+$J13","v":55},{"$f":"IF(L13=\"\",0,(RANK(L13,$L$5:$L$15)))+COUNTIF(L$5:L13,L13)-1","v":10}]
["BAGNAIA Pecco","DUCATI PRAMAC",null,null,null,null,"",null,"APRILIA RACING",{"$f":"SUM($G$32:$G$34)","v":0},{"$f":"IF(J14=\"\",0,(RANK(J14,$J$5:$J$15)))+COUNTIF(J$5:J14,J14)-1","v":10},{"$f":"SUMIF(Europe!$I$5:$I$15,Valence!$I14,Europe!$L$5:$L$15)+$J14","v":35},{"$f":"IF(L14=\"\",0,(RANK(L14,$L$5:$L$15)))+COUNTIF(L$5:L14,L14)-1","v":11}]
["MILLER Jack",null,null,null,null,null,"",null,"SUZUKI TEAM",{"$f":"SUM($G$32:$G$34)","v":0},{"$f":"IF(J15=\"\",0,(RANK(J15,$J$5:$J$15)))+COUNTIF(J$5:J15,J15)-1","v":11},{"$f":"SUMIF(Europe!$I$5:$I$15,Valence!$I15,Europe!$L$5:$L$15)+$J15","v":165},{"$f":"IF(L15=\"\",0,(RANK(L15,$L$5:$L$15)))+COUNTIF(L$5:L15,L15)-1","v":3}]
[null,null,null,null,null,null,""]
["MARQUES Alex","HONDA REPSOL",null,null,null,null,""]
["MARQUES Marc",null,null,null,null,null,""]
["BRADL Stephan",null,null,null,null,null,""]
["CRUTCHLOW Cal","HONDA LCR",null,null,null,null,""]
["NAKAGAMI Takaaki",null,null,null,null,null,""]
[null,null,null,null,null,null,""]
["BINDER Brad","KTM FACTORY",null,null,null,null,""]
["ESPARGARO Pol",null,null,null,null,null,""]
[null,null,null,null,null,null,""]
["LEKUONA Iker","KTM TECH3",null,null,null,null,""]
["OLIVEIRA Miguel",null,null,null,null,null,""]
[null,null,null,null,null,null,""]
["MIR Joan","SUZUKI TEAM",null,null,null,null,""]
["RINS Alex",null,null,null,null,null,""]
[null,null,null,null,null,null,""]
["ROSSI Valentino","YAMAHA FACTORY",null,null,null,null,""]
["VINALES Maverick",null,null,null,null,null,""]
[null,null,null,null,null,null,""]
["QUARTARARO Fabio","YAMAHA PETRONAS",null,null,null,null,""]
["MORBIDELLI Franco",null,null,null,null,null,""]
[null,null,null,null,null,null,""]

{"sheet":"Portugal","index":17,"n_rows":37,"n_cols":13,"rows_kept":37,"cut":false,"hidden":false,"merged":[[34,2,36,2],[34,1,36,1],[0,0,1,13],[2,0,3,0],[2,1,3,1],[2,2,3,2],[2,3,3,3],[2,4,3,4],[2,5,3,5],[2,6,3,6],[2,8,2,12],[4,1,6,1],[4,2,6,2],[7,1,9,1],[7,2,9,2],[10,1,12,1],[10,2,12,2],[13,1,15,1],[13,2,15,2],[16,1,18,1],[16,2,18,2],[19,1,21,1],[19,2,21,2],[31,1,33,1],[31,2,33,2],[22,1,24,1],[22,2,24,2],[25,1,27,1],[25,2,27,2],[28,1,30,1],[28,2,30,2]]}
["ALGARVE - 22 NOVEMBRE 2020"]
[]
["PILOTES","ECURIES","MOTOS","Finish","Pôle","Pt tour","Points",null,"CLASSEMENT"]
[null,null,null,null,null,null,null,{"$f":"IF(G4=\"\",\"\",(RANK(G4,G4:G23)))","v":""},"ÉCURIES","POINTS","RANG","TOTAL","PONCTUEL"]
["IANNONE Andrea","APRILIA RACING",null,null,null,null,{"$f":"IFERROR(CHOOSE(D5,25,20,165,13,11,10,9,8,7,6,5,4,3,2,1)+(F5=1),\"\")","v":""},null,"YAMAHA PETRONAS",{"$f":"SUM($G$35:$G$37)","v":0},{"$f":"IF(J5=\"\",0,(RANK(J5,$J$5:$J$15)))+COUNTIF(J$5:J5,J5)-1","v":1},{"$f":"SUMIF(Valence!$I$5:$I$15,Portugal!$I5,Valence!$L$5:$L$15)+$J5","v":192},{"$f":"IF(L5=\"\",0,(RANK(L5,$L$5:$L$15)))+COUNTIF(L$5:L5,L5)-1","v":1}]
["ESPARGARO Aleix",null,null,null,null,null,{"$f":"IFERROR(CHOOSE(D6,25,20,165,13,11,10,9,8,7,6,5,4,3,2,1)+(F6=1),\"\")","v":""},null,"DUCATI TEAM",{"$f":"SUM($G$8:$G$10)","v":0},{"$f":"IF(J6=\"\",0,(RANK(J6,$J$5:$J$15)))+COUNTIF(J$5:J6,J6)-1","v":2},{"$f":"SUMIF(Valence!$I$5:$I$15,Portugal!$I6,Valence!$L$5:$L$15)+$J6","v":165},{"$f":"IF(L6=\"\",0,(RANK(L6,$L$5:$L$15)))+COUNTIF(L$5:L6,L6)-1","v":2}]
["BRADLEY Smitth",null,null,null,null,null,"",null,"DUCATI PRAMAC",{"$f":"SUM($G$14:$G$16)","v":0},{"$f":"IF(J7=\"\",0,(RANK(J7,$J$5:$J$15)))+COUNTIF(J$5:J7,J7)-1","v":3},{"$f":"SUMIF(Valence!$I$5:$I$15,Portugal!$I7,Valence!$L$5:$L$15)+$J7","v":117},{"$f":"IF(L7=\"\",0,(RANK(L7,$L$5:$L$15)))+COUNTIF(L$5:L7,L7)-1","v":6}]
["PETRUCCI Danielo","DUCATI TEAM",null,null,null,null,"",null,"YAMAHA FACTORY",{"$f":"SUM($G$32:$G$34)","v":0},{"$f":"IF(J8=\"\",0,(RANK(J8,$J$5:$J$15)))+COUNTIF(J$5:J8,J8)-1","v":4},{"$f":"SUMIF(Valence!$I$5:$I$15,Portugal!$I8,Valence!$L$5:$L$15)+$J8","v":154},{"$f":"IF(L8=\"\",0,(RANK(L8,$L$5:$L$15)))+COUNTIF(L$5:L8,L8)-1","v":4}]
["DEVIZIOSO Andrea",null,null,null,null,null,"",null,"KTM FACTORY",{"$f":"SUM($G$23:$G$25)","v":0},{"$f":"IF(J9=\"\",0,(RANK(J9,$J$5:$J$15)))+COUNTIF(J$5:J9,J9)-1","v":5},{"$f":"SUMIF(Valence!$I$5:$I$15,Portugal!$I9,Valence!$L$5:$L$15)+$J9","v":135},{"$f":"IF(L9=\"\",0,(RANK(L9,$L$5:$L$15)))+COUNTIF(L$5:L9,L9)-1","v":5}]
["PIRRO Michele",null,null,null,null,null,"",null,"KTM TECH3",{"$f":"SUM($G$26:$G$28)","v":0},{"$f":"IF(J10=\"\",0,(RANK(J10,$J$5:$J$15)))+COUNTIF(J$5:J10,J10)-1","v":6},{"$f":"SUMIF(Valence!$I$5:$I$15,Portugal!$I10,Valence!$L$5:$L$15)+$J10","v":86},{"$f":"IF(L10=\"\",0,(RANK(L10,$L$5:$L$15)))+COUNTIF(L$5:L10,L10)-1","v":8}]
["ZARCO Johann","AVINTIA RACING",null,null,null,null,"",null,"HONDA LCR",{"$f":"SUM($G$20:$G$22)","v":0},{"$f":"IF(J11=\"\",0,(RANK(J11,$J$5:$J$15)))+COUNTIF(J$5:J11,J11)-1","v":7},{"$f":"SUMIF(Valence!$I$5:$I$15,Portugal!$I11,Valence!$L$5:$L$15)+$J11","v":94},{"$f":"IF(L11=\"\",0,(RANK(L11,$L$5:$L$15)))+COUNTIF(L$5:L11,L11)-1","v":7}]
["RABAT Tito",null,null,null,null,null,"",null,"HONDA REPSOL",{"$f":"SUM($G$17:$G$19)","v":0},{"$f":"IF(J12=\"\",0,(RANK(J12,$J$5:$J$15)))+COUNTIF(J$5:J12,J12)-1","v":8},{"$f":"SUMIF(Valence!$I$5:$I$15,Portugal!$I12,Valence!$L$5:$L$15)+$J12","v":55},{"$f":"IF(L12=\"\",0,(RANK(L12,$L$5:$L$15)))+COUNTIF(L$5:L12,L12)-1","v":9}]
[null,null,null,null,null,null,"",null,"AVINTIA RACING",{"$f":"SUM($G$11:$G$13)","v":0},{"$f":"IF(J13=\"\",0,(RANK(J13,$J$5:$J$15)))+COUNTIF(J$5:J13,J13)-1","v":9},{"$f":"SUMIF(Valence!$I$5:$I$15,Portugal!$I13,Valence!$L$5:$L$15)+$J13","v":55},{"$f":"IF(L13=\"\",0,(RANK(L13,$L$5:$L$15)))+COUNTIF(L$5:L13,L13)-1","v":10}]
["BAGNAIA Pecco","DUCATI PRAMAC",null,null,null,null,"",null,"APRILIA RACING",{"$f":"SUM($G$5:$G$7)","v":0},{"$f":"IF(J14=\"\",0,(RANK(J14,$J$5:$J$15)))+COUNTIF(J$5:J14,J14)-1","v":10},{"$f":"SUMIF(Valence!$I$5:$I$15,Portugal!$I14,Valence!$L$5:$L$15)+$J14","v":35},{"$f":"IF(L14=\"\",0,(RANK(L14,$L$5:$L$15)))+COUNTIF(L$5:L14,L14)-1","v":11}]
["MILLER Jack",null,null,null,null,null,"",null,"SUZUKI TEAM",{"$f":"SUM($G$29:$G$31)","v":0},{"$f":"IF(J15=\"\",0,(RANK(J15,$J$5:$J$15)))+COUNTIF(J$5:J15,J15)-1","v":11},{"$f":"SUMIF(Valence!$I$5:$I$15,Portugal!$I15,Valence!$L$5:$L$15)+$J15","v":165},{"$f":"IF(L15=\"\",0,(RANK(L15,$L$5:$L$15)))+COUNTIF(L$5:L15,L15)-1","v":3}]
[null,null,null,null,null,null,""]
["MARQUES Alex","HONDA REPSOL",null,null,null,null,""]
["MARQUES Marc",null,null,null,null,null,""]
["BRADL Stephan",null,null,null,null,null,""]
["CRUTCHLOW Cal","HONDA LCR",null,null,null,null,""]
["NAKAGAMI Takaaki",null,null,null,null,null,""]
[null,null,null,null,null,null,""]
["BINDER Brad","KTM FACTORY",null,null,null,null,""]
["ESPARGARO Pol",null,null,null,null,null,""]
[null,null,null,null,null,null,""]
["LEKUONA Iker","KTM TECH3",null,null,null,null,""]
["OLIVEIRA Miguel",null,null,null,null,null,""]
[null,null,null,null,null,null,""]
["MIR Joan","SUZUKI TEAM",null,null,null,null,""]
["RINS Alex",null,null,null,null,null,""]
[null,null,null,null,null,null,""]
["ROSSI Valentino","YAMAHA FACTORY",null,null,null,null,""]
["VINALES Maverick",null,null,null,null,null,""]
[null,null,null,null,null,null,""]
["QUARTARARO Fabio","YAMAHA PETRONAS",null,null,null,null,""]
["MORBIDELLI Franco",null,null,null,null,null,""]
[null,null,null,null,null,null,""]