{"text_format":"1","workbook":"xlsx","n_sheets":3,"sheets":["Parametres","Facture","Import_base_mensuelle"],"not_rendered":{"charts":0,"images":0,"macros":1,"external_links":0,"defined_names":1,"comments":0,"pivot_tables":0},"unopened":[],"bounds":{"document_bytes":16777216,"sheet_cells":100000,"rows_first":2000,"rows_last":500,"rows_between":2000,"halvings":0,"cell_chars":16384,"cell_head_chars":4096},"cells_cut":0,"cells_raw":0,"read":"whole","date_system":"1900"}

{"sheet":"Parametres","index":0,"n_rows":5,"n_cols":3,"rows_kept":5,"cut":false,"hidden":false,"merged":[[3,0,3,1],[4,0,4,1],[0,0,2,6]]}
["PARAMETRES REPERTOIRES STOCKAGE"]
[]
[]
["Archivage facture",null,"C:\\fact clients\\"]
["Import Base Mensuel",null,"S:\\base clients\\"]

{"sheet":"Facture","index":1,"n_rows":30,"n_cols":12,"rows_kept":30,"cut":false,"hidden":false,"merged":[]}
["Date MAJ","N°Client","Nom","Prénom","Commune","Domaine","type Dom","client.Anc","fact xls","fact doc","fact pdf","Commentaire "]
["2015-08-15",14567,{"$f":"VLOOKUP(B2,N_Client,2,FALSE)","v":"Robert"},{"$f":"VLOOKUP(B2,N_Client,3,FALSE)","v":"Pierre"},{"$f":"VLOOKUP(B2,N_Client,4,FALSE)","v":"Lorient"},{"$f":"VLOOKUP(B2,N_Client,5,FALSE)","v":"plast.Fine"},{"$f":"VLOOKUP(B2,N_Client,6,FALSE)","v":"Expansé"},{"$f":"VLOOKUP(B2,N_Client,7,FALSE)","v":"4 m"},"C:\\fact clients\\14567-Expansé.xlsm","C:\\fact clients\\14567-4 m.doc","C:\\fact clients\\14567-4 m.pdf","Traitée"]
[null,13456,"rebattu","claude","Paris","Méca Géné",{"$f":"VLOOKUP(B3,N_Client,6,FALSE)","v":"Acier"},{"$f":"VLOOKUP(B3,N_Client,7,FALSE)","v":" 4A"},null,null,null,"en cours"]
[null,14567,"Robert","Pierre","Lorient","plast.Fine",{"$f":"VLOOKUP(B4,N_Client,6,FALSE)","v":"Expansé"},{"$f":"VLOOKUP(B4,N_Client,7,FALSE)","v":"4 m"},"C:\\fact clients\\14567-Expansé.xlsm","C:\\fact clients\\14567-4 m.doc","C:\\fact clients\\14567-4 m.pdf"]
[null,null,{"$error":"#N/A"},{"$error":"#N/A"},{"$error":"#N/A"},{"$error":"#N/A"},{"$f":"VLOOKUP(B5,N_Client,6,FALSE)","v":{"$error":"#N/A"}},{"$f":"VLOOKUP(B5,N_Client,7,FALSE)","v":{"$error":"#N/A"}}]
[null,null,{"$error":"#N/A"},{"$error":"#N/A"},{"$error":"#N/A"},{"$error":"#N/A"},{"$error":"#N/A"},{"$error":"#N/A"}]
[null,null,{"$error":"#N/A"},{"$error":"#N/A"},{"$error":"#N/A"},{"$error":"#N/A"},{"$error":"#N/A"},{"$error":"#N/A"}]
[null,null,{"$error":"#N/A"},{"$error":"#N/A"},{"$error":"#N/A"},{"$error":"#N/A"},{"$error":"#N/A"},{"$error":"#N/A"}]
[null,null,{"$error":"#N/A"},{"$error":"#N/A"},{"$error":"#N/A"},{"$error":"#N/A"},{"$error":"#N/A"},{"$error":"#N/A"}]
[null,null,{"$error":"#N/A"},{"$error":"#N/A"},{"$error":"#N/A"},{"$error":"#N/A"},{"$error":"#N/A"},{"$error":"#N/A"}]
[null,null,{"$error":"#N/A"},{"$error":"#N/A"},{"$error":"#N/A"},{"$error":"#N/A"},{"$error":"#N/A"},{"$error":"#N/A"}]
[null,null,{"$error":"#N/A"},{"$error":"#N/A"},{"$error":"#N/A"},{"$error":"#N/A"},{"$error":"#N/A"},{"$error":"#N/A"}]
[null,null,{"$error":"#N/A"},{"$error":"#N/A"},{"$error":"#N/A"},{"$error":"#N/A"},{"$error":"#N/A"},{"$error":"#N/A"}]
[null,null,{"$error":"#N/A"},{"$error":"#N/A"},{"$error":"#N/A"},{"$error":"#N/A"},{"$error":"#N/A"},{"$error":"#N/A"}]
[null,null,{"$error":"#N/A"},{"$error":"#N/A"},{"$error":"#N/A"},{"$error":"#N/A"},{"$error":"#N/A"},{"$error":"#N/A"}]
[null,null,{"$error":"#N/A"},{"$error":"#N/A"},{"$error":"#N/A"},{"$error":"#N/A"},{"$error":"#N/A"},{"$error":"#N/A"}]
[null,null,{"$error":"#N/A"},{"$error":"#N/A"},{"$error":"#N/A"},{"$error":"#N/A"},{"$error":"#N/A"},{"$error":"#N/A"}]
[null,null,{"$error":"#N/A"},{"$error":"#N/A"},{"$error":"#N/A"},{"$error":"#N/A"},{"$error":"#N/A"},{"$error":"#N/A"}]
[null,null,{"$error":"#N/A"},{"$error":"#N/A"},{"$error":"#N/A"},{"$error":"#N/A"},{"$error":"#N/A"},{"$error":"#N/A"}]
[null,null,{"$error":"#N/A"},{"$error":"#N/A"},{"$error":"#N/A"},{"$error":"#N/A"},{"$error":"#N/A"},{"$error":"#N/A"}]
[null,null,{"$error":"#N/A"},{"$error":"#N/A"},{"$error":"#N/A"},{"$error":"#N/A"},{"$error":"#N/A"},{"$error":"#N/A"}]
[null,null,{"$error":"#N/A"},{"$error":"#N/A"},{"$error":"#N/A"},{"$error":"#N/A"},{"$error":"#N/A"},{"$error":"#N/A"}]
[null,null,{"$error":"#N/A"},{"$error":"#N/A"},{"$error":"#N/A"},{"$error":"#N/A"},{"$error":"#N/A"},{"$error":"#N/A"}]
[null,null,{"$error":"#N/A"},{"$error":"#N/A"},{"$error":"#N/A"},{"$error":"#N/A"},{"$error":"#N/A"},{"$error":"#N/A"}]
[null,null,{"$error":"#N/A"},{"$error":"#N/A"},{"$error":"#N/A"},{"$error":"#N/A"},{"$error":"#N/A"},{"$error":"#N/A"}]
[null,null,{"$error":"#N/A"},{"$error":"#N/A"},{"$error":"#N/A"},{"$error":"#N/A"},{"$error":"#N/A"},{"$error":"#N/A"}]
[null,null,{"$error":"#N/A"},{"$error":"#N/A"},{"$error":"#N/A"},{"$error":"#N/A"},{"$error":"#N/A"},{"$error":"#N/A"}]
[null,null,{"$error":"#N/A"},{"$error":"#N/A"},{"$error":"#N/A"},{"$error":"#N/A"},{"$error":"#N/A"},{"$error":"#N/A"}]
[null,null,{"$error":"#N/A"},{"$error":"#N/A"},{"$error":"#N/A"},{"$error":"#N/A"},{"$error":"#N/A"},{"$error":"#N/A"}]
[null,null,{"$error":"#N/A"},{"$error":"#N/A"},{"$error":"#N/A"},{"$error":"#N/A"},{"$error":"#N/A"},{"$error":"#N/A"}]

{"sheet":"Import_base_mensuelle","index":2,"n_rows":7,"n_cols":10,"rows_kept":7,"cut":false,"hidden":false,"merged":[]}
["N°Client","Nom","Prénom","Commune","Domaine","type Dom","client.Anc"," "," "," "]
[12345,"Duplot","Jean","Lyon","Méca Géné","Alu","12 M"]
[13456,"rebattu","claude","Paris","Méca Géné","Acier"," 4A"]
[14567,"Robert","Pierre","Lorient","plast.Fine","Expansé","4 m"]
[15678,"grange","agnès","marseille","Verrerie","automobile","7 m"]
[16789,"gagnaire","jean","antibes","Verrerie","batiment","12 m"]
[17890,"Dunjon","pierre","Lyon","Chimie","Phama","1 M"]