{"text_format":"1","workbook":"xlsx","n_sheets":3,"sheets":["Tirage","Alea","Gains"],"not_rendered":{"charts":0,"images":20,"macros":1,"external_links":0,"defined_names":14,"comments":0,"pivot_tables":0},"unopened":[],"bounds":{"document_bytes":16777216,"sheet_cells":100000,"rows_first":2000,"rows_last":500,"rows_between":2000,"halvings":0,"cell_chars":16384,"cell_head_chars":4096},"cells_cut":0,"cells_raw":0,"read":"whole","date_system":"1900"}

{"sheet":"Tirage","index":0,"n_rows":22,"n_cols":15,"rows_kept":22,"cut":false,"hidden":false,"merged":[[8,7,13,7],[8,8,13,8],[8,9,13,9],[15,9,16,9],[8,11,9,13],[10,11,12,13],[16,11,18,13],[3,11,3,13],[4,11,4,13],[5,11,5,13],[18,21,23,22],[6,11,6,13],[7,11,7,13],[13,12,13,13],[14,11,15,13],[19,11,19,13],[20,11,20,13],[21,11,21,13]]}
[]
[{"$f":"INDEX(Alea!$A$1:$A$5,MATCH(LARGE(Alea!$B$1:$B$5,ROW()),Alea!$B$1:$B$5,0))","v":3},{"$f":"INDEX(Alea!$D$1:$D$5,MATCH(LARGE(Alea!$E$1:$E$5,ROW()),Alea!$E$1:$E$5,0))","v":4},{"$f":"INDEX(Alea!$G$1:$G$5,MATCH(LARGE(Alea!$H$1:$H$5,ROW()),Alea!$H$1:$H$5,0))","v":4},{"$f":"INDEX(Alea!$J$1:$J$5,MATCH(LARGE(Alea!$K$1:$K$5,ROW()),Alea!$K$1:$K$5,0))","v":5}]
[null,null,null,null,null,null,null,null,null,null,null,null,null,null,"GAINS"]
[null,null,null,null,null,null,null,null,null,null,null,null,null,null,20]
[null,null,null,null,null,null,null,null,null,null,null,null,null,null,30]
[null,null,null,null,null,null,null,null,null,null,null,null,null,null,40]
[null,null,null,null,null,null,null,null,null,null,null,null,null,null,50]
[null,null,null,null,null,null,null,null,null,null,null,null,null,null,60]
[null,null,null,null,null,null,null,{"$f":"A2","v":3},{"$f":"B2","v":4},{"$f":"C2","v":4},null,null,null,null,80]
[]
[null,null,null,null,null,null,null,null,null,null,null,null,null,null,100]
[]
[]
[null,null,null,null,null,null,null,null,null,null,null,null,null,null,10]
[null,null,null,null,null,null,null,null,null,null,null,null,null,null,15]
[null,null,null,null,null,null,null,"Credits",{"$f":"I19","v":-0.5},1239.5]
[]
[null,null,null,null,null,null,null,null,null,null,null,null,null,null,25]
[null,null,null,null,null,null,null,null,{"$f":"IFERROR(VLOOKUP(A2&B2&C2,tirage3,2,0),IFERROR(VLOOKUP(A2&B2,tirage2,2,0),IFERROR(VLOOKUP(A2&C2,tirage2,2,0),IFERROR(VLOOKUP(B2&C2,tirage2,2,0),-0.5))))","v":-0.5}]
[null,null,null,null,null,null,null,null,null,null,null,null,null,null,250]
[null,null,null,null,null,null,null,null,null,null,null,null,null,null,45]
[null,null,null,null,null,null,null,null,null,null,null,null,null,null,400]

{"sheet":"Alea","index":1,"n_rows":5,"n_cols":11,"rows_kept":5,"cut":false,"hidden":false,"merged":[]}
[1,{"$f":"RAND()","v":0.29442738967836934},null,1,{"$f":"RAND()","v":0.3665153270531436},null,1,{"$f":"RAND()","v":0.95025933033464671},null,1,{"$f":"RAND()","v":0.673654348562577}]
[2,0.99181759620352694,null,2,0.88514897154875216,null,2,0.10139693032535124,null,2,0.97977451956200756]
[3,0.76917141597638117,null,3,0.33780893503071052,null,3,0.37825412382797818,null,3,0.2377072318814939]
[4,2.5350285033274744E-2,null,4,0.57636720781909245,null,4,0.74098466915108929,null,4,0.38225040481781392]
[5,0.66014170073994793,null,5,0.31149733043181893,null,5,0.33297549795754389,null,5,0.73848894855571867]

{"sheet":"Gains","index":2,"n_rows":10,"n_cols":4,"rows_kept":10,"cut":false,"hidden":false,"merged":[]}
["Tirage3","Gain","Tirage2","Gain"]
["111","20","55","10"]
["222","30","66","15"]
["333","40","77","25"]
["444","50","88","45"]
["555","60"]
["666","70"]
["777","100"]
["888","250"]
["999","400"]