{"text_format":"1","workbook":"xlsx","n_sheets":15,"sheets":["Liste attente","Points de service","Provenance","Statut","Nbre dem. reçues","Nbre PEC","Nbre attente","Nbre délai","Intervenants","Résidences","Priorité","Profil","Programmes","Services","Périodes adm."],"not_rendered":{"charts":0,"images":0,"macros":1,"external_links":0,"defined_names":34,"comments":0,"pivot_tables":4},"unopened":[],"bounds":{"document_bytes":16777216,"sheet_cells":100000,"rows_first":2000,"rows_last":500,"rows_between":2000,"halvings":0,"cell_chars":16384,"cell_head_chars":4096},"cells_cut":0,"cells_raw":0,"read":"whole","date_system":"1900"}

{"sheet":"Liste attente","index":0,"n_rows":14,"n_cols":24,"rows_kept":14,"cut":false,"hidden":false,"merged":[]}
[]
["Numéro dossier","Nom","Prénom","Résidence","Adresse (no, rue, ville)","App.","Téléphone","Point de service","Provenance","Date demande","Priorité","Échéance","Jours expirés","Délai","Programme","Service","Profil","Besoins","Commentaires","Date de PEC","Intervenant","Statut","Période","Année fin."]
[null,null,null,null,{"$f":"IFERROR(VLOOKUP(D3,Tab_Résidences[],2,FALSE),\"\")","v":""},null,{"$f":"IFERROR(VLOOKUP(D3,Tab_Résidences[],3,FALSE),\"\")","v":""},null,null,"2020-05-20",null,{"$f":"IF(K3=\"P1\",J3+3,\nIF(K3=\"P2\",J3+14,\nIF(K3=\"P3\",J3+30,\nIF(K3=\"P4\",J3+180,\"\"))))","v":""},{"$f":"IFERROR(VALUE(TODAY()-L3),\"\")","v":""},{"$f":"IF(Tableau1[[#This Row],[Jours expirés]]=\"\",\"\",IF(Tableau1[[#This Row],[Jours expirés]]<0,\"Dans le délai\",\"Hors délai\"))","v":""},null,null,null,null,null,"2020-07-27",null,{"$f":"IF(AND(Tableau1[[#This Row],[Date demande]]<>\"\",Tableau1[[#This Row],[Date de PEC]]<>\"\"),\"Vu\",IF(Tableau1[[#This Row],[Date demande]]<>\"\",\"Actif\",\"\"))","v":"Vu"},{"$f":"IF($J3=\"\",\"\",\nIF($J3<'Périodes adm.'!$B$2,\"Ant.\",\nIF($J3<'Périodes adm.'!$B$3,\"P01\",\nIF($J3<'Périodes adm.'!$B$4,\"P02\",\nIF($J3<'Périodes adm.'!$B$5,\"P03\",\nIF($J3<'Périodes adm.'!$B$6,\"P04\",\nIF($J3<'Périodes adm.'!$B$7,\"P05\",\nIF($J3<'Périodes adm.'!$B$8,\"P06\",\nIF($J3<'Périodes adm.'!$B$9,\"P07\",\nIF($J3<'Périodes adm.'!$B$10,\"P08\",\nIF($J3<'Périodes adm.'!$B$11,\"P09\",\nIF($J3<'Périodes adm.'!$B$12,\"P10\",\nIF($J3<'Périodes adm.'!$B$13,\"P11\",\nIF($J3<'Périodes adm.'!$B$14,\"P12\",\nIF($J3<'Périodes adm.'!$B$15,\"P13\",\nIF($J3<'Périodes adm.'!$B$16,\"P01\",\nIF($J3<'Périodes adm.'!$B$17,\"P02\",\nIF($J3<'Périodes adm.'!$B$18,\"P03\",\nIF($J3<'Périodes adm.'!$B$19,\"P04\",\nIF($J3<'Périodes adm.'!$B$20,\"P05\",\nIF($J3<'Périodes adm.'!$B$21,\"P06\",\nIF($J3<'Périodes adm.'!$B$22,\"P07\",\nIF($J3<'Périodes adm.'!$B$23,\"P08\",\nIF($J3<'Périodes adm.'!$B$24,\"P09\",\nIF($J3<'Périodes adm.'!$B$25,\"P10\",\nIF($J3<'Périodes adm.'!$B$26,\"P11\",\nIF($J3<'Périodes adm.'!$B$27,\"P12\",\nIF($J3<'Périodes adm.'!$B$28,\"P13\",\nIF($J3<'Périodes adm.'!$B$29,\"P01\",\nIF($J3<'Périodes adm.'!$B$30,\"P02\",\nIF($J3<'Périodes adm.'!$B$31,\"P03\",\nIF($J3<'Périodes adm.'!$B$32,\"P04\",\nIF($J3<'Périodes adm.'!$B$33,\"P05\",\nIF($J3<'Périodes adm.'!$B$34,\"P06\",\nIF($J3<'Périodes adm.'!$B$35,\"P07\",\nIF($J3<'Périodes adm.'!$B$36,\"P08\",\nIF($J3<'Périodes adm.'!$B$37,\"P09\",\nIF($J3<'Périodes adm.'!$B$38,\"P10\",\nIF($J3<'Périodes adm.'!$B$39,\"P11\",\nIF($J3<'Périodes adm.'!$B$40,\"P12\",\nIF($J3<'Périodes adm.'!$B$41,\"P13\",\nIF($J3<'Périodes adm.'!$B$42,\"P01\",\nIF($J3<'Périodes adm.'!$B$43,\"P02\",\nIF($J3<'Périodes adm.'!$B$44,\"P03\",\nIF($J3<'Périodes adm.'!$B$45,\"P04\",\nIF($J3<'Périodes adm.'!$B$46,\"P05\",\nIF($J3<'Périodes adm.'!$B$47,\"P06\",\nIF($J3<'Périodes adm.'!$B$48,\"P07\",\nIF($J3<'Périodes adm.'!$B$49,\"P08\",\nIF($J3<'Périodes adm.'!$B$50,\"P09\",\nIF($J3<'Périodes adm.'!$B$51,\"P10\",\nIF($J3<'Périodes adm.'!$B$52,\"P11\",\nIF($J3<'Périodes adm.'!$B$53,\"P12\",\nIF($J3<'Périodes adm.'!$B$54,\"P13\",\n\"\"))))))))))))))))))))))))))))))))))))))))))))))))))))))","v":"P02"},{"$f":"IF(Tableau1[[#This Row],[Date demande]]=\"\",\"\",\nIF(Tableau1[[#This Row],[Date demande]]<'Périodes adm.'!$B$15,\"2018-2019\",\nIF(Tableau1[[#This Row],[Date demande]]<'Périodes adm.'!$B$28,\"2019-2020\",\nIF(Tableau1[[#This Row],[Date demande]]<'Périodes adm.'!$B$41,\"2020-2021\",\nIF(Tableau1[[#This Row],[Date demande]]<'Périodes adm.'!$B$54,\"2021-2022\",\nIF(Tableau1[[#This Row],[Date demande]]<'Périodes adm.'!$B$67,\"2022-2023\",\nIF(Tableau1[[#This Row],[Date demande]]<'Périodes adm.'!$B$80,\"2023-2024\",\"\")))))))","v":"2020-2021"}]
[null,null,null,null,{"$f":"IFERROR(VLOOKUP(D4,Tab_Résidences[],2,FALSE),\"\")","v":""},null,{"$f":"IFERROR(VLOOKUP(D4,Tab_Résidences[],3,FALSE),\"\")","v":""},null,null,null,null,{"$f":"IF(K4=\"P1\",J4+3,\nIF(K4=\"P2\",J4+14,\nIF(K4=\"P3\",J4+30,\nIF(K4=\"P4\",J4+180,\"\"))))","v":""},{"$f":"IFERROR(VALUE(TODAY()-L4),\"\")","v":""},{"$f":"IF(Tableau1[[#This Row],[Jours expirés]]=\"\",\"\",IF(Tableau1[[#This Row],[Jours expirés]]<0,\"Dans le délai\",\"Hors délai\"))","v":""},null,null,null,null,null,null,null,{"$f":"IF(AND(Tableau1[[#This Row],[Date demande]]<>\"\",Tableau1[[#This Row],[Date de PEC]]<>\"\"),\"Vu\",IF(Tableau1[[#This Row],[Date demande]]<>\"\",\"Actif\",\"\"))","v":""},{"$f":"IF($J4=\"\",\"\",\nIF($J4<'Périodes adm.'!$B$2,\"Ant.\",\nIF($J4<'Périodes adm.'!$B$3,\"P01\",\nIF($J4<'Périodes adm.'!$B$4,\"P02\",\nIF($J4<'Périodes adm.'!$B$5,\"P03\",\nIF($J4<'Périodes adm.'!$B$6,\"P04\",\nIF($J4<'Périodes adm.'!$B$7,\"P05\",\nIF($J4<'Périodes adm.'!$B$8,\"P06\",\nIF($J4<'Périodes adm.'!$B$9,\"P07\",\nIF($J4<'Périodes adm.'!$B$10,\"P08\",\nIF($J4<'Périodes adm.'!$B$11,\"P09\",\nIF($J4<'Périodes adm.'!$B$12,\"P10\",\nIF($J4<'Périodes adm.'!$B$13,\"P11\",\nIF($J4<'Périodes adm.'!$B$14,\"P12\",\nIF($J4<'Périodes adm.'!$B$15,\"P13\",\nIF($J4<'Périodes adm.'!$B$16,\"P01\",\nIF($J4<'Périodes adm.'!$B$17,\"P02\",\nIF($J4<'Périodes adm.'!$B$18,\"P03\",\nIF($J4<'Périodes adm.'!$B$19,\"P04\",\nIF($J4<'Périodes adm.'!$B$20,\"P05\",\nIF($J4<'Périodes adm.'!$B$21,\"P06\",\nIF($J4<'Périodes adm.'!$B$22,\"P07\",\nIF($J4<'Périodes adm.'!$B$23,\"P08\",\nIF($J4<'Périodes adm.'!$B$24,\"P09\",\nIF($J4<'Périodes adm.'!$B$25,\"P10\",\nIF($J4<'Périodes adm.'!$B$26,\"P11\",\nIF($J4<'Périodes adm.'!$B$27,\"P12\",\nIF($J4<'Périodes adm.'!$B$28,\"P13\",\nIF($J4<'Périodes adm.'!$B$29,\"P01\",\nIF($J4<'Périodes adm.'!$B$30,\"P02\",\nIF($J4<'Périodes adm.'!$B$31,\"P03\",\nIF($J4<'Périodes adm.'!$B$32,\"P04\",\nIF($J4<'Périodes adm.'!$B$33,\"P05\",\nIF($J4<'Périodes adm.'!$B$34,\"P06\",\nIF($J4<'Périodes adm.'!$B$35,\"P07\",\nIF($J4<'Périodes adm.'!$B$36,\"P08\",\nIF($J4<'Périodes adm.'!$B$37,\"P09\",\nIF($J4<'Périodes adm.'!$B$38,\"P10\",\nIF($J4<'Périodes adm.'!$B$39,\"P11\",\nIF($J4<'Périodes adm.'!$B$40,\"P12\",\nIF($J4<'Périodes adm.'!$B$41,\"P13\",\nIF($J4<'Périodes adm.'!$B$42,\"P01\",\nIF($J4<'Périodes adm.'!$B$43,\"P02\",\nIF($J4<'Périodes adm.'!$B$44,\"P03\",\nIF($J4<'Périodes adm.'!$B$45,\"P04\",\nIF($J4<'Périodes adm.'!$B$46,\"P05\",\nIF($J4<'Périodes adm.'!$B$47,\"P06\",\nIF($J4<'Périodes adm.'!$B$48,\"P07\",\nIF($J4<'Périodes adm.'!$B$49,\"P08\",\nIF($J4<'Périodes adm.'!$B$50,\"P09\",\nIF($J4<'Périodes adm.'!$B$51,\"P10\",\nIF($J4<'Périodes adm.'!$B$52,\"P11\",\nIF($J4<'Périodes adm.'!$B$53,\"P12\",\nIF($J4<'Périodes adm.'!$B$54,\"P13\",\n\"\"))))))))))))))))))))))))))))))))))))))))))))))))))))))","v":""},{"$f":"IF(Tableau1[[#This Row],[Date demande]]=\"\",\"\",\nIF(Tableau1[[#This Row],[Date demande]]<'Périodes adm.'!$B$15,\"2018-2019\",\nIF(Tableau1[[#This Row],[Date demande]]<'Périodes adm.'!$B$28,\"2019-2020\",\nIF(Tableau1[[#This Row],[Date demande]]<'Périodes adm.'!$B$41,\"2020-2021\",\nIF(Tableau1[[#This Row],[Date demande]]<'Périodes adm.'!$B$54,\"2021-2022\",\nIF(Tableau1[[#This Row],[Date demande]]<'Périodes adm.'!$B$67,\"2022-2023\",\nIF(Tableau1[[#This Row],[Date demande]]<'Périodes adm.'!$B$80,\"2023-2024\",\"\")))))))","v":""}]
[null,null,null,null,{"$f":"IFERROR(VLOOKUP(D5,Tab_Résidences[],2,FALSE),\"\")","v":""},null,{"$f":"IFERROR(VLOOKUP(D5,Tab_Résidences[],3,FALSE),\"\")","v":""},null,null,"2020-01-01",null,{"$f":"IF(K5=\"P1\",J5+3,\nIF(K5=\"P2\",J5+14,\nIF(K5=\"P3\",J5+30,\nIF(K5=\"P4\",J5+180,\"\"))))","v":""},"",{"$f":"IF(Tableau1[[#This Row],[Jours expirés]]=\"\",\"\",IF(Tableau1[[#This Row],[Jours expirés]]<0,\"Dans le délai\",\"Hors délai\"))","v":""},"Santé physique",null,null,null,null,"2021-02-25",null,{"$f":"IF(AND(Tableau1[[#This Row],[Date demande]]<>\"\",Tableau1[[#This Row],[Date de PEC]]<>\"\"),\"Vu\",IF(Tableau1[[#This Row],[Date demande]]<>\"\",\"Actif\",\"\"))","v":"Vu"},{"$f":"IF($J5=\"\",\"\",\nIF($J5<'Périodes adm.'!$B$2,\"Ant.\",\nIF($J5<'Périodes adm.'!$B$3,\"P01\",\nIF($J5<'Périodes adm.'!$B$4,\"P02\",\nIF($J5<'Périodes adm.'!$B$5,\"P03\",\nIF($J5<'Périodes adm.'!$B$6,\"P04\",\nIF($J5<'Périodes adm.'!$B$7,\"P05\",\nIF($J5<'Périodes adm.'!$B$8,\"P06\",\nIF($J5<'Périodes adm.'!$B$9,\"P07\",\nIF($J5<'Périodes adm.'!$B$10,\"P08\",\nIF($J5<'Périodes adm.'!$B$11,\"P09\",\nIF($J5<'Périodes adm.'!$B$12,\"P10\",\nIF($J5<'Périodes adm.'!$B$13,\"P11\",\nIF($J5<'Périodes adm.'!$B$14,\"P12\",\nIF($J5<'Périodes adm.'!$B$15,\"P13\",\nIF($J5<'Périodes adm.'!$B$16,\"P01\",\nIF($J5<'Périodes adm.'!$B$17,\"P02\",\nIF($J5<'Périodes adm.'!$B$18,\"P03\",\nIF($J5<'Périodes adm.'!$B$19,\"P04\",\nIF($J5<'Périodes adm.'!$B$20,\"P05\",\nIF($J5<'Périodes adm.'!$B$21,\"P06\",\nIF($J5<'Périodes adm.'!$B$22,\"P07\",\nIF($J5<'Périodes adm.'!$B$23,\"P08\",\nIF($J5<'Périodes adm.'!$B$24,\"P09\",\nIF($J5<'Périodes adm.'!$B$25,\"P10\",\nIF($J5<'Périodes adm.'!$B$26,\"P11\",\nIF($J5<'Périodes adm.'!$B$27,\"P12\",\nIF($J5<'Périodes adm.'!$B$28,\"P13\",\nIF($J5<'Périodes adm.'!$B$29,\"P01\",\nIF($J5<'Périodes adm.'!$B$30,\"P02\",\nIF($J5<'Périodes adm.'!$B$31,\"P03\",\nIF($J5<'Périodes adm.'!$B$32,\"P04\",\nIF($J5<'Périodes adm.'!$B$33,\"P05\",\nIF($J5<'Périodes adm.'!$B$34,\"P06\",\nIF($J5<'Périodes adm.'!$B$35,\"P07\",\nIF($J5<'Périodes adm.'!$B$36,\"P08\",\nIF($J5<'Périodes adm.'!$B$37,\"P09\",\nIF($J5<'Périodes adm.'!$B$38,\"P10\",\nIF($J5<'Périodes adm.'!$B$39,\"P11\",\nIF($J5<'Périodes adm.'!$B$40,\"P12\",\nIF($J5<'Périodes adm.'!$B$41,\"P13\",\nIF($J5<'Périodes adm.'!$B$42,\"P01\",\nIF($J5<'Périodes adm.'!$B$43,\"P02\",\nIF($J5<'Périodes adm.'!$B$44,\"P03\",\nIF($J5<'Périodes adm.'!$B$45,\"P04\",\nIF($J5<'Périodes adm.'!$B$46,\"P05\",\nIF($J5<'Périodes adm.'!$B$47,\"P06\",\nIF($J5<'Périodes adm.'!$B$48,\"P07\",\nIF($J5<'Périodes adm.'!$B$49,\"P08\",\nIF($J5<'Périodes adm.'!$B$50,\"P09\",\nIF($J5<'Périodes adm.'!$B$51,\"P10\",\nIF($J5<'Périodes adm.'!$B$52,\"P11\",\nIF($J5<'Périodes adm.'!$B$53,\"P12\",\nIF($J5<'Périodes adm.'!$B$54,\"P13\",\n\"\"))))))))))))))))))))))))))))))))))))))))))))))))))))))","v":"P10"},{"$f":"IF(Tableau1[[#This Row],[Date demande]]=\"\",\"\",\nIF(Tableau1[[#This Row],[Date demande]]<'Périodes adm.'!$B$15,\"2018-2019\",\nIF(Tableau1[[#This Row],[Date demande]]<'Périodes adm.'!$B$28,\"2019-2020\",\nIF(Tableau1[[#This Row],[Date demande]]<'Périodes adm.'!$B$41,\"2020-2021\",\nIF(Tableau1[[#This Row],[Date demande]]<'Périodes adm.'!$B$54,\"2021-2022\",\nIF(Tableau1[[#This Row],[Date demande]]<'Périodes adm.'!$B$67,\"2022-2023\",\nIF(Tableau1[[#This Row],[Date demande]]<'Périodes adm.'!$B$80,\"2023-2024\",\"\")))))))","v":"2019-2020"}]
[null,null,null,null,{"$f":"IFERROR(VLOOKUP(D6,Tab_Résidences[],2,FALSE),\"\")","v":""},null,{"$f":"IFERROR(VLOOKUP(D6,Tab_Résidences[],3,FALSE),\"\")","v":""},null,null,"2020-04-01",null,"","",{"$f":"IF(Tableau1[[#This Row],[Jours expirés]]=\"\",\"\",IF(Tableau1[[#This Row],[Jours expirés]]<0,\"Dans le délai\",\"Hors délai\"))","v":""},null,null,null,null,null,null,null,{"$f":"IF(AND(Tableau1[[#This Row],[Date demande]]<>\"\",Tableau1[[#This Row],[Date de PEC]]<>\"\"),\"Vu\",IF(Tableau1[[#This Row],[Date demande]]<>\"\",\"Actif\",\"\"))","v":"Actif"},{"$f":"IF($J6=\"\",\"\",\nIF($J6<'Périodes adm.'!$B$2,\"Ant.\",\nIF($J6<'Périodes adm.'!$B$3,\"P01\",\nIF($J6<'Périodes adm.'!$B$4,\"P02\",\nIF($J6<'Périodes adm.'!$B$5,\"P03\",\nIF($J6<'Périodes adm.'!$B$6,\"P04\",\nIF($J6<'Périodes adm.'!$B$7,\"P05\",\nIF($J6<'Périodes adm.'!$B$8,\"P06\",\nIF($J6<'Périodes adm.'!$B$9,\"P07\",\nIF($J6<'Périodes adm.'!$B$10,\"P08\",\nIF($J6<'Périodes adm.'!$B$11,\"P09\",\nIF($J6<'Périodes adm.'!$B$12,\"P10\",\nIF($J6<'Périodes adm.'!$B$13,\"P11\",\nIF($J6<'Périodes adm.'!$B$14,\"P12\",\nIF($J6<'Périodes adm.'!$B$15,\"P13\",\nIF($J6<'Périodes adm.'!$B$16,\"P01\",\nIF($J6<'Périodes adm.'!$B$17,\"P02\",\nIF($J6<'Périodes adm.'!$B$18,\"P03\",\nIF($J6<'Périodes adm.'!$B$19,\"P04\",\nIF($J6<'Périodes adm.'!$B$20,\"P05\",\nIF($J6<'Périodes adm.'!$B$21,\"P06\",\nIF($J6<'Périodes adm.'!$B$22,\"P07\",\nIF($J6<'Périodes adm.'!$B$23,\"P08\",\nIF($J6<'Périodes adm.'!$B$24,\"P09\",\nIF($J6<'Périodes adm.'!$B$25,\"P10\",\nIF($J6<'Périodes adm.'!$B$26,\"P11\",\nIF($J6<'Périodes adm.'!$B$27,\"P12\",\nIF($J6<'Périodes adm.'!$B$28,\"P13\",\nIF($J6<'Périodes adm.'!$B$29,\"P01\",\nIF($J6<'Périodes adm.'!$B$30,\"P02\",\nIF($J6<'Périodes adm.'!$B$31,\"P03\",\nIF($J6<'Périodes adm.'!$B$32,\"P04\",\nIF($J6<'Périodes adm.'!$B$33,\"P05\",\nIF($J6<'Périodes adm.'!$B$34,\"P06\",\nIF($J6<'Périodes adm.'!$B$35,\"P07\",\nIF($J6<'Périodes adm.'!$B$36,\"P08\",\nIF($J6<'Périodes adm.'!$B$37,\"P09\",\nIF($J6<'Périodes adm.'!$B$38,\"P10\",\nIF($J6<'Périodes adm.'!$B$39,\"P11\",\nIF($J6<'Périodes adm.'!$B$40,\"P12\",\nIF($J6<'Périodes adm.'!$B$41,\"P13\",\nIF($J6<'Périodes adm.'!$B$42,\"P01\",\nIF($J6<'Périodes adm.'!$B$43,\"P02\",\nIF($J6<'Périodes adm.'!$B$44,\"P03\",\nIF($J6<'Périodes adm.'!$B$45,\"P04\",\nIF($J6<'Périodes adm.'!$B$46,\"P05\",\nIF($J6<'Périodes adm.'!$B$47,\"P06\",\nIF($J6<'Périodes adm.'!$B$48,\"P07\",\nIF($J6<'Périodes adm.'!$B$49,\"P08\",\nIF($J6<'Périodes adm.'!$B$50,\"P09\",\nIF($J6<'Périodes adm.'!$B$51,\"P10\",\nIF($J6<'Périodes adm.'!$B$52,\"P11\",\nIF($J6<'Périodes adm.'!$B$53,\"P12\",\nIF($J6<'Périodes adm.'!$B$54,\"P13\",\n\"\"))))))))))))))))))))))))))))))))))))))))))))))))))))))","v":"P01"},{"$f":"IF(Tableau1[[#This Row],[Date demande]]=\"\",\"\",\nIF(Tableau1[[#This Row],[Date demande]]<'Périodes adm.'!$B$15,\"2018-2019\",\nIF(Tableau1[[#This Row],[Date demande]]<'Périodes adm.'!$B$28,\"2019-2020\",\nIF(Tableau1[[#This Row],[Date demande]]<'Périodes adm.'!$B$41,\"2020-2021\",\nIF(Tableau1[[#This Row],[Date demande]]<'Périodes adm.'!$B$54,\"2021-2022\",\nIF(Tableau1[[#This Row],[Date demande]]<'Périodes adm.'!$B$67,\"2022-2023\",\nIF(Tableau1[[#This Row],[Date demande]]<'Périodes adm.'!$B$80,\"2023-2024\",\"\")))))))","v":"2020-2021"}]
[null,null,null,null,{"$f":"IFERROR(VLOOKUP(D7,Tab_Résidences[],2,FALSE),\"\")","v":""},null,{"$f":"IFERROR(VLOOKUP(D7,Tab_Résidences[],3,FALSE),\"\")","v":""},null,null,"2021-03-31",null,"","",{"$f":"IF(Tableau1[[#This Row],[Jours expirés]]=\"\",\"\",IF(Tableau1[[#This Row],[Jours expirés]]<0,\"Dans le délai\",\"Hors délai\"))","v":""},null,null,null,null,null,"2022-09-15",null,{"$f":"IF(AND(Tableau1[[#This Row],[Date demande]]<>\"\",Tableau1[[#This Row],[Date de PEC]]<>\"\"),\"Vu\",IF(Tableau1[[#This Row],[Date demande]]<>\"\",\"Actif\",\"\"))","v":"Vu"},{"$f":"IF($J7=\"\",\"\",\nIF($J7<'Périodes adm.'!$B$2,\"Ant.\",\nIF($J7<'Périodes adm.'!$B$3,\"P01\",\nIF($J7<'Périodes adm.'!$B$4,\"P02\",\nIF($J7<'Périodes adm.'!$B$5,\"P03\",\nIF($J7<'Périodes adm.'!$B$6,\"P04\",\nIF($J7<'Périodes adm.'!$B$7,\"P05\",\nIF($J7<'Périodes adm.'!$B$8,\"P06\",\nIF($J7<'Périodes adm.'!$B$9,\"P07\",\nIF($J7<'Périodes adm.'!$B$10,\"P08\",\nIF($J7<'Périodes adm.'!$B$11,\"P09\",\nIF($J7<'Périodes adm.'!$B$12,\"P10\",\nIF($J7<'Périodes adm.'!$B$13,\"P11\",\nIF($J7<'Périodes adm.'!$B$14,\"P12\",\nIF($J7<'Périodes adm.'!$B$15,\"P13\",\nIF($J7<'Périodes adm.'!$B$16,\"P01\",\nIF($J7<'Périodes adm.'!$B$17,\"P02\",\nIF($J7<'Périodes adm.'!$B$18,\"P03\",\nIF($J7<'Périodes adm.'!$B$19,\"P04\",\nIF($J7<'Périodes adm.'!$B$20,\"P05\",\nIF($J7<'Périodes adm.'!$B$21,\"P06\",\nIF($J7<'Périodes adm.'!$B$22,\"P07\",\nIF($J7<'Périodes adm.'!$B$23,\"P08\",\nIF($J7<'Périodes adm.'!$B$24,\"P09\",\nIF($J7<'Périodes adm.'!$B$25,\"P10\",\nIF($J7<'Périodes adm.'!$B$26,\"P11\",\nIF($J7<'Périodes adm.'!$B$27,\"P12\",\nIF($J7<'Périodes adm.'!$B$28,\"P13\",\nIF($J7<'Périodes adm.'!$B$29,\"P01\",\nIF($J7<'Périodes adm.'!$B$30,\"P02\",\nIF($J7<'Périodes adm.'!$B$31,\"P03\",\nIF($J7<'Périodes adm.'!$B$32,\"P04\",\nIF($J7<'Périodes adm.'!$B$33,\"P05\",\nIF($J7<'Périodes adm.'!$B$34,\"P06\",\nIF($J7<'Périodes adm.'!$B$35,\"P07\",\nIF($J7<'Périodes adm.'!$B$36,\"P08\",\nIF($J7<'Périodes adm.'!$B$37,\"P09\",\nIF($J7<'Périodes adm.'!$B$38,\"P10\",\nIF($J7<'Périodes adm.'!$B$39,\"P11\",\nIF($J7<'Périodes adm.'!$B$40,\"P12\",\nIF($J7<'Périodes adm.'!$B$41,\"P13\",\nIF($J7<'Périodes adm.'!$B$42,\"P01\",\nIF($J7<'Périodes adm.'!$B$43,\"P02\",\nIF($J7<'Périodes adm.'!$B$44,\"P03\",\nIF($J7<'Périodes adm.'!$B$45,\"P04\",\nIF($J7<'Périodes adm.'!$B$46,\"P05\",\nIF($J7<'Périodes adm.'!$B$47,\"P06\",\nIF($J7<'Périodes adm.'!$B$48,\"P07\",\nIF($J7<'Périodes adm.'!$B$49,\"P08\",\nIF($J7<'Périodes adm.'!$B$50,\"P09\",\nIF($J7<'Périodes adm.'!$B$51,\"P10\",\nIF($J7<'Périodes adm.'!$B$52,\"P11\",\nIF($J7<'Périodes adm.'!$B$53,\"P12\",\nIF($J7<'Périodes adm.'!$B$54,\"P13\",\n\"\"))))))))))))))))))))))))))))))))))))))))))))))))))))))","v":"P13"},{"$f":"IF(Tableau1[[#This Row],[Date demande]]=\"\",\"\",\nIF(Tableau1[[#This Row],[Date demande]]<'Périodes adm.'!$B$15,\"2018-2019\",\nIF(Tableau1[[#This Row],[Date demande]]<'Périodes adm.'!$B$28,\"2019-2020\",\nIF(Tableau1[[#This Row],[Date demande]]<'Périodes adm.'!$B$41,\"2020-2021\",\nIF(Tableau1[[#This Row],[Date demande]]<'Périodes adm.'!$B$54,\"2021-2022\",\nIF(Tableau1[[#This Row],[Date demande]]<'Périodes adm.'!$B$67,\"2022-2023\",\nIF(Tableau1[[#This Row],[Date demande]]<'Périodes adm.'!$B$80,\"2023-2024\",\"\")))))))","v":"2020-2021"}]
[null,null,null,null,{"$f":"IFERROR(VLOOKUP(D8,Tab_Résidences[],2,FALSE),\"\")","v":""},null,{"$f":"IFERROR(VLOOKUP(D8,Tab_Résidences[],3,FALSE),\"\")","v":""},null,null,"2021-04-01",null,"","",{"$f":"IF(Tableau1[[#This Row],[Jours expirés]]=\"\",\"\",IF(Tableau1[[#This Row],[Jours expirés]]<0,\"Dans le délai\",\"Hors délai\"))","v":""},null,null,null,null,null,null,null,{"$f":"IF(AND(Tableau1[[#This Row],[Date demande]]<>\"\",Tableau1[[#This Row],[Date de PEC]]<>\"\"),\"Vu\",IF(Tableau1[[#This Row],[Date demande]]<>\"\",\"Actif\",\"\"))","v":"Actif"},{"$f":"IF($J8=\"\",\"\",\nIF($J8<'Périodes adm.'!$B$2,\"Ant.\",\nIF($J8<'Périodes adm.'!$B$3,\"P01\",\nIF($J8<'Périodes adm.'!$B$4,\"P02\",\nIF($J8<'Périodes adm.'!$B$5,\"P03\",\nIF($J8<'Périodes adm.'!$B$6,\"P04\",\nIF($J8<'Périodes adm.'!$B$7,\"P05\",\nIF($J8<'Périodes adm.'!$B$8,\"P06\",\nIF($J8<'Périodes adm.'!$B$9,\"P07\",\nIF($J8<'Périodes adm.'!$B$10,\"P08\",\nIF($J8<'Périodes adm.'!$B$11,\"P09\",\nIF($J8<'Périodes adm.'!$B$12,\"P10\",\nIF($J8<'Périodes adm.'!$B$13,\"P11\",\nIF($J8<'Périodes adm.'!$B$14,\"P12\",\nIF($J8<'Périodes adm.'!$B$15,\"P13\",\nIF($J8<'Périodes adm.'!$B$16,\"P01\",\nIF($J8<'Périodes adm.'!$B$17,\"P02\",\nIF($J8<'Périodes adm.'!$B$18,\"P03\",\nIF($J8<'Périodes adm.'!$B$19,\"P04\",\nIF($J8<'Périodes adm.'!$B$20,\"P05\",\nIF($J8<'Périodes adm.'!$B$21,\"P06\",\nIF($J8<'Périodes adm.'!$B$22,\"P07\",\nIF($J8<'Périodes adm.'!$B$23,\"P08\",\nIF($J8<'Périodes adm.'!$B$24,\"P09\",\nIF($J8<'Périodes adm.'!$B$25,\"P10\",\nIF($J8<'Périodes adm.'!$B$26,\"P11\",\nIF($J8<'Périodes adm.'!$B$27,\"P12\",\nIF($J8<'Périodes adm.'!$B$28,\"P13\",\nIF($J8<'Périodes adm.'!$B$29,\"P01\",\nIF($J8<'Périodes adm.'!$B$30,\"P02\",\nIF($J8<'Périodes adm.'!$B$31,\"P03\",\nIF($J8<'Périodes adm.'!$B$32,\"P04\",\nIF($J8<'Périodes adm.'!$B$33,\"P05\",\nIF($J8<'Périodes adm.'!$B$34,\"P06\",\nIF($J8<'Périodes adm.'!$B$35,\"P07\",\nIF($J8<'Périodes adm.'!$B$36,\"P08\",\nIF($J8<'Périodes adm.'!$B$37,\"P09\",\nIF($J8<'Périodes adm.'!$B$38,\"P10\",\nIF($J8<'Périodes adm.'!$B$39,\"P11\",\nIF($J8<'Périodes adm.'!$B$40,\"P12\",\nIF($J8<'Périodes adm.'!$B$41,\"P13\",\nIF($J8<'Périodes adm.'!$B$42,\"P01\",\nIF($J8<'Périodes adm.'!$B$43,\"P02\",\nIF($J8<'Périodes adm.'!$B$44,\"P03\",\nIF($J8<'Périodes adm.'!$B$45,\"P04\",\nIF($J8<'Périodes adm.'!$B$46,\"P05\",\nIF($J8<'Périodes adm.'!$B$47,\"P06\",\nIF($J8<'Périodes adm.'!$B$48,\"P07\",\nIF($J8<'Périodes adm.'!$B$49,\"P08\",\nIF($J8<'Périodes adm.'!$B$50,\"P09\",\nIF($J8<'Périodes adm.'!$B$51,\"P10\",\nIF($J8<'Périodes adm.'!$B$52,\"P11\",\nIF($J8<'Périodes adm.'!$B$53,\"P12\",\nIF($J8<'Périodes adm.'!$B$54,\"P13\",\n\"\"))))))))))))))))))))))))))))))))))))))))))))))))))))))","v":"P01"},{"$f":"IF(Tableau1[[#This Row],[Date demande]]=\"\",\"\",\nIF(Tableau1[[#This Row],[Date demande]]<'Périodes adm.'!$B$15,\"2018-2019\",\nIF(Tableau1[[#This Row],[Date demande]]<'Périodes adm.'!$B$28,\"2019-2020\",\nIF(Tableau1[[#This Row],[Date demande]]<'Périodes adm.'!$B$41,\"2020-2021\",\nIF(Tableau1[[#This Row],[Date demande]]<'Périodes adm.'!$B$54,\"2021-2022\",\nIF(Tableau1[[#This Row],[Date demande]]<'Périodes adm.'!$B$67,\"2022-2023\",\nIF(Tableau1[[#This Row],[Date demande]]<'Périodes adm.'!$B$80,\"2023-2024\",\"\")))))))","v":"2021-2022"}]
[null,null,null,null,{"$f":"IFERROR(VLOOKUP(D9,Tab_Résidences[],2,FALSE),\"\")","v":""},null,{"$f":"IFERROR(VLOOKUP(D9,Tab_Résidences[],3,FALSE),\"\")","v":""},null,null,"2022-03-31",null,"","",{"$f":"IF(Tableau1[[#This Row],[Jours expirés]]=\"\",\"\",IF(Tableau1[[#This Row],[Jours expirés]]<0,\"Dans le délai\",\"Hors délai\"))","v":""},null,null,null,null,null,null,null,{"$f":"IF(AND(Tableau1[[#This Row],[Date demande]]<>\"\",Tableau1[[#This Row],[Date de PEC]]<>\"\"),\"Vu\",IF(Tableau1[[#This Row],[Date demande]]<>\"\",\"Actif\",\"\"))","v":"Actif"},{"$f":"IF($J9=\"\",\"\",\nIF($J9<'Périodes adm.'!$B$2,\"Ant.\",\nIF($J9<'Périodes adm.'!$B$3,\"P01\",\nIF($J9<'Périodes adm.'!$B$4,\"P02\",\nIF($J9<'Périodes adm.'!$B$5,\"P03\",\nIF($J9<'Périodes adm.'!$B$6,\"P04\",\nIF($J9<'Périodes adm.'!$B$7,\"P05\",\nIF($J9<'Périodes adm.'!$B$8,\"P06\",\nIF($J9<'Périodes adm.'!$B$9,\"P07\",\nIF($J9<'Périodes adm.'!$B$10,\"P08\",\nIF($J9<'Périodes adm.'!$B$11,\"P09\",\nIF($J9<'Périodes adm.'!$B$12,\"P10\",\nIF($J9<'Périodes adm.'!$B$13,\"P11\",\nIF($J9<'Périodes adm.'!$B$14,\"P12\",\nIF($J9<'Périodes adm.'!$B$15,\"P13\",\nIF($J9<'Périodes adm.'!$B$16,\"P01\",\nIF($J9<'Périodes adm.'!$B$17,\"P02\",\nIF($J9<'Périodes adm.'!$B$18,\"P03\",\nIF($J9<'Périodes adm.'!$B$19,\"P04\",\nIF($J9<'Périodes adm.'!$B$20,\"P05\",\nIF($J9<'Périodes adm.'!$B$21,\"P06\",\nIF($J9<'Périodes adm.'!$B$22,\"P07\",\nIF($J9<'Périodes adm.'!$B$23,\"P08\",\nIF($J9<'Périodes adm.'!$B$24,\"P09\",\nIF($J9<'Périodes adm.'!$B$25,\"P10\",\nIF($J9<'Périodes adm.'!$B$26,\"P11\",\nIF($J9<'Périodes adm.'!$B$27,\"P12\",\nIF($J9<'Périodes adm.'!$B$28,\"P13\",\nIF($J9<'Périodes adm.'!$B$29,\"P01\",\nIF($J9<'Périodes adm.'!$B$30,\"P02\",\nIF($J9<'Périodes adm.'!$B$31,\"P03\",\nIF($J9<'Périodes adm.'!$B$32,\"P04\",\nIF($J9<'Périodes adm.'!$B$33,\"P05\",\nIF($J9<'Périodes adm.'!$B$34,\"P06\",\nIF($J9<'Périodes adm.'!$B$35,\"P07\",\nIF($J9<'Périodes adm.'!$B$36,\"P08\",\nIF($J9<'Périodes adm.'!$B$37,\"P09\",\nIF($J9<'Périodes adm.'!$B$38,\"P10\",\nIF($J9<'Périodes adm.'!$B$39,\"P11\",\nIF($J9<'Périodes adm.'!$B$40,\"P12\",\nIF($J9<'Périodes adm.'!$B$41,\"P13\",\nIF($J9<'Périodes adm.'!$B$42,\"P01\",\nIF($J9<'Périodes adm.'!$B$43,\"P02\",\nIF($J9<'Périodes adm.'!$B$44,\"P03\",\nIF($J9<'Périodes adm.'!$B$45,\"P04\",\nIF($J9<'Périodes adm.'!$B$46,\"P05\",\nIF($J9<'Périodes adm.'!$B$47,\"P06\",\nIF($J9<'Périodes adm.'!$B$48,\"P07\",\nIF($J9<'Périodes adm.'!$B$49,\"P08\",\nIF($J9<'Périodes adm.'!$B$50,\"P09\",\nIF($J9<'Périodes adm.'!$B$51,\"P10\",\nIF($J9<'Périodes adm.'!$B$52,\"P11\",\nIF($J9<'Périodes adm.'!$B$53,\"P12\",\nIF($J9<'Périodes adm.'!$B$54,\"P13\",\n\"\"))))))))))))))))))))))))))))))))))))))))))))))))))))))","v":"P13"},{"$f":"IF(Tableau1[[#This Row],[Date demande]]=\"\",\"\",\nIF(Tableau1[[#This Row],[Date demande]]<'Périodes adm.'!$B$15,\"2018-2019\",\nIF(Tableau1[[#This Row],[Date demande]]<'Périodes adm.'!$B$28,\"2019-2020\",\nIF(Tableau1[[#This Row],[Date demande]]<'Périodes adm.'!$B$41,\"2020-2021\",\nIF(Tableau1[[#This Row],[Date demande]]<'Périodes adm.'!$B$54,\"2021-2022\",\nIF(Tableau1[[#This Row],[Date demande]]<'Périodes adm.'!$B$67,\"2022-2023\",\nIF(Tableau1[[#This Row],[Date demande]]<'Périodes adm.'!$B$80,\"2023-2024\",\"\")))))))","v":"2021-2022"}]
[null,null,null,null,{"$f":"IFERROR(VLOOKUP(D10,Tab_Résidences[],2,FALSE),\"\")","v":""},null,{"$f":"IFERROR(VLOOKUP(D10,Tab_Résidences[],3,FALSE),\"\")","v":""},null,null,null,null,"","",{"$f":"IF(Tableau1[[#This Row],[Jours expirés]]=\"\",\"\",IF(Tableau1[[#This Row],[Jours expirés]]<0,\"Dans le délai\",\"Hors délai\"))","v":""},null,null,null,null,null,null,null,{"$f":"IF(AND(Tableau1[[#This Row],[Date demande]]<>\"\",Tableau1[[#This Row],[Date de PEC]]<>\"\"),\"Vu\",IF(Tableau1[[#This Row],[Date demande]]<>\"\",\"Actif\",\"\"))","v":""},{"$f":"IF($J10=\"\",\"\",\nIF($J10<'Périodes adm.'!$B$2,\"Ant.\",\nIF($J10<'Périodes adm.'!$B$3,\"P01\",\nIF($J10<'Périodes adm.'!$B$4,\"P02\",\nIF($J10<'Périodes adm.'!$B$5,\"P03\",\nIF($J10<'Périodes adm.'!$B$6,\"P04\",\nIF($J10<'Périodes adm.'!$B$7,\"P05\",\nIF($J10<'Périodes adm.'!$B$8,\"P06\",\nIF($J10<'Périodes adm.'!$B$9,\"P07\",\nIF($J10<'Périodes adm.'!$B$10,\"P08\",\nIF($J10<'Périodes adm.'!$B$11,\"P09\",\nIF($J10<'Périodes adm.'!$B$12,\"P10\",\nIF($J10<'Périodes adm.'!$B$13,\"P11\",\nIF($J10<'Périodes adm.'!$B$14,\"P12\",\nIF($J10<'Périodes adm.'!$B$15,\"P13\",\nIF($J10<'Périodes adm.'!$B$16,\"P01\",\nIF($J10<'Périodes adm.'!$B$17,\"P02\",\nIF($J10<'Périodes adm.'!$B$18,\"P03\",\nIF($J10<'Périodes adm.'!$B$19,\"P04\",\nIF($J10<'Périodes adm.'!$B$20,\"P05\",\nIF($J10<'Périodes adm.'!$B$21,\"P06\",\nIF($J10<'Périodes adm.'!$B$22,\"P07\",\nIF($J10<'Périodes adm.'!$B$23,\"P08\",\nIF($J10<'Périodes adm.'!$B$24,\"P09\",\nIF($J10<'Périodes adm.'!$B$25,\"P10\",\nIF($J10<'Périodes adm.'!$B$26,\"P11\",\nIF($J10<'Périodes adm.'!$B$27,\"P12\",\nIF($J10<'Périodes adm.'!$B$28,\"P13\",\nIF($J10<'Périodes adm.'!$B$29,\"P01\",\nIF($J10<'Périodes adm.'!$B$30,\"P02\",\nIF($J10<'Périodes adm.'!$B$31,\"P03\",\nIF($J10<'Périodes adm.'!$B$32,\"P04\",\nIF($J10<'Périodes adm.'!$B$33,\"P05\",\nIF($J10<'Périodes adm.'!$B$34,\"P06\",\nIF($J10<'Périodes adm.'!$B$35,\"P07\",\nIF($J10<'Périodes adm.'!$B$36,\"P08\",\nIF($J10<'Périodes adm.'!$B$37,\"P09\",\nIF($J10<'Périodes adm.'!$B$38,\"P10\",\nIF($J10<'Périodes adm.'!$B$39,\"P11\",\nIF($J10<'Périodes adm.'!$B$40,\"P12\",\nIF($J10<'Périodes adm.'!$B$41,\"P13\",\nIF($J10<'Périodes adm.'!$B$42,\"P01\",\nIF($J10<'Périodes adm.'!$B$43,\"P02\",\nIF($J10<'Périodes adm.'!$B$44,\"P03\",\nIF($J10<'Périodes adm.'!$B$45,\"P04\",\nIF($J10<'Périodes adm.'!$B$46,\"P05\",\nIF($J10<'Périodes adm.'!$B$47,\"P06\",\nIF($J10<'Périodes adm.'!$B$48,\"P07\",\nIF($J10<'Périodes adm.'!$B$49,\"P08\",\nIF($J10<'Périodes adm.'!$B$50,\"P09\",\nIF($J10<'Périodes adm.'!$B$51,\"P10\",\nIF($J10<'Périodes adm.'!$B$52,\"P11\",\nIF($J10<'Périodes adm.'!$B$53,\"P12\",\nIF($J10<'Périodes adm.'!$B$54,\"P13\",\n\"\"))))))))))))))))))))))))))))))))))))))))))))))))))))))","v":""},{"$f":"IF(Tableau1[[#This Row],[Date demande]]=\"\",\"\",\nIF(Tableau1[[#This Row],[Date demande]]<'Périodes adm.'!$B$15,\"2018-2019\",\nIF(Tableau1[[#This Row],[Date demande]]<'Périodes adm.'!$B$28,\"2019-2020\",\nIF(Tableau1[[#This Row],[Date demande]]<'Périodes adm.'!$B$41,\"2020-2021\",\nIF(Tableau1[[#This Row],[Date demande]]<'Périodes adm.'!$B$54,\"2021-2022\",\nIF(Tableau1[[#This Row],[Date demande]]<'Périodes adm.'!$B$67,\"2022-2023\",\nIF(Tableau1[[#This Row],[Date demande]]<'Périodes adm.'!$B$80,\"2023-2024\",\"\")))))))","v":""}]
[null,null,null,null,{"$f":"IFERROR(VLOOKUP(D11,Tab_Résidences[],2,FALSE),\"\")","v":""},null,{"$f":"IFERROR(VLOOKUP(D11,Tab_Résidences[],3,FALSE),\"\")","v":""},null,null,null,null,"","",{"$f":"IF(Tableau1[[#This Row],[Jours expirés]]=\"\",\"\",IF(Tableau1[[#This Row],[Jours expirés]]<0,\"Dans le délai\",\"Hors délai\"))","v":""},null,null,null,null,null,null,null,{"$f":"IF(AND(Tableau1[[#This Row],[Date demande]]<>\"\",Tableau1[[#This Row],[Date de PEC]]<>\"\"),\"Vu\",IF(Tableau1[[#This Row],[Date demande]]<>\"\",\"Actif\",\"\"))","v":""},{"$f":"IF($J11=\"\",\"\",\nIF($J11<'Périodes adm.'!$B$2,\"Ant.\",\nIF($J11<'Périodes adm.'!$B$3,\"P01\",\nIF($J11<'Périodes adm.'!$B$4,\"P02\",\nIF($J11<'Périodes adm.'!$B$5,\"P03\",\nIF($J11<'Périodes adm.'!$B$6,\"P04\",\nIF($J11<'Périodes adm.'!$B$7,\"P05\",\nIF($J11<'Périodes adm.'!$B$8,\"P06\",\nIF($J11<'Périodes adm.'!$B$9,\"P07\",\nIF($J11<'Périodes adm.'!$B$10,\"P08\",\nIF($J11<'Périodes adm.'!$B$11,\"P09\",\nIF($J11<'Périodes adm.'!$B$12,\"P10\",\nIF($J11<'Périodes adm.'!$B$13,\"P11\",\nIF($J11<'Périodes adm.'!$B$14,\"P12\",\nIF($J11<'Périodes adm.'!$B$15,\"P13\",\nIF($J11<'Périodes adm.'!$B$16,\"P01\",\nIF($J11<'Périodes adm.'!$B$17,\"P02\",\nIF($J11<'Périodes adm.'!$B$18,\"P03\",\nIF($J11<'Périodes adm.'!$B$19,\"P04\",\nIF($J11<'Périodes adm.'!$B$20,\"P05\",\nIF($J11<'Périodes adm.'!$B$21,\"P06\",\nIF($J11<'Périodes adm.'!$B$22,\"P07\",\nIF($J11<'Périodes adm.'!$B$23,\"P08\",\nIF($J11<'Périodes adm.'!$B$24,\"P09\",\nIF($J11<'Périodes adm.'!$B$25,\"P10\",\nIF($J11<'Périodes adm.'!$B$26,\"P11\",\nIF($J11<'Périodes adm.'!$B$27,\"P12\",\nIF($J11<'Périodes adm.'!$B$28,\"P13\",\nIF($J11<'Périodes adm.'!$B$29,\"P01\",\nIF($J11<'Périodes adm.'!$B$30,\"P02\",\nIF($J11<'Périodes adm.'!$B$31,\"P03\",\nIF($J11<'Périodes adm.'!$B$32,\"P04\",\nIF($J11<'Périodes adm.'!$B$33,\"P05\",\nIF($J11<'Périodes adm.'!$B$34,\"P06\",\nIF($J11<'Périodes adm.'!$B$35,\"P07\",\nIF($J11<'Périodes adm.'!$B$36,\"P08\",\nIF($J11<'Périodes adm.'!$B$37,\"P09\",\nIF($J11<'Périodes adm.'!$B$38,\"P10\",\nIF($J11<'Périodes adm.'!$B$39,\"P11\",\nIF($J11<'Périodes adm.'!$B$40,\"P12\",\nIF($J11<'Périodes adm.'!$B$41,\"P13\",\nIF($J11<'Périodes adm.'!$B$42,\"P01\",\nIF($J11<'Périodes adm.'!$B$43,\"P02\",\nIF($J11<'Périodes adm.'!$B$44,\"P03\",\nIF($J11<'Périodes adm.'!$B$45,\"P04\",\nIF($J11<'Périodes adm.'!$B$46,\"P05\",\nIF($J11<'Périodes adm.'!$B$47,\"P06\",\nIF($J11<'Périodes adm.'!$B$48,\"P07\",\nIF($J11<'Périodes adm.'!$B$49,\"P08\",\nIF($J11<'Périodes adm.'!$B$50,\"P09\",\nIF($J11<'Périodes adm.'!$B$51,\"P10\",\nIF($J11<'Périodes adm.'!$B$52,\"P11\",\nIF($J11<'Périodes adm.'!$B$53,\"P12\",\nIF($J11<'Périodes adm.'!$B$54,\"P13\",\n\"\"))))))))))))))))))))))))))))))))))))))))))))))))))))))","v":""},{"$f":"IF(Tableau1[[#This Row],[Date demande]]=\"\",\"\",\nIF(Tableau1[[#This Row],[Date demande]]<'Périodes adm.'!$B$15,\"2018-2019\",\nIF(Tableau1[[#This Row],[Date demande]]<'Périodes adm.'!$B$28,\"2019-2020\",\nIF(Tableau1[[#This Row],[Date demande]]<'Périodes adm.'!$B$41,\"2020-2021\",\nIF(Tableau1[[#This Row],[Date demande]]<'Périodes adm.'!$B$54,\"2021-2022\",\nIF(Tableau1[[#This Row],[Date demande]]<'Périodes adm.'!$B$67,\"2022-2023\",\nIF(Tableau1[[#This Row],[Date demande]]<'Périodes adm.'!$B$80,\"2023-2024\",\"\")))))))","v":""}]
[null,null,null,null,{"$f":"IFERROR(VLOOKUP(D12,Tab_Résidences[],2,FALSE),\"\")","v":""},null,{"$f":"IFERROR(VLOOKUP(D12,Tab_Résidences[],3,FALSE),\"\")","v":""},null,null,null,null,"","",{"$f":"IF(Tableau1[[#This Row],[Jours expirés]]=\"\",\"\",IF(Tableau1[[#This Row],[Jours expirés]]<0,\"Dans le délai\",\"Hors délai\"))","v":""},null,null,null,null,null,null,null,{"$f":"IF(AND(Tableau1[[#This Row],[Date demande]]<>\"\",Tableau1[[#This Row],[Date de PEC]]<>\"\"),\"Vu\",IF(Tableau1[[#This Row],[Date demande]]<>\"\",\"Actif\",\"\"))","v":""},{"$f":"IF($J12=\"\",\"\",\nIF($J12<'Périodes adm.'!$B$2,\"Ant.\",\nIF($J12<'Périodes adm.'!$B$3,\"P01\",\nIF($J12<'Périodes adm.'!$B$4,\"P02\",\nIF($J12<'Périodes adm.'!$B$5,\"P03\",\nIF($J12<'Périodes adm.'!$B$6,\"P04\",\nIF($J12<'Périodes adm.'!$B$7,\"P05\",\nIF($J12<'Périodes adm.'!$B$8,\"P06\",\nIF($J12<'Périodes adm.'!$B$9,\"P07\",\nIF($J12<'Périodes adm.'!$B$10,\"P08\",\nIF($J12<'Périodes adm.'!$B$11,\"P09\",\nIF($J12<'Périodes adm.'!$B$12,\"P10\",\nIF($J12<'Périodes adm.'!$B$13,\"P11\",\nIF($J12<'Périodes adm.'!$B$14,\"P12\",\nIF($J12<'Périodes adm.'!$B$15,\"P13\",\nIF($J12<'Périodes adm.'!$B$16,\"P01\",\nIF($J12<'Périodes adm.'!$B$17,\"P02\",\nIF($J12<'Périodes adm.'!$B$18,\"P03\",\nIF($J12<'Périodes adm.'!$B$19,\"P04\",\nIF($J12<'Périodes adm.'!$B$20,\"P05\",\nIF($J12<'Périodes adm.'!$B$21,\"P06\",\nIF($J12<'Périodes adm.'!$B$22,\"P07\",\nIF($J12<'Périodes adm.'!$B$23,\"P08\",\nIF($J12<'Périodes adm.'!$B$24,\"P09\",\nIF($J12<'Périodes adm.'!$B$25,\"P10\",\nIF($J12<'Périodes adm.'!$B$26,\"P11\",\nIF($J12<'Périodes adm.'!$B$27,\"P12\",\nIF($J12<'Périodes adm.'!$B$28,\"P13\",\nIF($J12<'Périodes adm.'!$B$29,\"P01\",\nIF($J12<'Périodes adm.'!$B$30,\"P02\",\nIF($J12<'Périodes adm.'!$B$31,\"P03\",\nIF($J12<'Périodes adm.'!$B$32,\"P04\",\nIF($J12<'Périodes adm.'!$B$33,\"P05\",\nIF($J12<'Périodes adm.'!$B$34,\"P06\",\nIF($J12<'Périodes adm.'!$B$35,\"P07\",\nIF($J12<'Périodes adm.'!$B$36,\"P08\",\nIF($J12<'Périodes adm.'!$B$37,\"P09\",\nIF($J12<'Périodes adm.'!$B$38,\"P10\",\nIF($J12<'Périodes adm.'!$B$39,\"P11\",\nIF($J12<'Périodes adm.'!$B$40,\"P12\",\nIF($J12<'Périodes adm.'!$B$41,\"P13\",\nIF($J12<'Périodes adm.'!$B$42,\"P01\",\nIF($J12<'Périodes adm.'!$B$43,\"P02\",\nIF($J12<'Périodes adm.'!$B$44,\"P03\",\nIF($J12<'Périodes adm.'!$B$45,\"P04\",\nIF($J12<'Périodes adm.'!$B$46,\"P05\",\nIF($J12<'Périodes adm.'!$B$47,\"P06\",\nIF($J12<'Périodes adm.'!$B$48,\"P07\",\nIF($J12<'Périodes adm.'!$B$49,\"P08\",\nIF($J12<'Périodes adm.'!$B$50,\"P09\",\nIF($J12<'Périodes adm.'!$B$51,\"P10\",\nIF($J12<'Périodes adm.'!$B$52,\"P11\",\nIF($J12<'Périodes adm.'!$B$53,\"P12\",\nIF($J12<'Périodes adm.'!$B$54,\"P13\",\n\"\"))))))))))))))))))))))))))))))))))))))))))))))))))))))","v":""},{"$f":"IF(Tableau1[[#This Row],[Date demande]]=\"\",\"\",\nIF(Tableau1[[#This Row],[Date demande]]<'Périodes adm.'!$B$15,\"2018-2019\",\nIF(Tableau1[[#This Row],[Date demande]]<'Périodes adm.'!$B$28,\"2019-2020\",\nIF(Tableau1[[#This Row],[Date demande]]<'Périodes adm.'!$B$41,\"2020-2021\",\nIF(Tableau1[[#This Row],[Date demande]]<'Périodes adm.'!$B$54,\"2021-2022\",\nIF(Tableau1[[#This Row],[Date demande]]<'Périodes adm.'!$B$67,\"2022-2023\",\nIF(Tableau1[[#This Row],[Date demande]]<'Périodes adm.'!$B$80,\"2023-2024\",\"\")))))))","v":""}]
[null,null,null,null,{"$f":"IFERROR(VLOOKUP(D13,Tab_Résidences[],2,FALSE),\"\")","v":""},null,{"$f":"IFERROR(VLOOKUP(D13,Tab_Résidences[],3,FALSE),\"\")","v":""},null,null,null,null,"","",{"$f":"IF(Tableau1[[#This Row],[Jours expirés]]=\"\",\"\",IF(Tableau1[[#This Row],[Jours expirés]]<0,\"Dans le délai\",\"Hors délai\"))","v":""},null,null,null,null,null,null,null,{"$f":"IF(AND(Tableau1[[#This Row],[Date demande]]<>\"\",Tableau1[[#This Row],[Date de PEC]]<>\"\"),\"Vu\",IF(Tableau1[[#This Row],[Date demande]]<>\"\",\"Actif\",\"\"))","v":""},{"$f":"IF($J13=\"\",\"\",\nIF($J13<'Périodes adm.'!$B$2,\"Ant.\",\nIF($J13<'Périodes adm.'!$B$3,\"P01\",\nIF($J13<'Périodes adm.'!$B$4,\"P02\",\nIF($J13<'Périodes adm.'!$B$5,\"P03\",\nIF($J13<'Périodes adm.'!$B$6,\"P04\",\nIF($J13<'Périodes adm.'!$B$7,\"P05\",\nIF($J13<'Périodes adm.'!$B$8,\"P06\",\nIF($J13<'Périodes adm.'!$B$9,\"P07\",\nIF($J13<'Périodes adm.'!$B$10,\"P08\",\nIF($J13<'Périodes adm.'!$B$11,\"P09\",\nIF($J13<'Périodes adm.'!$B$12,\"P10\",\nIF($J13<'Périodes adm.'!$B$13,\"P11\",\nIF($J13<'Périodes adm.'!$B$14,\"P12\",\nIF($J13<'Périodes adm.'!$B$15,\"P13\",\nIF($J13<'Périodes adm.'!$B$16,\"P01\",\nIF($J13<'Périodes adm.'!$B$17,\"P02\",\nIF($J13<'Périodes adm.'!$B$18,\"P03\",\nIF($J13<'Périodes adm.'!$B$19,\"P04\",\nIF($J13<'Périodes adm.'!$B$20,\"P05\",\nIF($J13<'Périodes adm.'!$B$21,\"P06\",\nIF($J13<'Périodes adm.'!$B$22,\"P07\",\nIF($J13<'Périodes adm.'!$B$23,\"P08\",\nIF($J13<'Périodes adm.'!$B$24,\"P09\",\nIF($J13<'Périodes adm.'!$B$25,\"P10\",\nIF($J13<'Périodes adm.'!$B$26,\"P11\",\nIF($J13<'Périodes adm.'!$B$27,\"P12\",\nIF($J13<'Périodes adm.'!$B$28,\"P13\",\nIF($J13<'Périodes adm.'!$B$29,\"P01\",\nIF($J13<'Périodes adm.'!$B$30,\"P02\",\nIF($J13<'Périodes adm.'!$B$31,\"P03\",\nIF($J13<'Périodes adm.'!$B$32,\"P04\",\nIF($J13<'Périodes adm.'!$B$33,\"P05\",\nIF($J13<'Périodes adm.'!$B$34,\"P06\",\nIF($J13<'Périodes adm.'!$B$35,\"P07\",\nIF($J13<'Périodes adm.'!$B$36,\"P08\",\nIF($J13<'Périodes adm.'!$B$37,\"P09\",\nIF($J13<'Périodes adm.'!$B$38,\"P10\",\nIF($J13<'Périodes adm.'!$B$39,\"P11\",\nIF($J13<'Périodes adm.'!$B$40,\"P12\",\nIF($J13<'Périodes adm.'!$B$41,\"P13\",\nIF($J13<'Périodes adm.'!$B$42,\"P01\",\nIF($J13<'Périodes adm.'!$B$43,\"P02\",\nIF($J13<'Périodes adm.'!$B$44,\"P03\",\nIF($J13<'Périodes adm.'!$B$45,\"P04\",\nIF($J13<'Périodes adm.'!$B$46,\"P05\",\nIF($J13<'Périodes adm.'!$B$47,\"P06\",\nIF($J13<'Périodes adm.'!$B$48,\"P07\",\nIF($J13<'Périodes adm.'!$B$49,\"P08\",\nIF($J13<'Périodes adm.'!$B$50,\"P09\",\nIF($J13<'Périodes adm.'!$B$51,\"P10\",\nIF($J13<'Périodes adm.'!$B$52,\"P11\",\nIF($J13<'Périodes adm.'!$B$53,\"P12\",\nIF($J13<'Périodes adm.'!$B$54,\"P13\",\n\"\"))))))))))))))))))))))))))))))))))))))))))))))))))))))","v":""},{"$f":"IF(Tableau1[[#This Row],[Date demande]]=\"\",\"\",\nIF(Tableau1[[#This Row],[Date demande]]<'Périodes adm.'!$B$15,\"2018-2019\",\nIF(Tableau1[[#This Row],[Date demande]]<'Périodes adm.'!$B$28,\"2019-2020\",\nIF(Tableau1[[#This Row],[Date demande]]<'Périodes adm.'!$B$41,\"2020-2021\",\nIF(Tableau1[[#This Row],[Date demande]]<'Périodes adm.'!$B$54,\"2021-2022\",\nIF(Tableau1[[#This Row],[Date demande]]<'Périodes adm.'!$B$67,\"2022-2023\",\nIF(Tableau1[[#This Row],[Date demande]]<'Périodes adm.'!$B$80,\"2023-2024\",\"\")))))))","v":""}]
[null,null,null,null,{"$f":"IFERROR(VLOOKUP(D14,Tab_Résidences[],2,FALSE),\"\")","v":""},null,{"$f":"IFERROR(VLOOKUP(D14,Tab_Résidences[],3,FALSE),\"\")","v":""},null,null,null,null,"","",{"$f":"IF(Tableau1[[#This Row],[Jours expirés]]=\"\",\"\",IF(Tableau1[[#This Row],[Jours expirés]]<0,\"Dans le délai\",\"Hors délai\"))","v":""},null,null,null,null,null,null,null,{"$f":"IF(AND(Tableau1[[#This Row],[Date demande]]<>\"\",Tableau1[[#This Row],[Date de PEC]]<>\"\"),\"Vu\",IF(Tableau1[[#This Row],[Date demande]]<>\"\",\"Actif\",\"\"))","v":""},{"$f":"IF($J14=\"\",\"\",\nIF($J14<'Périodes adm.'!$B$2,\"Ant.\",\nIF($J14<'Périodes adm.'!$B$3,\"P01\",\nIF($J14<'Périodes adm.'!$B$4,\"P02\",\nIF($J14<'Périodes adm.'!$B$5,\"P03\",\nIF($J14<'Périodes adm.'!$B$6,\"P04\",\nIF($J14<'Périodes adm.'!$B$7,\"P05\",\nIF($J14<'Périodes adm.'!$B$8,\"P06\",\nIF($J14<'Périodes adm.'!$B$9,\"P07\",\nIF($J14<'Périodes adm.'!$B$10,\"P08\",\nIF($J14<'Périodes adm.'!$B$11,\"P09\",\nIF($J14<'Périodes adm.'!$B$12,\"P10\",\nIF($J14<'Périodes adm.'!$B$13,\"P11\",\nIF($J14<'Périodes adm.'!$B$14,\"P12\",\nIF($J14<'Périodes adm.'!$B$15,\"P13\",\nIF($J14<'Périodes adm.'!$B$16,\"P01\",\nIF($J14<'Périodes adm.'!$B$17,\"P02\",\nIF($J14<'Périodes adm.'!$B$18,\"P03\",\nIF($J14<'Périodes adm.'!$B$19,\"P04\",\nIF($J14<'Périodes adm.'!$B$20,\"P05\",\nIF($J14<'Périodes adm.'!$B$21,\"P06\",\nIF($J14<'Périodes adm.'!$B$22,\"P07\",\nIF($J14<'Périodes adm.'!$B$23,\"P08\",\nIF($J14<'Périodes adm.'!$B$24,\"P09\",\nIF($J14<'Périodes adm.'!$B$25,\"P10\",\nIF($J14<'Périodes adm.'!$B$26,\"P11\",\nIF($J14<'Périodes adm.'!$B$27,\"P12\",\nIF($J14<'Périodes adm.'!$B$28,\"P13\",\nIF($J14<'Périodes adm.'!$B$29,\"P01\",\nIF($J14<'Périodes adm.'!$B$30,\"P02\",\nIF($J14<'Périodes adm.'!$B$31,\"P03\",\nIF($J14<'Périodes adm.'!$B$32,\"P04\",\nIF($J14<'Périodes adm.'!$B$33,\"P05\",\nIF($J14<'Périodes adm.'!$B$34,\"P06\",\nIF($J14<'Périodes adm.'!$B$35,\"P07\",\nIF($J14<'Périodes adm.'!$B$36,\"P08\",\nIF($J14<'Périodes adm.'!$B$37,\"P09\",\nIF($J14<'Périodes adm.'!$B$38,\"P10\",\nIF($J14<'Périodes adm.'!$B$39,\"P11\",\nIF($J14<'Périodes adm.'!$B$40,\"P12\",\nIF($J14<'Périodes adm.'!$B$41,\"P13\",\nIF($J14<'Périodes adm.'!$B$42,\"P01\",\nIF($J14<'Périodes adm.'!$B$43,\"P02\",\nIF($J14<'Périodes adm.'!$B$44,\"P03\",\nIF($J14<'Périodes adm.'!$B$45,\"P04\",\nIF($J14<'Périodes adm.'!$B$46,\"P05\",\nIF($J14<'Périodes adm.'!$B$47,\"P06\",\nIF($J14<'Périodes adm.'!$B$48,\"P07\",\nIF($J14<'Périodes adm.'!$B$49,\"P08\",\nIF($J14<'Périodes adm.'!$B$50,\"P09\",\nIF($J14<'Périodes adm.'!$B$51,\"P10\",\nIF($J14<'Périodes adm.'!$B$52,\"P11\",\nIF($J14<'Périodes adm.'!$B$53,\"P12\",\nIF($J14<'Périodes adm.'!$B$54,\"P13\",\n\"\"))))))))))))))))))))))))))))))))))))))))))))))))))))))","v":""},{"$f":"IF(Tableau1[[#This Row],[Date demande]]=\"\",\"\",\nIF(Tableau1[[#This Row],[Date demande]]<'Périodes adm.'!$B$15,\"2018-2019\",\nIF(Tableau1[[#This Row],[Date demande]]<'Périodes adm.'!$B$28,\"2019-2020\",\nIF(Tableau1[[#This Row],[Date demande]]<'Périodes adm.'!$B$41,\"2020-2021\",\nIF(Tableau1[[#This Row],[Date demande]]<'Périodes adm.'!$B$54,\"2021-2022\",\nIF(Tableau1[[#This Row],[Date demande]]<'Périodes adm.'!$B$67,\"2022-2023\",\nIF(Tableau1[[#This Row],[Date demande]]<'Périodes adm.'!$B$80,\"2023-2024\",\"\")))))))","v":""}]

{"sheet":"Points de service","index":1,"n_rows":6,"n_cols":1,"rows_kept":6,"cut":false,"hidden":true,"merged":[]}
["Points de service"]
["Drummondville"]
["Fortierville"]
["Gentilly"]
["Nicolet"]
["St-Célestin"]

{"sheet":"Provenance","index":2,"n_rows":3,"n_cols":1,"rows_kept":3,"cut":false,"hidden":true,"merged":[]}
["Provenance"]
["Guichet"]
["Interne"]

{"sheet":"Statut","index":3,"n_rows":8,"n_cols":1,"rows_kept":8,"cut":false,"hidden":false,"merged":[]}
["Statut"]
[]
["Actif"]
["Annulé"]
["Décédé"]
["Hospitalisé"]
["Transféré"]
["Vu"]

{"sheet":"Nbre dem. reçues","index":4,"n_rows":15,"n_cols":3,"rows_kept":15,"cut":false,"hidden":false,"merged":[]}
["Nombre de nouvelles demandes par période et année financière"]
[]
[]
["Nombre de Date demande","Priorités"]
["Années/Périodes","(vide)","Total général"]
["2020-2021",3,3]
["P01",1,1]
["P02",1,1]
["P13",1,1]
["2021-2022",2,2]
["P01",1,1]
["P13",1,1]
[""]
[]
["Total général",5,5]

{"sheet":"Nbre PEC","index":5,"n_rows":15,"n_cols":3,"rows_kept":15,"cut":false,"hidden":false,"merged":[]}
["Nombre de dossiers pris en charge par période et année financière"]
[]
[]
["Nombre de Date de PEC","Priorités"]
["Années/Périodes","(vide)","Total général"]
["2020-2021",2,2]
["P01"]
["P02",1,1]
["P13",1,1]
["2021-2022"]
["P01"]
["P13"]
[""]
[]
["Total général",2,2]

{"sheet":"Nbre attente","index":6,"n_rows":7,"n_cols":3,"rows_kept":7,"cut":false,"hidden":false,"merged":[]}
["Nombre de dossiers en attente par programme et par priorité"]
[]
[]
["Nombre de Date demande","Priorités"]
["Programmes","(vide)","Total général"]
["(vide)",3,3]
["Total général",3,3]

{"sheet":"Nbre délai","index":7,"n_rows":8,"n_cols":3,"rows_kept":8,"cut":false,"hidden":false,"merged":[]}
["Nombre de dossiers dans les délais et hors délais par priorité"]
[]
["Statut","Actif"]
[]
["Nombre de Date demande","Délai"]
["Priorité","#VALEUR!","Total général"]
["(vide)",3,3]
["Total général",3,3]

{"sheet":"Intervenants","index":8,"n_rows":4,"n_cols":1,"rows_kept":4,"cut":false,"hidden":true,"merged":[]}
["Intervenants"]
["Beauregard, Brigitte"]
["Paquette, Caroline"]
["Pearson, Mylène"]

{"sheet":"Résidences","index":9,"n_rows":32,"n_cols":3,"rows_kept":32,"cut":false,"hidden":false,"merged":[]}
["Résidences","Adresse","Téléphone"]
["Domicile"]
["600 Bousquet","600, rue Bousquet, Drummondville","819-477-6862"]
["Accueil du Doux Repos","347, rue Laurier, Drummondville","819-477-3392"]
["Auberge Bon-Conseil","201, rue Mathieu, Notre-Dame-du-Bon-Conseil","819-336-2678"]
["Centre d'hébergement Saint-Frédéric","198, rue Lindsay, Drummondville","819-474-5938"]
["Centre d'hébergement Saint-Joseph","360, rue Melançon, Drummondville","819-472-0942"]
["Jardins de la Cité","275, rue Cockburn, Drummondville","819-475-0545"]
["La Maisonnée d'Antan","249, rue St-Pierre, St-Germain","819-395-5113"]
["Le Jazz","400, rue Rose-Ellis, Drummondville","819-850-5342"]
["L'Oasis D'Abee","528, rue St-Jean, Drummondville","819-479-2304"]
["Maison du Golf","77, rue Brock, Drummondville","819-478-8739"]
["Manoir Drummond","248, rue Hériot, Drummondville","819-478-2507"]
["Mon Parent","634, rue Hériot, Drummondville","819-478-3339"]
["Myosotis","880, rue Côté, St-Charles-de-Drummond","819-474-1160"]
["Pavillon Marie-Reine-des-Cœurs","1145, boul. Mercure, Drummondville","819-477-5376"]
["Résidence Baril et Lapointe","2915, boul. Lemire, Drummondville","819-478-9285"]
["Résidence Carole Léger","820, rue Cherrier, Drummondville","819-477-2223"]
["Résidence Cockburn","486, rue Cockburn, Drummondville","819-474-5786"]
["Résidence Cormier","465, rue Cormier, Drummondville","819-474-5368"]
["Résidence Ermitage","540, rue Bérol, Drummondville","819-472-6818"]
["Résidence Rodier et Courchesne","19, rue Gall, Drummondville","819-474-7821"]
["Résidence Saint-Cyrille","45, rue St-Laurent, St-Cyrille-de-Wendover","819-397-5475"]
["Résidence St-Joseph","162, rue St-Jean-Baptiste, St-Guillaume","819-396-2877"]
["Résidence Tanguay/Leclerc","1940, rue Daniel, Drummondville","819-475-3223"]
["Résidence Vincent","600, rue Bruno, Drummondville","819-478-3406"]
["Résidences René-Léosa","1104, rue Des Tours, Drummondville","819-850-8353"]
["RI St-Charles","640, cours du Chevreuil, Drummondville","819-472-2929"]
["Terrasses de la Fonderie ","1450, rue Hébert, Drummondville","819-472-5454"]
["Villa Bel Époque","528, rue St-Jean, Drummondville","819-472-8077"]
["Villa du Boisé","100, rue Laforest, Drummondville","819-478-1292"]
["Villa du Parc de la Paix","305, rue Cockburn, Drummondville","819-479-2700"]

{"sheet":"Priorité","index":10,"n_rows":5,"n_cols":1,"rows_kept":5,"cut":false,"hidden":true,"merged":[]}
["Priorité"]
["P1"]
["P2"]
["P3"]
["P4"]

{"sheet":"Profil","index":11,"n_rows":12,"n_cols":1,"rows_kept":12,"cut":false,"hidden":true,"merged":[]}
["Profil"]
[110]
[121]
[131]
[191]
[192]
[210]
[311]
[312]
[410]
[420]
[710]

{"sheet":"Programmes","index":12,"n_rows":9,"n_cols":1,"rows_kept":9,"cut":false,"hidden":true,"merged":[]}
["Programmes"]
["LPH"]
["RNI"]
["RPA"]
["Santé physique"]
["SAPA"]
["SAPA (cognitif)"]
["SAPA (physique)"]
["Soins palliatifs"]

{"sheet":"Services","index":13,"n_rows":9,"n_cols":1,"rows_kept":9,"cut":false,"hidden":true,"merged":[]}
["Services"]
["Aide à domicile"]
["Ergothérapie"]
["Inhalothérapie"]
["Nutrition"]
["Physiothérapie"]
["Post op (ergo)"]
["Service social"]
["Soins infirmiers"]

{"sheet":"Périodes adm.","index":14,"n_rows":92,"n_cols":4,"rows_kept":92,"cut":false,"hidden":false,"merged":[[66,3,78,3],[79,3,91,3],[14,3,26,3],[27,3,39,3],[1,3,13,3],[40,3,52,3],[53,3,65,3]]}
["Périodes","Date début","Date fin","Année"]
["P01","2018-04-01","2018-04-28","2018-2019"]
["P02",{"$f":"C2+1","v":"2018-04-29"},{"$f":"B3+27","v":"2018-05-26"}]
["P03","2018-05-27","2018-06-23"]
["P04","2018-06-24","2018-07-21"]
["P05","2018-07-22","2018-08-18"]
["P06","2018-08-19","2018-09-15"]
["P07","2018-09-16","2018-10-13"]
["P08","2018-10-14","2018-11-10"]
["P09","2018-11-11","2018-12-08"]
["P10","2018-12-09","2019-01-05"]
["P11","2019-01-06","2019-02-02"]
["P12","2019-02-03","2019-03-02"]
["P13","2019-03-03","2019-03-31"]
["P01","2019-04-01","2019-04-27","2019-2020"]
["P02",{"$f":"C15+1","v":"2019-04-28"},{"$f":"B16+27","v":"2019-05-25"}]
["P03","2019-05-26","2019-06-22"]
["P04","2019-06-23","2019-07-20"]
["P05","2019-07-21","2019-08-17"]
["P06","2019-08-18","2019-09-14"]
["P07","2019-09-15","2019-10-12"]
["P08","2019-10-13","2019-11-09"]
["P09","2019-11-10","2019-12-07"]
["P10","2019-12-08","2020-01-04"]
["P11","2020-01-05","2020-02-01"]
["P12","2020-02-02","2020-02-29"]
["P13","2020-03-01","2020-03-31"]
["P01","2020-04-01","2020-04-25","2020-2021"]
["P02",{"$f":"C28+1","v":"2020-04-26"},{"$f":"B29+27","v":"2020-05-23"}]
["P03","2020-05-24","2020-06-20"]
["P04","2020-06-21","2020-07-18"]
["P05","2020-07-19","2020-08-15"]
["P06","2020-08-16","2020-09-12"]
["P07","2020-09-13","2020-10-10"]
["P08","2020-10-11","2020-11-07"]
["P09","2020-11-08","2020-12-05"]
["P10","2020-12-06","2021-01-02"]
["P11","2021-01-03","2021-01-30"]
["P12","2021-01-31","2021-02-27"]
["P13","2021-02-28","2021-03-31"]
["P01","2021-04-01","2021-04-24","2021-2022"]
["P02",{"$f":"C41+1","v":"2021-04-25"},{"$f":"B42+27","v":"2021-05-22"}]
["P03","2021-05-23","2021-06-19"]
["P04","2021-06-20","2021-07-17"]
["P05","2021-07-18","2021-08-14"]
["P06","2021-08-15","2021-09-11"]
["P07","2021-09-12","2021-10-09"]
["P08","2021-10-10","2021-11-06"]
["P09","2021-11-07","2021-12-04"]
["P10","2021-12-05","2022-01-01"]
["P11","2022-01-02","2022-01-29"]
["P12","2022-01-30","2022-02-26"]
["P13","2022-02-27","2022-03-31"]
["P01","2022-04-01","2022-04-23","2022-2023"]
["P02",{"$f":"C54+1","v":"2022-04-24"},{"$f":"B55+27","v":"2022-05-21"}]
["P03","2022-05-22","2022-06-18"]
["P04","2022-06-19","2022-07-16"]
["P05",{"$f":"C57+1","v":"2022-07-17"},{"$f":"B58+27","v":"2022-08-13"}]
["P06","2022-08-14","2022-09-10"]
["P07","2022-09-11","2022-10-08"]
["P08","2022-10-09","2022-11-05"]
["P09","2022-11-06","2022-12-03"]
["P10","2022-12-04","2022-12-31"]
["P11","2023-01-01","2023-01-28"]
["P12","2023-01-29","2023-02-25"]
["P13","2023-02-26","2023-03-31"]
["P01","2023-04-01","2023-04-22","2023-2024"]
["P02",{"$f":"C67+1","v":"2023-04-23"},{"$f":"B68+27","v":"2023-05-20"}]
["P03","2023-05-21","2023-06-17"]
["P04","2023-06-18","2023-07-15"]
["P05","2023-07-16","2023-08-12"]
["P06","2023-08-13","2023-09-09"]
["P07","2023-09-10","2023-10-07"]
["P08","2023-10-08","2023-11-04"]
["P09","2023-11-05","2023-12-02"]
["P10","2023-12-03","2023-12-30"]
["P11","2023-12-31","2024-01-27"]
["P12","2024-01-28","2024-02-24"]
["P13","2024-02-25","2024-03-31"]
["P01","2024-04-01",null,"2024-2025"]
["P02"]
["P03"]
["P04"]
["P05"]
["P06"]
["P07"]
["P08"]
["P09"]
["P10"]
["P11"]
["P12"]
["P13"]