{"text_format":"1","workbook":"xlsx","n_sheets":10,"sheets":["Sommaire","Nos données","Lisez moi !","Base clients","Base prestations","Devis","Facture","Chiffre affaires","outils TTC ou HT","Table"],"not_rendered":{"charts":2,"images":3,"macros":1,"external_links":2,"defined_names":8842,"comments":0,"pivot_tables":0},"unopened":[],"bounds":{"document_bytes":16777216,"sheet_cells":100000,"rows_first":2000,"rows_last":500,"rows_between":2000,"halvings":0,"cell_chars":16384,"cell_head_chars":4096},"cells_cut":0,"cells_raw":0,"read":"row_number_cap","date_system":"1900"}

{"sheet":"Sommaire","index":0,"n_rows":19,"n_cols":4,"rows_kept":19,"cut":false,"hidden":false,"merged":[[3,3,5,8],[8,2,8,9]]}
[]
[]
[]
[null,null,null,"Facturier V0 "]
[]
[]
[]
[]
[null,null,"Sommaire"]
[]
[null,null,null,"Nos données"]
[null,null,null,"Sommaire"]
[null,null,null,"Lisez moi !"]
[null,null,null,"Base clients"]
[null,null,null,"Base prestations"]
[null,null,null,"outils TTC ou HT"]
[null,null,null,"Devis"]
[null,null,null,"Facture"]
[null,null,null,"Chiffre affaires"]

{"sheet":"Nos données","index":1,"n_rows":24,"n_cols":9,"rows_kept":24,"cut":false,"hidden":false,"merged":[]}
["v","Outil de facturation Concilium"]
[]
[null,"Vos données"]
[null,"Saisir dans les cases vertes uniquement"]
[null,null,null,null,null,null,null,null,"oui"]
[null,null,null,null,null,null,null,null,"non"]
[null,"Votre nom ou raison sociale :",null,null,"Moyens de règlement clients :"]
[null,"Complément raison sociale :",null,null,"chèque"]
[null,"Adresse de votre siège :",null,null,"virement"]
[null,"Code postal :",null,null,"carte bancaire"]
[null,"Ville :",null,null,"espèces"]
[null,"Téléphone :"]
[null,"Numéro Siret :"]
[null,"Numéro de TVA intracommunautaire (si applicable) :"]
[]
[]
[null,"Taux de TVA :"]
[null,"Taux 0",0]
[null,"Taux 1",5.5E-2]
[null,"Taux 2",0.1]
{"$rows_left_out":5}
{"sheet":"Lisez moi !","index":2,"n_rows":29,"n_cols":5,"rows_kept":29,"cut":false,"hidden":false,"merged":[]}
[]
[]
[]
[]
[]
[null,null,"Mode opératoire du fichier"]
[]
[null,null,"Dans l'onglet nos données, veuillez saisir les éléments relatifs à votre société (raison sociale, adresse, Siret etc.)"]
[null,null,null,"Ceci met à jour les onglets facture et devis"]
[]
[null,null,"L'outil HT TTC a été ajouté enfin de répondre a besoins ponctuels"]
[]
[null,null,"Dans l'onglet base client, veuillez saisir tous les éléments relatifs aux clients (adresse, téléphone etc.)"]
[null,null,null,"Un code unique sera affecté à chaque client"]
[]
[null,null,"Dans base prestation veuillez saisir tous les éléments relatifs aux devis "]
[null,null,null,"En colonne i vous pouvez indiquer un numéro et le répéter si vous souhaitez indiquer un détail des lignes du devis pour un même client."]
[null,null,null,"Une fois le devis accepté et la prestation réalisée, vous pouvez indiquer une date de facture et un statut à éditer"]
[null,null,null,"Colonne L, il existe un bouton permettant de définir un numéro de facture unique et chronologique"]
[]
{"$rows_left_out":10}
{"sheet":"Base clients","index":3,"n_rows":1806,"n_cols":16,"rows_kept":1806,"cut":false,"hidden":false,"merged":[]}
["Base clients"]
["Saisissez vos clients ici (cases vertes uniquement)"]
["Pour trouver un client plus rapidement, faire Ctrl + touche F"]
["Remplir toutes les cellules vertes"]
["Nom Client","Code","Type","Raison sociale","Nom du contact","Prénom du contact","Nom du particulier","Prénom du particulier","Adresse","C. postal","Ville","Téléphone","Portable","Site internet","E-mail","Remarques"]
["société x",{"$f":"IF(A6<>\"\",IFERROR(IF(LEN(ROW()-5)=1,\"C000\"&ROW()-5,IF(LEN(ROW()-5)=2,\"C00\"&ROW()-5,IF(LEN(ROW()-5)=3,\"C0\"&ROW()-5,IF(LEN(ROW()-5)=4,\"C\"&ROW()-5)))),\"\"),\"\")","v":"C0001"},"Pro",{"$f":"IF(OR(C6=\"Part\",C6=\"\"),\"\",A6)","v":"société x"},"Le Blanc","Thomas",{"$f":"IF(C6=\"Part\",MID(A6,1,LEN(A6)-LEN(H6)),\"\")","v":""},{"$f":"IF(C6=\"Part\",MID(A6,FIND(\"µ\",SUBSTITUTE(A6,\" \",\"µ\",LEN(A6)-LEN(SUBSTITUTE(A6,\" \",\"\"))))+1,8000),\"\")","v":""},"343 rue de Neuilly","75016","Paris"]
["société Y",{"$f":"IF(A7<>\"\",IFERROR(IF(LEN(ROW()-5)=1,\"C000\"&ROW()-5,IF(LEN(ROW()-5)=2,\"C00\"&ROW()-5,IF(LEN(ROW()-5)=3,\"C0\"&ROW()-5,IF(LEN(ROW()-5)=4,\"C\"&ROW()-5)))),\"\"),\"\")","v":"C0002"},"Pro","société Y","Bon","Jean",{"$f":"IF(C7=\"Part\",MID(A7,1,LEN(A7)-LEN(H7)),\"\")","v":""},{"$f":"IF(C7=\"Part\",MID(A7,FIND(\"µ\",SUBSTITUTE(A7,\" \",\"µ\",LEN(A7)-LEN(SUBSTITUTE(A7,\" \",\"\"))))+1,8000),\"\")","v":""},"rue du Paradis","75008","Paris"]
[null,"",null,"",null,null,"",""]
[null,"",null,"",null,null,"",""]
[null,"",null,"",null,null,"",""]
[null,"",null,"",null,null,"",""]
[null,"",null,"",null,null,"",""]
[null,"",null,"",null,null,"",""]
[null,"",null,"",null,null,"",""]
[null,"",null,"",null,null,"",""]
[null,"",null,"",null,null,"",""]
[null,"",null,"",null,null,{"$f":"IF(C17=\"Part\",MID(A17,1,LEN(A17)-LEN(H17)),\"\")","v":""},""]
[null,"",null,"",null,null,"",""]
[null,"",null,"",null,null,"",""]
[null,"",null,"",null,null,"",""]
{"$rows_left_out":1787}
{"sheet":"Base prestations","index":4,"n_rows":606,"n_cols":22,"rows_kept":606,"cut":false,"hidden":false,"merged":[],"read":"row_number_cap"}
[null,null,null,null,null,null,null,null,null,null,null,null,null,"Base prestations","Base clients","PARAM","PARAM","PARAM","PARAM","PARAM","PARAM"]
[null,null,null,null,null,null,null,null,null,null,null,null,null,{"$f":"COUNTIFS(L:L,\"à éditer\")","v":1},null,null,null,null,"mois","année","hypothèses"]
[]
[null,"Base de devis et facturation",null,null,null,null,null,null,{"$f":"IF(MONTH(TODAY())<10,\"0\"&MONTH(TODAY()),MONTH(TODAY()))","v":"08"}]
[null,"Produits et services",null,null,null,null,null,null,null,"Faire \"control et ; \" pour insérer la date du jour.",null,"Choix d'édition de facture.",null,null,null,null,{"$f":"_xlfn.MAXIFS(N:N,L:L,\"définitif\")","v":0}]
["index","Code client","Description","Prix de vente € HT","Acompte de 30% à recevoir ?","Taux TVA","Remise","Moyens de paiement","Numéro de prestation","Date de devis","Date de facture","Edition ?","Raison de l'abandon","Numéro de facture","Type","libre","Incrémentation n° facture","total à éditer","MOIS","ANNEE","Etat","Pour Tiny référence devis"]
[1,"C0001","prestation 1",300,"OUI",0.2,null,"virement",1,"2020-05-01",null,"à éditer",null,{"$f":"IF(L7=\"à éditer\",IF(B7=B6,N6,$Q$5+IF(Q7=R7,Q7,R7)),\"\")+22000","v":22001},{"$f":"IFERROR(INDIRECT(\"'\"&$O$1&\"'!C\"&MATCH(B7,INDIRECT(\"'\"&$O$1&\"'!B:B\"),0)),\"\")","v":"Pro"},null,{"$f":"COUNTIFS(L:L,\"à éditer\",B:B,B7)","v":1},{"$f":"COUNTIFS($L$7:L7,\"à éditer\",$B$7:B7,B7)","v":1},{"$f":"IFERROR(MONTH(J7),\"\")","v":5},{"$f":"YEAR(J7)","v":2020},{"$f":"IF(OR(L7=\"définitif\",L7=\"à éditer\",L7=\"en cours de réalisation\"),\"Réalisé\",IF(OR(L7=\"projet annulé\",L7=\"\"),\"Non réalisé\",IF(L7=\"en attente\",\"En attente\",\"\")))","v":"Réalisé"}]
[{"$f":"A7+1","v":2},"C0001","Prestation 2",400,"OUI",0.1,0.05,"virement",1,null,null,null,null,{"$f":"IF(L8=\"à éditer\",IF(B8=B7,N7,$Q$5+IF(Q8=R8,Q8,R8)),\"\")","v":""},{"$f":"IFERROR(INDIRECT(\"'\"&$O$1&\"'!C\"&MATCH(B8,INDIRECT(\"'\"&$O$1&\"'!B:B\"),0)),\"\")","v":"Pro"},null,{"$f":"COUNTIFS(L:L,\"à éditer\",B:B,B8)","v":1},{"$f":"COUNTIFS($L$7:L8,\"à éditer\")","v":1},{"$f":"IFERROR(MONTH(J8),\"\")","v":1},{"$f":"YEAR(J8)","v":1900},{"$f":"IF(OR(L8=\"définitif\",L8=\"à éditer\",L8=\"en cours de réalisation\"),\"Réalisé\",IF(OR(L8=\"projet annulé\",L8=\"\"),\"Non réalisé\",IF(L8=\"en attente\",\"En attente\",\"\")))","v":"Non réalisé"}]
[3,"C0002","prestation 1",300,"NON",0.2,null,"virement",2,null,null,null,null,"","Pro",null,0,{"$f":"COUNTIFS($L$7:L9,\"à éditer\")","v":1},1,1900,"Non réalisé"]
[4,null,null,null,null,null,null,null,null,null,null,null,null,"","",null,0,{"$f":"COUNTIFS($L$7:L10,\"à éditer\")","v":1},1,1900,"Non réalisé"]
[5,null,null,null,null,null,null,null,null,null,null,null,null,"","",null,0,{"$f":"COUNTIFS($L$7:L11,\"à éditer\")","v":1},1,1900,"Non réalisé"]
[6,null,null,null,null,null,null,null,null,null,null,null,null,"","",null,0,{"$f":"COUNTIFS($L$7:L12,\"à éditer\")","v":1},1,1900,"Non réalisé"]
[7,null,null,null,null,null,null,null,null,null,null,null,null,"","Pro",null,0,{"$f":"COUNTIFS($L$7:L13,\"à éditer\")","v":1},1,1900,"Non réalisé"]
[8,null,null,null,null,null,null,null,null,null,null,null,null,"",{"$f":"IFERROR(INDIRECT(\"'\"&$O$1&\"'!C\"&MATCH(B14,INDIRECT(\"'\"&$O$1&\"'!B:B\"),0)),\"\")","v":""},null,0,{"$f":"COUNTIFS($L$7:L14,\"à éditer\")","v":1},1,1900,"Non réalisé"]
[9,null,null,null,null,null,null,null,null,null,null,null,null,"","",null,0,{"$f":"COUNTIFS($L$7:L16,\"à éditer\")","v":1},1,1900,"Non réalisé"]
[10,null,null,null,null,null,null,null,null,null,null,null,null,"","",null,0,{"$f":"COUNTIFS($L$7:L16,\"à éditer\")","v":1},1,1900,"Non réalisé"]
[11,null,null,null,null,null,null,null,null,null,null,null,null,"","",null,0,{"$f":"COUNTIFS($L$7:L17,\"à éditer\")","v":1},1,1900,"Non réalisé"]
[12,null,null,null,null,null,null,null,null,null,null,null,null,"","",null,0,{"$f":"COUNTIFS($L$7:L18,\"à éditer\")","v":1},1,1900,"Non réalisé"]
[13,null,null,null,null,null,null,null,null,null,null,null,null,"","",null,0,{"$f":"COUNTIFS($L$7:L19,\"à éditer\")","v":1},1,1900,"Non réalisé"]
[14,null,null,null,null,null,null,null,null,null,null,null,null,"",{"$f":"IFERROR(INDIRECT(\"'\"&$O$1&\"'!C\"&MATCH(B20,INDIRECT(\"'\"&$O$1&\"'!B:B\"),0)),\"\")","v":""},null,{"$f":"COUNTIFS(L:L,\"à éditer\",B:B,B20)","v":0},{"$f":"COUNTIFS($L$7:L20,\"à éditer\")","v":1},1,1900,"Non réalisé"]
{"$rows_left_out":587}
{"sheet":"Devis","index":5,"n_rows":78,"n_cols":14,"rows_kept":78,"cut":false,"hidden":false,"merged":[[17,6,17,7]]}
[]
[]
[]
[null,null,null,null,null,null,null,"Base prestations","Prestation ?"]
[null,null,"Ce devis se met à jour en fonction de la saisie de la colonne B de l'onglet Base Prestation",null,null,null,"sélection du code client","C0001",1]
[null,null,"Onglet automatique, ne pas modifier",null,null,null,null,{"$f":"IF(I6=\"Tous\",MATCH(H5,INDIRECT(\"'\"&H4&\"'!B:B\"),0),IF(I6>MATCH(H5,INDIRECT(\"'\"&H4&\"'!B:B\"),0),I6,MATCH(H5,INDIRECT(\"'\"&H4&\"'!B:B\"),0)))","v":7},{"$f":"IF(I5=\"*\",\"tous\",MATCH(I5,INDIRECT(\"'\"&H4&\"'!I:I\"),0))","v":7}]
[null,null,null,"https://d.docs.live.net/521f8be27da355e0/Documents/T-WOOD",null,null,null,"Base clients"]
[null,null,null,null,null,null,null,{"$f":"IFERROR(INDIRECT(\"'\"&$H$7&\"'!C\"&MATCH(H5,INDIRECT(\"'\"&$H$7&\"'!B:B\"),0)),\"\")","v":"Pro"}]
[null,null,"Nom client",{"$f":"IFERROR(IF($H$8=\"PRO\",\"Société \"&INDIRECT(\"'\"&$H$7&\"'!D\"&MATCH(H5,INDIRECT(\"'\"&$H$7&\"'!B:B\"),0)),\"\"),\"\")&\" \"&IFERROR(IF(H8=\"PRO\",\"A l'attention de \"&INDIRECT(\"'\"&$H$7&\"'!f\"&MATCH(H5,INDIRECT(\"'\"&$H$7&\"'!B:B\"),0))&\" \"&INDIRECT(\"'\"&$H$7&\"'!E\"&MATCH(H5,INDIRECT(\"'\"&$H$7&\"'!B:B\"),0)),INDIRECT(\"'\"&$H$7&\"'!h\"&MATCH(H5,INDIRECT(\"'\"&$H$7&\"'!B:B\"),0))&\" \"&INDIRECT(\"'\"&$H$7&\"'!g\"&MATCH(H5,INDIRECT(\"'\"&$H$7&\"'!B:B\"),0))),\"\")","v":"Société société x A l'attention de Thomas Le Blanc"}]
[null,null,null,"Acompte demandé :",{"$f":"INDIRECT(\"'\"&$H$4&\"'!e\"&C29)","v":"OUI"}]
[]
[]
[null,null,null,null,null,{"$f":"IF(I5=\"*\",\"Récapitulatif de tous les devis\",\"DEVIS \"&YEAR(NOW())&\"_\"&IF(MONTH(NOW())<10,\"0\"&MONTH(NOW()),MONTH(NOW()))&\"_\"&IF(DAY(NOW())<10,\"0\"&DAY(NOW()),DAY(NOW())))&\"_\"&IF(HOUR(NOW())<10,\"0\"&HOUR(NOW()),HOUR(NOW()))&\"h\"&IF(MINUTE(NOW())<10,\"0\"&MINUTE(NOW()),MINUTE(NOW()))&\"_\"&IF(SECOND(NOW())<10,\"0\"&SECOND(NOW()),SECOND(NOW()))","v":"DEVIS 2020_08_11_16h10_40"}]
[null,null,null,null,null,null,"Date :",{"$f":"INDIRECT(\"'\"&H4&\"'!J\"&H6)","v":"2020-05-01"}]
[]
[null,null,""]
[null,null,{"$f":"IF(ISBLANK('Nos données'!C7),\"\",'Nos données'!C7)","v":""}]
[null,null,{"$f":"IF(ISBLANK('Nos données'!C8),\"\",'Nos données'!C8)","v":""},null,null,null,{"$f":"IFERROR(IF($H$8=\"PRO\",\"Société \"&INDIRECT(\"'\"&$H$7&\"'!D\"&MATCH(H5,INDIRECT(\"'\"&$H$7&\"'!B:B\"),0)),\"\"),\"\")","v":"Société société x"}]
[null,null,{"$f":"IF(ISBLANK('Nos données'!C9),\"\",'Nos données'!C9)","v":""},null,null,null,{"$f":"IFERROR(IF(H8=\"PRO\",\"A l'attention de \"&INDIRECT(\"'\"&$H$7&\"'!f\"&MATCH(H5,INDIRECT(\"'\"&$H$7&\"'!B:B\"),0))&\" \"&INDIRECT(\"'\"&$H$7&\"'!E\"&MATCH(H5,INDIRECT(\"'\"&$H$7&\"'!B:B\"),0)),INDIRECT(\"'\"&$H$7&\"'!h\"&MATCH(H5,INDIRECT(\"'\"&$H$7&\"'!B:B\"),0))&\" \"&INDIRECT(\"'\"&$H$7&\"'!g\"&MATCH(H5,INDIRECT(\"'\"&$H$7&\"'!B:B\"),0))),\"\")","v":"A l'attention de Thomas Le Blanc"}]
[null,null,{"$f":"IF(ISBLANK('Nos données'!C10),\"\",'Nos données'!C10)&\" \"&IF(ISBLANK('Nos données'!C11),\"\",'Nos données'!C11)","v":" "},null,null,null,{"$f":"IFERROR(INDIRECT(\"'\"&$H$7&\"'!i\"&MATCH(H5,INDIRECT(\"'\"&$H$7&\"'!B:B\"),0)),\"\")","v":"343 rue de Neuilly"}]
{"$rows_left_out":59}
{"sheet":"Facture","index":6,"n_rows":77,"n_cols":12,"rows_kept":77,"cut":false,"hidden":false,"merged":[[12,5,12,6],[17,6,17,7],[75,3,75,4],[76,3,76,4]]}
[]
[]
[]
[null,null,null,null,null,null,null,"Base prestations","Prestation ?"]
[null,null,"Ce devis se met à jour en fonction de la saisie de la colonne B de l'onglet Base Prestation",null,null,null,"sélection du code client","C0001",1]
[null,null,"Onglet automatique, ne pas modifier",null,null,null,"Ligne en cours de base prestation",{"$f":"IF(I6>MATCH(H5,INDIRECT(\"'\"&H4&\"'!B:B\"),0),I6,MATCH(H5,INDIRECT(\"'\"&H4&\"'!B:B\"),0))","v":7},{"$f":"MATCH(I5,INDIRECT(\"'\"&H4&\"'!I:I\"),0)","v":7}]
[null,null,null,"C:\\Users\\xavie\\OneDrive\\Documents\\T-WOOD",null,null,null,"Base clients"]
[null,null,null,null,null,null,null,{"$f":"IFERROR(INDIRECT(\"'\"&$H$7&\"'!C\"&MATCH(H5,INDIRECT(\"'\"&$H$7&\"'!B:B\"),0)),\"\")","v":"Pro"}]
[null,null,"Nom client",{"$f":"UPPER(IFERROR(IF($H$8=\"PRO\",\"Société \"&INDIRECT(\"'\"&$H$7&\"'!D\"&MATCH(H5,INDIRECT(\"'\"&$H$7&\"'!B:B\"),0)),\"\"),\"\")&\" \"&IFERROR(IF(H8=\"PRO\",\"A l'attention de \"&INDIRECT(\"'\"&$H$7&\"'!f\"&MATCH(H5,INDIRECT(\"'\"&$H$7&\"'!B:B\"),0))&\" \"&INDIRECT(\"'\"&$H$7&\"'!E\"&MATCH(H5,INDIRECT(\"'\"&$H$7&\"'!B:B\"),0)),INDIRECT(\"'\"&$H$7&\"'!h\"&MATCH(H5,INDIRECT(\"'\"&$H$7&\"'!B:B\"),0))&\" \"&INDIRECT(\"'\"&$H$7&\"'!g\"&MATCH(H5,INDIRECT(\"'\"&$H$7&\"'!B:B\"),0))),\"\"))","v":"SOCIÉTÉ SOCIÉTÉ X A L'ATTENTION DE THOMAS LE BLANC"}]
[null,null,null,"Acompte reçu ?",{"$f":"INDIRECT(\"'\"&H4&\"'!E\"&H6)","v":"OUI"}]
[]
[]
[null,null,null,null,null,"Facture n°",null,{"$f":"INDIRECT(\"'\"&H4&\"'!N\"&H6)","v":22001}]
[null,null,null,null,null,null,"Date :",{"$f":"INDIRECT(\"'\"&H4&\"'!K\"&H6)","v":"00:00:00"}]
[]
[null,null,""]
[null,null,{"$f":"IF(ISBLANK('Nos données'!C7),\"\",'Nos données'!C7)","v":""}]
[null,null,{"$f":"IF(ISBLANK('Nos données'!C8),\"\",'Nos données'!C8)","v":""},null,null,null,{"$f":"IFERROR(IF($H$8=\"PRO\",\"Société \"&INDIRECT(\"'\"&$H$7&\"'!D\"&MATCH(H5,INDIRECT(\"'\"&$H$7&\"'!B:B\"),0)),\"\"),\"\")","v":"Société société x"}]
[null,null,{"$f":"IF(ISBLANK('Nos données'!C9),\"\",'Nos données'!C9)","v":""},null,null,null,{"$f":"IFERROR(IF(H8=\"PRO\",\"A l'attention de \"&INDIRECT(\"'\"&$H$7&\"'!f\"&MATCH(H5,INDIRECT(\"'\"&$H$7&\"'!B:B\"),0))&\" \"&INDIRECT(\"'\"&$H$7&\"'!E\"&MATCH(H5,INDIRECT(\"'\"&$H$7&\"'!B:B\"),0)),INDIRECT(\"'\"&$H$7&\"'!h\"&MATCH(H5,INDIRECT(\"'\"&$H$7&\"'!B:B\"),0))&\" \"&INDIRECT(\"'\"&$H$7&\"'!g\"&MATCH(H5,INDIRECT(\"'\"&$H$7&\"'!B:B\"),0))),\"\")","v":"A l'attention de Thomas Le Blanc"}]
[null,null,{"$f":"IF(ISBLANK('Nos données'!C10),\"\",'Nos données'!C10)&\" \"&IF(ISBLANK('Nos données'!C11),\"\",'Nos données'!C11)","v":" "},null,null,null,{"$f":"IFERROR(INDIRECT(\"'\"&$H$7&\"'!i\"&MATCH(H5,INDIRECT(\"'\"&$H$7&\"'!B:B\"),0)),\"\")","v":"343 rue de Neuilly"}]
{"$rows_left_out":58}
{"sheet":"Chiffre affaires","index":7,"n_rows":49,"n_cols":13,"rows_kept":49,"cut":false,"hidden":false,"merged":[]}
["année","*","Taper * pour toutes les années"]
["Type","Réalisé"]
["Onglet","Base prestations"]
[]
["Mois",1,{"$f":"B5+1","v":2},{"$f":"C5+1","v":3},4,5,6,7,8,9,10,11,12]
["CA",{"$f":"IF($B$1=\"*\",SUMIFS('Base prestations'!$D:$D,'Base prestations'!$S:$S,B$5,'Base prestations'!$U:$U,$B$2),SUMIFS('Base prestations'!$D:$D,'Base prestations'!$S:$S,B$5,'Base prestations'!$T:$T,$B$1,'Base prestations'!$U:$U,$B$2))","v":0},{"$f":"IF($B$1=\"*\",SUMIFS('Base prestations'!$D:$D,'Base prestations'!$S:$S,C$5,'Base prestations'!$U:$U,$B$2),SUMIFS('Base prestations'!$D:$D,'Base prestations'!$S:$S,C$5,'Base prestations'!$T:$T,$B$1,'Base prestations'!$U:$U,$B$2))","v":0},{"$f":"IF($B$1=\"*\",SUMIFS('Base prestations'!$D:$D,'Base prestations'!$S:$S,D$5,'Base prestations'!$U:$U,$B$2),SUMIFS('Base prestations'!$D:$D,'Base prestations'!$S:$S,D$5,'Base prestations'!$T:$T,$B$1,'Base prestations'!$U:$U,$B$2))","v":0},{"$f":"IF($B$1=\"*\",SUMIFS('Base prestations'!$D:$D,'Base prestations'!$S:$S,E$5,'Base prestations'!$U:$U,$B$2),SUMIFS('Base prestations'!$D:$D,'Base prestations'!$S:$S,E$5,'Base prestations'!$T:$T,$B$1,'Base prestations'!$U:$U,$B$2))","v":0},{"$f":"IF($B$1=\"*\",SUMIFS('Base prestations'!$D:$D,'Base prestations'!$S:$S,F$5,'Base prestations'!$U:$U,$B$2),SUMIFS('Base prestations'!$D:$D,'Base prestations'!$S:$S,F$5,'Base prestations'!$T:$T,$B$1,'Base prestations'!$U:$U,$B$2))","v":300},{"$f":"IF($B$1=\"*\",SUMIFS('Base prestations'!$D:$D,'Base prestations'!$S:$S,G$5,'Base prestations'!$U:$U,$B$2),SUMIFS('Base prestations'!$D:$D,'Base prestations'!$S:$S,G$5,'Base prestations'!$T:$T,$B$1,'Base prestations'!$U:$U,$B$2))","v":0},{"$f":"IF($B$1=\"*\",SUMIFS('Base prestations'!$D:$D,'Base prestations'!$S:$S,H$5,'Base prestations'!$U:$U,$B$2),SUMIFS('Base prestations'!$D:$D,'Base prestations'!$S:$S,H$5,'Base prestations'!$T:$T,$B$1,'Base prestations'!$U:$U,$B$2))","v":0},{"$f":"IF($B$1=\"*\",SUMIFS('Base prestations'!$D:$D,'Base prestations'!$S:$S,I$5,'Base prestations'!$U:$U,$B$2),SUMIFS('Base prestations'!$D:$D,'Base prestations'!$S:$S,I$5,'Base prestations'!$T:$T,$B$1,'Base prestations'!$U:$U,$B$2))","v":0},{"$f":"IF($B$1=\"*\",SUMIFS('Base prestations'!$D:$D,'Base prestations'!$S:$S,J$5,'Base prestations'!$U:$U,$B$2),SUMIFS('Base prestations'!$D:$D,'Base prestations'!$S:$S,J$5,'Base prestations'!$T:$T,$B$1,'Base prestations'!$U:$U,$B$2))","v":0},{"$f":"IF($B$1=\"*\",SUMIFS('Base prestations'!$D:$D,'Base prestations'!$S:$S,K$5,'Base prestations'!$U:$U,$B$2),SUMIFS('Base prestations'!$D:$D,'Base prestations'!$S:$S,K$5,'Base prestations'!$T:$T,$B$1,'Base prestations'!$U:$U,$B$2))","v":0},{"$f":"IF($B$1=\"*\",SUMIFS('Base prestations'!$D:$D,'Base prestations'!$S:$S,L$5,'Base prestations'!$U:$U,$B$2),SUMIFS('Base prestations'!$D:$D,'Base prestations'!$S:$S,L$5,'Base prestations'!$T:$T,$B$1,'Base prestations'!$U:$U,$B$2))","v":0},{"$f":"IF($B$1=\"*\",SUMIFS('Base prestations'!$D:$D,'Base prestations'!$S:$S,M$5,'Base prestations'!$U:$U,$B$2),SUMIFS('Base prestations'!$D:$D,'Base prestations'!$S:$S,M$5,'Base prestations'!$T:$T,$B$1,'Base prestations'!$U:$U,$B$2))","v":0}]
[null,"Chiffre d'affaires"]
[null,"Ceci est un onglet de consultation, pas de modification possible"]
[]
[null,{"$f":"IF(B1=\"*\",\"Toutes les années\",B1)","v":"Toutes les années"},{"$f":"\"Chiffre d'affaires \"&B2","v":"Chiffre d'affaires Réalisé"}]
[1,"JANVIER",{"$f":"SUMIF($A$5:$ALL$5,A11,$A$6:$ALL$6)","v":0}]
[2,"FÉVRIER",{"$f":"SUMIF($A$5:$ALL$5,A12,$A$6:$ALL$6)","v":0}]
[3,"MARS",0]
[4,"AVRIL",0]
[5,"MAI",300]
[6,"JUIN",0]
[7,"JUILLET",0]
[8,"AOÛT",0]
[9,"SEPTEMBRE",0]
[10,"OCTOBRE",0]
{"$rows_left_out":30}
{"sheet":"outils TTC ou HT","index":8,"n_rows":13,"n_cols":5,"rows_kept":13,"cut":false,"hidden":false,"merged":[]}
[]
[]
[]
[]
[]
[]
[]
[]
[null,"Taux TVA","Montant HT","Montant TVA","Montant TTC"]
[null,0.2,{"$f":"2405.76-1749","v":656.76000000000022},{"$f":"E10-C10","v":131.35199999999998},{"$f":"C10*(1+B10)","v":788.11200000000019}]
[]
[null,"Taux TVA","Montant HT","Montant TVA","Montant TTC"]
[null,0.2,{"$f":"E13-D13","v":1155.7583333333334},{"$f":"-E13/(1+B13)+E13","v":231.15166666666664},1386.91]

{"sheet":"Table","index":9,"n_rows":2841,"n_cols":1,"rows_kept":2841,"cut":false,"hidden":true,"merged":[]}
["Prestations"]
[1]
[2]
[3]
[4]
[5]
[6]
[7]
[8]
[9]
[10]
[11]
[12]
[13]
[14]
[15]
[16]
[17]
[18]
[19]
{"$rows_left_out":2821}