{"text_format":"1","workbook":"xlsx","n_sheets":10,"sheets":["Sommaire","Nos données","Lisez moi !","Base clients","Base prestations","Devis","Facture","Chiffre affaires","outils TTC ou HT","Table"],"not_rendered":{"charts":2,"images":3,"macros":1,"external_links":2,"defined_names":8842,"comments":0,"pivot_tables":0},"unopened":[],"bounds":{"document_bytes":16777216,"sheet_cells":100000,"rows_first":2000,"rows_last":500,"rows_between":2000,"halvings":0,"cell_chars":16384,"cell_head_chars":4096},"cells_cut":0,"cells_raw":0,"read":"row_number_cap","date_system":"1900"}

{"sheet":"Sommaire","index":0,"n_rows":19,"n_cols":4,"rows_kept":19,"cut":false,"hidden":false,"merged":[[3,3,5,8],[8,2,8,9]]}
[]
[]
[]
[null,null,null,"Facturier V0 "]
[]
[]
[]
[]
[null,null,"Sommaire"]
[]
[null,null,null,"Nos données"]
[null,null,null,"Sommaire"]
[null,null,null,"Lisez moi !"]
[null,null,null,"Base clients"]
[null,null,null,"Base prestations"]
[null,null,null,"outils TTC ou HT"]
[null,null,null,"Devis"]
[null,null,null,"Facture"]
[null,null,null,"Chiffre affaires"]

{"sheet":"Nos données","index":1,"n_rows":24,"n_cols":9,"rows_kept":24,"cut":false,"hidden":false,"merged":[]}
["v","Outil de facturation Concilium"]
[]
[null,"Vos données"]
[null,"Saisir dans les cases vertes uniquement"]
[null,null,null,null,null,null,null,null,"oui"]
[null,null,null,null,null,null,null,null,"non"]
[null,"Votre nom ou raison sociale :",null,null,"Moyens de règlement clients :"]
[null,"Complément raison sociale :",null,null,"chèque"]
[null,"Adresse de votre siège :",null,null,"virement"]
[null,"Code postal :",null,null,"carte bancaire"]
[null,"Ville :",null,null,"espèces"]
[null,"Téléphone :"]
[null,"Numéro Siret :"]
[null,"Numéro de TVA intracommunautaire (si applicable) :"]
[]
[]
[null,"Taux de TVA :"]
[null,"Taux 0",0]
[null,"Taux 1",5.5E-2]
[null,"Taux 2",0.1]
[null,"Taux 3",0.2]
[]
[null,"Etes-vous exonéré de TVA ? (par exemple oui si vous êtes en micro-entreprise)"]
[null,"non"]

{"sheet":"Lisez moi !","index":2,"n_rows":29,"n_cols":5,"rows_kept":29,"cut":false,"hidden":false,"merged":[]}
[]
[]
[]
[]
[]
[null,null,"Mode opératoire du fichier"]
[]
[null,null,"Dans l'onglet nos données, veuillez saisir les éléments relatifs à votre société (raison sociale, adresse, Siret etc.)"]
[null,null,null,"Ceci met à jour les onglets facture et devis"]
[]
[null,null,"L'outil HT TTC a été ajouté enfin de répondre a besoins ponctuels"]
[]
[null,null,"Dans l'onglet base client, veuillez saisir tous les éléments relatifs aux clients (adresse, téléphone etc.)"]
[null,null,null,"Un code unique sera affecté à chaque client"]
[]
[null,null,"Dans base prestation veuillez saisir tous les éléments relatifs aux devis "]
[null,null,null,"En colonne i vous pouvez indiquer un numéro et le répéter si vous souhaitez indiquer un détail des lignes du devis pour un même client."]
[null,null,null,"Une fois le devis accepté et la prestation réalisée, vous pouvez indiquer une date de facture et un statut à éditer"]
[null,null,null,"Colonne L, il existe un bouton permettant de définir un numéro de facture unique et chronologique"]
[]
[null,null,"L’onglet devis est automatique ; il convient uniquement de préciser le code client en H5 et le numéro de prestation en I5 afin de restituer le devis"]
[null,null,null,"Deux commandes existent pour soit mettre en forme le document soit de générer un PDF"]
[null,null,null,"Le PDF sera automatiquement placés au même endroit que le fichier excel"]
[null,null,null,"Le programme est compatible Windows excel 2016 et Macintosh excel 2016"]
[]
[null,null,"L'onglet chiffre d'affaires se met à jour automatiquement à partir des données saisies en base prestation"]
[null,null,null,"Les deux graphiques permettent de suivre :"]
[null,null,null,null,"Le chiffre d'affaires réalisé"]
[null,null,null,null,"Le chiffre d'affaires en attente"]

{"sheet":"Base clients","index":3,"n_rows":1806,"n_cols":16,"rows_kept":1806,"cut":false,"hidden":false,"merged":[]}
["Base clients"]
["Saisissez vos clients ici (cases vertes uniquement)"]
["Pour trouver un client plus rapidement, faire Ctrl + touche F"]
["Remplir toutes les cellules vertes"]
["Nom Client","Code","Type","Raison sociale","Nom du contact","Prénom du contact","Nom du particulier","Prénom du particulier","Adresse","C. postal","Ville","Téléphone","Portable","Site internet","E-mail","Remarques"]
["société x",{"$f":"IF(A6<>\"\",IFERROR(IF(LEN(ROW()-5)=1,\"C000\"&ROW()-5,IF(LEN(ROW()-5)=2,\"C00\"&ROW()-5,IF(LEN(ROW()-5)=3,\"C0\"&ROW()-5,IF(LEN(ROW()-5)=4,\"C\"&ROW()-5)))),\"\"),\"\")","v":"C0001"},"Pro",{"$f":"IF(OR(C6=\"Part\",C6=\"\"),\"\",A6)","v":"société x"},"Le Blanc","Thomas",{"$f":"IF(C6=\"Part\",MID(A6,1,LEN(A6)-LEN(H6)),\"\")","v":""},{"$f":"IF(C6=\"Part\",MID(A6,FIND(\"µ\",SUBSTITUTE(A6,\" \",\"µ\",LEN(A6)-LEN(SUBSTITUTE(A6,\" \",\"\"))))+1,8000),\"\")","v":""},"343 rue de Neuilly","75016","Paris"]
["société Y",{"$f":"IF(A7<>\"\",IFERROR(IF(LEN(ROW()-5)=1,\"C000\"&ROW()-5,IF(LEN(ROW()-5)=2,\"C00\"&ROW()-5,IF(LEN(ROW()-5)=3,\"C0\"&ROW()-5,IF(LEN(ROW()-5)=4,\"C\"&ROW()-5)))),\"\"),\"\")","v":"C0002"},"Pro","société Y","Bon","Jean",{"$f":"IF(C7=\"Part\",MID(A7,1,LEN(A7)-LEN(H7)),\"\")","v":""},{"$f":"IF(C7=\"Part\",MID(A7,FIND(\"µ\",SUBSTITUTE(A7,\" \",\"µ\",LEN(A7)-LEN(SUBSTITUTE(A7,\" \",\"\"))))+1,8000),\"\")","v":""},"rue du Paradis","75008","Paris"]
[null,"",null,"",null,null,"",""]
[null,"",null,"",null,null,"",""]
[null,"",null,"",null,null,"",""]
[null,"",null,"",null,null,"",""]
[null,"",null,"",null,null,"",""]
[null,"",null,"",null,null,"",""]
[null,"",null,"",null,null,"",""]
[null,"",null,"",null,null,"",""]
[null,"",null,"",null,null,"",""]
[null,"",null,"",null,null,{"$f":"IF(C17=\"Part\",MID(A17,1,LEN(A17)-LEN(H17)),\"\")","v":""},""]
[null,"",null,"",null,null,"",""]
[null,"",null,"",null,null,"",""]
[null,"",null,"",null,null,"",""]
[null,"",null,""]
[null,"",null,"",null,null,"",""]
[null,"",null,"",null,null,"",""]
[null,"",null,"",null,null,"",""]
[null,"",null,"",null,null,"",""]
[null,"",null,"",null,null,"",""]
[null,"",null,"",null,null,"",""]
[null,"",null,"",null,null,"",""]
[null,"",null,"",null,null,"",""]
[null,"",null,"",null,null,"",""]
[null,"",null,"",null,null,"",""]
[null,"",null,"",null,null,"",""]
[null,"",null,"",null,null,"",""]
[null,"",null,"",null,null,"",""]
[null,"",null,"",null,null,"",""]
[null,"",null,"",null,null,"",""]
[null,"",null,"",null,null,"",""]
[null,"",null,"",null,null,"",""]
[null,"",null,"",null,null,"",""]
[null,"",null,"",null,null,"",""]
[null,"",null,"",null,null,"",""]
[null,"",null,"",null,null,"",""]
[null,"",null,"",null,null,"",""]
[null,"",null,"",null,null,"",""]
[null,"",null,"",null,null,"",""]
[null,"",null,"",null,null,"",""]
[null,"",null,"",null,null,"",""]
[null,"",null,"",null,null,"",""]
[null,"",null,"",null,null,"",""]
[null,"",null,"",null,null,"",""]
[null,"",null,"",null,null,"",""]
[null,"",null,"",null,null,"",""]
[null,"",null,"",null,null,"",""]
[null,"",null,"",null,null,"",""]
[null,"",null,"",null,null,"",""]
[null,"",null,"",null,null,"",""]
[null,"",null,"",null,null,"",""]
[null,"",null,"",null,null,"",""]
[null,"",null,"",null,null,"",""]
[null,"",null,"",null,null,"",""]
[null,"",null,"",null,null,"",""]
[null,"",null,"",null,null,"",""]
[null,"",null,"",null,null,"",""]
[null,"",null,"",null,null,"",""]
[null,"",null,"",null,null,"",""]
[null,"",null,"",null,null,"",""]
[null,"",null,{"$f":"IF(OR(C67=\"Part\",C67=\"\"),\"\",A67)","v":""},null,null,"",""]
[null,"",null,"",null,null,{"$f":"IF(C68=\"Part\",MID(A68,1,LEN(A68)-LEN(H68)),\"\")","v":""},{"$f":"IF(C68=\"Part\",MID(A68,FIND(\"µ\",SUBSTITUTE(A68,\" \",\"µ\",LEN(A68)-LEN(SUBSTITUTE(A68,\" \",\"\"))))+1,8000),\"\")","v":""}]
[null,{"$f":"IF(A69<>\"\",IFERROR(IF(LEN(ROW()-5)=1,\"C000\"&ROW()-5,IF(LEN(ROW()-5)=2,\"C00\"&ROW()-5,IF(LEN(ROW()-5)=3,\"C0\"&ROW()-5,IF(LEN(ROW()-5)=4,\"C\"&ROW()-5)))),\"\"),\"\")","v":""},null,"",null,null,"",""]
[null,"",null,"",null,null,"",""]
[null,"",null,"",null,null,"",""]
[null,"",null,"",null,null,"",""]
[null,"",null,"",null,null,"",""]
[null,"",null,"",null,null,"",""]
[null,"",null,"",null,null,"",""]
[null,"",null,"",null,null,"",""]
[null,"",null,"",null,null,"",""]
[null,"",null,"",null,null,"",""]
[null,"",null,"",null,null,"",""]
[null,"",null,"",null,null,"",""]
[null,"",null,"",null,null,"",""]
[null,"",null,"",null,null,"",""]
[null,"",null,"",null,null,"",""]
[null,"",null,"",null,null,"",""]
[null,"",null,"",null,null,"",""]
[null,"",null,"",null,null,"",""]
[null,"",null,"",null,null,"",""]
[null,"",null,"",null,null,"",""]
[null,"",null,"",null,null,"",""]
[null,"",null,"",null,null,"",""]
[null,"",null,"",null,null,"",""]
[null,"",null,"",null,null,"",""]
[null,"",null,"",null,null,"",""]
[null,"",null,"",null,null,"",""]
[null,"",null,"",null,null,"",""]
[null,"",null,"",null,null,"",""]
[null,"",null,"",null,null,"",""]
[null,"",null,"",null,null,"",""]
[null,"",null,"",null,null,"",""]
[null,"",null,"",null,null,"",""]
[null,"",null,"",null,null,"",""]
[null,"",null,"",null,null,"",""]
[null,"",null,"",null,null,"",""]
[null,"",null,"",null,null,"",""]
[null,"",null,"",null,null,"",""]
[null,"",null,"",null,null,"",""]
[null,"",null,"",null,null,"",""]
[null,"",null,"",null,null,"",""]
[null,"",null,"",null,null,"",""]
[null,"",null,"",null,null,"",""]
[null,"",null,"",null,null,"",""]
[null,"",null,"",null,null,"",""]
[null,"",null,"",null,null,"",""]
[null,"",null,"",null,null,"",""]
[null,"",null,"",null,null,"",""]
[null,"",null,"",null,null,"",""]
[null,"",null,"",null,null,"",""]
[null,"",null,"",null,null,"",""]
[null,"",null,"",null,null,"",""]
[null,"",null,"",null,null,"",""]
[null,"",null,"",null,null,"",""]
[null,"",null,"",null,null,"",""]
[null,"",null,"",null,null,"",""]
[null,"",null,"",null,null,"",""]
[null,"",null,"",null,null,"",""]
[null,"",null,"",null,null,"",""]
[null,"",null,"",null,null,"",""]
[null,"",null,"",null,null,"",""]
[null,"",null,"",null,null,"",""]
[null,"",null,"",null,null,"",""]
[null,"",null,{"$f":"IF(OR(C131=\"Part\",C131=\"\"),\"\",A131)","v":""},null,null,"",""]
[null,"",null,"",null,null,{"$f":"IF(C132=\"Part\",MID(A132,1,LEN(A132)-LEN(H132)),\"\")","v":""},{"$f":"IF(C132=\"Part\",MID(A132,FIND(\"µ\",SUBSTITUTE(A132,\" \",\"µ\",LEN(A132)-LEN(SUBSTITUTE(A132,\" \",\"\"))))+1,8000),\"\")","v":""}]
[null,{"$f":"IF(A133<>\"\",IFERROR(IF(LEN(ROW()-5)=1,\"C000\"&ROW()-5,IF(LEN(ROW()-5)=2,\"C00\"&ROW()-5,IF(LEN(ROW()-5)=3,\"C0\"&ROW()-5,IF(LEN(ROW()-5)=4,\"C\"&ROW()-5)))),\"\"),\"\")","v":""},null,"",null,null,"",""]
[null,"",null,"",null,null,"",""]
[null,"",null,"",null,null,"",""]
[null,"",null,"",null,null,"",""]
[null,"",null,"",null,null,"",""]
[null,"",null,"",null,null,"",""]
[null,"",null,"",null,null,"",""]
[null,"",null,"",null,null,"",""]
[null,"",null,"",null,null,"",""]
[null,"",null,"",null,null,"",""]
[null,"",null,"",null,null,"",""]
[null,"",null,"",null,null,"",""]
[null,"",null,"",null,null,"",""]
[null,"",null,"",null,null,"",""]
[null,"",null,"",null,null,"",""]
[null,"",null,"",null,null,"",""]
[null,"",null,"",null,null,"",""]
[null,"",null,"",null,null,"",""]
[null,"",null,"",null,null,"",""]
[null,"",null,"",null,null,"",""]
[null,"",null,"",null,null,"",""]
[null,"",null,"",null,null,"",""]
[null,"",null,"",null,null,"",""]
[null,"",null,"",null,null,"",""]
[null,"",null,"",null,null,"",""]
[null,"",null,"",null,null,"",""]
[null,"",null,"",null,null,"",""]
[null,"",null,"",null,null,"",""]
[null,"",null,"",null,null,"",""]
[null,"",null,"",null,null,"",""]
[null,"",null,"",null,null,"",""]
[null,"",null,"",null,null,"",""]
[null,"",null,"",null,null,"",""]
[null,"",null,"",null,null,"",""]
[null,"",null,"",null,null,"",""]
[null,"",null,"",null,null,"",""]
[null,"",null,"",null,null,"",""]
[null,"",null,"",null,null,"",""]
[null,"",null,"",null,null,"",""]
[null,"",null,"",null,null,"",""]
[null,"",null,"",null,null,"",""]
[null,"",null,"",null,null,"",""]
[null,"",null,"",null,null,"",""]
[null,"",null,"",null,null,"",""]
[null,"",null,"",null,null,"",""]
[null,"",null,"",null,null,"",""]
[null,"",null,"",null,null,"",""]
[null,"",null,"",null,null,"",""]
[null,"",null,"",null,null,"",""]
[null,"",null,"",null,null,"",""]
[null,"",null,"",null,null,"",""]
[null,"",null,"",null,null,"",""]
[null,"",null,"",null,null,"",""]
[null,"",null,"",null,null,"",""]
[null,"",null,"",null,null,"",""]
[null,"",null,"",null,null,"",""]
[null,"",null,"",null,null,"",""]
[null,"",null,"",null,null,"",""]
[null,"",null,"",null,null,"",""]
[null,"",null,"",null,null,"",""]
[null,"",null,"",null,null,"",""]
[null,"",null,"",null,null,"",""]
[null,"",null,{"$f":"IF(OR(C195=\"Part\",C195=\"\"),\"\",A195)","v":""},null,null,"",""]
[null,"",null,"",null,null,{"$f":"IF(C196=\"Part\",MID(A196,1,LEN(A196)-LEN(H196)),\"\")","v":""},{"$f":"IF(C196=\"Part\",MID(A196,FIND(\"µ\",SUBSTITUTE(A196,\" \",\"µ\",LEN(A196)-LEN(SUBSTITUTE(A196,\" \",\"\"))))+1,8000),\"\")","v":""}]
[null,{"$f":"IF(A197<>\"\",IFERROR(IF(LEN(ROW()-5)=1,\"C000\"&ROW()-5,IF(LEN(ROW()-5)=2,\"C00\"&ROW()-5,IF(LEN(ROW()-5)=3,\"C0\"&ROW()-5,IF(LEN(ROW()-5)=4,\"C\"&ROW()-5)))),\"\"),\"\")","v":""},null,"",null,null,"",""]
[null,"",null,"",null,null,"",""]
[null,"",null,"",null,null,"",""]
[null,"",null,"",null,null,"",""]
[null,"",null,"",null,null,"",""]
[null,"",null,"",null,null,"",""]
[null,"",null,"",null,null,"",""]
[null,"",null,"",null,null,"",""]
[null,"",null,"",null,null,"",""]
[null,"",null,"",null,null,"",""]
[null,"",null,"",null,null,"",""]
[null,"",null,"",null,null,"",""]
[null,"",null,"",null,null,"",""]
[null,"",null,"",null,null,"",""]
[null,"",null,"",null,null,"",""]
[null,"",null,"",null,null,"",""]
[null,"",null,"",null,null,"",""]
[null,"",null,"",null,null,"",""]
[null,"",null,"",null,null,"",""]
[null,"",null,"",null,null,"",""]
[null,"",null,"",null,null,"",""]
[null,"",null,"",null,null,"",""]
[null,"",null,"",null,null,"",""]
[null,"",null,"",null,null,"",""]
[null,"",null,"",null,null,"",""]
[null,"",null,"",null,null,"",""]
[null,"",null,"",null,null,"",""]
[null,"",null,"",null,null,"",""]
[null,"",null,"",null,null,"",""]
[null,"",null,"",null,null,"",""]
[null,"",null,"",null,null,"",""]
[null,"",null,"",null,null,"",""]
[null,"",null,"",null,null,"",""]
[null,"",null,"",null,null,"",""]
[null,"",null,"",null,null,"",""]
[null,"",null,"",null,null,"",""]
[null,"",null,"",null,null,"",""]
[null,"",null,"",null,null,"",""]
[null,"",null,"",null,null,"",""]
[null,"",null,"",null,null,"",""]
[null,"",null,"",null,null,"",""]
[null,"",null,"",null,null,"",""]
[null,"",null,"",null,null,"",""]
[null,"",null,"",null,null,"",""]
[null,"",null,"",null,null,"",""]
[null,"",null,"",null,null,"",""]
[null,"",null,"",null,null,"",""]
[null,"",null,"",null,null,"",""]
[null,"",null,"",null,null,"",""]
[null,"",null,"",null,null,"",""]
[null,"",null,"",null,null,"",""]
[null,"",null,"",null,null,"",""]
[null,"",null,"",null,null,"",""]
[null,"",null,"",null,null,"",""]
[null,"",null,"",null,null,"",""]
[null,"",null,"",null,null,"",""]
[null,"",null,"",null,null,"",""]
[null,"",null,"",null,null,"",""]
[null,"",null,"",null,null,"",""]
[null,"",null,"",null,null,"",""]
[null,"",null,"",null,null,"",""]
[null,"",null,"",null,null,"",""]
[null,"",null,{"$f":"IF(OR(C259=\"Part\",C259=\"\"),\"\",A259)","v":""},null,null,"",""]
[null,"",null,"",null,null,{"$f":"IF(C260=\"Part\",MID(A260,1,LEN(A260)-LEN(H260)),\"\")","v":""},{"$f":"IF(C260=\"Part\",MID(A260,FIND(\"µ\",SUBSTITUTE(A260,\" \",\"µ\",LEN(A260)-LEN(SUBSTITUTE(A260,\" \",\"\"))))+1,8000),\"\")","v":""}]
[null,{"$f":"IF(A261<>\"\",IFERROR(IF(LEN(ROW()-5)=1,\"C000\"&ROW()-5,IF(LEN(ROW()-5)=2,\"C00\"&ROW()-5,IF(LEN(ROW()-5)=3,\"C0\"&ROW()-5,IF(LEN(ROW()-5)=4,\"C\"&ROW()-5)))),\"\"),\"\")","v":""},null,"",null,null,"",""]
[null,"",null,"",null,null,"",""]
[null,"",null,"",null,null,"",""]
[null,"",null,"",null,null,"",""]
[null,"",null,"",null,null,"",""]
[null,"",null,"",null,null,"",""]
[null,"",null,"",null,null,"",""]
[null,"",null,"",null,null,"",""]
[null,"",null,"",null,null,"",""]
[null,"",null,"",null,null,"",""]
[null,"",null,"",null,null,"",""]
[null,"",null,"",null,null,"",""]
[null,"",null,"",null,null,"",""]
[null,"",null,"",null,null,"",""]
[null,"",null,"",null,null,"",""]
[null,"",null,"",null,null,"",""]
[null,"",null,"",null,null,"",""]
[null,"",null,"",null,null,"",""]
[null,"",null,"",null,null,"",""]
[null,"",null,"",null,null,"",""]
[null,"",null,"",null,null,"",""]
[null,"",null,"",null,null,"",""]
[null,"",null,"",null,null,"",""]
[null,"",null,"",null,null,"",""]
[null,"",null,"",null,null,"",""]
[null,"",null,"",null,null,"",""]
[null,"",null,"",null,null,"",""]
[null,"",null,"",null,null,"",""]
[null,"",null,"",null,null,"",""]
[null,"",null,"",null,null,"",""]
[null,"",null,"",null,null,"",""]
[null,"",null,"",null,null,"",""]
[null,"",null,"",null,null,"",""]
[null,"",null,"",null,null,"",""]
[null,"",null,"",null,null,"",""]
[null,"",null,"",null,null,"",""]
[null,"",null,"",null,null,"",""]
[null,"",null,"",null,null,"",""]
[null,"",null,"",null,null,"",""]
[null,"",null,"",null,null,"",""]
[null,"",null,"",null,null,"",""]
[null,"",null,"",null,null,"",""]
[null,"",null,"",null,null,"",""]
[null,"",null,"",null,null,"",""]
[null,"",null,"",null,null,"",""]
[null,"",null,"",null,null,"",""]
[null,"",null,"",null,null,"",""]
[null,"",null,"",null,null,"",""]
[null,"",null,"",null,null,"",""]
[null,"",null,"",null,null,"",""]
[null,"",null,"",null,null,"",""]
[null,"",null,"",null,null,"",""]
[null,"",null,"",null,null,"",""]
[null,"",null,"",null,null,"",""]
[null,"",null,"",null,null,"",""]
[null,"",null,"",null,null,"",""]
[null,"",null,"",null,null,"",""]
[null,"",null,"",null,null,"",""]
[null,"",null,"",null,null,"",""]
[null,"",null,"",null,null,"",""]
[null,"",null,"",null,null,"",""]
[null,"",null,"",null,null,"",""]
[null,"",null,{"$f":"IF(OR(C323=\"Part\",C323=\"\"),\"\",A323)","v":""},null,null,"",""]
[null,"",null,"",null,null,{"$f":"IF(C324=\"Part\",MID(A324,1,LEN(A324)-LEN(H324)),\"\")","v":""},{"$f":"IF(C324=\"Part\",MID(A324,FIND(\"µ\",SUBSTITUTE(A324,\" \",\"µ\",LEN(A324)-LEN(SUBSTITUTE(A324,\" \",\"\"))))+1,8000),\"\")","v":""}]
[null,{"$f":"IF(A325<>\"\",IFERROR(IF(LEN(ROW()-5)=1,\"C000\"&ROW()-5,IF(LEN(ROW()-5)=2,\"C00\"&ROW()-5,IF(LEN(ROW()-5)=3,\"C0\"&ROW()-5,IF(LEN(ROW()-5)=4,\"C\"&ROW()-5)))),\"\"),\"\")","v":""},null,"",null,null,"",""]
[null,"",null,"",null,null,"",""]
[null,"",null,"",null,null,"",""]
[null,"",null,"",null,null,"",""]
[null,"",null,"",null,null,"",""]
[null,"",null,"",null,null,"",""]
[null,"",null,"",null,null,"",""]
[null,"",null,"",null,null,"",""]
[null,"",null,"",null,null,"",""]
[null,"",null,"",null,null,"",""]
[null,"",null,"",null,null,"",""]
[null,"",null,"",null,null,"",""]
[null,"",null,"",null,null,"",""]
[null,"",null,"",null,null,"",""]
[null,"",null,"",null,null,"",""]
[null,"",null,"",null,null,"",""]
[null,"",null,"",null,null,"",""]
[null,"",null,"",null,null,"",""]
[null,"",null,"",null,null,"",""]
[null,"",null,"",null,null,"",""]
[null,"",null,"",null,null,"",""]
[null,"",null,"",null,null,"",""]
[null,"",null,"",null,null,"",""]
[null,"",null,"",null,null,"",""]
[null,"",null,"",null,null,"",""]
[null,"",null,"",null,null,"",""]
[null,"",null,"",null,null,"",""]
[null,"",null,"",null,null,"",""]
[null,"",null,"",null,null,"",""]
[null,"",null,"",null,null,"",""]
[null,"",null,"",null,null,"",""]
[null,"",null,"",null,null,"",""]
[null,"",null,"",null,null,"",""]
[null,"",null,"",null,null,"",""]
[null,"",null,"",null,null,"",""]
[null,"",null,"",null,null,"",""]
[null,"",null,"",null,null,"",""]
[null,"",null,"",null,null,"",""]
[null,"",null,"",null,null,"",""]
[null,"",null,"",null,null,"",""]
[null,"",null,"",null,null,"",""]
[null,"",null,"",null,null,"",""]
[null,"",null,"",null,null,"",""]
[null,"",null,"",null,null,"",""]
[null,"",null,"",null,null,"",""]
[null,"",null,"",null,null,"",""]
[null,"",null,"",null,null,"",""]
[null,"",null,"",null,null,"",""]
[null,"",null,"",null,null,"",""]
[null,"",null,"",null,null,"",""]
[null,"",null,"",null,null,"",""]
[null,"",null,"",null,null,"",""]
[null,"",null,"",null,null,"",""]
[null,"",null,"",null,null,"",""]
[null,"",null,"",null,null,"",""]
[null,"",null,"",null,null,"",""]
[null,"",null,"",null,null,"",""]
[null,"",null,"",null,null,"",""]
[null,"",null,"",null,null,"",""]
[null,"",null,"",null,null,"",""]
[null,"",null,"",null,null,"",""]
[null,"",null,"",null,null,"",""]
[null,"",null,{"$f":"IF(OR(C387=\"Part\",C387=\"\"),\"\",A387)","v":""},null,null,"",""]
[null,"",null,"",null,null,{"$f":"IF(C388=\"Part\",MID(A388,1,LEN(A388)-LEN(H388)),\"\")","v":""},{"$f":"IF(C388=\"Part\",MID(A388,FIND(\"µ\",SUBSTITUTE(A388,\" \",\"µ\",LEN(A388)-LEN(SUBSTITUTE(A388,\" \",\"\"))))+1,8000),\"\")","v":""}]
[null,{"$f":"IF(A389<>\"\",IFERROR(IF(LEN(ROW()-5)=1,\"C000\"&ROW()-5,IF(LEN(ROW()-5)=2,\"C00\"&ROW()-5,IF(LEN(ROW()-5)=3,\"C0\"&ROW()-5,IF(LEN(ROW()-5)=4,\"C\"&ROW()-5)))),\"\"),\"\")","v":""},null,"",null,null,"",""]
[null,"",null,"",null,null,"",""]
[null,"",null,"",null,null,"",""]
[null,"",null,"",null,null,"",""]
[null,"",null,"",null,null,"",""]
[null,"",null,"",null,null,"",""]
[null,"",null,"",null,null,"",""]
[null,"",null,"",null,null,"",""]
[null,"",null,"",null,null,"",""]
[null,"",null,"",null,null,"",""]
[null,"",null,"",null,null,"",""]
[null,"",null,"",null,null,"",""]
[null,"",null,"",null,null,"",""]
[null,"",null,"",null,null,"",""]
[null,"",null,"",null,null,"",""]
[null,"",null,"",null,null,"",""]
[null,"",null,"",null,null,"",""]
[null,"",null,"",null,null,"",""]
[null,"",null,"",null,null,"",""]
[null,"",null,"",null,null,"",""]
[null,"",null,"",null,null,"",""]
[null,"",null,"",null,null,"",""]
[null,"",null,"",null,null,"",""]
[null,"",null,"",null,null,"",""]
[null,"",null,"",null,null,"",""]
[null,"",null,"",null,null,"",""]
[null,"",null,"",null,null,"",""]
[null,"",null,"",null,null,"",""]
[null,"",null,"",null,null,"",""]
[null,"",null,"",null,null,"",""]
[null,"",null,"",null,null,"",""]
[null,"",null,"",null,null,"",""]
[null,"",null,"",null,null,"",""]
[null,"",null,"",null,null,"",""]
[null,"",null,"",null,null,"",""]
[null,"",null,"",null,null,"",""]
[null,"",null,"",null,null,"",""]
[null,"",null,"",null,null,"",""]
[null,"",null,"",null,null,"",""]
[null,"",null,"",null,null,"",""]
[null,"",null,"",null,null,"",""]
[null,"",null,"",null,null,"",""]
[null,"",null,"",null,null,"",""]
[null,"",null,"",null,null,"",""]
[null,"",null,"",null,null,"",""]
[null,"",null,"",null,null,"",""]
[null,"",null,"",null,null,"",""]
[null,"",null,"",null,null,"",""]
[null,"",null,"",null,null,"",""]
[null,"",null,"",null,null,"",""]
[null,"",null,"",null,null,"",""]
[null,"",null,"",null,null,"",""]
[null,"",null,"",null,null,"",""]
[null,"",null,"",null,null,"",""]
[null,"",null,"",null,null,"",""]
[null,"",null,"",null,null,"",""]
[null,"",null,"",null,null,"",""]
[null,"",null,"",null,null,"",""]
[null,"",null,"",null,null,"",""]
[null,"",null,"",null,null,"",""]
[null,"",null,"",null,null,"",""]
[null,"",null,"",null,null,"",""]
[null,"",null,{"$f":"IF(OR(C451=\"Part\",C451=\"\"),\"\",A451)","v":""},null,null,"",""]
[null,"",null,"",null,null,{"$f":"IF(C452=\"Part\",MID(A452,1,LEN(A452)-LEN(H452)),\"\")","v":""},{"$f":"IF(C452=\"Part\",MID(A452,FIND(\"µ\",SUBSTITUTE(A452,\" \",\"µ\",LEN(A452)-LEN(SUBSTITUTE(A452,\" \",\"\"))))+1,8000),\"\")","v":""}]
[null,{"$f":"IF(A453<>\"\",IFERROR(IF(LEN(ROW()-5)=1,\"C000\"&ROW()-5,IF(LEN(ROW()-5)=2,\"C00\"&ROW()-5,IF(LEN(ROW()-5)=3,\"C0\"&ROW()-5,IF(LEN(ROW()-5)=4,\"C\"&ROW()-5)))),\"\"),\"\")","v":""},null,"",null,null,"",""]
[null,"",null,"",null,null,"",""]
[null,"",null,"",null,null,"",""]
[null,"",null,"",null,null,"",""]
[null,"",null,"",null,null,"",""]
[null,"",null,"",null,null,"",""]
[null,"",null,"",null,null,"",""]
[null,"",null,"",null,null,"",""]
[null,"",null,"",null,null,"",""]
[null,"",null,"",null,null,"",""]
[null,"",null,"",null,null,"",""]
[null,"",null,"",null,null,"",""]
[null,"",null,"",null,null,"",""]
[null,"",null,"",null,null,"",""]
[null,"",null,"",null,null,"",""]
[null,"",null,"",null,null,"",""]
[null,"",null,"",null,null,"",""]
[null,"",null,"",null,null,"",""]
[null,"",null,"",null,null,"",""]
[null,"",null,"",null,null,"",""]
[null,"",null,"",null,null,"",""]
[null,"",null,"",null,null,"",""]
[null,"",null,"",null,null,"",""]
[null,"",null,"",null,null,"",""]
[null,"",null,"",null,null,"",""]
[null,"",null,"",null,null,"",""]
[null,"",null,"",null,null,"",""]
[null,"",null,"",null,null,"",""]
[null,"",null,"",null,null,"",""]
[null,"",null,"",null,null,"",""]
[null,"",null,"",null,null,"",""]
[null,"",null,"",null,null,"",""]
[null,"",null,"",null,null,"",""]
[null,"",null,"",null,null,"",""]
[null,"",null,"",null,null,"",""]
[null,"",null,"",null,null,"",""]
[null,"",null,"",null,null,"",""]
[null,"",null,"",null,null,"",""]
[null,"",null,"",null,null,"",""]
[null,"",null,"",null,null,"",""]
[null,"",null,"",null,null,"",""]
[null,"",null,"",null,null,"",""]
[null,"",null,"",null,null,"",""]
[null,"",null,"",null,null,"",""]
[null,"",null,"",null,null,"",""]
[null,"",null,"",null,null,"",""]
[null,"",null,"",null,null,"",""]
[null,"",null,"",null,null,"",""]
[null,"",null,"",null,null,"",""]
[null,"",null,"",null,null,"",""]
[null,"",null,"",null,null,"",""]
[null,"",null,"",null,null,"",""]
[null,"",null,"",null,null,"",""]
[null,"",null,"",null,null,"",""]
[null,"",null,"",null,null,"",""]
[null,"",null,"",null,null,"",""]
[null,"",null,"",null,null,"",""]
[null,"",null,"",null,null,"",""]
[null,"",null,"",null,null,"",""]
[null,"",null,"",null,null,"",""]
[null,"",null,"",null,null,"",""]
[null,"",null,"",null,null,"",""]
[null,"",null,{"$f":"IF(OR(C515=\"Part\",C515=\"\"),\"\",A515)","v":""},null,null,"",""]
[null,"",null,"",null,null,{"$f":"IF(C516=\"Part\",MID(A516,1,LEN(A516)-LEN(H516)),\"\")","v":""},{"$f":"IF(C516=\"Part\",MID(A516,FIND(\"µ\",SUBSTITUTE(A516,\" \",\"µ\",LEN(A516)-LEN(SUBSTITUTE(A516,\" \",\"\"))))+1,8000),\"\")","v":""}]
[null,{"$f":"IF(A517<>\"\",IFERROR(IF(LEN(ROW()-5)=1,\"C000\"&ROW()-5,IF(LEN(ROW()-5)=2,\"C00\"&ROW()-5,IF(LEN(ROW()-5)=3,\"C0\"&ROW()-5,IF(LEN(ROW()-5)=4,\"C\"&ROW()-5)))),\"\"),\"\")","v":""},null,"",null,null,"",""]
[null,"",null,"",null,null,"",""]
[null,"",null,"",null,null,"",""]
[null,"",null,"",null,null,"",""]
[null,"",null,"",null,null,"",""]
[null,"",null,"",null,null,"",""]
[null,"",null,"",null,null,"",""]
[null,"",null,"",null,null,"",""]
[null,"",null,"",null,null,"",""]
[null,"",null,"",null,null,"",""]
[null,"",null,"",null,null,"",""]
[null,"",null,"",null,null,"",""]
[null,"",null,"",null,null,"",""]
[null,"",null,"",null,null,"",""]
[null,"",null,"",null,null,"",""]
[null,"",null,"",null,null,"",""]
[null,"",null,"",null,null,"",""]
[null,"",null,"",null,null,"",""]
[null,"",null,"",null,null,"",""]
[null,"",null,"",null,null,"",""]
[null,"",null,"",null,null,"",""]
[null,"",null,"",null,null,"",""]
[null,"",null,"",null,null,"",""]
[null,"",null,"",null,null,"",""]
[null,"",null,"",null,null,"",""]
[null,"",null,"",null,null,"",""]
[null,"",null,"",null,null,"",""]
[null,"",null,"",null,null,"",""]
[null,"",null,"",null,null,"",""]
[null,"",null,"",null,null,"",""]
[null,"",null,"",null,null,"",""]
[null,"",null,"",null,null,"",""]
[null,"",null,"",null,null,"",""]
[null,"",null,"",null,null,"",""]
[null,"",null,"",null,null,"",""]
[null,"",null,"",null,null,"",""]
[null,"",null,"",null,null,"",""]
[null,"",null,"",null,null,"",""]
[null,"",null,"",null,null,"",""]
[null,"",null,"",null,null,"",""]
[null,"",null,"",null,null,"",""]
[null,"",null,"",null,null,"",""]
[null,"",null,"",null,null,"",""]
[null,"",null,"",null,null,"",""]
[null,"",null,"",null,null,"",""]
[null,"",null,"",null,null,"",""]
[null,"",null,"",null,null,"",""]
[null,"",null,"",null,null,"",""]
[null,"",null,"",null,null,"",""]
[null,"",null,"",null,null,"",""]
[null,"",null,"",null,null,"",""]
[null,"",null,"",null,null,"",""]
[null,"",null,"",null,null,"",""]
[null,"",null,"",null,null,"",""]
[null,"",null,"",null,null,"",""]
[null,"",null,"",null,null,"",""]
[null,"",null,"",null,null,"",""]
[null,"",null,"",null,null,"",""]
[null,"",null,"",null,null,"",""]
[null,"",null,"",null,null,"",""]
[null,"",null,"",null,null,"",""]
[null,"",null,"",null,null,"",""]
[null,"",null,{"$f":"IF(OR(C579=\"Part\",C579=\"\"),\"\",A579)","v":""},null,null,"",""]
[null,"",null,"",null,null,{"$f":"IF(C580=\"Part\",MID(A580,1,LEN(A580)-LEN(H580)),\"\")","v":""},{"$f":"IF(C580=\"Part\",MID(A580,FIND(\"µ\",SUBSTITUTE(A580,\" \",\"µ\",LEN(A580)-LEN(SUBSTITUTE(A580,\" \",\"\"))))+1,8000),\"\")","v":""}]
[null,{"$f":"IF(A581<>\"\",IFERROR(IF(LEN(ROW()-5)=1,\"C000\"&ROW()-5,IF(LEN(ROW()-5)=2,\"C00\"&ROW()-5,IF(LEN(ROW()-5)=3,\"C0\"&ROW()-5,IF(LEN(ROW()-5)=4,\"C\"&ROW()-5)))),\"\"),\"\")","v":""},null,"",null,null,"",""]
[null,"",null,"",null,null,"",""]
[null,"",null,"",null,null,"",""]
[null,"",null,"",null,null,"",""]
[null,"",null,"",null,null,"",""]
[null,"",null,"",null,null,"",""]
[null,"",null,"",null,null,"",""]
[null,"",null,"",null,null,"",""]
[null,"",null,"",null,null,"",""]
[null,"",null,"",null,null,"",""]
[null,"",null,"",null,null,"",""]
[null,"",null,"",null,null,"",""]
[null,"",null,"",null,null,"",""]
[null,"",null,"",null,null,"",""]
[null,"",null,"",null,null,"",""]
[null,"",null,"",null,null,"",""]
[null,"",null,"",null,null,"",""]
[null,"",null,"",null,null,"",""]
[null,"",null,"",null,null,"",""]
[null,"",null,"",null,null,"",""]
[null,"",null,"",null,null,"",""]
[null,"",null,"",null,null,"",""]
[null,"",null,"",null,null,"",""]
[null,"",null,"",null,null,"",""]
[null,"",null,"",null,null,"",""]
[null,"",null,"",null,null,"",""]
[null,"",null,"",null,null,"",""]
[null,"",null,"",null,null,"",""]
[null,"",null,"",null,null,"",""]
[null,"",null,"",null,null,"",""]
[null,"",null,"",null,null,"",""]
[null,"",null,"",null,null,"",""]
[null,"",null,"",null,null,"",""]
[null,"",null,"",null,null,"",""]
[null,"",null,"",null,null,"",""]
[null,"",null,"",null,null,"",""]
[null,"",null,"",null,null,"",""]
[null,"",null,"",null,null,"",""]
[null,"",null,"",null,null,"",""]
[null,"",null,"",null,null,"",""]
[null,"",null,"",null,null,"",""]
[null,"",null,"",null,null,"",""]
[null,"",null,"",null,null,"",""]
[null,"",null,"",null,null,"",""]
[null,"",null,"",null,null,"",""]
[null,"",null,"",null,null,"",""]
[null,"",null,"",null,null,"",""]
[null,"",null,"",null,null,"",""]
[null,"",null,"",null,null,"",""]
[null,"",null,"",null,null,"",""]
[null,"",null,"",null,null,"",""]
[null,"",null,"",null,null,"",""]
[null,"",null,"",null,null,"",""]
[null,"",null,"",null,null,"",""]
[null,"",null,"",null,null,"",""]
[null,"",null,"",null,null,"",""]
[null,"",null,"",null,null,"",""]
[null,"",null,"",null,null,"",""]
[null,"",null,"",null,null,"",""]
[null,"",null,"",null,null,"",""]
[null,"",null,"",null,null,"",""]
[null,"",null,"",null,null,"",""]
[null,"",null,{"$f":"IF(OR(C643=\"Part\",C643=\"\"),\"\",A643)","v":""},null,null,"",""]
[null,"",null,"",null,null,{"$f":"IF(C644=\"Part\",MID(A644,1,LEN(A644)-LEN(H644)),\"\")","v":""},{"$f":"IF(C644=\"Part\",MID(A644,FIND(\"µ\",SUBSTITUTE(A644,\" \",\"µ\",LEN(A644)-LEN(SUBSTITUTE(A644,\" \",\"\"))))+1,8000),\"\")","v":""}]
[null,{"$f":"IF(A645<>\"\",IFERROR(IF(LEN(ROW()-5)=1,\"C000\"&ROW()-5,IF(LEN(ROW()-5)=2,\"C00\"&ROW()-5,IF(LEN(ROW()-5)=3,\"C0\"&ROW()-5,IF(LEN(ROW()-5)=4,\"C\"&ROW()-5)))),\"\"),\"\")","v":""},null,"",null,null,"",""]
[null,"",null,"",null,null,"",""]
[null,"",null,"",null,null,"",""]
[null,"",null,"",null,null,"",""]
[null,"",null,"",null,null,"",""]
[null,"",null,"",null,null,"",""]
[null,"",null,"",null,null,"",""]
[null,"",null,"",null,null,"",""]
[null,"",null,"",null,null,"",""]
[null,"",null,"",null,null,"",""]
[null,"",null,"",null,null,"",""]
[null,"",null,"",null,null,"",""]
[null,"",null,"",null,null,"",""]
[null,"",null,"",null,null,"",""]
[null,"",null,"",null,null,"",""]
[null,"",null,"",null,null,"",""]
[null,"",null,"",null,null,"",""]
[null,"",null,"",null,null,"",""]
[null,"",null,"",null,null,"",""]
[null,"",null,"",null,null,"",""]
[null,"",null,"",null,null,"",""]
[null,"",null,"",null,null,"",""]
[null,"",null,"",null,null,"",""]
[null,"",null,"",null,null,"",""]
[null,"",null,"",null,null,"",""]
[null,"",null,"",null,null,"",""]
[null,"",null,"",null,null,"",""]
[null,"",null,"",null,null,"",""]
[null,"",null,"",null,null,"",""]
[null,"",null,"",null,null,"",""]
[null,"",null,"",null,null,"",""]
[null,"",null,"",null,null,"",""]
[null,"",null,"",null,null,"",""]
[null,"",null,"",null,null,"",""]
[null,"",null,"",null,null,"",""]
[null,"",null,"",null,null,"",""]
[null,"",null,"",null,null,"",""]
[null,"",null,"",null,null,"",""]
[null,"",null,"",null,null,"",""]
[null,"",null,"",null,null,"",""]
[null,"",null,"",null,null,"",""]
[null,"",null,"",null,null,"",""]
[null,"",null,"",null,null,"",""]
[null,"",null,"",null,null,"",""]
[null,"",null,"",null,null,"",""]
[null,"",null,"",null,null,"",""]
[null,"",null,"",null,null,"",""]
[null,"",null,"",null,null,"",""]
[null,"",null,"",null,null,"",""]
[null,"",null,"",null,null,"",""]
[null,"",null,"",null,null,"",""]
[null,"",null,"",null,null,"",""]
[null,"",null,"",null,null,"",""]
[null,"",null,"",null,null,"",""]
[null,"",null,"",null,null,"",""]
[null,"",null,"",null,null,"",""]
[null,"",null,"",null,null,"",""]
[null,"",null,"",null,null,"",""]
[null,"",null,"",null,null,"",""]
[null,"",null,"",null,null,"",""]
[null,"",null,"",null,null,"",""]
[null,"",null,"",null,null,"",""]
[null,"",null,{"$f":"IF(OR(C707=\"Part\",C707=\"\"),\"\",A707)","v":""},null,null,"",""]
[null,"",null,"",null,null,{"$f":"IF(C708=\"Part\",MID(A708,1,LEN(A708)-LEN(H708)),\"\")","v":""},{"$f":"IF(C708=\"Part\",MID(A708,FIND(\"µ\",SUBSTITUTE(A708,\" \",\"µ\",LEN(A708)-LEN(SUBSTITUTE(A708,\" \",\"\"))))+1,8000),\"\")","v":""}]
[null,{"$f":"IF(A709<>\"\",IFERROR(IF(LEN(ROW()-5)=1,\"C000\"&ROW()-5,IF(LEN(ROW()-5)=2,\"C00\"&ROW()-5,IF(LEN(ROW()-5)=3,\"C0\"&ROW()-5,IF(LEN(ROW()-5)=4,\"C\"&ROW()-5)))),\"\"),\"\")","v":""},null,"",null,null,"",""]
[null,"",null,"",null,null,"",""]
[null,"",null,"",null,null,"",""]
[null,"",null,"",null,null,"",""]
[null,"",null,"",null,null,"",""]
[null,"",null,"",null,null,"",""]
[null,"",null,"",null,null,"",""]
[null,"",null,"",null,null,"",""]
[null,"",null,"",null,null,"",""]
[null,"",null,"",null,null,"",""]
[null,"",null,"",null,null,"",""]
[null,"",null,"",null,null,"",""]
[null,"",null,"",null,null,"",""]
[null,"",null,"",null,null,"",""]
[null,"",null,"",null,null,"",""]
[null,"",null,"",null,null,"",""]
[null,"",null,"",null,null,"",""]
[null,"",null,"",null,null,"",""]
[null,"",null,"",null,null,"",""]
[null,"",null,"",null,null,"",""]
[null,"",null,"",null,null,"",""]
[null,"",null,"",null,null,"",""]
[null,"",null,"",null,null,"",""]
[null,"",null,"",null,null,"",""]
[null,"",null,"",null,null,"",""]
[null,"",null,{"$f":"IF(OR(C734=\"Part\",C734=\"\"),\"\",A734)","v":""},null,null,{"$f":"IF(C734=\"Part\",MID(A734,1,LEN(A734)-LEN(H734)),\"\")","v":""},{"$f":"IF(C734=\"Part\",MID(A734,FIND(\"µ\",SUBSTITUTE(A734,\" \",\"µ\",LEN(A734)-LEN(SUBSTITUTE(A734,\" \",\"\"))))+1,8000),\"\")","v":""}]
[null,"",null,"",null,null,"",""]
[null,"",null,"",null,null,"",""]
[null,"",null,"",null,null,"",""]
[null,"",null,"",null,null,"",""]
[null,"",null,"",null,null,"",""]
[null,"",null,"",null,null,"",""]
[null,"",null,"",null,null,"",""]
[null,"",null,"",null,null,"",""]
[null,"",null,"",null,null,"",""]
[null,"",null,"",null,null,"",""]
[null,"",null,"",null,null,"",""]
[null,"",null,"",null,null,"",""]
[null,"",null,"",null,null,"",""]
[null,"",null,"",null,null,"",""]
[null,"",null,"",null,null,"",""]
[null,"",null,"",null,null,"",""]
[null,"",null,"",null,null,"",""]
[null,"",null,"",null,null,"",""]
[null,"",null,"",null,null,"",""]
[null,"",null,"",null,null,"",""]
[null,"",null,"",null,null,"",""]
[null,"",null,"",null,null,"",""]
[null,"",null,"",null,null,"",""]
[null,"",null,"",null,null,"",""]
[null,"",null,"",null,null,"",""]
[null,"",null,"",null,null,"",""]
[null,"",null,"",null,null,"",""]
[null,"",null,"",null,null,"",""]
[null,"",null,"",null,null,"",""]
[null,"",null,"",null,null,"",""]
[null,"",null,"",null,null,"",""]
[null,"",null,"",null,null,"",""]
[null,"",null,"",null,null,"",""]
[null,"",null,"",null,null,"",""]
[null,"",null,"",null,null,"",""]
[null,"",null,"",null,null,"",""]
[null,"",null,"",null,null,"",""]
[null,"",null,"",null,null,"",""]
[null,{"$f":"IF(A773<>\"\",IFERROR(IF(LEN(ROW()-5)=1,\"C000\"&ROW()-5,IF(LEN(ROW()-5)=2,\"C00\"&ROW()-5,IF(LEN(ROW()-5)=3,\"C0\"&ROW()-5,IF(LEN(ROW()-5)=4,\"C\"&ROW()-5)))),\"\"),\"\")","v":""},null,"",null,null,"",""]
[null,"",null,"",null,null,"",""]
[null,"",null,"",null,null,"",""]
[null,"",null,"",null,null,"",""]
[null,"",null,"",null,null,"",""]
[null,"",null,"",null,null,"",""]
[null,"",null,"",null,null,"",""]
[null,"",null,"",null,null,"",""]
[null,"",null,"",null,null,"",""]
[null,"",null,"",null,null,"",""]
[null,"",null,"",null,null,"",""]
[null,"",null,"",null,null,"",""]
[null,"",null,"",null,null,"",""]
[null,"",null,"",null,null,"",""]
[null,"",null,"",null,null,"",""]
[null,"",null,"",null,null,"",""]
[null,"",null,"",null,null,"",""]
[null,"",null,"",null,null,"",""]
[null,"",null,"",null,null,"",""]
[null,"",null,"",null,null,"",""]
[null,"",null,"",null,null,"",""]
[null,"",null,"",null,null,"",""]
[null,"",null,"",null,null,"",""]
[null,"",null,"",null,null,"",""]
[null,"",null,"",null,null,"",""]
[null,"",null,{"$f":"IF(OR(C798=\"Part\",C798=\"\"),\"\",A798)","v":""},null,null,{"$f":"IF(C798=\"Part\",MID(A798,1,LEN(A798)-LEN(H798)),\"\")","v":""},{"$f":"IF(C798=\"Part\",MID(A798,FIND(\"µ\",SUBSTITUTE(A798,\" \",\"µ\",LEN(A798)-LEN(SUBSTITUTE(A798,\" \",\"\"))))+1,8000),\"\")","v":""}]
[null,"",null,"",null,null,"",""]
[null,"",null,"",null,null,"",""]
[null,"",null,"",null,null,"",""]
[null,"",null,"",null,null,"",""]
[null,"",null,"",null,null,"",""]
[null,"",null,"",null,null,"",""]
[null,"",null,"",null,null,"",""]
[null,"",null,"",null,null,"",""]
[null,"",null,"",null,null,"",""]
[null,"",null,"",null,null,"",""]
[null,"",null,"",null,null,"",""]
[null,"",null,"",null,null,"",""]
[null,"",null,"",null,null,"",""]
[null,"",null,"",null,null,"",""]
[null,"",null,"",null,null,"",""]
[null,"",null,"",null,null,"",""]
[null,"",null,"",null,null,"",""]
[null,"",null,"",null,null,"",""]
[null,"",null,"",null,null,"",""]
[null,"",null,"",null,null,"",""]
[null,"",null,"",null,null,"",""]
[null,"",null,"",null,null,"",""]
[null,"",null,"",null,null,"",""]
[null,"",null,"",null,null,"",""]
[null,"",null,"",null,null,"",""]
[null,"",null,"",null,null,"",""]
[null,"",null,"",null,null,"",""]
[null,"",null,"",null,null,"",""]
[null,"",null,"",null,null,"",""]
[null,"",null,"",null,null,"",""]
[null,"",null,"",null,null,"",""]
[null,"",null,"",null,null,"",""]
[null,"",null,"",null,null,"",""]
[null,"",null,"",null,null,"",""]
[null,"",null,"",null,null,"",""]
[null,"",null,"",null,null,"",""]
[null,"",null,"",null,null,"",""]
[null,"",null,"",null,null,"",""]
[null,{"$f":"IF(A837<>\"\",IFERROR(IF(LEN(ROW()-5)=1,\"C000\"&ROW()-5,IF(LEN(ROW()-5)=2,\"C00\"&ROW()-5,IF(LEN(ROW()-5)=3,\"C0\"&ROW()-5,IF(LEN(ROW()-5)=4,\"C\"&ROW()-5)))),\"\"),\"\")","v":""},null,"",null,null,"",""]
[null,"",null,"",null,null,"",""]
[null,"",null,"",null,null,"",""]
[null,"",null,"",null,null,"",""]
[null,"",null,"",null,null,"",""]
[null,"",null,"",null,null,"",""]
[null,"",null,"",null,null,"",""]
[null,"",null,"",null,null,"",""]
[null,"",null,"",null,null,"",""]
[null,"",null,"",null,null,"",""]
[null,"",null,"",null,null,"",""]
[null,"",null,"",null,null,"",""]
[null,"",null,"",null,null,"",""]
[null,"",null,"",null,null,"",""]
[null,"",null,"",null,null,"",""]
[null,"",null,"",null,null,"",""]
[null,"",null,"",null,null,"",""]
[null,"",null,"",null,null,"",""]
[null,"",null,"",null,null,"",""]
[null,"",null,"",null,null,"",""]
[null,"",null,"",null,null,"",""]
[null,"",null,"",null,null,"",""]
[null,"",null,"",null,null,"",""]
[null,"",null,"",null,null,"",""]
[null,"",null,"",null,null,"",""]
[null,"",null,{"$f":"IF(OR(C862=\"Part\",C862=\"\"),\"\",A862)","v":""},null,null,{"$f":"IF(C862=\"Part\",MID(A862,1,LEN(A862)-LEN(H862)),\"\")","v":""},{"$f":"IF(C862=\"Part\",MID(A862,FIND(\"µ\",SUBSTITUTE(A862,\" \",\"µ\",LEN(A862)-LEN(SUBSTITUTE(A862,\" \",\"\"))))+1,8000),\"\")","v":""}]
[null,"",null,"",null,null,"",""]
[null,"",null,"",null,null,"",""]
[null,"",null,"",null,null,"",""]
[null,"",null,"",null,null,"",""]
[null,"",null,"",null,null,"",""]
[null,"",null,"",null,null,"",""]
[null,"",null,"",null,null,"",""]
[null,"",null,"",null,null,"",""]
[null,"",null,"",null,null,"",""]
[null,"",null,"",null,null,"",""]
[null,"",null,"",null,null,"",""]
[null,"",null,"",null,null,"",""]
[null,"",null,"",null,null,"",""]
[null,"",null,"",null,null,"",""]
[null,"",null,"",null,null,"",""]
[null,"",null,"",null,null,"",""]
[null,"",null,"",null,null,"",""]
[null,"",null,"",null,null,"",""]
[null,"",null,"",null,null,"",""]
[null,"",null,"",null,null,"",""]
[null,"",null,"",null,null,"",""]
[null,"",null,"",null,null,"",""]
[null,"",null,"",null,null,"",""]
[null,"",null,"",null,null,"",""]
[null,"",null,"",null,null,"",""]
[null,"",null,"",null,null,"",""]
[null,"",null,"",null,null,"",""]
[null,"",null,"",null,null,"",""]
[null,"",null,"",null,null,"",""]
[null,"",null,"",null,null,"",""]
[null,"",null,"",null,null,"",""]
[null,"",null,"",null,null,"",""]
[null,"",null,"",null,null,"",""]
[null,"",null,"",null,null,"",""]
[null,"",null,"",null,null,"",""]
[null,"",null,"",null,null,"",""]
[null,"",null,"",null,null,"",""]
[null,"",null,"",null,null,"",""]
[null,{"$f":"IF(A901<>\"\",IFERROR(IF(LEN(ROW()-5)=1,\"C000\"&ROW()-5,IF(LEN(ROW()-5)=2,\"C00\"&ROW()-5,IF(LEN(ROW()-5)=3,\"C0\"&ROW()-5,IF(LEN(ROW()-5)=4,\"C\"&ROW()-5)))),\"\"),\"\")","v":""},null,"",null,null,"",""]
[null,"",null,"",null,null,"",""]
[null,"",null,"",null,null,"",""]
[null,"",null,"",null,null,"",""]
[null,"",null,"",null,null,"",""]
[null,"",null,"",null,null,"",""]
[null,"",null,"",null,null,"",""]
[null,"",null,"",null,null,"",""]
[null,"",null,"",null,null,"",""]
[null,"",null,"",null,null,"",""]
[null,"",null,"",null,null,"",""]
[null,"",null,"",null,null,"",""]
[null,"",null,"",null,null,"",""]
[null,"",null,"",null,null,"",""]
[null,"",null,"",null,null,"",""]
[null,"",null,"",null,null,"",""]
[null,"",null,"",null,null,"",""]
[null,"",null,"",null,null,"",""]
[null,"",null,"",null,null,"",""]
[null,"",null,"",null,null,"",""]
[null,"",null,"",null,null,"",""]
[null,"",null,"",null,null,"",""]
[null,"",null,"",null,null,"",""]
[null,"",null,"",null,null,"",""]
[null,"",null,"",null,null,"",""]
[null,"",null,{"$f":"IF(OR(C926=\"Part\",C926=\"\"),\"\",A926)","v":""},null,null,{"$f":"IF(C926=\"Part\",MID(A926,1,LEN(A926)-LEN(H926)),\"\")","v":""},{"$f":"IF(C926=\"Part\",MID(A926,FIND(\"µ\",SUBSTITUTE(A926,\" \",\"µ\",LEN(A926)-LEN(SUBSTITUTE(A926,\" \",\"\"))))+1,8000),\"\")","v":""}]
[null,"",null,"",null,null,"",""]
[null,"",null,"",null,null,"",""]
[null,"",null,"",null,null,"",""]
[null,"",null,"",null,null,"",""]
[null,"",null,"",null,null,"",""]
[null,"",null,"",null,null,"",""]
[null,"",null,"",null,null,"",""]
[null,"",null,"",null,null,"",""]
[null,"",null,"",null,null,"",""]
[null,"",null,"",null,null,"",""]
[null,"",null,"",null,null,"",""]
[null,"",null,"",null,null,"",""]
[null,"",null,"",null,null,"",""]
[null,"",null,"",null,null,"",""]
[null,"",null,"",null,null,"",""]
[null,"",null,"",null,null,"",""]
[null,"",null,"",null,null,"",""]
[null,"",null,"",null,null,"",""]
[null,"",null,"",null,null,"",""]
[null,"",null,"",null,null,"",""]
[null,"",null,"",null,null,"",""]
[null,"",null,"",null,null,"",""]
[null,"",null,"",null,null,"",""]
[null,"",null,"",null,null,"",""]
[null,"",null,"",null,null,"",""]
[null,"",null,"",null,null,"",""]
[null,"",null,"",null,null,"",""]
[null,"",null,"",null,null,"",""]
[null,"",null,"",null,null,"",""]
[null,"",null,"",null,null,"",""]
[null,"",null,"",null,null,"",""]
[null,"",null,"",null,null,"",""]
[null,"",null,"",null,null,"",""]
[null,"",null,"",null,null,"",""]
[null,"",null,"",null,null,"",""]
[null,"",null,"",null,null,"",""]
[null,"",null,"",null,null,"",""]
[null,"",null,"",null,null,"",""]
[null,{"$f":"IF(A965<>\"\",IFERROR(IF(LEN(ROW()-5)=1,\"C000\"&ROW()-5,IF(LEN(ROW()-5)=2,\"C00\"&ROW()-5,IF(LEN(ROW()-5)=3,\"C0\"&ROW()-5,IF(LEN(ROW()-5)=4,\"C\"&ROW()-5)))),\"\"),\"\")","v":""},null,"",null,null,"",""]
[null,"",null,"",null,null,"",""]
[null,"",null,"",null,null,"",""]
[null,"",null,"",null,null,"",""]
[null,"",null,"",null,null,"",""]
[null,"",null,"",null,null,"",""]
[null,"",null,"",null,null,"",""]
[null,"",null,"",null,null,"",""]
[null,"",null,"",null,null,"",""]
[null,"",null,"",null,null,"",""]
[null,"",null,"",null,null,"",""]
[null,"",null,"",null,null,"",""]
[null,"",null,"",null,null,"",""]
[null,"",null,"",null,null,"",""]
[null,"",null,"",null,null,"",""]
[null,"",null,"",null,null,"",""]
[null,"",null,"",null,null,"",""]
[null,"",null,"",null,null,"",""]
[null,"",null,"",null,null,"",""]
[null,"",null,"",null,null,"",""]
[null,"",null,"",null,null,"",""]
[null,"",null,"",null,null,"",""]
[null,"",null,"",null,null,"",""]
[null,"",null,"",null,null,"",""]
[null,"",null,"",null,null,"",""]
[null,"",null,{"$f":"IF(OR(C990=\"Part\",C990=\"\"),\"\",A990)","v":""},null,null,{"$f":"IF(C990=\"Part\",MID(A990,1,LEN(A990)-LEN(H990)),\"\")","v":""},{"$f":"IF(C990=\"Part\",MID(A990,FIND(\"µ\",SUBSTITUTE(A990,\" \",\"µ\",LEN(A990)-LEN(SUBSTITUTE(A990,\" \",\"\"))))+1,8000),\"\")","v":""}]
[null,"",null,"",null,null,"",""]
[null,"",null,"",null,null,"",""]
[null,"",null,"",null,null,"",""]
[null,"",null,"",null,null,"",""]
[null,"",null,"",null,null,"",""]
[null,"",null,"",null,null,"",""]
[null,"",null,"",null,null,"",""]
[null,"",null,"",null,null,"",""]
[null,"",null,"",null,null,"",""]
[null,"",null,"",null,null,"",""]
[null,"",null,"",null,null,"",""]
[null,"",null,"",null,null,"",""]
[null,"",null,"",null,null,"",""]
[null,"",null,"",null,null,"",""]
[null,"",null,"",null,null,"",""]
[null,"",null,"",null,null,"",""]
[null,"",null,"",null,null,"",""]
[null,"",null,"",null,null,"",""]
[null,"",null,"",null,null,"",""]
[null,"",null,"",null,null,"",""]
[null,"",null,"",null,null,"",""]
[null,"",null,"",null,null,"",""]
[null,"",null,"",null,null,"",""]
[null,"",null,"",null,null,"",""]
[null,"",null,"",null,null,"",""]
[null,"",null,"",null,null,"",""]
[null,"",null,"",null,null,"",""]
[null,"",null,"",null,null,"",""]
[null,"",null,"",null,null,"",""]
[null,"",null,"",null,null,"",""]
[null,"",null,"",null,null,"",""]
[null,"",null,"",null,null,"",""]
[null,"",null,"",null,null,"",""]
[null,"",null,"",null,null,"",""]
[null,"",null,"",null,null,"",""]
[null,"",null,"",null,null,"",""]
[null,"",null,"",null,null,"",""]
[null,"",null,"",null,null,"",""]
[null,{"$f":"IF(A1029<>\"\",IFERROR(IF(LEN(ROW()-5)=1,\"C000\"&ROW()-5,IF(LEN(ROW()-5)=2,\"C00\"&ROW()-5,IF(LEN(ROW()-5)=3,\"C0\"&ROW()-5,IF(LEN(ROW()-5)=4,\"C\"&ROW()-5)))),\"\"),\"\")","v":""},null,"",null,null,"",""]
[null,"",null,"",null,null,"",""]
[null,"",null,"",null,null,"",""]
[null,"",null,"",null,null,"",""]
[null,"",null,"",null,null,"",""]
[null,"",null,"",null,null,"",""]
[null,"",null,"",null,null,"",""]
[null,"",null,"",null,null,"",""]
[null,"",null,"",null,null,"",""]
[null,"",null,"",null,null,"",""]
[null,"",null,"",null,null,"",""]
[null,"",null,"",null,null,"",""]
[null,"",null,"",null,null,"",""]
[null,"",null,"",null,null,"",""]
[null,"",null,"",null,null,"",""]
[null,"",null,"",null,null,"",""]
[null,"",null,"",null,null,"",""]
[null,"",null,"",null,null,"",""]
[null,"",null,"",null,null,"",""]
[null,"",null,"",null,null,"",""]
[null,"",null,"",null,null,"",""]
[null,"",null,"",null,null,"",""]
[null,"",null,"",null,null,"",""]
[null,"",null,"",null,null,"",""]
[null,"",null,"",null,null,"",""]
[null,"",null,{"$f":"IF(OR(C1054=\"Part\",C1054=\"\"),\"\",A1054)","v":""},null,null,{"$f":"IF(C1054=\"Part\",MID(A1054,1,LEN(A1054)-LEN(H1054)),\"\")","v":""},{"$f":"IF(C1054=\"Part\",MID(A1054,FIND(\"µ\",SUBSTITUTE(A1054,\" \",\"µ\",LEN(A1054)-LEN(SUBSTITUTE(A1054,\" \",\"\"))))+1,8000),\"\")","v":""}]
[null,"",null,"",null,null,"",""]
[null,"",null,"",null,null,"",""]
[null,"",null,"",null,null,"",""]
[null,"",null,"",null,null,"",""]
[null,"",null,"",null,null,"",""]
[null,"",null,"",null,null,"",""]
[null,"",null,"",null,null,"",""]
[null,"",null,"",null,null,"",""]
[null,"",null,"",null,null,"",""]
[null,"",null,"",null,null,"",""]
[null,"",null,"",null,null,"",""]
[null,"",null,"",null,null,"",""]
[null,"",null,"",null,null,"",""]
[null,"",null,"",null,null,"",""]
[null,"",null,"",null,null,"",""]
[null,"",null,"",null,null,"",""]
[null,"",null,"",null,null,"",""]
[null,"",null,"",null,null,"",""]
[null,"",null,"",null,null,"",""]
[null,"",null,"",null,null,"",""]
[null,"",null,"",null,null,"",""]
[null,"",null,"",null,null,"",""]
[null,"",null,"",null,null,"",""]
[null,"",null,"",null,null,"",""]
[null,"",null,"",null,null,"",""]
[null,"",null,"",null,null,"",""]
[null,"",null,"",null,null,"",""]
[null,"",null,"",null,null,"",""]
[null,"",null,"",null,null,"",""]
[null,"",null,"",null,null,"",""]
[null,"",null,"",null,null,"",""]
[null,"",null,"",null,null,"",""]
[null,"",null,"",null,null,"",""]
[null,"",null,"",null,null,"",""]
[null,"",null,"",null,null,"",""]
[null,"",null,"",null,null,"",""]
[null,"",null,"",null,null,"",""]
[null,"",null,"",null,null,"",""]
[null,{"$f":"IF(A1093<>\"\",IFERROR(IF(LEN(ROW()-5)=1,\"C000\"&ROW()-5,IF(LEN(ROW()-5)=2,\"C00\"&ROW()-5,IF(LEN(ROW()-5)=3,\"C0\"&ROW()-5,IF(LEN(ROW()-5)=4,\"C\"&ROW()-5)))),\"\"),\"\")","v":""},null,"",null,null,"",""]
[null,"",null,"",null,null,"",""]
[null,"",null,"",null,null,"",""]
[null,"",null,"",null,null,"",""]
[null,"",null,"",null,null,"",""]
[null,"",null,"",null,null,"",""]
[null,"",null,"",null,null,"",""]
[null,"",null,"",null,null,"",""]
[null,"",null,"",null,null,"",""]
[null,"",null,"",null,null,"",""]
[null,"",null,"",null,null,"",""]
[null,"",null,"",null,null,"",""]
[null,"",null,"",null,null,"",""]
[null,"",null,"",null,null,"",""]
[null,"",null,"",null,null,"",""]
[null,"",null,"",null,null,"",""]
[null,"",null,"",null,null,"",""]
[null,"",null,"",null,null,"",""]
[null,"",null,"",null,null,"",""]
[null,"",null,"",null,null,"",""]
[null,"",null,"",null,null,"",""]
[null,"",null,"",null,null,"",""]
[null,"",null,"",null,null,"",""]
[null,"",null,"",null,null,"",""]
[null,"",null,"",null,null,"",""]
[null,"",null,{"$f":"IF(OR(C1118=\"Part\",C1118=\"\"),\"\",A1118)","v":""},null,null,{"$f":"IF(C1118=\"Part\",MID(A1118,1,LEN(A1118)-LEN(H1118)),\"\")","v":""},{"$f":"IF(C1118=\"Part\",MID(A1118,FIND(\"µ\",SUBSTITUTE(A1118,\" \",\"µ\",LEN(A1118)-LEN(SUBSTITUTE(A1118,\" \",\"\"))))+1,8000),\"\")","v":""}]
[null,"",null,"",null,null,"",""]
[null,"",null,"",null,null,"",""]
[null,"",null,"",null,null,"",""]
[null,"",null,"",null,null,"",""]
[null,"",null,"",null,null,"",""]
[null,"",null,"",null,null,"",""]
[null,"",null,"",null,null,"",""]
[null,"",null,"",null,null,"",""]
[null,"",null,"",null,null,"",""]
[null,"",null,"",null,null,"",""]
[null,"",null,"",null,null,"",""]
[null,"",null,"",null,null,"",""]
[null,"",null,"",null,null,"",""]
[null,"",null,"",null,null,"",""]
[null,"",null,"",null,null,"",""]
[null,"",null,"",null,null,"",""]
[null,"",null,"",null,null,"",""]
[null,"",null,"",null,null,"",""]
[null,"",null,"",null,null,"",""]
[null,"",null,"",null,null,"",""]
[null,"",null,"",null,null,"",""]
[null,"",null,"",null,null,"",""]
[null,"",null,"",null,null,"",""]
[null,"",null,"",null,null,"",""]
[null,"",null,"",null,null,"",""]
[null,"",null,"",null,null,"",""]
[null,"",null,"",null,null,"",""]
[null,"",null,"",null,null,"",""]
[null,"",null,"",null,null,"",""]
[null,"",null,"",null,null,"",""]
[null,"",null,"",null,null,"",""]
[null,"",null,"",null,null,"",""]
[null,"",null,"",null,null,"",""]
[null,"",null,"",null,null,"",""]
[null,"",null,"",null,null,"",""]
[null,"",null,"",null,null,"",""]
[null,"",null,"",null,null,"",""]
[null,"",null,"",null,null,"",""]
[null,{"$f":"IF(A1157<>\"\",IFERROR(IF(LEN(ROW()-5)=1,\"C000\"&ROW()-5,IF(LEN(ROW()-5)=2,\"C00\"&ROW()-5,IF(LEN(ROW()-5)=3,\"C0\"&ROW()-5,IF(LEN(ROW()-5)=4,\"C\"&ROW()-5)))),\"\"),\"\")","v":""},null,"",null,null,"",""]
[null,"",null,"",null,null,"",""]
[null,"",null,"",null,null,"",""]
[null,"",null,"",null,null,"",""]
[null,"",null,"",null,null,"",""]
[null,"",null,"",null,null,"",""]
[null,"",null,"",null,null,"",""]
[null,"",null,"",null,null,"",""]
[null,"",null,"",null,null,"",""]
[null,"",null,"",null,null,"",""]
[null,"",null,"",null,null,"",""]
[null,"",null,"",null,null,"",""]
[null,"",null,"",null,null,"",""]
[null,"",null,"",null,null,"",""]
[null,"",null,"",null,null,"",""]
[null,"",null,"",null,null,"",""]
[null,"",null,"",null,null,"",""]
[null,"",null,"",null,null,"",""]
[null,"",null,"",null,null,"",""]
[null,"",null,"",null,null,"",""]
[null,"",null,"",null,null,"",""]
[null,"",null,"",null,null,"",""]
[null,"",null,"",null,null,"",""]
[null,"",null,"",null,null,"",""]
[null,"",null,"",null,null,"",""]
[null,"",null,{"$f":"IF(OR(C1182=\"Part\",C1182=\"\"),\"\",A1182)","v":""},null,null,{"$f":"IF(C1182=\"Part\",MID(A1182,1,LEN(A1182)-LEN(H1182)),\"\")","v":""},{"$f":"IF(C1182=\"Part\",MID(A1182,FIND(\"µ\",SUBSTITUTE(A1182,\" \",\"µ\",LEN(A1182)-LEN(SUBSTITUTE(A1182,\" \",\"\"))))+1,8000),\"\")","v":""}]
[null,"",null,"",null,null,"",""]
[null,"",null,"",null,null,"",""]
[null,"",null,"",null,null,"",""]
[null,"",null,"",null,null,"",""]
[null,"",null,"",null,null,"",""]
[null,"",null,"",null,null,"",""]
[null,"",null,"",null,null,"",""]
[null,"",null,"",null,null,"",""]
[null,"",null,"",null,null,"",""]
[null,"",null,"",null,null,"",""]
[null,"",null,"",null,null,"",""]
[null,"",null,"",null,null,"",""]
[null,"",null,"",null,null,"",""]
[null,"",null,"",null,null,"",""]
[null,"",null,"",null,null,"",""]
[null,"",null,"",null,null,"",""]
[null,"",null,"",null,null,"",""]
[null,"",null,"",null,null,"",""]
[null,"",null,"",null,null,"",""]
[null,"",null,"",null,null,"",""]
[null,"",null,"",null,null,"",""]
[null,"",null,"",null,null,"",""]
[null,"",null,"",null,null,"",""]
[null,"",null,"",null,null,"",""]
[null,"",null,"",null,null,"",""]
[null,"",null,"",null,null,"",""]
[null,"",null,"",null,null,"",""]
[null,"",null,"",null,null,"",""]
[null,"",null,"",null,null,"",""]
[null,"",null,"",null,null,"",""]
[null,"",null,"",null,null,"",""]
[null,"",null,"",null,null,"",""]
[null,"",null,"",null,null,"",""]
[null,"",null,"",null,null,"",""]
[null,"",null,"",null,null,"",""]
[null,"",null,"",null,null,"",""]
[null,"",null,"",null,null,"",""]
[null,"",null,"",null,null,"",""]
[null,{"$f":"IF(A1221<>\"\",IFERROR(IF(LEN(ROW()-5)=1,\"C000\"&ROW()-5,IF(LEN(ROW()-5)=2,\"C00\"&ROW()-5,IF(LEN(ROW()-5)=3,\"C0\"&ROW()-5,IF(LEN(ROW()-5)=4,\"C\"&ROW()-5)))),\"\"),\"\")","v":""},null,"",null,null,"",""]
[null,"",null,"",null,null,"",""]
[null,"",null,"",null,null,"",""]
[null,"",null,"",null,null,"",""]
[null,"",null,"",null,null,"",""]
[null,"",null,"",null,null,"",""]
[null,"",null,"",null,null,"",""]
[null,"",null,"",null,null,"",""]
[null,"",null,"",null,null,"",""]
[null,"",null,"",null,null,"",""]
[null,"",null,"",null,null,"",""]
[null,"",null,"",null,null,"",""]
[null,"",null,"",null,null,"",""]
[null,"",null,"",null,null,"",""]
[null,"",null,"",null,null,"",""]
[null,"",null,"",null,null,"",""]
[null,"",null,"",null,null,"",""]
[null,"",null,"",null,null,"",""]
[null,"",null,"",null,null,"",""]
[null,"",null,"",null,null,"",""]
[null,"",null,"",null,null,"",""]
[null,"",null,"",null,null,"",""]
[null,"",null,"",null,null,"",""]
[null,"",null,"",null,null,"",""]
[null,"",null,"",null,null,"",""]
[null,"",null,{"$f":"IF(OR(C1246=\"Part\",C1246=\"\"),\"\",A1246)","v":""},null,null,{"$f":"IF(C1246=\"Part\",MID(A1246,1,LEN(A1246)-LEN(H1246)),\"\")","v":""},{"$f":"IF(C1246=\"Part\",MID(A1246,FIND(\"µ\",SUBSTITUTE(A1246,\" \",\"µ\",LEN(A1246)-LEN(SUBSTITUTE(A1246,\" \",\"\"))))+1,8000),\"\")","v":""}]
[null,"",null,"",null,null,"",""]
[null,"",null,"",null,null,"",""]
[null,"",null,"",null,null,"",""]
[null,"",null,"",null,null,"",""]
[null,"",null,"",null,null,"",""]
[null,"",null,"",null,null,"",""]
[null,"",null,"",null,null,"",""]
[null,"",null,"",null,null,"",""]
[null,"",null,"",null,null,"",""]
[null,"",null,"",null,null,"",""]
[null,"",null,"",null,null,"",""]
[null,"",null,"",null,null,"",""]
[null,"",null,"",null,null,"",""]
[null,"",null,"",null,null,"",""]
[null,"",null,"",null,null,"",""]
[null,"",null,"",null,null,"",""]
[null,"",null,"",null,null,"",""]
[null,"",null,"",null,null,"",""]
[null,"",null,"",null,null,"",""]
[null,"",null,"",null,null,"",""]
[null,"",null,"",null,null,"",""]
[null,"",null,"",null,null,"",""]
[null,"",null,"",null,null,"",""]
[null,"",null,"",null,null,"",""]
[null,"",null,"",null,null,"",""]
[null,"",null,"",null,null,"",""]
[null,"",null,"",null,null,"",""]
[null,"",null,"",null,null,"",""]
[null,"",null,"",null,null,"",""]
[null,"",null,"",null,null,"",""]
[null,"",null,"",null,null,"",""]
[null,"",null,"",null,null,"",""]
[null,"",null,"",null,null,"",""]
[null,"",null,"",null,null,"",""]
[null,"",null,"",null,null,"",""]
[null,"",null,"",null,null,"",""]
[null,"",null,"",null,null,"",""]
[null,"",null,"",null,null,"",""]
[null,{"$f":"IF(A1285<>\"\",IFERROR(IF(LEN(ROW()-5)=1,\"C000\"&ROW()-5,IF(LEN(ROW()-5)=2,\"C00\"&ROW()-5,IF(LEN(ROW()-5)=3,\"C0\"&ROW()-5,IF(LEN(ROW()-5)=4,\"C\"&ROW()-5)))),\"\"),\"\")","v":""},null,"",null,null,"",""]
[null,"",null,"",null,null,"",""]
[null,"",null,"",null,null,"",""]
[null,"",null,"",null,null,"",""]
[null,"",null,"",null,null,"",""]
[null,"",null,"",null,null,"",""]
[null,"",null,"",null,null,"",""]
[null,"",null,"",null,null,"",""]
[null,"",null,"",null,null,"",""]
[null,"",null,"",null,null,"",""]
[null,"",null,"",null,null,"",""]
[null,"",null,"",null,null,"",""]
[null,"",null,"",null,null,"",""]
[null,"",null,"",null,null,"",""]
[null,"",null,"",null,null,"",""]
[null,"",null,"",null,null,"",""]
[null,"",null,"",null,null,"",""]
[null,"",null,"",null,null,"",""]
[null,"",null,"",null,null,"",""]
[null,"",null,"",null,null,"",""]
[null,"",null,"",null,null,"",""]
[null,"",null,"",null,null,"",""]
[null,"",null,"",null,null,"",""]
[null,"",null,"",null,null,"",""]
[null,"",null,"",null,null,"",""]
[null,"",null,{"$f":"IF(OR(C1310=\"Part\",C1310=\"\"),\"\",A1310)","v":""},null,null,{"$f":"IF(C1310=\"Part\",MID(A1310,1,LEN(A1310)-LEN(H1310)),\"\")","v":""},{"$f":"IF(C1310=\"Part\",MID(A1310,FIND(\"µ\",SUBSTITUTE(A1310,\" \",\"µ\",LEN(A1310)-LEN(SUBSTITUTE(A1310,\" \",\"\"))))+1,8000),\"\")","v":""}]
[null,"",null,"",null,null,"",""]
[null,"",null,"",null,null,"",""]
[null,"",null,"",null,null,"",""]
[null,"",null,"",null,null,"",""]
[null,"",null,"",null,null,"",""]
[null,"",null,"",null,null,"",""]
[null,"",null,"",null,null,"",""]
[null,"",null,"",null,null,"",""]
[null,"",null,"",null,null,"",""]
[null,"",null,"",null,null,"",""]
[null,"",null,"",null,null,"",""]
[null,"",null,"",null,null,"",""]
[null,"",null,"",null,null,"",""]
[null,"",null,"",null,null,"",""]
[null,"",null,"",null,null,"",""]
[null,"",null,"",null,null,"",""]
[null,"",null,"",null,null,"",""]
[null,"",null,"",null,null,"",""]
[null,"",null,"",null,null,"",""]
[null,"",null,"",null,null,"",""]
[null,"",null,"",null,null,"",""]
[null,"",null,"",null,null,"",""]
[null,"",null,"",null,null,"",""]
[null,"",null,"",null,null,"",""]
[null,"",null,"",null,null,"",""]
[null,"",null,"",null,null,"",""]
[null,"",null,"",null,null,"",""]
[null,"",null,"",null,null,"",""]
[null,"",null,"",null,null,"",""]
[null,"",null,"",null,null,"",""]
[null,"",null,"",null,null,"",""]
[null,"",null,"",null,null,"",""]
[null,"",null,"",null,null,"",""]
[null,"",null,"",null,null,"",""]
[null,"",null,"",null,null,"",""]
[null,"",null,"",null,null,"",""]
[null,"",null,"",null,null,"",""]
[null,"",null,"",null,null,"",""]
[null,{"$f":"IF(A1349<>\"\",IFERROR(IF(LEN(ROW()-5)=1,\"C000\"&ROW()-5,IF(LEN(ROW()-5)=2,\"C00\"&ROW()-5,IF(LEN(ROW()-5)=3,\"C0\"&ROW()-5,IF(LEN(ROW()-5)=4,\"C\"&ROW()-5)))),\"\"),\"\")","v":""},null,"",null,null,"",""]
[null,"",null,"",null,null,"",""]
[null,"",null,"",null,null,"",""]
[null,"",null,"",null,null,"",""]
[null,"",null,"",null,null,"",""]
[null,"",null,"",null,null,"",""]
[null,"",null,"",null,null,"",""]
[null,"",null,"",null,null,"",""]
[null,"",null,"",null,null,"",""]
[null,"",null,"",null,null,"",""]
[null,"",null,"",null,null,"",""]
[null,"",null,"",null,null,"",""]
[null,"",null,"",null,null,"",""]
[null,"",null,"",null,null,"",""]
[null,"",null,"",null,null,"",""]
[null,"",null,"",null,null,"",""]
[null,"",null,"",null,null,"",""]
[null,"",null,"",null,null,"",""]
[null,"",null,"",null,null,"",""]
[null,"",null,"",null,null,"",""]
[null,"",null,"",null,null,"",""]
[null,"",null,"",null,null,"",""]
[null,"",null,"",null,null,"",""]
[null,"",null,"",null,null,"",""]
[null,"",null,"",null,null,"",""]
[null,"",null,{"$f":"IF(OR(C1374=\"Part\",C1374=\"\"),\"\",A1374)","v":""},null,null,{"$f":"IF(C1374=\"Part\",MID(A1374,1,LEN(A1374)-LEN(H1374)),\"\")","v":""},{"$f":"IF(C1374=\"Part\",MID(A1374,FIND(\"µ\",SUBSTITUTE(A1374,\" \",\"µ\",LEN(A1374)-LEN(SUBSTITUTE(A1374,\" \",\"\"))))+1,8000),\"\")","v":""}]
[null,"",null,"",null,null,"",""]
[null,"",null,"",null,null,"",""]
[null,"",null,"",null,null,"",""]
[null,"",null,"",null,null,"",""]
[null,"",null,"",null,null,"",""]
[null,"",null,"",null,null,"",""]
[null,"",null,"",null,null,"",""]
[null,"",null,"",null,null,"",""]
[null,"",null,"",null,null,"",""]
[null,"",null,"",null,null,"",""]
[null,"",null,"",null,null,"",""]
[null,"",null,"",null,null,"",""]
[null,"",null,"",null,null,"",""]
[null,"",null,"",null,null,"",""]
[null,"",null,"",null,null,"",""]
[null,"",null,"",null,null,"",""]
[null,"",null,"",null,null,"",""]
[null,"",null,"",null,null,"",""]
[null,"",null,"",null,null,"",""]
[null,"",null,"",null,null,"",""]
[null,"",null,"",null,null,"",""]
[null,"",null,"",null,null,"",""]
[null,"",null,"",null,null,"",""]
[null,"",null,"",null,null,"",""]
[null,"",null,"",null,null,"",""]
[null,"",null,"",null,null,"",""]
[null,"",null,"",null,null,"",""]
[null,"",null,"",null,null,"",""]
[null,"",null,"",null,null,"",""]
[null,"",null,"",null,null,"",""]
[null,"",null,"",null,null,"",""]
[null,"",null,"",null,null,"",""]
[null,"",null,"",null,null,"",""]
[null,"",null,"",null,null,"",""]
[null,"",null,"",null,null,"",""]
[null,"",null,"",null,null,"",""]
[null,"",null,"",null,null,"",""]
[null,"",null,"",null,null,"",""]
[null,{"$f":"IF(A1413<>\"\",IFERROR(IF(LEN(ROW()-5)=1,\"C000\"&ROW()-5,IF(LEN(ROW()-5)=2,\"C00\"&ROW()-5,IF(LEN(ROW()-5)=3,\"C0\"&ROW()-5,IF(LEN(ROW()-5)=4,\"C\"&ROW()-5)))),\"\"),\"\")","v":""},null,"",null,null,"",""]
[null,"",null,"",null,null,"",""]
[null,"",null,"",null,null,"",""]
[null,"",null,"",null,null,"",""]
[null,"",null,"",null,null,"",""]
[null,"",null,"",null,null,"",""]
[null,"",null,"",null,null,"",""]
[null,"",null,"",null,null,"",""]
[null,"",null,"",null,null,"",""]
[null,"",null,"",null,null,"",""]
[null,"",null,"",null,null,"",""]
[null,"",null,"",null,null,"",""]
[null,"",null,"",null,null,"",""]
[null,"",null,"",null,null,"",""]
[null,"",null,"",null,null,"",""]
[null,"",null,"",null,null,"",""]
[null,"",null,"",null,null,"",""]
[null,"",null,"",null,null,"",""]
[null,"",null,"",null,null,"",""]
[null,"",null,"",null,null,"",""]
[null,"",null,"",null,null,"",""]
[null,"",null,"",null,null,"",""]
[null,"",null,"",null,null,"",""]
[null,"",null,"",null,null,"",""]
[null,"",null,"",null,null,"",""]
[null,"",null,{"$f":"IF(OR(C1438=\"Part\",C1438=\"\"),\"\",A1438)","v":""},null,null,{"$f":"IF(C1438=\"Part\",MID(A1438,1,LEN(A1438)-LEN(H1438)),\"\")","v":""},{"$f":"IF(C1438=\"Part\",MID(A1438,FIND(\"µ\",SUBSTITUTE(A1438,\" \",\"µ\",LEN(A1438)-LEN(SUBSTITUTE(A1438,\" \",\"\"))))+1,8000),\"\")","v":""}]
[null,"",null,"",null,null,"",""]
[null,"",null,"",null,null,"",""]
[null,"",null,"",null,null,"",""]
[null,"",null,"",null,null,"",""]
[null,"",null,"",null,null,"",""]
[null,"",null,"",null,null,"",""]
[null,"",null,"",null,null,"",""]
[null,"",null,"",null,null,"",""]
[null,"",null,"",null,null,"",""]
[null,"",null,"",null,null,"",""]
[null,"",null,"",null,null,"",""]
[null,"",null,"",null,null,"",""]
[null,"",null,"",null,null,"",""]
[null,"",null,"",null,null,"",""]
[null,"",null,"",null,null,"",""]
[null,"",null,"",null,null,"",""]
[null,"",null,"",null,null,"",""]
[null,"",null,"",null,null,"",""]
[null,"",null,"",null,null,"",""]
[null,"",null,"",null,null,"",""]
[null,"",null,"",null,null,"",""]
[null,"",null,"",null,null,"",""]
[null,"",null,"",null,null,"",""]
[null,"",null,"",null,null,"",""]
[null,"",null,"",null,null,"",""]
[null,"",null,"",null,null,"",""]
[null,"",null,"",null,null,"",""]
[null,"",null,"",null,null,"",""]
[null,"",null,"",null,null,"",""]
[null,"",null,"",null,null,"",""]
[null,"",null,"",null,null,"",""]
[null,"",null,"",null,null,"",""]
[null,"",null,"",null,null,"",""]
[null,"",null,"",null,null,"",""]
[null,"",null,"",null,null,"",""]
[null,"",null,"",null,null,"",""]
[null,"",null,"",null,null,"",""]
[null,"",null,"",null,null,"",""]
[null,{"$f":"IF(A1477<>\"\",IFERROR(IF(LEN(ROW()-5)=1,\"C000\"&ROW()-5,IF(LEN(ROW()-5)=2,\"C00\"&ROW()-5,IF(LEN(ROW()-5)=3,\"C0\"&ROW()-5,IF(LEN(ROW()-5)=4,\"C\"&ROW()-5)))),\"\"),\"\")","v":""},null,"",null,null,"",""]
[null,"",null,"",null,null,"",""]
[null,"",null,"",null,null,"",""]
[null,"",null,"",null,null,"",""]
[null,"",null,"",null,null,"",""]
[null,"",null,"",null,null,"",""]
[null,"",null,"",null,null,"",""]
[null,"",null,"",null,null,"",""]
[null,"",null,"",null,null,"",""]
[null,"",null,"",null,null,"",""]
[null,"",null,"",null,null,"",""]
[null,"",null,"",null,null,"",""]
[null,"",null,"",null,null,"",""]
[null,"",null,"",null,null,"",""]
[null,"",null,"",null,null,"",""]
[null,"",null,"",null,null,"",""]
[null,"",null,"",null,null,"",""]
[null,"",null,"",null,null,"",""]
[null,"",null,"",null,null,"",""]
[null,"",null,"",null,null,"",""]
[null,"",null,"",null,null,"",""]
[null,"",null,"",null,null,"",""]
[null,"",null,"",null,null,"",""]
[null,"",null,"",null,null,"",""]
[null,"",null,"",null,null,"",""]
[null,"",null,{"$f":"IF(OR(C1502=\"Part\",C1502=\"\"),\"\",A1502)","v":""},null,null,{"$f":"IF(C1502=\"Part\",MID(A1502,1,LEN(A1502)-LEN(H1502)),\"\")","v":""},{"$f":"IF(C1502=\"Part\",MID(A1502,FIND(\"µ\",SUBSTITUTE(A1502,\" \",\"µ\",LEN(A1502)-LEN(SUBSTITUTE(A1502,\" \",\"\"))))+1,8000),\"\")","v":""}]
[null,"",null,"",null,null,"",""]
[null,"",null,"",null,null,"",""]
[null,"",null,"",null,null,"",""]
[null,"",null,"",null,null,"",""]
[null,"",null,"",null,null,"",""]
[null,"",null,"",null,null,"",""]
[null,"",null,"",null,null,"",""]
[null,"",null,"",null,null,"",""]
[null,"",null,"",null,null,"",""]
[null,"",null,"",null,null,"",""]
[null,"",null,"",null,null,"",""]
[null,"",null,"",null,null,"",""]
[null,"",null,"",null,null,"",""]
[null,"",null,"",null,null,"",""]
[null,"",null,"",null,null,"",""]
[null,"",null,"",null,null,"",""]
[null,"",null,"",null,null,"",""]
[null,"",null,"",null,null,"",""]
[null,"",null,"",null,null,"",""]
[null,"",null,"",null,null,"",""]
[null,"",null,"",null,null,"",""]
[null,"",null,"",null,null,"",""]
[null,"",null,"",null,null,"",""]
[null,"",null,"",null,null,"",""]
[null,"",null,"",null,null,"",""]
[null,"",null,"",null,null,"",""]
[null,"",null,"",null,null,"",""]
[null,"",null,"",null,null,"",""]
[null,"",null,"",null,null,"",""]
[null,"",null,"",null,null,"",""]
[null,"",null,"",null,null,"",""]
[null,"",null,"",null,null,"",""]
[null,"",null,"",null,null,"",""]
[null,"",null,"",null,null,"",""]
[null,"",null,"",null,null,"",""]
[null,"",null,"",null,null,"",""]
[null,"",null,"",null,null,"",""]
[null,"",null,"",null,null,"",""]
[null,{"$f":"IF(A1541<>\"\",IFERROR(IF(LEN(ROW()-5)=1,\"C000\"&ROW()-5,IF(LEN(ROW()-5)=2,\"C00\"&ROW()-5,IF(LEN(ROW()-5)=3,\"C0\"&ROW()-5,IF(LEN(ROW()-5)=4,\"C\"&ROW()-5)))),\"\"),\"\")","v":""},null,"",null,null,"",""]
[null,"",null,"",null,null,"",""]
[null,"",null,"",null,null,"",""]
[null,"",null,"",null,null,"",""]
[null,"",null,"",null,null,"",""]
[null,"",null,"",null,null,"",""]
[null,"",null,"",null,null,"",""]
[null,"",null,"",null,null,"",""]
[null,"",null,"",null,null,"",""]
[null,"",null,"",null,null,"",""]
[null,"",null,"",null,null,"",""]
[null,"",null,"",null,null,"",""]
[null,"",null,"",null,null,"",""]
[null,"",null,"",null,null,"",""]
[null,"",null,"",null,null,"",""]
[null,"",null,"",null,null,"",""]
[null,"",null,"",null,null,"",""]
[null,"",null,"",null,null,"",""]
[null,"",null,"",null,null,"",""]
[null,"",null,"",null,null,"",""]
[null,"",null,"",null,null,"",""]
[null,"",null,"",null,null,"",""]
[null,"",null,"",null,null,"",""]
[null,"",null,"",null,null,"",""]
[null,"",null,"",null,null,"",""]
[null,"",null,{"$f":"IF(OR(C1566=\"Part\",C1566=\"\"),\"\",A1566)","v":""},null,null,{"$f":"IF(C1566=\"Part\",MID(A1566,1,LEN(A1566)-LEN(H1566)),\"\")","v":""},{"$f":"IF(C1566=\"Part\",MID(A1566,FIND(\"µ\",SUBSTITUTE(A1566,\" \",\"µ\",LEN(A1566)-LEN(SUBSTITUTE(A1566,\" \",\"\"))))+1,8000),\"\")","v":""}]
[null,"",null,"",null,null,"",""]
[null,"",null,"",null,null,"",""]
[null,"",null,"",null,null,"",""]
[null,"",null,"",null,null,"",""]
[null,"",null,"",null,null,"",""]
[null,"",null,"",null,null,"",""]
[null,"",null,"",null,null,"",""]
[null,"",null,"",null,null,"",""]
[null,"",null,"",null,null,"",""]
[null,"",null,"",null,null,"",""]
[null,"",null,"",null,null,"",""]
[null,"",null,"",null,null,"",""]
[null,"",null,"",null,null,"",""]
[null,"",null,"",null,null,"",""]
[null,"",null,"",null,null,"",""]
[null,"",null,"",null,null,"",""]
[null,"",null,"",null,null,"",""]
[null,"",null,"",null,null,"",""]
[null,"",null,"",null,null,"",""]
[null,"",null,"",null,null,"",""]
[null,"",null,"",null,null,"",""]
[null,"",null,"",null,null,"",""]
[null,"",null,"",null,null,"",""]
[null,"",null,"",null,null,"",""]
[null,"",null,"",null,null,"",""]
[null,"",null,"",null,null,"",""]
[null,"",null,"",null,null,"",""]
[null,"",null,"",null,null,"",""]
[null,"",null,"",null,null,"",""]
[null,"",null,"",null,null,"",""]
[null,"",null,"",null,null,"",""]
[null,"",null,"",null,null,"",""]
[null,"",null,"",null,null,"",""]
[null,"",null,"",null,null,"",""]
[null,"",null,"",null,null,"",""]
[null,"",null,"",null,null,"",""]
[null,"",null,"",null,null,"",""]
[null,"",null,"",null,null,"",""]
[null,{"$f":"IF(A1605<>\"\",IFERROR(IF(LEN(ROW()-5)=1,\"C000\"&ROW()-5,IF(LEN(ROW()-5)=2,\"C00\"&ROW()-5,IF(LEN(ROW()-5)=3,\"C0\"&ROW()-5,IF(LEN(ROW()-5)=4,\"C\"&ROW()-5)))),\"\"),\"\")","v":""},null,"",null,null,"",""]
[null,"",null,"",null,null,"",""]
[null,"",null,"",null,null,"",""]
[null,"",null,"",null,null,"",""]
[null,"",null,"",null,null,"",""]
[null,"",null,"",null,null,"",""]
[null,"",null,"",null,null,"",""]
[null,"",null,"",null,null,"",""]
[null,"",null,"",null,null,"",""]
[null,"",null,"",null,null,"",""]
[null,"",null,"",null,null,"",""]
[null,"",null,"",null,null,"",""]
[null,"",null,"",null,null,"",""]
[null,"",null,"",null,null,"",""]
[null,"",null,"",null,null,"",""]
[null,"",null,"",null,null,"",""]
[null,"",null,"",null,null,"",""]
[null,"",null,"",null,null,"",""]
[null,"",null,"",null,null,"",""]
[null,"",null,"",null,null,"",""]
[null,"",null,"",null,null,"",""]
[null,"",null,"",null,null,"",""]
[null,"",null,"",null,null,"",""]
[null,"",null,"",null,null,"",""]
[null,"",null,"",null,null,"",""]
[null,"",null,{"$f":"IF(OR(C1630=\"Part\",C1630=\"\"),\"\",A1630)","v":""},null,null,{"$f":"IF(C1630=\"Part\",MID(A1630,1,LEN(A1630)-LEN(H1630)),\"\")","v":""},{"$f":"IF(C1630=\"Part\",MID(A1630,FIND(\"µ\",SUBSTITUTE(A1630,\" \",\"µ\",LEN(A1630)-LEN(SUBSTITUTE(A1630,\" \",\"\"))))+1,8000),\"\")","v":""}]
[null,"",null,"",null,null,"",""]
[null,"",null,"",null,null,"",""]
[null,"",null,"",null,null,"",""]
[null,"",null,"",null,null,"",""]
[null,"",null,"",null,null,"",""]
[null,"",null,"",null,null,"",""]
[null,"",null,"",null,null,"",""]
[null,"",null,"",null,null,"",""]
[null,"",null,"",null,null,"",""]
[null,"",null,"",null,null,"",""]
[null,"",null,"",null,null,"",""]
[null,"",null,"",null,null,"",""]
[null,"",null,"",null,null,"",""]
[null,"",null,"",null,null,"",""]
[null,"",null,"",null,null,"",""]
[null,"",null,"",null,null,"",""]
[null,"",null,"",null,null,"",""]
[null,"",null,"",null,null,"",""]
[null,"",null,"",null,null,"",""]
[null,"",null,"",null,null,"",""]
[null,"",null,"",null,null,"",""]
[null,"",null,"",null,null,"",""]
[null,"",null,"",null,null,"",""]
[null,"",null,"",null,null,"",""]
[null,"",null,"",null,null,"",""]
[null,"",null,"",null,null,"",""]
[null,"",null,"",null,null,"",""]
[null,"",null,"",null,null,"",""]
[null,"",null,"",null,null,"",""]
[null,"",null,"",null,null,"",""]
[null,"",null,"",null,null,"",""]
[null,"",null,"",null,null,"",""]
[null,"",null,"",null,null,"",""]
[null,"",null,"",null,null,"",""]
[null,"",null,"",null,null,"",""]
[null,"",null,"",null,null,"",""]
[null,"",null,"",null,null,"",""]
[null,"",null,"",null,null,"",""]
[null,{"$f":"IF(A1669<>\"\",IFERROR(IF(LEN(ROW()-5)=1,\"C000\"&ROW()-5,IF(LEN(ROW()-5)=2,\"C00\"&ROW()-5,IF(LEN(ROW()-5)=3,\"C0\"&ROW()-5,IF(LEN(ROW()-5)=4,\"C\"&ROW()-5)))),\"\"),\"\")","v":""},null,"",null,null,"",""]
[null,"",null,"",null,null,"",""]
[null,"",null,"",null,null,"",""]
[null,"",null,"",null,null,"",""]
[null,"",null,"",null,null,"",""]
[null,"",null,"",null,null,"",""]
[null,"",null,"",null,null,"",""]
[null,"",null,"",null,null,"",""]
[null,"",null,"",null,null,"",""]
[null,"",null,"",null,null,"",""]
[null,"",null,"",null,null,"",""]
[null,"",null,"",null,null,"",""]
[null,"",null,"",null,null,"",""]
[null,"",null,"",null,null,"",""]
[null,"",null,"",null,null,"",""]
[null,"",null,"",null,null,"",""]
[null,"",null,"",null,null,"",""]
[null,"",null,"",null,null,"",""]
[null,"",null,"",null,null,"",""]
[null,"",null,"",null,null,"",""]
[null,"",null,"",null,null,"",""]
[null,"",null,"",null,null,"",""]
[null,"",null,"",null,null,"",""]
[null,"",null,"",null,null,"",""]
[null,"",null,"",null,null,"",""]
[null,"",null,{"$f":"IF(OR(C1694=\"Part\",C1694=\"\"),\"\",A1694)","v":""},null,null,{"$f":"IF(C1694=\"Part\",MID(A1694,1,LEN(A1694)-LEN(H1694)),\"\")","v":""},{"$f":"IF(C1694=\"Part\",MID(A1694,FIND(\"µ\",SUBSTITUTE(A1694,\" \",\"µ\",LEN(A1694)-LEN(SUBSTITUTE(A1694,\" \",\"\"))))+1,8000),\"\")","v":""}]
[null,"",null,"",null,null,"",""]
[null,"",null,"",null,null,"",""]
[null,"",null,"",null,null,"",""]
[null,"",null,"",null,null,"",""]
[null,"",null,"",null,null,"",""]
[null,"",null,"",null,null,"",""]
[null,"",null,"",null,null,"",""]
[null,"",null,"",null,null,"",""]
[null,"",null,"",null,null,"",""]
[null,"",null,"",null,null,"",""]
[null,"",null,"",null,null,"",""]
[null,"",null,"",null,null,"",""]
[null,"",null,"",null,null,"",""]
[null,"",null,"",null,null,"",""]
[null,"",null,"",null,null,"",""]
[null,"",null,"",null,null,"",""]
[null,"",null,"",null,null,"",""]
[null,"",null,"",null,null,"",""]
[null,"",null,"",null,null,"",""]
[null,"",null,"",null,null,"",""]
[null,"",null,"",null,null,"",""]
[null,"",null,"",null,null,"",""]
[null,"",null,"",null,null,"",""]
[null,"",null,"",null,null,"",""]
[null,"",null,"",null,null,"",""]
[null,"",null,"",null,null,"",""]
[null,"",null,"",null,null,"",""]
[null,"",null,"",null,null,"",""]
[null,"",null,"",null,null,"",""]
[null,"",null,"",null,null,"",""]
[null,"",null,"",null,null,"",""]
[null,"",null,"",null,null,"",""]
[null,"",null,"",null,null,"",""]
[null,"",null,"",null,null,"",""]
[null,"",null,"",null,null,"",""]
[null,"",null,"",null,null,"",""]
[null,"",null,"",null,null,"",""]
[null,"",null,"",null,null,"",""]
[null,{"$f":"IF(A1733<>\"\",IFERROR(IF(LEN(ROW()-5)=1,\"C000\"&ROW()-5,IF(LEN(ROW()-5)=2,\"C00\"&ROW()-5,IF(LEN(ROW()-5)=3,\"C0\"&ROW()-5,IF(LEN(ROW()-5)=4,\"C\"&ROW()-5)))),\"\"),\"\")","v":""},null,"",null,null,"",""]
[null,"",null,"",null,null,"",""]
[null,"",null,"",null,null,"",""]
[null,"",null,"",null,null,"",""]
[null,"",null,"",null,null,"",""]
[null,"",null,"",null,null,"",""]
[null,"",null,"",null,null,"",""]
[null,"",null,"",null,null,"",""]
[null,"",null,"",null,null,"",""]
[null,"",null,"",null,null,"",""]
[null,"",null,"",null,null,"",""]
[null,"",null,"",null,null,"",""]
[null,"",null,"",null,null,"",""]
[null,"",null,"",null,null,"",""]
[null,"",null,"",null,null,"",""]
[null,"",null,"",null,null,"",""]
[null,"",null,"",null,null,"",""]
[null,"",null,"",null,null,"",""]
[null,"",null,"",null,null,"",""]
[null,"",null,"",null,null,"",""]
[null,"",null,"",null,null,"",""]
[null,"",null,"",null,null,"",""]
[null,"",null,"",null,null,"",""]
[null,"",null,"",null,null,"",""]
[null,"",null,"",null,null,"",""]
[null,"",null,{"$f":"IF(OR(C1758=\"Part\",C1758=\"\"),\"\",A1758)","v":""},null,null,{"$f":"IF(C1758=\"Part\",MID(A1758,1,LEN(A1758)-LEN(H1758)),\"\")","v":""},{"$f":"IF(C1758=\"Part\",MID(A1758,FIND(\"µ\",SUBSTITUTE(A1758,\" \",\"µ\",LEN(A1758)-LEN(SUBSTITUTE(A1758,\" \",\"\"))))+1,8000),\"\")","v":""}]
[null,"",null,"",null,null,"",""]
[null,"",null,"",null,null,"",""]
[null,"",null,"",null,null,"",""]
[null,"",null,"",null,null,"",""]
[null,"",null,"",null,null,"",""]
[null,"",null,"",null,null,"",""]
[null,"",null,"",null,null,"",""]
[null,"",null,"",null,null,"",""]
[null,"",null,"",null,null,"",""]
[null,"",null,"",null,null,"",""]
[null,"",null,"",null,null,"",""]
[null,"",null,"",null,null,"",""]
[null,"",null,"",null,null,"",""]
[null,"",null,"",null,null,"",""]
[null,"",null,"",null,null,"",""]
[null,"",null,"",null,null,"",""]
[null,"",null,"",null,null,"",""]
[null,"",null,"",null,null,"",""]
[null,"",null,"",null,null,"",""]
[null,"",null,"",null,null,"",""]
[null,"",null,"",null,null,"",""]
[null,"",null,"",null,null,"",""]
[null,"",null,"",null,null,"",""]
[null,"",null,"",null,null,"",""]
[null,"",null,"",null,null,"",""]
[null,"",null,"",null,null,"",""]
[null,"",null,"",null,null,"",""]
[null,"",null,"",null,null,"",""]
[null,"",null,"",null,null,"",""]
[null,"",null,"",null,null,"",""]
[null,"",null,"",null,null,"",""]
[null,"",null,"",null,null,"",""]
[null,"",null,"",null,null,"",""]
[null,"",null,"",null,null,"",""]
[null,"",null,"",null,null,"",""]
[null,"",null,"",null,null,"",""]
[null,"",null,"",null,null,"",""]
[null,"",null,"",null,null,"",""]
[null,{"$f":"IF(A1797<>\"\",IFERROR(IF(LEN(ROW()-5)=1,\"C000\"&ROW()-5,IF(LEN(ROW()-5)=2,\"C00\"&ROW()-5,IF(LEN(ROW()-5)=3,\"C0\"&ROW()-5,IF(LEN(ROW()-5)=4,\"C\"&ROW()-5)))),\"\"),\"\")","v":""},null,"",null,null,"",""]
[null,"",null,"",null,null,"",""]
[null,"",null,"",null,null,"",""]
[null,"",null,"",null,null,"",""]
[null,"",null,"",null,null,"",""]
[null,"",null,"",null,null,"",""]
[null,"",null,"",null,null,"",""]
[null,"",null,"",null,null,"",""]
[null,"",null,"",null,null,"",""]
[null,"",null,"",null,null,"",""]

{"sheet":"Base prestations","index":4,"n_rows":606,"n_cols":22,"rows_kept":606,"cut":false,"hidden":false,"merged":[],"read":"row_number_cap"}
[null,null,null,null,null,null,null,null,null,null,null,null,null,"Base prestations","Base clients","PARAM","PARAM","PARAM","PARAM","PARAM","PARAM"]
[null,null,null,null,null,null,null,null,null,null,null,null,null,{"$f":"COUNTIFS(L:L,\"à éditer\")","v":1},null,null,null,null,"mois","année","hypothèses"]
[]
[null,"Base de devis et facturation",null,null,null,null,null,null,{"$f":"IF(MONTH(TODAY())<10,\"0\"&MONTH(TODAY()),MONTH(TODAY()))","v":"08"}]
[null,"Produits et services",null,null,null,null,null,null,null,"Faire \"control et ; \" pour insérer la date du jour.",null,"Choix d'édition de facture.",null,null,null,null,{"$f":"_xlfn.MAXIFS(N:N,L:L,\"définitif\")","v":0}]
["index","Code client","Description","Prix de vente € HT","Acompte de 30% à recevoir ?","Taux TVA","Remise","Moyens de paiement","Numéro de prestation","Date de devis","Date de facture","Edition ?","Raison de l'abandon","Numéro de facture","Type","libre","Incrémentation n° facture","total à éditer","MOIS","ANNEE","Etat","Pour Tiny référence devis"]
[1,"C0001","prestation 1",300,"OUI",0.2,null,"virement",1,"2020-05-01",null,"à éditer",null,{"$f":"IF(L7=\"à éditer\",IF(B7=B6,N6,$Q$5+IF(Q7=R7,Q7,R7)),\"\")+22000","v":22001},{"$f":"IFERROR(INDIRECT(\"'\"&$O$1&\"'!C\"&MATCH(B7,INDIRECT(\"'\"&$O$1&\"'!B:B\"),0)),\"\")","v":"Pro"},null,{"$f":"COUNTIFS(L:L,\"à éditer\",B:B,B7)","v":1},{"$f":"COUNTIFS($L$7:L7,\"à éditer\",$B$7:B7,B7)","v":1},{"$f":"IFERROR(MONTH(J7),\"\")","v":5},{"$f":"YEAR(J7)","v":2020},{"$f":"IF(OR(L7=\"définitif\",L7=\"à éditer\",L7=\"en cours de réalisation\"),\"Réalisé\",IF(OR(L7=\"projet annulé\",L7=\"\"),\"Non réalisé\",IF(L7=\"en attente\",\"En attente\",\"\")))","v":"Réalisé"}]
[{"$f":"A7+1","v":2},"C0001","Prestation 2",400,"OUI",0.1,0.05,"virement",1,null,null,null,null,{"$f":"IF(L8=\"à éditer\",IF(B8=B7,N7,$Q$5+IF(Q8=R8,Q8,R8)),\"\")","v":""},{"$f":"IFERROR(INDIRECT(\"'\"&$O$1&\"'!C\"&MATCH(B8,INDIRECT(\"'\"&$O$1&\"'!B:B\"),0)),\"\")","v":"Pro"},null,{"$f":"COUNTIFS(L:L,\"à éditer\",B:B,B8)","v":1},{"$f":"COUNTIFS($L$7:L8,\"à éditer\")","v":1},{"$f":"IFERROR(MONTH(J8),\"\")","v":1},{"$f":"YEAR(J8)","v":1900},{"$f":"IF(OR(L8=\"définitif\",L8=\"à éditer\",L8=\"en cours de réalisation\"),\"Réalisé\",IF(OR(L8=\"projet annulé\",L8=\"\"),\"Non réalisé\",IF(L8=\"en attente\",\"En attente\",\"\")))","v":"Non réalisé"}]
[3,"C0002","prestation 1",300,"NON",0.2,null,"virement",2,null,null,null,null,"","Pro",null,0,{"$f":"COUNTIFS($L$7:L9,\"à éditer\")","v":1},1,1900,"Non réalisé"]
[4,null,null,null,null,null,null,null,null,null,null,null,null,"","",null,0,{"$f":"COUNTIFS($L$7:L10,\"à éditer\")","v":1},1,1900,"Non réalisé"]
[5,null,null,null,null,null,null,null,null,null,null,null,null,"","",null,0,{"$f":"COUNTIFS($L$7:L11,\"à éditer\")","v":1},1,1900,"Non réalisé"]
[6,null,null,null,null,null,null,null,null,null,null,null,null,"","",null,0,{"$f":"COUNTIFS($L$7:L12,\"à éditer\")","v":1},1,1900,"Non réalisé"]
[7,null,null,null,null,null,null,null,null,null,null,null,null,"","Pro",null,0,{"$f":"COUNTIFS($L$7:L13,\"à éditer\")","v":1},1,1900,"Non réalisé"]
[8,null,null,null,null,null,null,null,null,null,null,null,null,"",{"$f":"IFERROR(INDIRECT(\"'\"&$O$1&\"'!C\"&MATCH(B14,INDIRECT(\"'\"&$O$1&\"'!B:B\"),0)),\"\")","v":""},null,0,{"$f":"COUNTIFS($L$7:L14,\"à éditer\")","v":1},1,1900,"Non réalisé"]
[9,null,null,null,null,null,null,null,null,null,null,null,null,"","",null,0,{"$f":"COUNTIFS($L$7:L16,\"à éditer\")","v":1},1,1900,"Non réalisé"]
[10,null,null,null,null,null,null,null,null,null,null,null,null,"","",null,0,{"$f":"COUNTIFS($L$7:L16,\"à éditer\")","v":1},1,1900,"Non réalisé"]
[11,null,null,null,null,null,null,null,null,null,null,null,null,"","",null,0,{"$f":"COUNTIFS($L$7:L17,\"à éditer\")","v":1},1,1900,"Non réalisé"]
[12,null,null,null,null,null,null,null,null,null,null,null,null,"","",null,0,{"$f":"COUNTIFS($L$7:L18,\"à éditer\")","v":1},1,1900,"Non réalisé"]
[13,null,null,null,null,null,null,null,null,null,null,null,null,"","",null,0,{"$f":"COUNTIFS($L$7:L19,\"à éditer\")","v":1},1,1900,"Non réalisé"]
[14,null,null,null,null,null,null,null,null,null,null,null,null,"",{"$f":"IFERROR(INDIRECT(\"'\"&$O$1&\"'!C\"&MATCH(B20,INDIRECT(\"'\"&$O$1&\"'!B:B\"),0)),\"\")","v":""},null,{"$f":"COUNTIFS(L:L,\"à éditer\",B:B,B20)","v":0},{"$f":"COUNTIFS($L$7:L20,\"à éditer\")","v":1},1,1900,"Non réalisé"]
[15,null,null,null,null,null,null,null,null,null,null,null,null,"","",null,0,{"$f":"COUNTIFS($L$7:L21,\"à éditer\")","v":1},1,1900,"Non réalisé"]
[16,null,null,null,null,null,null,null,null,null,null,null,null,"","",null,0,{"$f":"COUNTIFS($L$7:L22,\"à éditer\")","v":1},1,1900,"Non réalisé"]
[17,null,null,null,null,null,null,null,null,null,null,null,null,"","",null,0,{"$f":"COUNTIFS($L$7:L23,\"à éditer\")","v":1},1,1900,"Non réalisé"]
[18,null,null,null,null,null,null,null,null,null,null,null,null,"","",null,0,{"$f":"COUNTIFS($L$7:L24,\"à éditer\")","v":1},1,1900,"Non réalisé"]
[19,null,null,null,null,null,null,null,null,null,null,null,null,"","",null,0,{"$f":"COUNTIFS($L$7:L25,\"à éditer\")","v":1},1,1900,"Non réalisé"]
[20,null,null,null,null,null,null,null,null,null,null,null,null,"","",null,0,{"$f":"COUNTIFS($L$7:L26,\"à éditer\")","v":1},1,1900,"Non réalisé"]
[21,null,null,null,null,null,null,null,null,null,null,null,null,"","",null,0,{"$f":"COUNTIFS($L$7:L27,\"à éditer\")","v":1},1,1900,"Non réalisé"]
[22,null,null,null,null,null,null,null,null,null,null,null,null,"","",null,0,{"$f":"COUNTIFS($L$7:L28,\"à éditer\")","v":1},1,1900,"Non réalisé"]
[23,null,null,null,null,null,null,null,null,null,null,null,null,"","",null,0,{"$f":"COUNTIFS($L$7:L29,\"à éditer\")","v":1},1,1900,"Non réalisé"]
[24,null,null,null,null,null,null,null,null,null,null,null,null,"","",null,0,{"$f":"COUNTIFS($L$7:L30,\"à éditer\")","v":1},1,1900,"Non réalisé"]
[25,null,null,null,null,null,null,null,null,null,null,null,null,{"$f":"IF(L31=\"à éditer\",IF(B31=B30,N30,$Q$5+IF(Q31=R31,Q31,R31)),\"\")","v":""},"",null,0,{"$f":"COUNTIFS($L$7:L31,\"à éditer\")","v":1},1,1900,"Non réalisé"]
[26,null,null,null,null,null,null,null,null,null,null,null,null,"","",null,0,{"$f":"COUNTIFS($L$7:L32,\"à éditer\")","v":1},1,1900,"Non réalisé"]
[27,null,null,null,null,null,null,null,null,null,null,null,null,"","",null,0,{"$f":"COUNTIFS($L$7:L33,\"à éditer\")","v":1},1,1900,"Non réalisé"]
[28,null,null,null,null,null,null,null,null,null,null,null,null,"","",null,0,{"$f":"COUNTIFS($L$7:L34,\"à éditer\")","v":1},1,1900,"Non réalisé"]
[29,null,null,null,null,null,null,null,null,null,null,null,null,"","",null,0,{"$f":"COUNTIFS($L$7:L35,\"à éditer\")","v":1},1,1900,"Non réalisé"]
[30,null,null,null,null,null,null,null,null,null,null,null,null,"","",null,0,{"$f":"COUNTIFS($L$7:L36,\"à éditer\")","v":1},1,1900,"Non réalisé"]
[31,null,null,null,null,null,null,null,null,null,null,null,null,"","",null,0,{"$f":"COUNTIFS($L$7:L37,\"à éditer\")","v":1},1,1900,"Non réalisé"]
[32,null,null,null,null,null,null,null,null,null,null,null,null,"","",null,0,{"$f":"COUNTIFS($L$7:L38,\"à éditer\")","v":1},1,1900,"Non réalisé"]
[33,null,null,null,null,null,null,null,null,null,null,null,null,"","",null,0,{"$f":"COUNTIFS($L$7:L39,\"à éditer\")","v":1},1,1900,"Non réalisé"]
[34,null,null,null,null,null,null,null,null,null,null,null,null,"","",null,0,{"$f":"COUNTIFS($L$7:L40,\"à éditer\")","v":1},1,1900,"Non réalisé"]
[35,null,null,null,null,null,null,null,null,null,null,null,null,"","",null,0,{"$f":"COUNTIFS($L$7:L41,\"à éditer\")","v":1},1,1900,"Non réalisé"]
[36,null,null,null,null,null,null,null,null,null,null,null,null,"","",null,0,{"$f":"COUNTIFS($L$7:L42,\"à éditer\")","v":1},1,1900,"Non réalisé"]
[37,null,null,null,null,null,null,null,null,null,null,null,null,"","",null,0,{"$f":"COUNTIFS($L$7:L43,\"à éditer\")","v":1},1,1900,"Non réalisé"]
[38,null,null,null,null,null,null,null,null,null,null,null,null,"","",null,0,{"$f":"COUNTIFS($L$7:L44,\"à éditer\")","v":1},1,1900,"Non réalisé"]
[39,null,null,null,null,null,null,null,null,null,null,null,null,"","",null,0,{"$f":"COUNTIFS($L$7:L45,\"à éditer\")","v":1},1,1900,"Non réalisé"]
[40,null,null,null,null,null,null,null,null,null,null,null,null,"","",null,0,{"$f":"COUNTIFS($L$7:L46,\"à éditer\")","v":1},1,1900,"Non réalisé"]
[41,null,null,null,null,null,null,null,null,null,null,null,null,"","",null,0,{"$f":"COUNTIFS($L$7:L47,\"à éditer\")","v":1},1,1900,"Non réalisé"]
[42,null,null,null,null,null,null,null,null,null,null,null,null,"","",null,0,{"$f":"COUNTIFS($L$7:L48,\"à éditer\")","v":1},1,1900,"Non réalisé"]
[43,null,null,null,null,null,null,null,null,null,null,null,null,"","",null,0,{"$f":"COUNTIFS($L$7:L49,\"à éditer\")","v":1},1,1900,"Non réalisé"]
[44,null,null,null,null,null,null,null,null,null,null,null,null,"","",null,0,{"$f":"COUNTIFS($L$7:L50,\"à éditer\")","v":1},1,1900,"Non réalisé"]
[45,null,null,null,null,null,null,null,null,null,null,null,null,"","",null,0,{"$f":"COUNTIFS($L$7:L51,\"à éditer\")","v":1},1,1900,"Non réalisé"]
[46,null,null,null,null,null,null,null,null,null,null,null,null,"","",null,0,{"$f":"COUNTIFS($L$7:L52,\"à éditer\")","v":1},1,1900,"Non réalisé"]
[47,null,null,null,null,null,null,null,null,null,null,null,null,"","",null,0,{"$f":"COUNTIFS($L$7:L53,\"à éditer\")","v":1},1,1900,"Non réalisé"]
[48,null,null,null,null,null,null,null,null,null,null,null,null,"","",null,0,{"$f":"COUNTIFS($L$7:L54,\"à éditer\")","v":1},1,1900,"Non réalisé"]
[49,null,null,null,null,null,null,null,null,null,null,null,null,"","",null,0,{"$f":"COUNTIFS($L$7:L55,\"à éditer\")","v":1},1,1900,"Non réalisé"]
[50,null,null,null,null,null,null,null,null,null,null,null,null,"","",null,0,{"$f":"COUNTIFS($L$7:L56,\"à éditer\")","v":1},1,1900,"Non réalisé"]
[51,null,null,null,null,null,null,null,null,null,null,null,null,"","",null,0,{"$f":"COUNTIFS($L$7:L57,\"à éditer\")","v":1},1,1900,"Non réalisé"]
[52,null,null,null,null,null,null,null,null,null,null,null,null,"","",null,0,{"$f":"COUNTIFS($L$7:L58,\"à éditer\")","v":1},1,1900,"Non réalisé"]
[53,null,null,null,null,null,null,null,null,null,null,null,null,"","",null,0,{"$f":"COUNTIFS($L$7:L59,\"à éditer\")","v":1},1,1900,"Non réalisé"]
[54,null,null,null,null,null,null,null,null,null,null,null,null,"","",null,0,{"$f":"COUNTIFS($L$7:L60,\"à éditer\")","v":1},1,1900,"Non réalisé"]
[55,null,null,null,null,null,null,null,null,null,null,null,null,"","",null,0,{"$f":"COUNTIFS($L$7:L61,\"à éditer\")","v":1},1,1900,"Non réalisé"]
[56,null,null,null,null,null,null,null,null,null,null,null,null,"","",null,0,{"$f":"COUNTIFS($L$7:L62,\"à éditer\")","v":1},1,1900,"Non réalisé"]
[57,null,null,null,null,null,null,null,null,null,null,null,null,"","",null,0,{"$f":"COUNTIFS($L$7:L63,\"à éditer\")","v":1},1,1900,"Non réalisé"]
[58,null,null,null,null,null,null,null,null,null,null,null,null,"","",null,0,{"$f":"COUNTIFS($L$7:L64,\"à éditer\")","v":1},1,1900,"Non réalisé"]
[59,null,null,null,null,null,null,null,null,null,null,null,null,"","",null,0,{"$f":"COUNTIFS($L$7:L65,\"à éditer\")","v":1},1,1900,"Non réalisé"]
[60,null,null,null,null,null,null,null,null,null,null,null,null,"","",null,0,{"$f":"COUNTIFS($L$7:L66,\"à éditer\")","v":1},1,1900,"Non réalisé"]
[61,null,null,null,null,null,null,null,null,null,null,null,null,"","",null,0,{"$f":"COUNTIFS($L$7:L67,\"à éditer\")","v":1},1,1900,"Non réalisé"]
[62,null,null,null,null,null,null,null,null,null,null,null,null,"","",null,0,{"$f":"COUNTIFS($L$7:L68,\"à éditer\")","v":1},1,1900,"Non réalisé"]
[63,null,null,null,null,null,null,null,null,null,null,null,null,"","",null,0,{"$f":"COUNTIFS($L$7:L69,\"à éditer\")","v":1},1,1900,"Non réalisé"]
[64,null,null,null,null,null,null,null,null,null,null,null,null,"","",null,0,{"$f":"COUNTIFS($L$7:L70,\"à éditer\")","v":1},1,1900,"Non réalisé"]
[65,null,null,null,null,null,null,null,null,null,null,null,null,"","",null,0,{"$f":"COUNTIFS($L$7:L71,\"à éditer\")","v":1},1,1900,"Non réalisé"]
[{"$f":"A71+1","v":66},null,null,null,null,null,null,null,null,null,null,null,null,"","",null,0,{"$f":"COUNTIFS($L$7:L72,\"à éditer\")","v":1},{"$f":"IFERROR(MONTH(J72),\"\")","v":1},{"$f":"YEAR(J72)","v":1900},{"$f":"IF(OR(L72=\"définitif\",L72=\"à éditer\",L72=\"en cours de réalisation\"),\"Réalisé\",IF(OR(L72=\"projet annulé\",L72=\"\"),\"Non réalisé\",IF(L72=\"en attente\",\"En attente\",\"\")))","v":"Non réalisé"}]
[67,null,null,null,null,null,null,null,null,null,null,null,null,"","",null,0,{"$f":"COUNTIFS($L$7:L73,\"à éditer\")","v":1},1,1900,"Non réalisé"]
[68,null,null,null,null,null,null,null,null,null,null,null,null,"","",null,0,{"$f":"COUNTIFS($L$7:L74,\"à éditer\")","v":1},1,1900,"Non réalisé"]
[69,null,null,null,null,null,null,null,null,null,null,null,null,"","",null,0,{"$f":"COUNTIFS($L$7:L75,\"à éditer\")","v":1},1,1900,"Non réalisé"]
[70,null,null,null,null,null,null,null,null,null,null,null,null,"","",null,0,{"$f":"COUNTIFS($L$7:L76,\"à éditer\")","v":1},1,1900,"Non réalisé"]
[71,null,null,null,null,null,null,null,null,null,null,null,null,"","",null,0,{"$f":"COUNTIFS($L$7:L77,\"à éditer\")","v":1},1,1900,"Non réalisé"]
[72,null,null,null,null,null,null,null,null,null,null,null,null,"","",null,0,{"$f":"COUNTIFS($L$7:L78,\"à éditer\")","v":1},1,1900,"Non réalisé"]
[73,null,null,null,null,null,null,null,null,null,null,null,null,"","",null,0,{"$f":"COUNTIFS($L$7:L79,\"à éditer\")","v":1},1,1900,"Non réalisé"]
[74,null,null,null,null,null,null,null,null,null,null,null,null,"","",null,0,{"$f":"COUNTIFS($L$7:L80,\"à éditer\")","v":1},1,1900,"Non réalisé"]
[75,null,null,null,null,null,null,null,null,null,null,null,null,"","",null,0,{"$f":"COUNTIFS($L$7:L81,\"à éditer\")","v":1},1,1900,"Non réalisé"]
[76,null,null,null,null,null,null,null,null,null,null,null,null,"","",null,0,{"$f":"COUNTIFS($L$7:L82,\"à éditer\")","v":1},1,1900,"Non réalisé"]
[77,null,null,null,null,null,null,null,null,null,null,null,null,"","",null,0,{"$f":"COUNTIFS($L$7:L83,\"à éditer\")","v":1},1,1900,"Non réalisé"]
[78,null,null,null,null,null,null,null,null,null,null,null,null,"",{"$f":"IFERROR(INDIRECT(\"'\"&$O$1&\"'!C\"&MATCH(B84,INDIRECT(\"'\"&$O$1&\"'!B:B\"),0)),\"\")","v":""},null,{"$f":"COUNTIFS(L:L,\"à éditer\",B:B,B84)","v":0},{"$f":"COUNTIFS($L$7:L84,\"à éditer\")","v":1},1,1900,"Non réalisé"]
[79,null,null,null,null,null,null,null,null,null,null,null,null,"","",null,0,{"$f":"COUNTIFS($L$7:L85,\"à éditer\")","v":1},1,1900,"Non réalisé"]
[80,null,null,null,null,null,null,null,null,null,null,null,null,{"$f":"IF(L86=\"à éditer\",IF(B86=B85,N85,$Q$5+IF(Q86=R86,Q86,R86)),\"\")","v":""},"",null,0,{"$f":"COUNTIFS($L$7:L86,\"à éditer\")","v":1},1,1900,"Non réalisé"]
[81,null,null,null,null,null,null,null,null,null,null,null,null,"","",null,0,{"$f":"COUNTIFS($L$7:L87,\"à éditer\")","v":1},1,1900,"Non réalisé"]
[82,null,null,null,null,null,null,null,null,null,null,null,null,"","",null,0,{"$f":"COUNTIFS($L$7:L88,\"à éditer\")","v":1},1,1900,"Non réalisé"]
[83,null,null,null,null,null,null,null,null,null,null,null,null,"","",null,0,{"$f":"COUNTIFS($L$7:L89,\"à éditer\")","v":1},1,1900,"Non réalisé"]
[84,null,null,null,null,null,null,null,null,null,null,null,null,"","",null,0,{"$f":"COUNTIFS($L$7:L90,\"à éditer\")","v":1},1,1900,"Non réalisé"]
[85,null,null,null,null,null,null,null,null,null,null,null,null,"","",null,0,{"$f":"COUNTIFS($L$7:L91,\"à éditer\")","v":1},1,1900,"Non réalisé"]
[86,null,null,null,null,null,null,null,null,null,null,null,null,"","",null,0,{"$f":"COUNTIFS($L$7:L92,\"à éditer\")","v":1},1,1900,"Non réalisé"]
[87,null,null,null,null,null,null,null,null,null,null,null,null,"","",null,0,{"$f":"COUNTIFS($L$7:L93,\"à éditer\")","v":1},1,1900,"Non réalisé"]
[88,null,null,null,null,null,null,null,null,null,null,null,null,"","",null,0,{"$f":"COUNTIFS($L$7:L94,\"à éditer\")","v":1},1,1900,"Non réalisé"]
[89,null,null,null,null,null,null,null,null,null,null,null,null,"","",null,0,{"$f":"COUNTIFS($L$7:L95,\"à éditer\")","v":1},1,1900,"Non réalisé"]
[90,null,null,null,null,null,null,null,null,null,null,null,null,"","",null,0,{"$f":"COUNTIFS($L$7:L96,\"à éditer\")","v":1},1,1900,"Non réalisé"]
[91,null,null,null,null,null,null,null,null,null,null,null,null,"","",null,0,{"$f":"COUNTIFS($L$7:L97,\"à éditer\")","v":1},1,1900,"Non réalisé"]
[92,null,null,null,null,null,null,null,null,null,null,null,null,"","",null,0,{"$f":"COUNTIFS($L$7:L98,\"à éditer\")","v":1},1,1900,"Non réalisé"]
[93,null,null,null,null,null,null,null,null,null,null,null,null,"","",null,0,{"$f":"COUNTIFS($L$7:L99,\"à éditer\")","v":1},1,1900,"Non réalisé"]
[94,null,null,null,null,null,null,null,null,null,null,null,null,"","",null,0,{"$f":"COUNTIFS($L$7:L100,\"à éditer\")","v":1},1,1900,"Non réalisé"]
[95,null,null,null,null,null,null,null,null,null,null,null,null,"","",null,0,{"$f":"COUNTIFS($L$7:L101,\"à éditer\")","v":1},1,1900,"Non réalisé"]
[96,null,null,null,null,null,null,null,null,null,null,null,null,"","",null,0,{"$f":"COUNTIFS($L$7:L102,\"à éditer\")","v":1},1,1900,"Non réalisé"]
[97,null,null,null,null,null,null,null,null,null,null,null,null,"","",null,0,{"$f":"COUNTIFS($L$7:L103,\"à éditer\")","v":1},1,1900,"Non réalisé"]
[98,null,null,null,null,null,null,null,null,null,null,null,null,"","",null,0,{"$f":"COUNTIFS($L$7:L104,\"à éditer\")","v":1},1,1900,"Non réalisé"]
[99,null,null,null,null,null,null,null,null,null,null,null,null,"","",null,0,{"$f":"COUNTIFS($L$7:L105,\"à éditer\")","v":1},1,1900,"Non réalisé"]
[100,null,null,null,null,null,null,null,null,null,null,null,null,"","",null,0,{"$f":"COUNTIFS($L$7:L106,\"à éditer\")","v":1},1,1900,"Non réalisé"]
[101,null,null,null,null,null,null,null,null,null,null,null,null,"","",null,0,{"$f":"COUNTIFS($L$7:L107,\"à éditer\")","v":1},1,1900,"Non réalisé"]
[102,null,null,null,null,null,null,null,null,null,null,null,null,"","",null,0,{"$f":"COUNTIFS($L$7:L108,\"à éditer\")","v":1},1,1900,"Non réalisé"]
[103,null,null,null,null,null,null,null,null,null,null,null,null,"","",null,0,{"$f":"COUNTIFS($L$7:L109,\"à éditer\")","v":1},1,1900,"Non réalisé"]
[104,null,null,null,null,null,null,null,null,null,null,null,null,"","",null,0,{"$f":"COUNTIFS($L$7:L110,\"à éditer\")","v":1},1,1900,"Non réalisé"]
[105,null,null,null,null,null,null,null,null,null,null,null,null,"","",null,0,{"$f":"COUNTIFS($L$7:L111,\"à éditer\")","v":1},1,1900,"Non réalisé"]
[106,null,null,null,null,null,null,null,null,null,null,null,null,"","",null,0,{"$f":"COUNTIFS($L$7:L112,\"à éditer\")","v":1},1,1900,"Non réalisé"]
[107,null,null,null,null,null,null,null,null,null,null,null,null,"","",null,0,{"$f":"COUNTIFS($L$7:L113,\"à éditer\")","v":1},1,1900,"Non réalisé"]
[108,null,null,null,null,null,null,null,null,null,null,null,null,"","",null,0,{"$f":"COUNTIFS($L$7:L114,\"à éditer\")","v":1},1,1900,"Non réalisé"]
[109,null,null,null,null,null,null,null,null,null,null,null,null,"","",null,0,{"$f":"COUNTIFS($L$7:L115,\"à éditer\")","v":1},1,1900,"Non réalisé"]
[110,null,null,null,null,null,null,null,null,null,null,null,null,"","",null,0,{"$f":"COUNTIFS($L$7:L116,\"à éditer\")","v":1},1,1900,"Non réalisé"]
[111,null,null,null,null,null,null,null,null,null,null,null,null,"","",null,0,{"$f":"COUNTIFS($L$7:L117,\"à éditer\")","v":1},1,1900,"Non réalisé"]
[112,null,null,null,null,null,null,null,null,null,null,null,null,"","",null,0,{"$f":"COUNTIFS($L$7:L118,\"à éditer\")","v":1},1,1900,"Non réalisé"]
[113,null,null,null,null,null,null,null,null,null,null,null,null,"","",null,0,{"$f":"COUNTIFS($L$7:L119,\"à éditer\")","v":1},1,1900,"Non réalisé"]
[114,null,null,null,null,null,null,null,null,null,null,null,null,"","",null,0,{"$f":"COUNTIFS($L$7:L120,\"à éditer\")","v":1},1,1900,"Non réalisé"]
[115,null,null,null,null,null,null,null,null,null,null,null,null,"","",null,0,{"$f":"COUNTIFS($L$7:L121,\"à éditer\")","v":1},1,1900,"Non réalisé"]
[116,null,null,null,null,null,null,null,null,null,null,null,null,"","",null,0,{"$f":"COUNTIFS($L$7:L122,\"à éditer\")","v":1},1,1900,"Non réalisé"]
[117,null,null,null,null,null,null,null,null,null,null,null,null,"","",null,0,{"$f":"COUNTIFS($L$7:L123,\"à éditer\")","v":1},1,1900,"Non réalisé"]
[118,null,null,null,null,null,null,null,null,null,null,null,null,"","",null,0,{"$f":"COUNTIFS($L$7:L124,\"à éditer\")","v":1},1,1900,"Non réalisé"]
[119,null,null,null,null,null,null,null,null,null,null,null,null,"","",null,0,{"$f":"COUNTIFS($L$7:L125,\"à éditer\")","v":1},1,1900,"Non réalisé"]
[120,null,null,null,null,null,null,null,null,null,null,null,null,"","",null,0,{"$f":"COUNTIFS($L$7:L126,\"à éditer\")","v":1},1,1900,"Non réalisé"]
[121,null,null,null,null,null,null,null,null,null,null,null,null,"","",null,0,{"$f":"COUNTIFS($L$7:L127,\"à éditer\")","v":1},1,1900,"Non réalisé"]
[122,null,null,null,null,null,null,null,null,null,null,null,null,"","",null,0,{"$f":"COUNTIFS($L$7:L128,\"à éditer\")","v":1},1,1900,"Non réalisé"]
[123,null,null,null,null,null,null,null,null,null,null,null,null,"","",null,0,{"$f":"COUNTIFS($L$7:L129,\"à éditer\")","v":1},1,1900,"Non réalisé"]
[124,null,null,null,null,null,null,null,null,null,null,null,null,"","",null,0,{"$f":"COUNTIFS($L$7:L130,\"à éditer\")","v":1},1,1900,"Non réalisé"]
[125,null,null,null,null,null,null,null,null,null,null,null,null,"","",null,0,{"$f":"COUNTIFS($L$7:L131,\"à éditer\")","v":1},1,1900,"Non réalisé"]
[126,null,null,null,null,null,null,null,null,null,null,null,null,"","",null,0,{"$f":"COUNTIFS($L$7:L132,\"à éditer\")","v":1},1,1900,"Non réalisé"]
[127,null,null,null,null,null,null,null,null,null,null,null,null,"","",null,0,{"$f":"COUNTIFS($L$7:L133,\"à éditer\")","v":1},1,1900,"Non réalisé"]
[128,null,null,null,null,null,null,null,null,null,null,null,null,"","",null,0,{"$f":"COUNTIFS($L$7:L134,\"à éditer\")","v":1},1,1900,"Non réalisé"]
[129,null,null,null,null,null,null,null,null,null,null,null,null,"","",null,0,{"$f":"COUNTIFS($L$7:L135,\"à éditer\")","v":1},1,1900,"Non réalisé"]
[{"$f":"A135+1","v":130},null,null,null,null,null,null,null,null,null,null,null,null,"","",null,0,{"$f":"COUNTIFS($L$7:L136,\"à éditer\")","v":1},{"$f":"IFERROR(MONTH(J136),\"\")","v":1},{"$f":"YEAR(J136)","v":1900},{"$f":"IF(OR(L136=\"définitif\",L136=\"à éditer\",L136=\"en cours de réalisation\"),\"Réalisé\",IF(OR(L136=\"projet annulé\",L136=\"\"),\"Non réalisé\",IF(L136=\"en attente\",\"En attente\",\"\")))","v":"Non réalisé"}]
[131,null,null,null,null,null,null,null,null,null,null,null,null,"","",null,0,{"$f":"COUNTIFS($L$7:L137,\"à éditer\")","v":1},1,1900,"Non réalisé"]
[132,null,null,null,null,null,null,null,null,null,null,null,null,"","",null,0,{"$f":"COUNTIFS($L$7:L138,\"à éditer\")","v":1},1,1900,"Non réalisé"]
[133,null,null,null,null,null,null,null,null,null,null,null,null,"","",null,0,{"$f":"COUNTIFS($L$7:L139,\"à éditer\")","v":1},1,1900,"Non réalisé"]
[134,null,null,null,null,null,null,null,null,null,null,null,null,"","",null,0,{"$f":"COUNTIFS($L$7:L140,\"à éditer\")","v":1},1,1900,"Non réalisé"]
[135,null,null,null,null,null,null,null,null,null,null,null,null,"","",null,0,{"$f":"COUNTIFS($L$7:L141,\"à éditer\")","v":1},1,1900,"Non réalisé"]
[136,null,null,null,null,null,null,null,null,null,null,null,null,"","",null,0,{"$f":"COUNTIFS($L$7:L142,\"à éditer\")","v":1},1,1900,"Non réalisé"]
[137,null,null,null,null,null,null,null,null,null,null,null,null,"","",null,0,{"$f":"COUNTIFS($L$7:L143,\"à éditer\")","v":1},1,1900,"Non réalisé"]
[138,null,null,null,null,null,null,null,null,null,null,null,null,"","",null,0,{"$f":"COUNTIFS($L$7:L144,\"à éditer\")","v":1},1,1900,"Non réalisé"]
[139,null,null,null,null,null,null,null,null,null,null,null,null,"","",null,0,{"$f":"COUNTIFS($L$7:L145,\"à éditer\")","v":1},1,1900,"Non réalisé"]
[140,null,null,null,null,null,null,null,null,null,null,null,null,"","",null,0,{"$f":"COUNTIFS($L$7:L146,\"à éditer\")","v":1},1,1900,"Non réalisé"]
[141,null,null,null,null,null,null,null,null,null,null,null,null,"","",null,0,{"$f":"COUNTIFS($L$7:L147,\"à éditer\")","v":1},1,1900,"Non réalisé"]
[142,null,null,null,null,null,null,null,null,null,null,null,null,"",{"$f":"IFERROR(INDIRECT(\"'\"&$O$1&\"'!C\"&MATCH(B148,INDIRECT(\"'\"&$O$1&\"'!B:B\"),0)),\"\")","v":""},null,{"$f":"COUNTIFS(L:L,\"à éditer\",B:B,B148)","v":0},{"$f":"COUNTIFS($L$7:L148,\"à éditer\")","v":1},1,1900,"Non réalisé"]
[143,null,null,null,null,null,null,null,null,null,null,null,null,"","",null,0,{"$f":"COUNTIFS($L$7:L149,\"à éditer\")","v":1},1,1900,"Non réalisé"]
[144,null,null,null,null,null,null,null,null,null,null,null,null,{"$f":"IF(L150=\"à éditer\",IF(B150=B149,N149,$Q$5+IF(Q150=R150,Q150,R150)),\"\")","v":""},"",null,0,{"$f":"COUNTIFS($L$7:L150,\"à éditer\")","v":1},1,1900,"Non réalisé"]
[145,null,null,null,null,null,null,null,null,null,null,null,null,"","",null,0,{"$f":"COUNTIFS($L$7:L151,\"à éditer\")","v":1},1,1900,"Non réalisé"]
[146,null,null,null,null,null,null,null,null,null,null,null,null,"","",null,0,{"$f":"COUNTIFS($L$7:L152,\"à éditer\")","v":1},1,1900,"Non réalisé"]
[147,null,null,null,null,null,null,null,null,null,null,null,null,"","",null,0,{"$f":"COUNTIFS($L$7:L153,\"à éditer\")","v":1},1,1900,"Non réalisé"]
[148,null,null,null,null,null,null,null,null,null,null,null,null,"","",null,0,{"$f":"COUNTIFS($L$7:L154,\"à éditer\")","v":1},1,1900,"Non réalisé"]
[149,null,null,null,null,null,null,null,null,null,null,null,null,"","",null,0,{"$f":"COUNTIFS($L$7:L155,\"à éditer\")","v":1},1,1900,"Non réalisé"]
[150,null,null,null,null,null,null,null,null,null,null,null,null,"","",null,0,{"$f":"COUNTIFS($L$7:L156,\"à éditer\")","v":1},1,1900,"Non réalisé"]
[151,null,null,null,null,null,null,null,null,null,null,null,null,"","",null,0,{"$f":"COUNTIFS($L$7:L157,\"à éditer\")","v":1},1,1900,"Non réalisé"]
[152,null,null,null,null,null,null,null,null,null,null,null,null,"","",null,0,{"$f":"COUNTIFS($L$7:L158,\"à éditer\")","v":1},1,1900,"Non réalisé"]
[153,null,null,null,null,null,null,null,null,null,null,null,null,"","",null,0,{"$f":"COUNTIFS($L$7:L159,\"à éditer\")","v":1},1,1900,"Non réalisé"]
[154,null,null,null,null,null,null,null,null,null,null,null,null,"","",null,0,{"$f":"COUNTIFS($L$7:L160,\"à éditer\")","v":1},1,1900,"Non réalisé"]
[155,null,null,null,null,null,null,null,null,null,null,null,null,"","",null,0,{"$f":"COUNTIFS($L$7:L161,\"à éditer\")","v":1},1,1900,"Non réalisé"]
[156,null,null,null,null,null,null,null,null,null,null,null,null,"","",null,0,{"$f":"COUNTIFS($L$7:L162,\"à éditer\")","v":1},1,1900,"Non réalisé"]
[157,null,null,null,null,null,null,null,null,null,null,null,null,"","",null,0,{"$f":"COUNTIFS($L$7:L163,\"à éditer\")","v":1},1,1900,"Non réalisé"]
[158,null,null,null,null,null,null,null,null,null,null,null,null,"","",null,0,{"$f":"COUNTIFS($L$7:L164,\"à éditer\")","v":1},1,1900,"Non réalisé"]
[159,null,null,null,null,null,null,null,null,null,null,null,null,"","",null,0,{"$f":"COUNTIFS($L$7:L165,\"à éditer\")","v":1},1,1900,"Non réalisé"]
[160,null,null,null,null,null,null,null,null,null,null,null,null,"","",null,0,{"$f":"COUNTIFS($L$7:L166,\"à éditer\")","v":1},1,1900,"Non réalisé"]
[161,null,null,null,null,null,null,null,null,null,null,null,null,"","",null,0,{"$f":"COUNTIFS($L$7:L167,\"à éditer\")","v":1},1,1900,"Non réalisé"]
[162,null,null,null,null,null,null,null,null,null,null,null,null,"","",null,0,{"$f":"COUNTIFS($L$7:L168,\"à éditer\")","v":1},1,1900,"Non réalisé"]
[163,null,null,null,null,null,null,null,null,null,null,null,null,"","",null,0,{"$f":"COUNTIFS($L$7:L169,\"à éditer\")","v":1},1,1900,"Non réalisé"]
[164,null,null,null,null,null,null,null,null,null,null,null,null,"","",null,0,{"$f":"COUNTIFS($L$7:L170,\"à éditer\")","v":1},1,1900,"Non réalisé"]
[165,null,null,null,null,null,null,null,null,null,null,null,null,"","",null,0,{"$f":"COUNTIFS($L$7:L171,\"à éditer\")","v":1},1,1900,"Non réalisé"]
[166,null,null,null,null,null,null,null,null,null,null,null,null,"","",null,0,{"$f":"COUNTIFS($L$7:L172,\"à éditer\")","v":1},1,1900,"Non réalisé"]
[167,null,null,null,null,null,null,null,null,null,null,null,null,"","",null,0,{"$f":"COUNTIFS($L$7:L173,\"à éditer\")","v":1},1,1900,"Non réalisé"]
[168,null,null,null,null,null,null,null,null,null,null,null,null,"","",null,0,{"$f":"COUNTIFS($L$7:L174,\"à éditer\")","v":1},1,1900,"Non réalisé"]
[169,null,null,null,null,null,null,null,null,null,null,null,null,"","",null,0,{"$f":"COUNTIFS($L$7:L175,\"à éditer\")","v":1},1,1900,"Non réalisé"]
[170,null,null,null,null,null,null,null,null,null,null,null,null,"","",null,0,{"$f":"COUNTIFS($L$7:L176,\"à éditer\")","v":1},1,1900,"Non réalisé"]
[171,null,null,null,null,null,null,null,null,null,null,null,null,"","",null,0,{"$f":"COUNTIFS($L$7:L177,\"à éditer\")","v":1},1,1900,"Non réalisé"]
[172,null,null,null,null,null,null,null,null,null,null,null,null,"","",null,0,{"$f":"COUNTIFS($L$7:L178,\"à éditer\")","v":1},1,1900,"Non réalisé"]
[173,null,null,null,null,null,null,null,null,null,null,null,null,"","",null,0,{"$f":"COUNTIFS($L$7:L179,\"à éditer\")","v":1},1,1900,"Non réalisé"]
[174,null,null,null,null,null,null,null,null,null,null,null,null,"","",null,0,{"$f":"COUNTIFS($L$7:L180,\"à éditer\")","v":1},1,1900,"Non réalisé"]
[175,null,null,null,null,null,null,null,null,null,null,null,null,"","",null,0,{"$f":"COUNTIFS($L$7:L181,\"à éditer\")","v":1},1,1900,"Non réalisé"]
[176,null,null,null,null,null,null,null,null,null,null,null,null,"","",null,0,{"$f":"COUNTIFS($L$7:L182,\"à éditer\")","v":1},1,1900,"Non réalisé"]
[177,null,null,null,null,null,null,null,null,null,null,null,null,"","",null,0,{"$f":"COUNTIFS($L$7:L183,\"à éditer\")","v":1},1,1900,"Non réalisé"]
[178,null,null,null,null,null,null,null,null,null,null,null,null,"","",null,0,{"$f":"COUNTIFS($L$7:L184,\"à éditer\")","v":1},1,1900,"Non réalisé"]
[179,null,null,null,null,null,null,null,null,null,null,null,null,"","",null,0,{"$f":"COUNTIFS($L$7:L185,\"à éditer\")","v":1},1,1900,"Non réalisé"]
[180,null,null,null,null,null,null,null,null,null,null,null,null,"","",null,0,{"$f":"COUNTIFS($L$7:L186,\"à éditer\")","v":1},1,1900,"Non réalisé"]
[181,null,null,null,null,null,null,null,null,null,null,null,null,"","",null,0,{"$f":"COUNTIFS($L$7:L187,\"à éditer\")","v":1},1,1900,"Non réalisé"]
[182,null,null,null,null,null,null,null,null,null,null,null,null,"","",null,0,{"$f":"COUNTIFS($L$7:L188,\"à éditer\")","v":1},1,1900,"Non réalisé"]
[183,null,null,null,null,null,null,null,null,null,null,null,null,"","",null,0,{"$f":"COUNTIFS($L$7:L189,\"à éditer\")","v":1},1,1900,"Non réalisé"]
[184,null,null,null,null,null,null,null,null,null,null,null,null,"","",null,0,{"$f":"COUNTIFS($L$7:L190,\"à éditer\")","v":1},1,1900,"Non réalisé"]
[185,null,null,null,null,null,null,null,null,null,null,null,null,"","",null,0,{"$f":"COUNTIFS($L$7:L191,\"à éditer\")","v":1},1,1900,"Non réalisé"]
[186,null,null,null,null,null,null,null,null,null,null,null,null,"","",null,0,{"$f":"COUNTIFS($L$7:L192,\"à éditer\")","v":1},1,1900,"Non réalisé"]
[187,null,null,null,null,null,null,null,null,null,null,null,null,"","",null,0,{"$f":"COUNTIFS($L$7:L193,\"à éditer\")","v":1},1,1900,"Non réalisé"]
[188,null,null,null,null,null,null,null,null,null,null,null,null,"","",null,0,{"$f":"COUNTIFS($L$7:L194,\"à éditer\")","v":1},1,1900,"Non réalisé"]
[189,null,null,null,null,null,null,null,null,null,null,null,null,"","",null,0,{"$f":"COUNTIFS($L$7:L195,\"à éditer\")","v":1},1,1900,"Non réalisé"]
[190,null,null,null,null,null,null,null,null,null,null,null,null,"","",null,0,{"$f":"COUNTIFS($L$7:L196,\"à éditer\")","v":1},1,1900,"Non réalisé"]
[191,null,null,null,null,null,null,null,null,null,null,null,null,"","",null,0,{"$f":"COUNTIFS($L$7:L197,\"à éditer\")","v":1},1,1900,"Non réalisé"]
[192,null,null,null,null,null,null,null,null,null,null,null,null,"","",null,0,{"$f":"COUNTIFS($L$7:L198,\"à éditer\")","v":1},1,1900,"Non réalisé"]
[193,null,null,null,null,null,null,null,null,null,null,null,null,"","",null,0,{"$f":"COUNTIFS($L$7:L199,\"à éditer\")","v":1},1,1900,"Non réalisé"]
[{"$f":"A199+1","v":194},null,null,null,null,null,null,null,null,null,null,null,null,"","",null,0,{"$f":"COUNTIFS($L$7:L200,\"à éditer\")","v":1},{"$f":"IFERROR(MONTH(J200),\"\")","v":1},{"$f":"YEAR(J200)","v":1900},{"$f":"IF(OR(L200=\"définitif\",L200=\"à éditer\",L200=\"en cours de réalisation\"),\"Réalisé\",IF(OR(L200=\"projet annulé\",L200=\"\"),\"Non réalisé\",IF(L200=\"en attente\",\"En attente\",\"\")))","v":"Non réalisé"}]
[195,null,null,null,null,null,null,null,null,null,null,null,null,"","",null,0,{"$f":"COUNTIFS($L$7:L201,\"à éditer\")","v":1},1,1900,"Non réalisé"]
[196,null,null,null,null,null,null,null,null,null,null,null,null,"","",null,0,{"$f":"COUNTIFS($L$7:L202,\"à éditer\")","v":1},1,1900,"Non réalisé"]
[197,null,null,null,null,null,null,null,null,null,null,null,null,"","",null,0,{"$f":"COUNTIFS($L$7:L203,\"à éditer\")","v":1},1,1900,"Non réalisé"]
[198,null,null,null,null,null,null,null,null,null,null,null,null,"","",null,0,{"$f":"COUNTIFS($L$7:L204,\"à éditer\")","v":1},1,1900,"Non réalisé"]
[199,null,null,null,null,null,null,null,null,null,null,null,null,"","",null,0,{"$f":"COUNTIFS($L$7:L205,\"à éditer\")","v":1},1,1900,"Non réalisé"]
[200,null,null,null,null,null,null,null,null,null,null,null,null,"","",null,0,{"$f":"COUNTIFS($L$7:L206,\"à éditer\")","v":1},1,1900,"Non réalisé"]
[201,null,null,null,null,null,null,null,null,null,null,null,null,"","",null,0,{"$f":"COUNTIFS($L$7:L207,\"à éditer\")","v":1},1,1900,"Non réalisé"]
[202,null,null,null,null,null,null,null,null,null,null,null,null,"","",null,0,{"$f":"COUNTIFS($L$7:L208,\"à éditer\")","v":1},1,1900,"Non réalisé"]
[203,null,null,null,null,null,null,null,null,null,null,null,null,"","",null,0,{"$f":"COUNTIFS($L$7:L209,\"à éditer\")","v":1},1,1900,"Non réalisé"]
[204,null,null,null,null,null,null,null,null,null,null,null,null,"","",null,0,{"$f":"COUNTIFS($L$7:L210,\"à éditer\")","v":1},1,1900,"Non réalisé"]
[205,null,null,null,null,null,null,null,null,null,null,null,null,"","",null,0,{"$f":"COUNTIFS($L$7:L211,\"à éditer\")","v":1},1,1900,"Non réalisé"]
[206,null,null,null,null,null,null,null,null,null,null,null,null,"",{"$f":"IFERROR(INDIRECT(\"'\"&$O$1&\"'!C\"&MATCH(B212,INDIRECT(\"'\"&$O$1&\"'!B:B\"),0)),\"\")","v":""},null,{"$f":"COUNTIFS(L:L,\"à éditer\",B:B,B212)","v":0},{"$f":"COUNTIFS($L$7:L212,\"à éditer\")","v":1},1,1900,"Non réalisé"]
[207,null,null,null,null,null,null,null,null,null,null,null,null,"","",null,0,{"$f":"COUNTIFS($L$7:L213,\"à éditer\")","v":1},1,1900,"Non réalisé"]
[208,null,null,null,null,null,null,null,null,null,null,null,null,{"$f":"IF(L214=\"à éditer\",IF(B214=B213,N213,$Q$5+IF(Q214=R214,Q214,R214)),\"\")","v":""},"",null,0,{"$f":"COUNTIFS($L$7:L214,\"à éditer\")","v":1},1,1900,"Non réalisé"]
[209,null,null,null,null,null,null,null,null,null,null,null,null,"","",null,0,{"$f":"COUNTIFS($L$7:L215,\"à éditer\")","v":1},1,1900,"Non réalisé"]
[210,null,null,null,null,null,null,null,null,null,null,null,null,"","",null,0,{"$f":"COUNTIFS($L$7:L216,\"à éditer\")","v":1},1,1900,"Non réalisé"]
[211,null,null,null,null,null,null,null,null,null,null,null,null,"","",null,0,{"$f":"COUNTIFS($L$7:L217,\"à éditer\")","v":1},1,1900,"Non réalisé"]
[212,null,null,null,null,null,null,null,null,null,null,null,null,"","",null,0,{"$f":"COUNTIFS($L$7:L218,\"à éditer\")","v":1},1,1900,"Non réalisé"]
[213,null,null,null,null,null,null,null,null,null,null,null,null,"","",null,0,{"$f":"COUNTIFS($L$7:L219,\"à éditer\")","v":1},1,1900,"Non réalisé"]
[214,null,null,null,null,null,null,null,null,null,null,null,null,"","",null,0,{"$f":"COUNTIFS($L$7:L220,\"à éditer\")","v":1},1,1900,"Non réalisé"]
[215,null,null,null,null,null,null,null,null,null,null,null,null,"","",null,0,{"$f":"COUNTIFS($L$7:L221,\"à éditer\")","v":1},1,1900,"Non réalisé"]
[216,null,null,null,null,null,null,null,null,null,null,null,null,"","",null,0,{"$f":"COUNTIFS($L$7:L222,\"à éditer\")","v":1},1,1900,"Non réalisé"]
[217,null,null,null,null,null,null,null,null,null,null,null,null,"","",null,0,{"$f":"COUNTIFS($L$7:L223,\"à éditer\")","v":1},1,1900,"Non réalisé"]
[218,null,null,null,null,null,null,null,null,null,null,null,null,"","",null,0,{"$f":"COUNTIFS($L$7:L224,\"à éditer\")","v":1},1,1900,"Non réalisé"]
[219,null,null,null,null,null,null,null,null,null,null,null,null,"","",null,0,{"$f":"COUNTIFS($L$7:L225,\"à éditer\")","v":1},1,1900,"Non réalisé"]
[220,null,null,null,null,null,null,null,null,null,null,null,null,"","",null,0,{"$f":"COUNTIFS($L$7:L226,\"à éditer\")","v":1},1,1900,"Non réalisé"]
[221,null,null,null,null,null,null,null,null,null,null,null,null,"","",null,0,{"$f":"COUNTIFS($L$7:L227,\"à éditer\")","v":1},1,1900,"Non réalisé"]
[222,null,null,null,null,null,null,null,null,null,null,null,null,"","",null,0,{"$f":"COUNTIFS($L$7:L228,\"à éditer\")","v":1},1,1900,"Non réalisé"]
[223,null,null,null,null,null,null,null,null,null,null,null,null,"","",null,0,{"$f":"COUNTIFS($L$7:L229,\"à éditer\")","v":1},1,1900,"Non réalisé"]
[224,null,null,null,null,null,null,null,null,null,null,null,null,"","",null,0,{"$f":"COUNTIFS($L$7:L230,\"à éditer\")","v":1},1,1900,"Non réalisé"]
[225,null,null,null,null,null,null,null,null,null,null,null,null,"","",null,0,{"$f":"COUNTIFS($L$7:L231,\"à éditer\")","v":1},1,1900,"Non réalisé"]
[226,null,null,null,null,null,null,null,null,null,null,null,null,"","",null,0,{"$f":"COUNTIFS($L$7:L232,\"à éditer\")","v":1},1,1900,"Non réalisé"]
[227,null,null,null,null,null,null,null,null,null,null,null,null,"","",null,0,{"$f":"COUNTIFS($L$7:L233,\"à éditer\")","v":1},1,1900,"Non réalisé"]
[228,null,null,null,null,null,null,null,null,null,null,null,null,"","",null,0,{"$f":"COUNTIFS($L$7:L234,\"à éditer\")","v":1},1,1900,"Non réalisé"]
[229,null,null,null,null,null,null,null,null,null,null,null,null,"","",null,0,{"$f":"COUNTIFS($L$7:L235,\"à éditer\")","v":1},1,1900,"Non réalisé"]
[230,null,null,null,null,null,null,null,null,null,null,null,null,"","",null,0,{"$f":"COUNTIFS($L$7:L236,\"à éditer\")","v":1},1,1900,"Non réalisé"]
[231,null,null,null,null,null,null,null,null,null,null,null,null,"","",null,0,{"$f":"COUNTIFS($L$7:L237,\"à éditer\")","v":1},1,1900,"Non réalisé"]
[232,null,null,null,null,null,null,null,null,null,null,null,null,"","",null,0,{"$f":"COUNTIFS($L$7:L238,\"à éditer\")","v":1},1,1900,"Non réalisé"]
[233,null,null,null,null,null,null,null,null,null,null,null,null,"","",null,0,{"$f":"COUNTIFS($L$7:L239,\"à éditer\")","v":1},1,1900,"Non réalisé"]
[234,null,null,null,null,null,null,null,null,null,null,null,null,"","",null,0,{"$f":"COUNTIFS($L$7:L240,\"à éditer\")","v":1},1,1900,"Non réalisé"]
[235,null,null,null,null,null,null,null,null,null,null,null,null,"","",null,0,{"$f":"COUNTIFS($L$7:L241,\"à éditer\")","v":1},1,1900,"Non réalisé"]
[236,null,null,null,null,null,null,null,null,null,null,null,null,"","",null,0,{"$f":"COUNTIFS($L$7:L242,\"à éditer\")","v":1},1,1900,"Non réalisé"]
[237,null,null,null,null,null,null,null,null,null,null,null,null,"","",null,0,{"$f":"COUNTIFS($L$7:L243,\"à éditer\")","v":1},1,1900,"Non réalisé"]
[238,null,null,null,null,null,null,null,null,null,null,null,null,"","",null,0,{"$f":"COUNTIFS($L$7:L244,\"à éditer\")","v":1},1,1900,"Non réalisé"]
[239,null,null,null,null,null,null,null,null,null,null,null,null,"","",null,0,{"$f":"COUNTIFS($L$7:L245,\"à éditer\")","v":1},1,1900,"Non réalisé"]
[240,null,null,null,null,null,null,null,null,null,null,null,null,"","",null,0,{"$f":"COUNTIFS($L$7:L246,\"à éditer\")","v":1},1,1900,"Non réalisé"]
[241,null,null,null,null,null,null,null,null,null,null,null,null,"","",null,0,{"$f":"COUNTIFS($L$7:L247,\"à éditer\")","v":1},1,1900,"Non réalisé"]
[242,null,null,null,null,null,null,null,null,null,null,null,null,"","",null,0,{"$f":"COUNTIFS($L$7:L248,\"à éditer\")","v":1},1,1900,"Non réalisé"]
[243,null,null,null,null,null,null,null,null,null,null,null,null,"","",null,0,{"$f":"COUNTIFS($L$7:L249,\"à éditer\")","v":1},1,1900,"Non réalisé"]
[244,null,null,null,null,null,null,null,null,null,null,null,null,"","",null,0,{"$f":"COUNTIFS($L$7:L250,\"à éditer\")","v":1},1,1900,"Non réalisé"]
[245,null,null,null,null,null,null,null,null,null,null,null,null,"","",null,0,{"$f":"COUNTIFS($L$7:L251,\"à éditer\")","v":1},1,1900,"Non réalisé"]
[246,null,null,null,null,null,null,null,null,null,null,null,null,"","",null,0,{"$f":"COUNTIFS($L$7:L252,\"à éditer\")","v":1},1,1900,"Non réalisé"]
[247,null,null,null,null,null,null,null,null,null,null,null,null,"","",null,0,{"$f":"COUNTIFS($L$7:L253,\"à éditer\")","v":1},1,1900,"Non réalisé"]
[248,null,null,null,null,null,null,null,null,null,null,null,null,"","",null,0,{"$f":"COUNTIFS($L$7:L254,\"à éditer\")","v":1},1,1900,"Non réalisé"]
[249,null,null,null,null,null,null,null,null,null,null,null,null,"","",null,0,{"$f":"COUNTIFS($L$7:L255,\"à éditer\")","v":1},1,1900,"Non réalisé"]
[250,null,null,null,null,null,null,null,null,null,null,null,null,"","",null,0,{"$f":"COUNTIFS($L$7:L256,\"à éditer\")","v":1},1,1900,"Non réalisé"]
[251,null,null,null,null,null,null,null,null,null,null,null,null,"","",null,0,{"$f":"COUNTIFS($L$7:L257,\"à éditer\")","v":1},1,1900,"Non réalisé"]
[252,null,null,null,null,null,null,null,null,null,null,null,null,"","",null,0,{"$f":"COUNTIFS($L$7:L258,\"à éditer\")","v":1},1,1900,"Non réalisé"]
[253,null,null,null,null,null,null,null,null,null,null,null,null,"","",null,0,{"$f":"COUNTIFS($L$7:L259,\"à éditer\")","v":1},1,1900,"Non réalisé"]
[254,null,null,null,null,null,null,null,null,null,null,null,null,"","",null,0,{"$f":"COUNTIFS($L$7:L260,\"à éditer\")","v":1},1,1900,"Non réalisé"]
[255,null,null,null,null,null,null,null,null,null,null,null,null,"","",null,0,{"$f":"COUNTIFS($L$7:L261,\"à éditer\")","v":1},1,1900,"Non réalisé"]
[256,null,null,null,null,null,null,null,null,null,null,null,null,"","",null,0,{"$f":"COUNTIFS($L$7:L262,\"à éditer\")","v":1},1,1900,"Non réalisé"]
[257,null,null,null,null,null,null,null,null,null,null,null,null,"","",null,0,{"$f":"COUNTIFS($L$7:L263,\"à éditer\")","v":1},1,1900,"Non réalisé"]
[{"$f":"A263+1","v":258},null,null,null,null,null,null,null,null,null,null,null,null,"","",null,0,{"$f":"COUNTIFS($L$7:L264,\"à éditer\")","v":1},{"$f":"IFERROR(MONTH(J264),\"\")","v":1},{"$f":"YEAR(J264)","v":1900},{"$f":"IF(OR(L264=\"définitif\",L264=\"à éditer\",L264=\"en cours de réalisation\"),\"Réalisé\",IF(OR(L264=\"projet annulé\",L264=\"\"),\"Non réalisé\",IF(L264=\"en attente\",\"En attente\",\"\")))","v":"Non réalisé"}]
[259,null,null,null,null,null,null,null,null,null,null,null,null,"","",null,0,{"$f":"COUNTIFS($L$7:L265,\"à éditer\")","v":1},1,1900,"Non réalisé"]
[260,null,null,null,null,null,null,null,null,null,null,null,null,"","",null,0,{"$f":"COUNTIFS($L$7:L266,\"à éditer\")","v":1},1,1900,"Non réalisé"]
[261,null,null,null,null,null,null,null,null,null,null,null,null,"","",null,0,{"$f":"COUNTIFS($L$7:L267,\"à éditer\")","v":1},1,1900,"Non réalisé"]
[262,null,null,null,null,null,null,null,null,null,null,null,null,"","",null,0,{"$f":"COUNTIFS($L$7:L268,\"à éditer\")","v":1},1,1900,"Non réalisé"]
[263,null,null,null,null,null,null,null,null,null,null,null,null,"","",null,0,{"$f":"COUNTIFS($L$7:L269,\"à éditer\")","v":1},1,1900,"Non réalisé"]
[264,null,null,null,null,null,null,null,null,null,null,null,null,"","",null,0,{"$f":"COUNTIFS($L$7:L270,\"à éditer\")","v":1},1,1900,"Non réalisé"]
[265,null,null,null,null,null,null,null,null,null,null,null,null,"","",null,0,{"$f":"COUNTIFS($L$7:L271,\"à éditer\")","v":1},1,1900,"Non réalisé"]
[266,null,null,null,null,null,null,null,null,null,null,null,null,"","",null,0,{"$f":"COUNTIFS($L$7:L272,\"à éditer\")","v":1},1,1900,"Non réalisé"]
[267,null,null,null,null,null,null,null,null,null,null,null,null,"","",null,0,{"$f":"COUNTIFS($L$7:L273,\"à éditer\")","v":1},1,1900,"Non réalisé"]
[268,null,null,null,null,null,null,null,null,null,null,null,null,"","",null,0,{"$f":"COUNTIFS($L$7:L274,\"à éditer\")","v":1},1,1900,"Non réalisé"]
[269,null,null,null,null,null,null,null,null,null,null,null,null,"","",null,0,{"$f":"COUNTIFS($L$7:L275,\"à éditer\")","v":1},1,1900,"Non réalisé"]
[270,null,null,null,null,null,null,null,null,null,null,null,null,"",{"$f":"IFERROR(INDIRECT(\"'\"&$O$1&\"'!C\"&MATCH(B276,INDIRECT(\"'\"&$O$1&\"'!B:B\"),0)),\"\")","v":""},null,{"$f":"COUNTIFS(L:L,\"à éditer\",B:B,B276)","v":0},{"$f":"COUNTIFS($L$7:L276,\"à éditer\")","v":1},1,1900,"Non réalisé"]
[271,null,null,null,null,null,null,null,null,null,null,null,null,"","",null,0,{"$f":"COUNTIFS($L$7:L277,\"à éditer\")","v":1},1,1900,"Non réalisé"]
[272,null,null,null,null,null,null,null,null,null,null,null,null,{"$f":"IF(L278=\"à éditer\",IF(B278=B277,N277,$Q$5+IF(Q278=R278,Q278,R278)),\"\")","v":""},"",null,0,{"$f":"COUNTIFS($L$7:L278,\"à éditer\")","v":1},1,1900,"Non réalisé"]
[273,null,null,null,null,null,null,null,null,null,null,null,null,"","",null,0,{"$f":"COUNTIFS($L$7:L279,\"à éditer\")","v":1},1,1900,"Non réalisé"]
[274,null,null,null,null,null,null,null,null,null,null,null,null,"","",null,0,{"$f":"COUNTIFS($L$7:L280,\"à éditer\")","v":1},1,1900,"Non réalisé"]
[275,null,null,null,null,null,null,null,null,null,null,null,null,"","",null,0,{"$f":"COUNTIFS($L$7:L281,\"à éditer\")","v":1},1,1900,"Non réalisé"]
[276,null,null,null,null,null,null,null,null,null,null,null,null,"","",null,0,{"$f":"COUNTIFS($L$7:L282,\"à éditer\")","v":1},1,1900,"Non réalisé"]
[277,null,null,null,null,null,null,null,null,null,null,null,null,"","",null,0,{"$f":"COUNTIFS($L$7:L283,\"à éditer\")","v":1},1,1900,"Non réalisé"]
[278,null,null,null,null,null,null,null,null,null,null,null,null,"","",null,0,{"$f":"COUNTIFS($L$7:L284,\"à éditer\")","v":1},1,1900,"Non réalisé"]
[279,null,null,null,null,null,null,null,null,null,null,null,null,"","",null,0,{"$f":"COUNTIFS($L$7:L285,\"à éditer\")","v":1},1,1900,"Non réalisé"]
[280,null,null,null,null,null,null,null,null,null,null,null,null,"","",null,0,{"$f":"COUNTIFS($L$7:L286,\"à éditer\")","v":1},1,1900,"Non réalisé"]
[281,null,null,null,null,null,null,null,null,null,null,null,null,"","",null,0,{"$f":"COUNTIFS($L$7:L287,\"à éditer\")","v":1},1,1900,"Non réalisé"]
[282,null,null,null,null,null,null,null,null,null,null,null,null,"","",null,0,{"$f":"COUNTIFS($L$7:L288,\"à éditer\")","v":1},1,1900,"Non réalisé"]
[283,null,null,null,null,null,null,null,null,null,null,null,null,"","",null,0,{"$f":"COUNTIFS($L$7:L289,\"à éditer\")","v":1},1,1900,"Non réalisé"]
[284,null,null,null,null,null,null,null,null,null,null,null,null,"","",null,0,{"$f":"COUNTIFS($L$7:L290,\"à éditer\")","v":1},1,1900,"Non réalisé"]
[285,null,null,null,null,null,null,null,null,null,null,null,null,"","",null,0,{"$f":"COUNTIFS($L$7:L291,\"à éditer\")","v":1},1,1900,"Non réalisé"]
[286,null,null,null,null,null,null,null,null,null,null,null,null,"","",null,0,{"$f":"COUNTIFS($L$7:L292,\"à éditer\")","v":1},1,1900,"Non réalisé"]
[287,null,null,null,null,null,null,null,null,null,null,null,null,"","",null,0,{"$f":"COUNTIFS($L$7:L293,\"à éditer\")","v":1},1,1900,"Non réalisé"]
[288,null,null,null,null,null,null,null,null,null,null,null,null,"","",null,0,{"$f":"COUNTIFS($L$7:L294,\"à éditer\")","v":1},1,1900,"Non réalisé"]
[289,null,null,null,null,null,null,null,null,null,null,null,null,"","",null,0,{"$f":"COUNTIFS($L$7:L295,\"à éditer\")","v":1},1,1900,"Non réalisé"]
[290,null,null,null,null,null,null,null,null,null,null,null,null,"","",null,0,{"$f":"COUNTIFS($L$7:L296,\"à éditer\")","v":1},1,1900,"Non réalisé"]
[291,null,null,null,null,null,null,null,null,null,null,null,null,"","",null,0,{"$f":"COUNTIFS($L$7:L297,\"à éditer\")","v":1},1,1900,"Non réalisé"]
[292,null,null,null,null,null,null,null,null,null,null,null,null,"","",null,0,{"$f":"COUNTIFS($L$7:L298,\"à éditer\")","v":1},1,1900,"Non réalisé"]
[293,null,null,null,null,null,null,null,null,null,null,null,null,"","",null,0,{"$f":"COUNTIFS($L$7:L299,\"à éditer\")","v":1},1,1900,"Non réalisé"]
[294,null,null,null,null,null,null,null,null,null,null,null,null,"","",null,0,{"$f":"COUNTIFS($L$7:L300,\"à éditer\")","v":1},1,1900,"Non réalisé"]
[295,null,null,null,null,null,null,null,null,null,null,null,null,"","",null,0,{"$f":"COUNTIFS($L$7:L301,\"à éditer\")","v":1},1,1900,"Non réalisé"]
[296,null,null,null,null,null,null,null,null,null,null,null,null,"","",null,0,{"$f":"COUNTIFS($L$7:L302,\"à éditer\")","v":1},1,1900,"Non réalisé"]
[297,null,null,null,null,null,null,null,null,null,null,null,null,"","",null,0,{"$f":"COUNTIFS($L$7:L303,\"à éditer\")","v":1},1,1900,"Non réalisé"]
[298,null,null,null,null,null,null,null,null,null,null,null,null,"","",null,0,{"$f":"COUNTIFS($L$7:L304,\"à éditer\")","v":1},1,1900,"Non réalisé"]
[299,null,null,null,null,null,null,null,null,null,null,null,null,"","",null,0,{"$f":"COUNTIFS($L$7:L305,\"à éditer\")","v":1},1,1900,"Non réalisé"]
[300,null,null,null,null,null,null,null,null,null,null,null,null,"","",null,0,{"$f":"COUNTIFS($L$7:L306,\"à éditer\")","v":1},1,1900,"Non réalisé"]
[301,null,null,null,null,null,null,null,null,null,null,null,null,"","",null,0,{"$f":"COUNTIFS($L$7:L307,\"à éditer\")","v":1},1,1900,"Non réalisé"]
[302,null,null,null,null,null,null,null,null,null,null,null,null,"","",null,0,{"$f":"COUNTIFS($L$7:L308,\"à éditer\")","v":1},1,1900,"Non réalisé"]
[303,null,null,null,null,null,null,null,null,null,null,null,null,"","",null,0,{"$f":"COUNTIFS($L$7:L309,\"à éditer\")","v":1},1,1900,"Non réalisé"]
[304,null,null,null,null,null,null,null,null,null,null,null,null,"","",null,0,{"$f":"COUNTIFS($L$7:L310,\"à éditer\")","v":1},1,1900,"Non réalisé"]
[305,null,null,null,null,null,null,null,null,null,null,null,null,"","",null,0,{"$f":"COUNTIFS($L$7:L311,\"à éditer\")","v":1},1,1900,"Non réalisé"]
[306,null,null,null,null,null,null,null,null,null,null,null,null,"","",null,0,{"$f":"COUNTIFS($L$7:L312,\"à éditer\")","v":1},1,1900,"Non réalisé"]
[307,null,null,null,null,null,null,null,null,null,null,null,null,"","",null,0,{"$f":"COUNTIFS($L$7:L313,\"à éditer\")","v":1},1,1900,"Non réalisé"]
[308,null,null,null,null,null,null,null,null,null,null,null,null,"","",null,0,{"$f":"COUNTIFS($L$7:L314,\"à éditer\")","v":1},1,1900,"Non réalisé"]
[309,null,null,null,null,null,null,null,null,null,null,null,null,"","",null,0,{"$f":"COUNTIFS($L$7:L315,\"à éditer\")","v":1},1,1900,"Non réalisé"]
[310,null,null,null,null,null,null,null,null,null,null,null,null,"","",null,0,{"$f":"COUNTIFS($L$7:L316,\"à éditer\")","v":1},1,1900,"Non réalisé"]
[311,null,null,null,null,null,null,null,null,null,null,null,null,"","",null,0,{"$f":"COUNTIFS($L$7:L317,\"à éditer\")","v":1},1,1900,"Non réalisé"]
[312,null,null,null,null,null,null,null,null,null,null,null,null,"","",null,0,{"$f":"COUNTIFS($L$7:L318,\"à éditer\")","v":1},1,1900,"Non réalisé"]
[313,null,null,null,null,null,null,null,null,null,null,null,null,"","",null,0,{"$f":"COUNTIFS($L$7:L319,\"à éditer\")","v":1},1,1900,"Non réalisé"]
[314,null,null,null,null,null,null,null,null,null,null,null,null,"","",null,0,{"$f":"COUNTIFS($L$7:L320,\"à éditer\")","v":1},1,1900,"Non réalisé"]
[315,null,null,null,null,null,null,null,null,null,null,null,null,"","",null,0,{"$f":"COUNTIFS($L$7:L321,\"à éditer\")","v":1},1,1900,"Non réalisé"]
[316,null,null,null,null,null,null,null,null,null,null,null,null,"","",null,0,{"$f":"COUNTIFS($L$7:L322,\"à éditer\")","v":1},1,1900,"Non réalisé"]
[317,null,null,null,null,null,null,null,null,null,null,null,null,"","",null,0,{"$f":"COUNTIFS($L$7:L323,\"à éditer\")","v":1},1,1900,"Non réalisé"]
[318,null,null,null,null,null,null,null,null,null,null,null,null,"","",null,0,{"$f":"COUNTIFS($L$7:L324,\"à éditer\")","v":1},1,1900,"Non réalisé"]
[319,null,null,null,null,null,null,null,null,null,null,null,null,"","",null,0,{"$f":"COUNTIFS($L$7:L325,\"à éditer\")","v":1},1,1900,"Non réalisé"]
[320,null,null,null,null,null,null,null,null,null,null,null,null,"","",null,0,{"$f":"COUNTIFS($L$7:L326,\"à éditer\")","v":1},1,1900,"Non réalisé"]
[321,null,null,null,null,null,null,null,null,null,null,null,null,"","",null,0,{"$f":"COUNTIFS($L$7:L327,\"à éditer\")","v":1},1,1900,"Non réalisé"]
[{"$f":"A327+1","v":322},null,null,null,null,null,null,null,null,null,null,null,null,"","",null,0,{"$f":"COUNTIFS($L$7:L328,\"à éditer\")","v":1},{"$f":"IFERROR(MONTH(J328),\"\")","v":1},{"$f":"YEAR(J328)","v":1900},{"$f":"IF(OR(L328=\"définitif\",L328=\"à éditer\",L328=\"en cours de réalisation\"),\"Réalisé\",IF(OR(L328=\"projet annulé\",L328=\"\"),\"Non réalisé\",IF(L328=\"en attente\",\"En attente\",\"\")))","v":"Non réalisé"}]
[323,null,null,null,null,null,null,null,null,null,null,null,null,"","",null,0,{"$f":"COUNTIFS($L$7:L329,\"à éditer\")","v":1},1,1900,"Non réalisé"]
[324,null,null,null,null,null,null,null,null,null,null,null,null,"","",null,0,{"$f":"COUNTIFS($L$7:L330,\"à éditer\")","v":1},1,1900,"Non réalisé"]
[325,null,null,null,null,null,null,null,null,null,null,null,null,"","",null,0,{"$f":"COUNTIFS($L$7:L331,\"à éditer\")","v":1},1,1900,"Non réalisé"]
[326,null,null,null,null,null,null,null,null,null,null,null,null,"","",null,0,{"$f":"COUNTIFS($L$7:L332,\"à éditer\")","v":1},1,1900,"Non réalisé"]
[327,null,null,null,null,null,null,null,null,null,null,null,null,"","",null,0,{"$f":"COUNTIFS($L$7:L333,\"à éditer\")","v":1},1,1900,"Non réalisé"]
[328,null,null,null,null,null,null,null,null,null,null,null,null,"","",null,0,{"$f":"COUNTIFS($L$7:L334,\"à éditer\")","v":1},1,1900,"Non réalisé"]
[329,null,null,null,null,null,null,null,null,null,null,null,null,"","",null,0,{"$f":"COUNTIFS($L$7:L335,\"à éditer\")","v":1},1,1900,"Non réalisé"]
[330,null,null,null,null,null,null,null,null,null,null,null,null,"","",null,0,{"$f":"COUNTIFS($L$7:L336,\"à éditer\")","v":1},1,1900,"Non réalisé"]
[331,null,null,null,null,null,null,null,null,null,null,null,null,"","",null,0,{"$f":"COUNTIFS($L$7:L337,\"à éditer\")","v":1},1,1900,"Non réalisé"]
[332,null,null,null,null,null,null,null,null,null,null,null,null,"","",null,0,{"$f":"COUNTIFS($L$7:L338,\"à éditer\")","v":1},1,1900,"Non réalisé"]
[333,null,null,null,null,null,null,null,null,null,null,null,null,"","",null,0,{"$f":"COUNTIFS($L$7:L339,\"à éditer\")","v":1},1,1900,"Non réalisé"]
[334,null,null,null,null,null,null,null,null,null,null,null,null,"",{"$f":"IFERROR(INDIRECT(\"'\"&$O$1&\"'!C\"&MATCH(B340,INDIRECT(\"'\"&$O$1&\"'!B:B\"),0)),\"\")","v":""},null,{"$f":"COUNTIFS(L:L,\"à éditer\",B:B,B340)","v":0},{"$f":"COUNTIFS($L$7:L340,\"à éditer\")","v":1},1,1900,"Non réalisé"]
[335,null,null,null,null,null,null,null,null,null,null,null,null,"","",null,0,{"$f":"COUNTIFS($L$7:L341,\"à éditer\")","v":1},1,1900,"Non réalisé"]
[336,null,null,null,null,null,null,null,null,null,null,null,null,{"$f":"IF(L342=\"à éditer\",IF(B342=B341,N341,$Q$5+IF(Q342=R342,Q342,R342)),\"\")","v":""},"",null,0,{"$f":"COUNTIFS($L$7:L342,\"à éditer\")","v":1},1,1900,"Non réalisé"]
[337,null,null,null,null,null,null,null,null,null,null,null,null,"","",null,0,{"$f":"COUNTIFS($L$7:L343,\"à éditer\")","v":1},1,1900,"Non réalisé"]
[338,null,null,null,null,null,null,null,null,null,null,null,null,"","",null,0,{"$f":"COUNTIFS($L$7:L344,\"à éditer\")","v":1},1,1900,"Non réalisé"]
[339,null,null,null,null,null,null,null,null,null,null,null,null,"","",null,0,{"$f":"COUNTIFS($L$7:L345,\"à éditer\")","v":1},1,1900,"Non réalisé"]
[340,null,null,null,null,null,null,null,null,null,null,null,null,"","",null,0,{"$f":"COUNTIFS($L$7:L346,\"à éditer\")","v":1},1,1900,"Non réalisé"]
[341,null,null,null,null,null,null,null,null,null,null,null,null,"","",null,0,{"$f":"COUNTIFS($L$7:L347,\"à éditer\")","v":1},1,1900,"Non réalisé"]
[342,null,null,null,null,null,null,null,null,null,null,null,null,"","",null,0,{"$f":"COUNTIFS($L$7:L348,\"à éditer\")","v":1},1,1900,"Non réalisé"]
[343,null,null,null,null,null,null,null,null,null,null,null,null,"","",null,0,{"$f":"COUNTIFS($L$7:L349,\"à éditer\")","v":1},1,1900,"Non réalisé"]
[344,null,null,null,null,null,null,null,null,null,null,null,null,"","",null,0,{"$f":"COUNTIFS($L$7:L350,\"à éditer\")","v":1},1,1900,"Non réalisé"]
[345,null,null,null,null,null,null,null,null,null,null,null,null,"","",null,0,{"$f":"COUNTIFS($L$7:L351,\"à éditer\")","v":1},1,1900,"Non réalisé"]
[346,null,null,null,null,null,null,null,null,null,null,null,null,"","",null,0,{"$f":"COUNTIFS($L$7:L352,\"à éditer\")","v":1},1,1900,"Non réalisé"]
[347,null,null,null,null,null,null,null,null,null,null,null,null,"","",null,0,{"$f":"COUNTIFS($L$7:L353,\"à éditer\")","v":1},1,1900,"Non réalisé"]
[348,null,null,null,null,null,null,null,null,null,null,null,null,"","",null,0,{"$f":"COUNTIFS($L$7:L354,\"à éditer\")","v":1},1,1900,"Non réalisé"]
[349,null,null,null,null,null,null,null,null,null,null,null,null,"","",null,0,{"$f":"COUNTIFS($L$7:L355,\"à éditer\")","v":1},1,1900,"Non réalisé"]
[350,null,null,null,null,null,null,null,null,null,null,null,null,"","",null,0,{"$f":"COUNTIFS($L$7:L356,\"à éditer\")","v":1},1,1900,"Non réalisé"]
[351,null,null,null,null,null,null,null,null,null,null,null,null,"","",null,0,{"$f":"COUNTIFS($L$7:L357,\"à éditer\")","v":1},1,1900,"Non réalisé"]
[352,null,null,null,null,null,null,null,null,null,null,null,null,"","",null,0,{"$f":"COUNTIFS($L$7:L358,\"à éditer\")","v":1},1,1900,"Non réalisé"]
[353,null,null,null,null,null,null,null,null,null,null,null,null,"","",null,0,{"$f":"COUNTIFS($L$7:L359,\"à éditer\")","v":1},1,1900,"Non réalisé"]
[354,null,null,null,null,null,null,null,null,null,null,null,null,"","",null,0,{"$f":"COUNTIFS($L$7:L360,\"à éditer\")","v":1},1,1900,"Non réalisé"]
[355,null,null,null,null,null,null,null,null,null,null,null,null,"","",null,0,{"$f":"COUNTIFS($L$7:L361,\"à éditer\")","v":1},1,1900,"Non réalisé"]
[356,null,null,null,null,null,null,null,null,null,null,null,null,"","",null,0,{"$f":"COUNTIFS($L$7:L362,\"à éditer\")","v":1},1,1900,"Non réalisé"]
[357,null,null,null,null,null,null,null,null,null,null,null,null,"","",null,0,{"$f":"COUNTIFS($L$7:L363,\"à éditer\")","v":1},1,1900,"Non réalisé"]
[358,null,null,null,null,null,null,null,null,null,null,null,null,"","",null,0,{"$f":"COUNTIFS($L$7:L364,\"à éditer\")","v":1},1,1900,"Non réalisé"]
[359,null,null,null,null,null,null,null,null,null,null,null,null,"","",null,0,{"$f":"COUNTIFS($L$7:L365,\"à éditer\")","v":1},1,1900,"Non réalisé"]
[360,null,null,null,null,null,null,null,null,null,null,null,null,"","",null,0,{"$f":"COUNTIFS($L$7:L366,\"à éditer\")","v":1},1,1900,"Non réalisé"]
[361,null,null,null,null,null,null,null,null,null,null,null,null,"","",null,0,{"$f":"COUNTIFS($L$7:L367,\"à éditer\")","v":1},1,1900,"Non réalisé"]
[362,null,null,null,null,null,null,null,null,null,null,null,null,"","",null,0,{"$f":"COUNTIFS($L$7:L368,\"à éditer\")","v":1},1,1900,"Non réalisé"]
[363,null,null,null,null,null,null,null,null,null,null,null,null,"","",null,0,{"$f":"COUNTIFS($L$7:L369,\"à éditer\")","v":1},1,1900,"Non réalisé"]
[364,null,null,null,null,null,null,null,null,null,null,null,null,"","",null,0,{"$f":"COUNTIFS($L$7:L370,\"à éditer\")","v":1},1,1900,"Non réalisé"]
[365,null,null,null,null,null,null,null,null,null,null,null,null,"","",null,0,{"$f":"COUNTIFS($L$7:L371,\"à éditer\")","v":1},1,1900,"Non réalisé"]
[366,null,null,null,null,null,null,null,null,null,null,null,null,"","",null,0,{"$f":"COUNTIFS($L$7:L372,\"à éditer\")","v":1},1,1900,"Non réalisé"]
[367,null,null,null,null,null,null,null,null,null,null,null,null,"","",null,0,{"$f":"COUNTIFS($L$7:L373,\"à éditer\")","v":1},1,1900,"Non réalisé"]
[368,null,null,null,null,null,null,null,null,null,null,null,null,"","",null,0,{"$f":"COUNTIFS($L$7:L374,\"à éditer\")","v":1},1,1900,"Non réalisé"]
[369,null,null,null,null,null,null,null,null,null,null,null,null,"","",null,0,{"$f":"COUNTIFS($L$7:L375,\"à éditer\")","v":1},1,1900,"Non réalisé"]
[370,null,null,null,null,null,null,null,null,null,null,null,null,"","",null,0,{"$f":"COUNTIFS($L$7:L376,\"à éditer\")","v":1},1,1900,"Non réalisé"]
[371,null,null,null,null,null,null,null,null,null,null,null,null,"","",null,0,{"$f":"COUNTIFS($L$7:L377,\"à éditer\")","v":1},1,1900,"Non réalisé"]
[372,null,null,null,null,null,null,null,null,null,null,null,null,"","",null,0,{"$f":"COUNTIFS($L$7:L378,\"à éditer\")","v":1},1,1900,"Non réalisé"]
[373,null,null,null,null,null,null,null,null,null,null,null,null,"","",null,0,{"$f":"COUNTIFS($L$7:L379,\"à éditer\")","v":1},1,1900,"Non réalisé"]
[374,null,null,null,null,null,null,null,null,null,null,null,null,"","",null,0,{"$f":"COUNTIFS($L$7:L380,\"à éditer\")","v":1},1,1900,"Non réalisé"]
[375,null,null,null,null,null,null,null,null,null,null,null,null,"","",null,0,{"$f":"COUNTIFS($L$7:L381,\"à éditer\")","v":1},1,1900,"Non réalisé"]
[376,null,null,null,null,null,null,null,null,null,null,null,null,"","",null,0,{"$f":"COUNTIFS($L$7:L382,\"à éditer\")","v":1},1,1900,"Non réalisé"]
[377,null,null,null,null,null,null,null,null,null,null,null,null,"","",null,0,{"$f":"COUNTIFS($L$7:L383,\"à éditer\")","v":1},1,1900,"Non réalisé"]
[378,null,null,null,null,null,null,null,null,null,null,null,null,"","",null,0,{"$f":"COUNTIFS($L$7:L384,\"à éditer\")","v":1},1,1900,"Non réalisé"]
[379,null,null,null,null,null,null,null,null,null,null,null,null,"","",null,0,{"$f":"COUNTIFS($L$7:L385,\"à éditer\")","v":1},1,1900,"Non réalisé"]
[380,null,null,null,null,null,null,null,null,null,null,null,null,"","",null,0,{"$f":"COUNTIFS($L$7:L386,\"à éditer\")","v":1},1,1900,"Non réalisé"]
[381,null,null,null,null,null,null,null,null,null,null,null,null,"","",null,0,{"$f":"COUNTIFS($L$7:L387,\"à éditer\")","v":1},1,1900,"Non réalisé"]
[382,null,null,null,null,null,null,null,null,null,null,null,null,"","",null,0,{"$f":"COUNTIFS($L$7:L388,\"à éditer\")","v":1},1,1900,"Non réalisé"]
[383,null,null,null,null,null,null,null,null,null,null,null,null,"","",null,0,{"$f":"COUNTIFS($L$7:L389,\"à éditer\")","v":1},1,1900,"Non réalisé"]
[384,null,null,null,null,null,null,null,null,null,null,null,null,"","",null,0,{"$f":"COUNTIFS($L$7:L390,\"à éditer\")","v":1},1,1900,"Non réalisé"]
[385,null,null,null,null,null,null,null,null,null,null,null,null,"","",null,0,{"$f":"COUNTIFS($L$7:L391,\"à éditer\")","v":1},1,1900,"Non réalisé"]
[{"$f":"A391+1","v":386},null,null,null,null,null,null,null,null,null,null,null,null,"","",null,0,{"$f":"COUNTIFS($L$7:L392,\"à éditer\")","v":1},{"$f":"IFERROR(MONTH(J392),\"\")","v":1},{"$f":"YEAR(J392)","v":1900},{"$f":"IF(OR(L392=\"définitif\",L392=\"à éditer\",L392=\"en cours de réalisation\"),\"Réalisé\",IF(OR(L392=\"projet annulé\",L392=\"\"),\"Non réalisé\",IF(L392=\"en attente\",\"En attente\",\"\")))","v":"Non réalisé"}]
[387,null,null,null,null,null,null,null,null,null,null,null,null,"","",null,0,{"$f":"COUNTIFS($L$7:L393,\"à éditer\")","v":1},1,1900,"Non réalisé"]
[388,null,null,null,null,null,null,null,null,null,null,null,null,"","",null,0,{"$f":"COUNTIFS($L$7:L394,\"à éditer\")","v":1},1,1900,"Non réalisé"]
[389,null,null,null,null,null,null,null,null,null,null,null,null,"","",null,0,{"$f":"COUNTIFS($L$7:L395,\"à éditer\")","v":1},1,1900,"Non réalisé"]
[390,null,null,null,null,null,null,null,null,null,null,null,null,"","",null,0,{"$f":"COUNTIFS($L$7:L396,\"à éditer\")","v":1},1,1900,"Non réalisé"]
[391,null,null,null,null,null,null,null,null,null,null,null,null,"","",null,0,{"$f":"COUNTIFS($L$7:L397,\"à éditer\")","v":1},1,1900,"Non réalisé"]
[392,null,null,null,null,null,null,null,null,null,null,null,null,"","",null,0,{"$f":"COUNTIFS($L$7:L398,\"à éditer\")","v":1},1,1900,"Non réalisé"]
[393,null,null,null,null,null,null,null,null,null,null,null,null,"","",null,0,{"$f":"COUNTIFS($L$7:L399,\"à éditer\")","v":1},1,1900,"Non réalisé"]
[394,null,null,null,null,null,null,null,null,null,null,null,null,"","",null,0,{"$f":"COUNTIFS($L$7:L400,\"à éditer\")","v":1},1,1900,"Non réalisé"]
[395,null,null,null,null,null,null,null,null,null,null,null,null,"","",null,0,{"$f":"COUNTIFS($L$7:L401,\"à éditer\")","v":1},1,1900,"Non réalisé"]
[396,null,null,null,null,null,null,null,null,null,null,null,null,"","",null,0,{"$f":"COUNTIFS($L$7:L402,\"à éditer\")","v":1},1,1900,"Non réalisé"]
[397,null,null,null,null,null,null,null,null,null,null,null,null,"","",null,0,{"$f":"COUNTIFS($L$7:L403,\"à éditer\")","v":1},1,1900,"Non réalisé"]
[398,null,null,null,null,null,null,null,null,null,null,null,null,"",{"$f":"IFERROR(INDIRECT(\"'\"&$O$1&\"'!C\"&MATCH(B404,INDIRECT(\"'\"&$O$1&\"'!B:B\"),0)),\"\")","v":""},null,{"$f":"COUNTIFS(L:L,\"à éditer\",B:B,B404)","v":0},{"$f":"COUNTIFS($L$7:L404,\"à éditer\")","v":1},1,1900,"Non réalisé"]
[399,null,null,null,null,null,null,null,null,null,null,null,null,"","",null,0,{"$f":"COUNTIFS($L$7:L405,\"à éditer\")","v":1},1,1900,"Non réalisé"]
[400,null,null,null,null,null,null,null,null,null,null,null,null,{"$f":"IF(L406=\"à éditer\",IF(B406=B405,N405,$Q$5+IF(Q406=R406,Q406,R406)),\"\")","v":""},"",null,0,{"$f":"COUNTIFS($L$7:L406,\"à éditer\")","v":1},1,1900,"Non réalisé"]
[401,null,null,null,null,null,null,null,null,null,null,null,null,"","",null,0,{"$f":"COUNTIFS($L$7:L407,\"à éditer\")","v":1},1,1900,"Non réalisé"]
[402,null,null,null,null,null,null,null,null,null,null,null,null,"","",null,0,{"$f":"COUNTIFS($L$7:L408,\"à éditer\")","v":1},1,1900,"Non réalisé"]
[403,null,null,null,null,null,null,null,null,null,null,null,null,"","",null,0,{"$f":"COUNTIFS($L$7:L409,\"à éditer\")","v":1},1,1900,"Non réalisé"]
[404,null,null,null,null,null,null,null,null,null,null,null,null,"","",null,0,{"$f":"COUNTIFS($L$7:L410,\"à éditer\")","v":1},1,1900,"Non réalisé"]
[405,null,null,null,null,null,null,null,null,null,null,null,null,"","",null,0,{"$f":"COUNTIFS($L$7:L411,\"à éditer\")","v":1},1,1900,"Non réalisé"]
[406,null,null,null,null,null,null,null,null,null,null,null,null,"","",null,0,{"$f":"COUNTIFS($L$7:L412,\"à éditer\")","v":1},1,1900,"Non réalisé"]
[407,null,null,null,null,null,null,null,null,null,null,null,null,"","",null,0,{"$f":"COUNTIFS($L$7:L413,\"à éditer\")","v":1},1,1900,"Non réalisé"]
[408,null,null,null,null,null,null,null,null,null,null,null,null,"","",null,0,{"$f":"COUNTIFS($L$7:L414,\"à éditer\")","v":1},1,1900,"Non réalisé"]
[409,null,null,null,null,null,null,null,null,null,null,null,null,"","",null,0,{"$f":"COUNTIFS($L$7:L415,\"à éditer\")","v":1},1,1900,"Non réalisé"]
[410,null,null,null,null,null,null,null,null,null,null,null,null,"","",null,0,{"$f":"COUNTIFS($L$7:L416,\"à éditer\")","v":1},1,1900,"Non réalisé"]
[411,null,null,null,null,null,null,null,null,null,null,null,null,"","",null,0,{"$f":"COUNTIFS($L$7:L417,\"à éditer\")","v":1},1,1900,"Non réalisé"]
[412,null,null,null,null,null,null,null,null,null,null,null,null,"","",null,0,{"$f":"COUNTIFS($L$7:L418,\"à éditer\")","v":1},1,1900,"Non réalisé"]
[413,null,null,null,null,null,null,null,null,null,null,null,null,"","",null,0,{"$f":"COUNTIFS($L$7:L419,\"à éditer\")","v":1},1,1900,"Non réalisé"]
[414,null,null,null,null,null,null,null,null,null,null,null,null,"","",null,0,{"$f":"COUNTIFS($L$7:L420,\"à éditer\")","v":1},1,1900,"Non réalisé"]
[415,null,null,null,null,null,null,null,null,null,null,null,null,"","",null,0,{"$f":"COUNTIFS($L$7:L421,\"à éditer\")","v":1},1,1900,"Non réalisé"]
[416,null,null,null,null,null,null,null,null,null,null,null,null,"","",null,0,{"$f":"COUNTIFS($L$7:L422,\"à éditer\")","v":1},1,1900,"Non réalisé"]
[417,null,null,null,null,null,null,null,null,null,null,null,null,"","",null,0,{"$f":"COUNTIFS($L$7:L423,\"à éditer\")","v":1},1,1900,"Non réalisé"]
[418,null,null,null,null,null,null,null,null,null,null,null,null,"","",null,0,{"$f":"COUNTIFS($L$7:L424,\"à éditer\")","v":1},1,1900,"Non réalisé"]
[419,null,null,null,null,null,null,null,null,null,null,null,null,"","",null,0,{"$f":"COUNTIFS($L$7:L425,\"à éditer\")","v":1},1,1900,"Non réalisé"]
[420,null,null,null,null,null,null,null,null,null,null,null,null,"","",null,0,{"$f":"COUNTIFS($L$7:L426,\"à éditer\")","v":1},1,1900,"Non réalisé"]
[421,null,null,null,null,null,null,null,null,null,null,null,null,"","",null,0,{"$f":"COUNTIFS($L$7:L427,\"à éditer\")","v":1},1,1900,"Non réalisé"]
[422,null,null,null,null,null,null,null,null,null,null,null,null,"","",null,0,{"$f":"COUNTIFS($L$7:L428,\"à éditer\")","v":1},1,1900,"Non réalisé"]
[423,null,null,null,null,null,null,null,null,null,null,null,null,"","",null,0,{"$f":"COUNTIFS($L$7:L429,\"à éditer\")","v":1},1,1900,"Non réalisé"]
[424,null,null,null,null,null,null,null,null,null,null,null,null,"","",null,0,{"$f":"COUNTIFS($L$7:L430,\"à éditer\")","v":1},1,1900,"Non réalisé"]
[425,null,null,null,null,null,null,null,null,null,null,null,null,"","",null,0,{"$f":"COUNTIFS($L$7:L431,\"à éditer\")","v":1},1,1900,"Non réalisé"]
[426,null,null,null,null,null,null,null,null,null,null,null,null,"","",null,0,{"$f":"COUNTIFS($L$7:L432,\"à éditer\")","v":1},1,1900,"Non réalisé"]
[427,null,null,null,null,null,null,null,null,null,null,null,null,"","",null,0,{"$f":"COUNTIFS($L$7:L433,\"à éditer\")","v":1},1,1900,"Non réalisé"]
[428,null,null,null,null,null,null,null,null,null,null,null,null,"","",null,0,{"$f":"COUNTIFS($L$7:L434,\"à éditer\")","v":1},1,1900,"Non réalisé"]
[429,null,null,null,null,null,null,null,null,null,null,null,null,"","",null,0,{"$f":"COUNTIFS($L$7:L435,\"à éditer\")","v":1},1,1900,"Non réalisé"]
[430,null,null,null,null,null,null,null,null,null,null,null,null,"","",null,0,{"$f":"COUNTIFS($L$7:L436,\"à éditer\")","v":1},1,1900,"Non réalisé"]
[431,null,null,null,null,null,null,null,null,null,null,null,null,"","",null,0,{"$f":"COUNTIFS($L$7:L437,\"à éditer\")","v":1},1,1900,"Non réalisé"]
[432,null,null,null,null,null,null,null,null,null,null,null,null,"","",null,0,{"$f":"COUNTIFS($L$7:L438,\"à éditer\")","v":1},1,1900,"Non réalisé"]
[433,null,null,null,null,null,null,null,null,null,null,null,null,"","",null,0,{"$f":"COUNTIFS($L$7:L439,\"à éditer\")","v":1},1,1900,"Non réalisé"]
[434,null,null,null,null,null,null,null,null,null,null,null,null,"","",null,0,{"$f":"COUNTIFS($L$7:L440,\"à éditer\")","v":1},1,1900,"Non réalisé"]
[435,null,null,null,null,null,null,null,null,null,null,null,null,"","",null,0,{"$f":"COUNTIFS($L$7:L441,\"à éditer\")","v":1},1,1900,"Non réalisé"]
[436,null,null,null,null,null,null,null,null,null,null,null,null,"","",null,0,{"$f":"COUNTIFS($L$7:L442,\"à éditer\")","v":1},1,1900,"Non réalisé"]
[437,null,null,null,null,null,null,null,null,null,null,null,null,"","",null,0,{"$f":"COUNTIFS($L$7:L443,\"à éditer\")","v":1},1,1900,"Non réalisé"]
[438,null,null,null,null,null,null,null,null,null,null,null,null,"","",null,0,{"$f":"COUNTIFS($L$7:L444,\"à éditer\")","v":1},1,1900,"Non réalisé"]
[439,null,null,null,null,null,null,null,null,null,null,null,null,"","",null,0,{"$f":"COUNTIFS($L$7:L445,\"à éditer\")","v":1},1,1900,"Non réalisé"]
[440,null,null,null,null,null,null,null,null,null,null,null,null,"","",null,0,{"$f":"COUNTIFS($L$7:L446,\"à éditer\")","v":1},1,1900,"Non réalisé"]
[441,null,null,null,null,null,null,null,null,null,null,null,null,"","",null,0,{"$f":"COUNTIFS($L$7:L447,\"à éditer\")","v":1},1,1900,"Non réalisé"]
[442,null,null,null,null,null,null,null,null,null,null,null,null,"","",null,0,{"$f":"COUNTIFS($L$7:L448,\"à éditer\")","v":1},1,1900,"Non réalisé"]
[443,null,null,null,null,null,null,null,null,null,null,null,null,"","",null,0,{"$f":"COUNTIFS($L$7:L449,\"à éditer\")","v":1},1,1900,"Non réalisé"]
[444,null,null,null,null,null,null,null,null,null,null,null,null,"","",null,0,{"$f":"COUNTIFS($L$7:L450,\"à éditer\")","v":1},1,1900,"Non réalisé"]
[445,null,null,null,null,null,null,null,null,null,null,null,null,"","",null,0,{"$f":"COUNTIFS($L$7:L451,\"à éditer\")","v":1},1,1900,"Non réalisé"]
[446,null,null,null,null,null,null,null,null,null,null,null,null,"","",null,0,{"$f":"COUNTIFS($L$7:L452,\"à éditer\")","v":1},1,1900,"Non réalisé"]
[447,null,null,null,null,null,null,null,null,null,null,null,null,"","",null,0,{"$f":"COUNTIFS($L$7:L453,\"à éditer\")","v":1},1,1900,"Non réalisé"]
[448,null,null,null,null,null,null,null,null,null,null,null,null,"","",null,0,{"$f":"COUNTIFS($L$7:L454,\"à éditer\")","v":1},1,1900,"Non réalisé"]
[449,null,null,null,null,null,null,null,null,null,null,null,null,"","",null,0,{"$f":"COUNTIFS($L$7:L455,\"à éditer\")","v":1},1,1900,"Non réalisé"]
[{"$f":"A455+1","v":450},null,null,null,null,null,null,null,null,null,null,null,null,"","",null,0,{"$f":"COUNTIFS($L$7:L456,\"à éditer\")","v":1},{"$f":"IFERROR(MONTH(J456),\"\")","v":1},{"$f":"YEAR(J456)","v":1900},{"$f":"IF(OR(L456=\"définitif\",L456=\"à éditer\",L456=\"en cours de réalisation\"),\"Réalisé\",IF(OR(L456=\"projet annulé\",L456=\"\"),\"Non réalisé\",IF(L456=\"en attente\",\"En attente\",\"\")))","v":"Non réalisé"}]
[451,null,null,null,null,null,null,null,null,null,null,null,null,"","",null,0,{"$f":"COUNTIFS($L$7:L457,\"à éditer\")","v":1},1,1900,"Non réalisé"]
[452,null,null,null,null,null,null,null,null,null,null,null,null,"","",null,0,{"$f":"COUNTIFS($L$7:L458,\"à éditer\")","v":1},1,1900,"Non réalisé"]
[453,null,null,null,null,null,null,null,null,null,null,null,null,"","",null,0,{"$f":"COUNTIFS($L$7:L459,\"à éditer\")","v":1},1,1900,"Non réalisé"]
[454,null,null,null,null,null,null,null,null,null,null,null,null,"","",null,0,{"$f":"COUNTIFS($L$7:L460,\"à éditer\")","v":1},1,1900,"Non réalisé"]
[455,null,null,null,null,null,null,null,null,null,null,null,null,"","",null,0,{"$f":"COUNTIFS($L$7:L461,\"à éditer\")","v":1},1,1900,"Non réalisé"]
[456,null,null,null,null,null,null,null,null,null,null,null,null,"","",null,0,{"$f":"COUNTIFS($L$7:L462,\"à éditer\")","v":1},1,1900,"Non réalisé"]
[457,null,null,null,null,null,null,null,null,null,null,null,null,"","",null,0,{"$f":"COUNTIFS($L$7:L463,\"à éditer\")","v":1},1,1900,"Non réalisé"]
[458,null,null,null,null,null,null,null,null,null,null,null,null,"","",null,0,{"$f":"COUNTIFS($L$7:L464,\"à éditer\")","v":1},1,1900,"Non réalisé"]
[459,null,null,null,null,null,null,null,null,null,null,null,null,"","",null,0,{"$f":"COUNTIFS($L$7:L465,\"à éditer\")","v":1},1,1900,"Non réalisé"]
[460,null,null,null,null,null,null,null,null,null,null,null,null,"","",null,0,{"$f":"COUNTIFS($L$7:L466,\"à éditer\")","v":1},1,1900,"Non réalisé"]
[461,null,null,null,null,null,null,null,null,null,null,null,null,"","",null,0,{"$f":"COUNTIFS($L$7:L467,\"à éditer\")","v":1},1,1900,"Non réalisé"]
[462,null,null,null,null,null,null,null,null,null,null,null,null,"",{"$f":"IFERROR(INDIRECT(\"'\"&$O$1&\"'!C\"&MATCH(B468,INDIRECT(\"'\"&$O$1&\"'!B:B\"),0)),\"\")","v":""},null,{"$f":"COUNTIFS(L:L,\"à éditer\",B:B,B468)","v":0},{"$f":"COUNTIFS($L$7:L468,\"à éditer\")","v":1},1,1900,"Non réalisé"]
[463,null,null,null,null,null,null,null,null,null,null,null,null,"","",null,0,{"$f":"COUNTIFS($L$7:L469,\"à éditer\")","v":1},1,1900,"Non réalisé"]
[464,null,null,null,null,null,null,null,null,null,null,null,null,{"$f":"IF(L470=\"à éditer\",IF(B470=B469,N469,$Q$5+IF(Q470=R470,Q470,R470)),\"\")","v":""},"",null,0,{"$f":"COUNTIFS($L$7:L470,\"à éditer\")","v":1},1,1900,"Non réalisé"]
[465,null,null,null,null,null,null,null,null,null,null,null,null,"","",null,0,{"$f":"COUNTIFS($L$7:L471,\"à éditer\")","v":1},1,1900,"Non réalisé"]
[466,null,null,null,null,null,null,null,null,null,null,null,null,"","",null,0,{"$f":"COUNTIFS($L$7:L472,\"à éditer\")","v":1},1,1900,"Non réalisé"]
[467,null,null,null,null,null,null,null,null,null,null,null,null,"","",null,0,{"$f":"COUNTIFS($L$7:L473,\"à éditer\")","v":1},1,1900,"Non réalisé"]
[468,null,null,null,null,null,null,null,null,null,null,null,null,"","",null,0,{"$f":"COUNTIFS($L$7:L474,\"à éditer\")","v":1},1,1900,"Non réalisé"]
[469,null,null,null,null,null,null,null,null,null,null,null,null,"","",null,0,{"$f":"COUNTIFS($L$7:L475,\"à éditer\")","v":1},1,1900,"Non réalisé"]
[470,null,null,null,null,null,null,null,null,null,null,null,null,"","",null,0,{"$f":"COUNTIFS($L$7:L476,\"à éditer\")","v":1},1,1900,"Non réalisé"]
[471,null,null,null,null,null,null,null,null,null,null,null,null,"","",null,0,{"$f":"COUNTIFS($L$7:L477,\"à éditer\")","v":1},1,1900,"Non réalisé"]
[472,null,null,null,null,null,null,null,null,null,null,null,null,"","",null,0,{"$f":"COUNTIFS($L$7:L478,\"à éditer\")","v":1},1,1900,"Non réalisé"]
[473,null,null,null,null,null,null,null,null,null,null,null,null,"","",null,0,{"$f":"COUNTIFS($L$7:L479,\"à éditer\")","v":1},1,1900,"Non réalisé"]
[474,null,null,null,null,null,null,null,null,null,null,null,null,"","",null,0,{"$f":"COUNTIFS($L$7:L480,\"à éditer\")","v":1},1,1900,"Non réalisé"]
[475,null,null,null,null,null,null,null,null,null,null,null,null,"","",null,0,{"$f":"COUNTIFS($L$7:L481,\"à éditer\")","v":1},1,1900,"Non réalisé"]
[476,null,null,null,null,null,null,null,null,null,null,null,null,"","",null,0,{"$f":"COUNTIFS($L$7:L482,\"à éditer\")","v":1},1,1900,"Non réalisé"]
[477,null,null,null,null,null,null,null,null,null,null,null,null,"","",null,0,{"$f":"COUNTIFS($L$7:L483,\"à éditer\")","v":1},1,1900,"Non réalisé"]
[478,null,null,null,null,null,null,null,null,null,null,null,null,"","",null,0,{"$f":"COUNTIFS($L$7:L484,\"à éditer\")","v":1},1,1900,"Non réalisé"]
[479,null,null,null,null,null,null,null,null,null,null,null,null,"","",null,0,{"$f":"COUNTIFS($L$7:L485,\"à éditer\")","v":1},1,1900,"Non réalisé"]
[480,null,null,null,null,null,null,null,null,null,null,null,null,"","",null,0,{"$f":"COUNTIFS($L$7:L486,\"à éditer\")","v":1},1,1900,"Non réalisé"]
[481,null,null,null,null,null,null,null,null,null,null,null,null,"","",null,0,{"$f":"COUNTIFS($L$7:L487,\"à éditer\")","v":1},1,1900,"Non réalisé"]
[482,null,null,null,null,null,null,null,null,null,null,null,null,"","",null,0,{"$f":"COUNTIFS($L$7:L488,\"à éditer\")","v":1},1,1900,"Non réalisé"]
[483,null,null,null,null,null,null,null,null,null,null,null,null,"","",null,0,{"$f":"COUNTIFS($L$7:L489,\"à éditer\")","v":1},1,1900,"Non réalisé"]
[484,null,null,null,null,null,null,null,null,null,null,null,null,"","",null,0,{"$f":"COUNTIFS($L$7:L490,\"à éditer\")","v":1},1,1900,"Non réalisé"]
[485,null,null,null,null,null,null,null,null,null,null,null,null,"","",null,0,{"$f":"COUNTIFS($L$7:L491,\"à éditer\")","v":1},1,1900,"Non réalisé"]
[486,null,null,null,null,null,null,null,null,null,null,null,null,"","",null,0,{"$f":"COUNTIFS($L$7:L492,\"à éditer\")","v":1},1,1900,"Non réalisé"]
[487,null,null,null,null,null,null,null,null,null,null,null,null,"","",null,0,{"$f":"COUNTIFS($L$7:L493,\"à éditer\")","v":1},1,1900,"Non réalisé"]
[488,null,null,null,null,null,null,null,null,null,null,null,null,"","",null,0,{"$f":"COUNTIFS($L$7:L494,\"à éditer\")","v":1},1,1900,"Non réalisé"]
[489,null,null,null,null,null,null,null,null,null,null,null,null,"","",null,0,{"$f":"COUNTIFS($L$7:L495,\"à éditer\")","v":1},1,1900,"Non réalisé"]
[490,null,null,null,null,null,null,null,null,null,null,null,null,"","",null,0,{"$f":"COUNTIFS($L$7:L496,\"à éditer\")","v":1},1,1900,"Non réalisé"]
[491,null,null,null,null,null,null,null,null,null,null,null,null,"","",null,0,{"$f":"COUNTIFS($L$7:L497,\"à éditer\")","v":1},1,1900,"Non réalisé"]
[492,null,null,null,null,null,null,null,null,null,null,null,null,"","",null,0,{"$f":"COUNTIFS($L$7:L498,\"à éditer\")","v":1},1,1900,"Non réalisé"]
[493,null,null,null,null,null,null,null,null,null,null,null,null,"","",null,0,{"$f":"COUNTIFS($L$7:L499,\"à éditer\")","v":1},1,1900,"Non réalisé"]
[494,null,null,null,null,null,null,null,null,null,null,null,null,"","",null,0,{"$f":"COUNTIFS($L$7:L500,\"à éditer\")","v":1},1,1900,"Non réalisé"]
[495,null,null,null,null,null,null,null,null,null,null,null,null,"","",null,0,{"$f":"COUNTIFS($L$7:L501,\"à éditer\")","v":1},1,1900,"Non réalisé"]
[496,null,null,null,null,null,null,null,null,null,null,null,null,"","",null,0,{"$f":"COUNTIFS($L$7:L502,\"à éditer\")","v":1},1,1900,"Non réalisé"]
[497,null,null,null,null,null,null,null,null,null,null,null,null,"","",null,0,{"$f":"COUNTIFS($L$7:L503,\"à éditer\")","v":1},1,1900,"Non réalisé"]
[498,null,null,null,null,null,null,null,null,null,null,null,null,"","",null,0,{"$f":"COUNTIFS($L$7:L504,\"à éditer\")","v":1},1,1900,"Non réalisé"]
[499,null,null,null,null,null,null,null,null,null,null,null,null,"","",null,0,{"$f":"COUNTIFS($L$7:L505,\"à éditer\")","v":1},1,1900,"Non réalisé"]
[500,null,null,null,null,null,null,null,null,null,null,null,null,"","",null,0,{"$f":"COUNTIFS($L$7:L506,\"à éditer\")","v":1},1,1900,"Non réalisé"]
[501,null,null,null,null,null,null,null,null,null,null,null,null,"","",null,0,{"$f":"COUNTIFS($L$7:L507,\"à éditer\")","v":1},1,1900,"Non réalisé"]
[502,null,null,null,null,null,null,null,null,null,null,null,null,"","",null,0,{"$f":"COUNTIFS($L$7:L508,\"à éditer\")","v":1},1,1900,"Non réalisé"]
[503,null,null,null,null,null,null,null,null,null,null,null,null,"","",null,0,{"$f":"COUNTIFS($L$7:L509,\"à éditer\")","v":1},1,1900,"Non réalisé"]
[504,null,null,null,null,null,null,null,null,null,null,null,null,"","",null,0,{"$f":"COUNTIFS($L$7:L510,\"à éditer\")","v":1},1,1900,"Non réalisé"]
[505,null,null,null,null,null,null,null,null,null,null,null,null,"","",null,0,{"$f":"COUNTIFS($L$7:L511,\"à éditer\")","v":1},1,1900,"Non réalisé"]
[506,null,null,null,null,null,null,null,null,null,null,null,null,"","",null,0,{"$f":"COUNTIFS($L$7:L512,\"à éditer\")","v":1},1,1900,"Non réalisé"]
[507,null,null,null,null,null,null,null,null,null,null,null,null,"","",null,0,{"$f":"COUNTIFS($L$7:L513,\"à éditer\")","v":1},1,1900,"Non réalisé"]
[508,null,null,null,null,null,null,null,null,null,null,null,null,"","",null,0,{"$f":"COUNTIFS($L$7:L514,\"à éditer\")","v":1},1,1900,"Non réalisé"]
[509,null,null,null,null,null,null,null,null,null,null,null,null,"","",null,0,{"$f":"COUNTIFS($L$7:L515,\"à éditer\")","v":1},1,1900,"Non réalisé"]
[510,null,null,null,null,null,null,null,null,null,null,null,null,"","",null,0,{"$f":"COUNTIFS($L$7:L516,\"à éditer\")","v":1},1,1900,"Non réalisé"]
[511,null,null,null,null,null,null,null,null,null,null,null,null,"","",null,0,{"$f":"COUNTIFS($L$7:L517,\"à éditer\")","v":1},1,1900,"Non réalisé"]
[512,null,null,null,null,null,null,null,null,null,null,null,null,"","",null,0,{"$f":"COUNTIFS($L$7:L518,\"à éditer\")","v":1},1,1900,"Non réalisé"]
[513,null,null,null,null,null,null,null,null,null,null,null,null,"","",null,0,{"$f":"COUNTIFS($L$7:L519,\"à éditer\")","v":1},1,1900,"Non réalisé"]
[{"$f":"A519+1","v":514},null,null,null,null,null,null,null,null,null,null,null,null,"","",null,0,{"$f":"COUNTIFS($L$7:L520,\"à éditer\")","v":1},{"$f":"IFERROR(MONTH(J520),\"\")","v":1},{"$f":"YEAR(J520)","v":1900},{"$f":"IF(OR(L520=\"définitif\",L520=\"à éditer\",L520=\"en cours de réalisation\"),\"Réalisé\",IF(OR(L520=\"projet annulé\",L520=\"\"),\"Non réalisé\",IF(L520=\"en attente\",\"En attente\",\"\")))","v":"Non réalisé"}]
[515,null,null,null,null,null,null,null,null,null,null,null,null,"","",null,0,{"$f":"COUNTIFS($L$7:L521,\"à éditer\")","v":1},1,1900,"Non réalisé"]
[516,null,null,null,null,null,null,null,null,null,null,null,null,"","",null,0,{"$f":"COUNTIFS($L$7:L522,\"à éditer\")","v":1},1,1900,"Non réalisé"]
[517,null,null,null,null,null,null,null,null,null,null,null,null,"","",null,0,{"$f":"COUNTIFS($L$7:L523,\"à éditer\")","v":1},1,1900,"Non réalisé"]
[518,null,null,null,null,null,null,null,null,null,null,null,null,"","",null,0,{"$f":"COUNTIFS($L$7:L524,\"à éditer\")","v":1},1,1900,"Non réalisé"]
[519,null,null,null,null,null,null,null,null,null,null,null,null,"","",null,0,{"$f":"COUNTIFS($L$7:L525,\"à éditer\")","v":1},1,1900,"Non réalisé"]
[520,null,null,null,null,null,null,null,null,null,null,null,null,"","",null,0,{"$f":"COUNTIFS($L$7:L526,\"à éditer\")","v":1},1,1900,"Non réalisé"]
[521,null,null,null,null,null,null,null,null,null,null,null,null,"","",null,0,{"$f":"COUNTIFS($L$7:L527,\"à éditer\")","v":1},1,1900,"Non réalisé"]
[522,null,null,null,null,null,null,null,null,null,null,null,null,"","",null,0,{"$f":"COUNTIFS($L$7:L528,\"à éditer\")","v":1},1,1900,"Non réalisé"]
[523,null,null,null,null,null,null,null,null,null,null,null,null,"","",null,0,{"$f":"COUNTIFS($L$7:L529,\"à éditer\")","v":1},1,1900,"Non réalisé"]
[524,null,null,null,null,null,null,null,null,null,null,null,null,"","",null,0,{"$f":"COUNTIFS($L$7:L530,\"à éditer\")","v":1},1,1900,"Non réalisé"]
[525,null,null,null,null,null,null,null,null,null,null,null,null,"","",null,0,{"$f":"COUNTIFS($L$7:L531,\"à éditer\")","v":1},1,1900,"Non réalisé"]
[526,null,null,null,null,null,null,null,null,null,null,null,null,"",{"$f":"IFERROR(INDIRECT(\"'\"&$O$1&\"'!C\"&MATCH(B532,INDIRECT(\"'\"&$O$1&\"'!B:B\"),0)),\"\")","v":""},null,{"$f":"COUNTIFS(L:L,\"à éditer\",B:B,B532)","v":0},{"$f":"COUNTIFS($L$7:L532,\"à éditer\")","v":1},1,1900,"Non réalisé"]
[527,null,null,null,null,null,null,null,null,null,null,null,null,"","",null,0,{"$f":"COUNTIFS($L$7:L533,\"à éditer\")","v":1},1,1900,"Non réalisé"]
[528,null,null,null,null,null,null,null,null,null,null,null,null,{"$f":"IF(L534=\"à éditer\",IF(B534=B533,N533,$Q$5+IF(Q534=R534,Q534,R534)),\"\")","v":""},"",null,0,{"$f":"COUNTIFS($L$7:L534,\"à éditer\")","v":1},1,1900,"Non réalisé"]
[529,null,null,null,null,null,null,null,null,null,null,null,null,"","",null,0,{"$f":"COUNTIFS($L$7:L535,\"à éditer\")","v":1},1,1900,"Non réalisé"]
[530,null,null,null,null,null,null,null,null,null,null,null,null,"","",null,0,{"$f":"COUNTIFS($L$7:L536,\"à éditer\")","v":1},1,1900,"Non réalisé"]
[531,null,null,null,null,null,null,null,null,null,null,null,null,"","",null,0,{"$f":"COUNTIFS($L$7:L537,\"à éditer\")","v":1},1,1900,"Non réalisé"]
[532,null,null,null,null,null,null,null,null,null,null,null,null,"","",null,0,{"$f":"COUNTIFS($L$7:L538,\"à éditer\")","v":1},1,1900,"Non réalisé"]
[533,null,null,null,null,null,null,null,null,null,null,null,null,"","",null,0,{"$f":"COUNTIFS($L$7:L539,\"à éditer\")","v":1},1,1900,"Non réalisé"]
[534,null,null,null,null,null,null,null,null,null,null,null,null,"","",null,0,{"$f":"COUNTIFS($L$7:L540,\"à éditer\")","v":1},1,1900,"Non réalisé"]
[535,null,null,null,null,null,null,null,null,null,null,null,null,"","",null,0,{"$f":"COUNTIFS($L$7:L541,\"à éditer\")","v":1},1,1900,"Non réalisé"]
[536,null,null,null,null,null,null,null,null,null,null,null,null,"","",null,0,{"$f":"COUNTIFS($L$7:L542,\"à éditer\")","v":1},1,1900,"Non réalisé"]
[537,null,null,null,null,null,null,null,null,null,null,null,null,"","",null,0,{"$f":"COUNTIFS($L$7:L543,\"à éditer\")","v":1},1,1900,"Non réalisé"]
[538,null,null,null,null,null,null,null,null,null,null,null,null,"","",null,0,{"$f":"COUNTIFS($L$7:L544,\"à éditer\")","v":1},1,1900,"Non réalisé"]
[539,null,null,null,null,null,null,null,null,null,null,null,null,"","",null,0,{"$f":"COUNTIFS($L$7:L545,\"à éditer\")","v":1},1,1900,"Non réalisé"]
[540,null,null,null,null,null,null,null,null,null,null,null,null,"","",null,0,{"$f":"COUNTIFS($L$7:L546,\"à éditer\")","v":1},1,1900,"Non réalisé"]
[541,null,null,null,null,null,null,null,null,null,null,null,null,"","",null,0,{"$f":"COUNTIFS($L$7:L547,\"à éditer\")","v":1},1,1900,"Non réalisé"]
[542,null,null,null,null,null,null,null,null,null,null,null,null,"","",null,0,{"$f":"COUNTIFS($L$7:L548,\"à éditer\")","v":1},1,1900,"Non réalisé"]
[543,null,null,null,null,null,null,null,null,null,null,null,null,"","",null,0,{"$f":"COUNTIFS($L$7:L549,\"à éditer\")","v":1},1,1900,"Non réalisé"]
[544,null,null,null,null,null,null,null,null,null,null,null,null,"","",null,0,{"$f":"COUNTIFS($L$7:L550,\"à éditer\")","v":1},1,1900,"Non réalisé"]
[545,null,null,null,null,null,null,null,null,null,null,null,null,"","",null,0,{"$f":"COUNTIFS($L$7:L551,\"à éditer\")","v":1},1,1900,"Non réalisé"]
[546,null,null,null,null,null,null,null,null,null,null,null,null,"","",null,0,{"$f":"COUNTIFS($L$7:L552,\"à éditer\")","v":1},1,1900,"Non réalisé"]
[547,null,null,null,null,null,null,null,null,null,null,null,null,"","",null,0,{"$f":"COUNTIFS($L$7:L553,\"à éditer\")","v":1},1,1900,"Non réalisé"]
[548,null,null,null,null,null,null,null,null,null,null,null,null,"","",null,0,{"$f":"COUNTIFS($L$7:L554,\"à éditer\")","v":1},1,1900,"Non réalisé"]
[549,null,null,null,null,null,null,null,null,null,null,null,null,"","",null,0,{"$f":"COUNTIFS($L$7:L555,\"à éditer\")","v":1},1,1900,"Non réalisé"]
[550,null,null,null,null,null,null,null,null,null,null,null,null,"","",null,0,{"$f":"COUNTIFS($L$7:L556,\"à éditer\")","v":1},1,1900,"Non réalisé"]
[551,null,null,null,null,null,null,null,null,null,null,null,null,"","",null,0,{"$f":"COUNTIFS($L$7:L557,\"à éditer\")","v":1},1,1900,"Non réalisé"]
[552,null,null,null,null,null,null,null,null,null,null,null,null,"","",null,0,{"$f":"COUNTIFS($L$7:L558,\"à éditer\")","v":1},1,1900,"Non réalisé"]
[553,null,null,null,null,null,null,null,null,null,null,null,null,"","",null,0,{"$f":"COUNTIFS($L$7:L559,\"à éditer\")","v":1},1,1900,"Non réalisé"]
[554,null,null,null,null,null,null,null,null,null,null,null,null,"","",null,0,{"$f":"COUNTIFS($L$7:L560,\"à éditer\")","v":1},1,1900,"Non réalisé"]
[555,null,null,null,null,null,null,null,null,null,null,null,null,"","",null,0,{"$f":"COUNTIFS($L$7:L561,\"à éditer\")","v":1},1,1900,"Non réalisé"]
[556,null,null,null,null,null,null,null,null,null,null,null,null,"","",null,0,{"$f":"COUNTIFS($L$7:L562,\"à éditer\")","v":1},1,1900,"Non réalisé"]
[557,null,null,null,null,null,null,null,null,null,null,null,null,"","",null,0,{"$f":"COUNTIFS($L$7:L563,\"à éditer\")","v":1},1,1900,"Non réalisé"]
[558,null,null,null,null,null,null,null,null,null,null,null,null,"","",null,0,{"$f":"COUNTIFS($L$7:L564,\"à éditer\")","v":1},1,1900,"Non réalisé"]
[559,null,null,null,null,null,null,null,null,null,null,null,null,"","",null,0,{"$f":"COUNTIFS($L$7:L565,\"à éditer\")","v":1},1,1900,"Non réalisé"]
[560,null,null,null,null,null,null,null,null,null,null,null,null,"","",null,0,{"$f":"COUNTIFS($L$7:L566,\"à éditer\")","v":1},1,1900,"Non réalisé"]
[561,null,null,null,null,null,null,null,null,null,null,null,null,"","",null,0,{"$f":"COUNTIFS($L$7:L567,\"à éditer\")","v":1},1,1900,"Non réalisé"]
[562,null,null,null,null,null,null,null,null,null,null,null,null,"","",null,0,{"$f":"COUNTIFS($L$7:L568,\"à éditer\")","v":1},1,1900,"Non réalisé"]
[563,null,null,null,null,null,null,null,null,null,null,null,null,"","",null,0,{"$f":"COUNTIFS($L$7:L569,\"à éditer\")","v":1},1,1900,"Non réalisé"]
[564,null,null,null,null,null,null,null,null,null,null,null,null,"","",null,0,{"$f":"COUNTIFS($L$7:L570,\"à éditer\")","v":1},1,1900,"Non réalisé"]
[565,null,null,null,null,null,null,null,null,null,null,null,null,"","",null,0,{"$f":"COUNTIFS($L$7:L571,\"à éditer\")","v":1},1,1900,"Non réalisé"]
[566,null,null,null,null,null,null,null,null,null,null,null,null,"","",null,0,{"$f":"COUNTIFS($L$7:L572,\"à éditer\")","v":1},1,1900,"Non réalisé"]
[567,null,null,null,null,null,null,null,null,null,null,null,null,"","",null,0,{"$f":"COUNTIFS($L$7:L573,\"à éditer\")","v":1},1,1900,"Non réalisé"]
[568,null,null,null,null,null,null,null,null,null,null,null,null,"","",null,0,{"$f":"COUNTIFS($L$7:L574,\"à éditer\")","v":1},1,1900,"Non réalisé"]
[569,null,null,null,null,null,null,null,null,null,null,null,null,"","",null,0,{"$f":"COUNTIFS($L$7:L575,\"à éditer\")","v":1},1,1900,"Non réalisé"]
[{"$f":"A575+1","v":570},null,null,null,null,null,null,null,null,null,null,null,null,"","",null,0,{"$f":"COUNTIFS($L$7:L576,\"à éditer\")","v":1},1,1900,"Non réalisé"]
[571,null,null,null,null,null,null,null,null,null,null,null,null,"","",null,0,{"$f":"COUNTIFS($L$7:L577,\"à éditer\")","v":1},1,1900,"Non réalisé"]
[572,null,null,null,null,null,null,null,null,null,null,null,null,"","",null,0,{"$f":"COUNTIFS($L$7:L578,\"à éditer\")","v":1},1,1900,"Non réalisé"]
[573,null,null,null,null,null,null,null,null,null,null,null,null,"","",null,0,{"$f":"COUNTIFS($L$7:L579,\"à éditer\")","v":1},1,1900,"Non réalisé"]
[574,null,null,null,null,null,null,null,null,null,null,null,null,"","",null,0,{"$f":"COUNTIFS($L$7:L580,\"à éditer\")","v":1},1,1900,"Non réalisé"]
[575,null,null,null,null,null,null,null,null,null,null,null,null,"","",null,0,{"$f":"COUNTIFS($L$7:L581,\"à éditer\")","v":1},1,1900,"Non réalisé"]
[576,null,null,null,null,null,null,null,null,null,null,null,null,"","",null,0,{"$f":"COUNTIFS($L$7:L582,\"à éditer\")","v":1},1,1900,"Non réalisé"]
[577,null,null,null,null,null,null,null,null,null,null,null,null,"","",null,0,{"$f":"COUNTIFS($L$7:L583,\"à éditer\")","v":1},1,1900,"Non réalisé"]
[578,null,null,null,null,null,null,null,null,null,null,null,null,"","",null,0,{"$f":"COUNTIFS($L$7:L584,\"à éditer\")","v":1},{"$f":"IFERROR(MONTH(J584),\"\")","v":1},{"$f":"YEAR(J584)","v":1900},{"$f":"IF(OR(L584=\"définitif\",L584=\"à éditer\",L584=\"en cours de réalisation\"),\"Réalisé\",IF(OR(L584=\"projet annulé\",L584=\"\"),\"Non réalisé\",IF(L584=\"en attente\",\"En attente\",\"\")))","v":"Non réalisé"}]
[579,null,null,null,null,null,null,null,null,null,null,null,null,"","",null,0,{"$f":"COUNTIFS($L$7:L585,\"à éditer\")","v":1},1,1900,"Non réalisé"]
[580,null,null,null,null,null,null,null,null,null,null,null,null,"","",null,0,{"$f":"COUNTIFS($L$7:L586,\"à éditer\")","v":1},1,1900,"Non réalisé"]
[581,null,null,null,null,null,null,null,null,null,null,null,null,"","",null,0,{"$f":"COUNTIFS($L$7:L587,\"à éditer\")","v":1},1,1900,"Non réalisé"]
[582,null,null,null,null,null,null,null,null,null,null,null,null,"","",null,0,{"$f":"COUNTIFS($L$7:L588,\"à éditer\")","v":1},1,1900,"Non réalisé"]
[583,null,null,null,null,null,null,null,null,null,null,null,null,"","",null,0,{"$f":"COUNTIFS($L$7:L589,\"à éditer\")","v":1},1,1900,"Non réalisé"]
[584,null,null,null,null,null,null,null,null,null,null,null,null,"","",null,0,{"$f":"COUNTIFS($L$7:L590,\"à éditer\")","v":1},1,1900,"Non réalisé"]
[585,null,null,null,null,null,null,null,null,null,null,null,null,"","",null,0,{"$f":"COUNTIFS($L$7:L591,\"à éditer\")","v":1},1,1900,"Non réalisé"]
[586,null,null,null,null,null,null,null,null,null,null,null,null,"","",null,0,{"$f":"COUNTIFS($L$7:L592,\"à éditer\")","v":1},1,1900,"Non réalisé"]
[587,null,null,null,null,null,null,null,null,null,null,null,null,"","",null,0,{"$f":"COUNTIFS($L$7:L593,\"à éditer\")","v":1},1,1900,"Non réalisé"]
[588,null,null,null,null,null,null,null,null,null,null,null,null,"","",null,0,{"$f":"COUNTIFS($L$7:L594,\"à éditer\")","v":1},1,1900,"Non réalisé"]
[589,null,null,null,null,null,null,null,null,null,null,null,null,"","",null,0,{"$f":"COUNTIFS($L$7:L595,\"à éditer\")","v":1},1,1900,"Non réalisé"]
[590,null,null,null,null,null,null,null,null,null,null,null,null,"",{"$f":"IFERROR(INDIRECT(\"'\"&$O$1&\"'!C\"&MATCH(B596,INDIRECT(\"'\"&$O$1&\"'!B:B\"),0)),\"\")","v":""},null,{"$f":"COUNTIFS(L:L,\"à éditer\",B:B,B596)","v":0},{"$f":"COUNTIFS($L$7:L596,\"à éditer\")","v":1},1,1900,"Non réalisé"]
[591,null,null,null,null,null,null,null,null,null,null,null,null,"","",null,0,{"$f":"COUNTIFS($L$7:L597,\"à éditer\")","v":1},1,1900,"Non réalisé"]
[592,null,null,null,null,null,null,null,null,null,null,null,null,{"$f":"IF(L598=\"à éditer\",IF(B598=B597,N597,$Q$5+IF(Q598=R598,Q598,R598)),\"\")","v":""},"",null,0,{"$f":"COUNTIFS($L$7:L598,\"à éditer\")","v":1},1,1900,"Non réalisé"]
[593,null,null,null,null,null,null,null,null,null,null,null,null,"","",null,0,{"$f":"COUNTIFS($L$7:L599,\"à éditer\")","v":1},1,1900,"Non réalisé"]
[594,null,null,null,null,null,null,null,null,null,null,null,null,"","",null,0,{"$f":"COUNTIFS($L$7:L600,\"à éditer\")","v":1},1,1900,"Non réalisé"]
[null,null,null,null,null,null,null,null,null,null,null,null,null,"","",null,0,{"$f":"COUNTIFS($L$7:L601,\"à éditer\")","v":1},1,1900,"Non réalisé"]
[null,null,null,null,null,null,null,null,null,null,null,null,null,"","",null,0,{"$f":"COUNTIFS($L$7:L602,\"à éditer\")","v":1},1,1900,"Non réalisé"]
[null,null,null,null,null,null,null,null,null,null,null,null,null,"","",null,0,{"$f":"COUNTIFS($L$7:L603,\"à éditer\")","v":1},1,1900,"Non réalisé"]
[null,null,null,null,null,null,null,null,null,null,null,null,null,"","",null,0,{"$f":"COUNTIFS($L$7:L604,\"à éditer\")","v":1},1,1900,"Non réalisé"]
[null,null,null,null,null,null,null,null,null,null,null,null,null,"","",null,0,{"$f":"COUNTIFS($L$7:L605,\"à éditer\")","v":1},1,1900,"Non réalisé"]
[null,null,null,null,null,null,null,null,null,null,null,null,null,"","",null,0,{"$f":"COUNTIFS($L$7:L606,\"à éditer\")","v":1},1,1900,"Non réalisé"]

{"sheet":"Devis","index":5,"n_rows":78,"n_cols":14,"rows_kept":78,"cut":false,"hidden":false,"merged":[[17,6,17,7]]}
[]
[]
[]
[null,null,null,null,null,null,null,"Base prestations","Prestation ?"]
[null,null,"Ce devis se met à jour en fonction de la saisie de la colonne B de l'onglet Base Prestation",null,null,null,"sélection du code client","C0001",1]
[null,null,"Onglet automatique, ne pas modifier",null,null,null,null,{"$f":"IF(I6=\"Tous\",MATCH(H5,INDIRECT(\"'\"&H4&\"'!B:B\"),0),IF(I6>MATCH(H5,INDIRECT(\"'\"&H4&\"'!B:B\"),0),I6,MATCH(H5,INDIRECT(\"'\"&H4&\"'!B:B\"),0)))","v":7},{"$f":"IF(I5=\"*\",\"tous\",MATCH(I5,INDIRECT(\"'\"&H4&\"'!I:I\"),0))","v":7}]
[null,null,null,"https://d.docs.live.net/521f8be27da355e0/Documents/T-WOOD",null,null,null,"Base clients"]
[null,null,null,null,null,null,null,{"$f":"IFERROR(INDIRECT(\"'\"&$H$7&\"'!C\"&MATCH(H5,INDIRECT(\"'\"&$H$7&\"'!B:B\"),0)),\"\")","v":"Pro"}]
[null,null,"Nom client",{"$f":"IFERROR(IF($H$8=\"PRO\",\"Société \"&INDIRECT(\"'\"&$H$7&\"'!D\"&MATCH(H5,INDIRECT(\"'\"&$H$7&\"'!B:B\"),0)),\"\"),\"\")&\" \"&IFERROR(IF(H8=\"PRO\",\"A l'attention de \"&INDIRECT(\"'\"&$H$7&\"'!f\"&MATCH(H5,INDIRECT(\"'\"&$H$7&\"'!B:B\"),0))&\" \"&INDIRECT(\"'\"&$H$7&\"'!E\"&MATCH(H5,INDIRECT(\"'\"&$H$7&\"'!B:B\"),0)),INDIRECT(\"'\"&$H$7&\"'!h\"&MATCH(H5,INDIRECT(\"'\"&$H$7&\"'!B:B\"),0))&\" \"&INDIRECT(\"'\"&$H$7&\"'!g\"&MATCH(H5,INDIRECT(\"'\"&$H$7&\"'!B:B\"),0))),\"\")","v":"Société société x A l'attention de Thomas Le Blanc"}]
[null,null,null,"Acompte demandé :",{"$f":"INDIRECT(\"'\"&$H$4&\"'!e\"&C29)","v":"OUI"}]
[]
[]
[null,null,null,null,null,{"$f":"IF(I5=\"*\",\"Récapitulatif de tous les devis\",\"DEVIS \"&YEAR(NOW())&\"_\"&IF(MONTH(NOW())<10,\"0\"&MONTH(NOW()),MONTH(NOW()))&\"_\"&IF(DAY(NOW())<10,\"0\"&DAY(NOW()),DAY(NOW())))&\"_\"&IF(HOUR(NOW())<10,\"0\"&HOUR(NOW()),HOUR(NOW()))&\"h\"&IF(MINUTE(NOW())<10,\"0\"&MINUTE(NOW()),MINUTE(NOW()))&\"_\"&IF(SECOND(NOW())<10,\"0\"&SECOND(NOW()),SECOND(NOW()))","v":"DEVIS 2020_08_11_16h10_40"}]
[null,null,null,null,null,null,"Date :",{"$f":"INDIRECT(\"'\"&H4&\"'!J\"&H6)","v":"2020-05-01"}]
[]
[null,null,""]
[null,null,{"$f":"IF(ISBLANK('Nos données'!C7),\"\",'Nos données'!C7)","v":""}]
[null,null,{"$f":"IF(ISBLANK('Nos données'!C8),\"\",'Nos données'!C8)","v":""},null,null,null,{"$f":"IFERROR(IF($H$8=\"PRO\",\"Société \"&INDIRECT(\"'\"&$H$7&\"'!D\"&MATCH(H5,INDIRECT(\"'\"&$H$7&\"'!B:B\"),0)),\"\"),\"\")","v":"Société société x"}]
[null,null,{"$f":"IF(ISBLANK('Nos données'!C9),\"\",'Nos données'!C9)","v":""},null,null,null,{"$f":"IFERROR(IF(H8=\"PRO\",\"A l'attention de \"&INDIRECT(\"'\"&$H$7&\"'!f\"&MATCH(H5,INDIRECT(\"'\"&$H$7&\"'!B:B\"),0))&\" \"&INDIRECT(\"'\"&$H$7&\"'!E\"&MATCH(H5,INDIRECT(\"'\"&$H$7&\"'!B:B\"),0)),INDIRECT(\"'\"&$H$7&\"'!h\"&MATCH(H5,INDIRECT(\"'\"&$H$7&\"'!B:B\"),0))&\" \"&INDIRECT(\"'\"&$H$7&\"'!g\"&MATCH(H5,INDIRECT(\"'\"&$H$7&\"'!B:B\"),0))),\"\")","v":"A l'attention de Thomas Le Blanc"}]
[null,null,{"$f":"IF(ISBLANK('Nos données'!C10),\"\",'Nos données'!C10)&\" \"&IF(ISBLANK('Nos données'!C11),\"\",'Nos données'!C11)","v":" "},null,null,null,{"$f":"IFERROR(INDIRECT(\"'\"&$H$7&\"'!i\"&MATCH(H5,INDIRECT(\"'\"&$H$7&\"'!B:B\"),0)),\"\")","v":"343 rue de Neuilly"}]
[null,null,{"$f":"\"Téléphone : \"&IF(ISBLANK('Nos données'!C12),\"\",'Nos données'!C12)","v":"Téléphone : "},null,null,null,{"$f":"IFERROR(INDIRECT(\"'\"&$H$7&\"'!j\"&MATCH(H5,INDIRECT(\"'\"&$H$7&\"'!B:B\"),0))&\"   \"&INDIRECT(\"'\"&$H$7&\"'!k\"&MATCH(H5,INDIRECT(\"'\"&$H$7&\"'!B:B\"),0)),\"\")","v":"75016   Paris"}]
[null,null,{"$f":"\"Siret : \"&IF(ISBLANK('Nos données'!C13),\"\",'Nos données'!C13)","v":"Siret : "}]
[null,null,{"$f":"IF(ISBLANK('Nos données'!C14),\"\",\"N° TVA : \"&'Nos données'!C14)","v":""}]
[null,null,"Police d'assurance : 302988832000"]
[]
[]
[null,null,"Description",null,{"$f":"IF(SUM(E29:E61)>0,\"Remise\",\"\")","v":"Remise"},null,"Montant HT","Montant TTC","Taux TVA",null,null,null,"Numéro de prestation"]
[]
[5,null,{"$f":"H6","v":7},{"$f":"IF(C29<>\"\",\"#\"&IF(C29<>\"\",INDIRECT(\"'\"&$H$4&\"'!I\"&C29),\"\")&\" - \"&INDIRECT(\"'\"&$H$4&\"'!C\"&C29),\"\")","v":"#1 - prestation 1"},{"$f":"IFERROR(IF(IF(C29<>\"\",INDIRECT(\"'\"&$H$4&\"'!G\"&C29),\"\")=0,\"\",IF(C29<>\"\",INDIRECT(\"'\"&$H$4&\"'!G\"&C29),\"\")),\"\")","v":""},null,{"$f":"IF(C29<>\"\",INDIRECT(\"'\"&$H$4&\"'!D\"&C29),\"\")","v":300},{"$f":"IFERROR(G29*I29+G29,\"\")","v":360},{"$f":"IF(C29<>\"\",INDIRECT(\"'\"&$H$4&\"'!F\"&C29),\"\")","v":0.2},null,null,null,{"$f":"IF(C29<>\"\",INDIRECT(\"'\"&$H$4&\"'!I\"&C29),\"\")","v":1}]
[null,null,{"$f":"IF(AND(INDIRECT(\"'\"&H$4&\"'!B\"&H$6+L30)=H$5,C29<>\"\"),H$6+L30,\"\")","v":8},{"$f":"IF(C30<>\"\",\"#\"&IF(C30<>\"\",INDIRECT(\"'\"&$H$4&\"'!I\"&C30),\"\")&\" - \"&INDIRECT(\"'\"&$H$4&\"'!C\"&C30),\"\")","v":"#1 - Prestation 2"},0.05,null,400,{"$f":"IFERROR(G30*I30+G30,\"\")","v":440},0.1,null,null,1,{"$f":"IF(C30<>\"\",INDIRECT(\"'\"&$H$4&\"'!I\"&C30),\"\")","v":1},{"$f":"M29=M30","v":true}]
[null,null,{"$f":"IF(AND(INDIRECT(\"'\"&H$4&\"'!B\"&H$6+L31)=H$5,C30<>\"\"),H$6+L31,\"\")","v":""},{"$f":"IF(C31<>\"\",\"#\"&IF(C31<>\"\",INDIRECT(\"'\"&$H$4&\"'!I\"&C31),\"\")&\" - \"&INDIRECT(\"'\"&$H$4&\"'!C\"&C31),\"\")","v":""},"",null,"","","",null,null,{"$f":"L30+1","v":2},{"$f":"IF(C31<>\"\",INDIRECT(\"'\"&$H$4&\"'!I\"&C31),\"\")","v":""}]
[null,null,"","","",null,"","","",null,null,{"$f":"L31+1","v":3},""]
[null,null,"","","",null,"","","",null,null,4,""]
[null,null,"","","",null,"","","",null,null,5,""]
[null,null,"","","",null,"","","",null,null,6,""]
[null,null,"","","",null,{"$f":"IF(C36<>\"\",INDIRECT(\"'\"&$H$4&\"'!D\"&C36),\"\")","v":""},"","",null,null,7,""]
[null,null,"","","",null,"","","",null,null,8,""]
[null,null,"","","",null,"","","",null,null,9,""]
[null,null,"","","",null,"","","",null,null,10,""]
[null,null,"","","",null,"","","",null,null,11,""]
[null,null,"","","",null,"","","",null,null,12,""]
[null,null,"","","",null,"","","",null,null,13,""]
[null,null,"","","",null,"","","",null,null,14,""]
[null,null,"","","",null,"","","",null,null,15,""]
[null,null,"","","",null,"","","",null,null,16,""]
[null,null,"","","",null,"","","",null,null,17,""]
[null,null,"","","",null,"","","",null,null,18,""]
[null,null,"","","",null,"","","",null,null,19,""]
[null,null,"","","",null,"","","",null,null,20,""]
[null,null,"","","",null,"","","",null,null,21,""]
[null,null,"","","",null,"","","",null,null,22,""]
[null,null,"","","",null,"","","",null,null,23,""]
[null,null,"","","",null,"","","",null,null,24,""]
[null,null,"","","",null,"","","",null,null,25,""]
[null,null,"","","",null,"","","",null,null,26,""]
[null,null,"","","",null,"","","",null,null,27,""]
[null,null,"","","",null,"","","",null,null,28,""]
[null,null,"","","",null,"","","",null,null,29,""]
[null,null,"","","",null,"","","",null,null,30,""]
[null,null,{"$f":"IF(AND(INDIRECT(\"'\"&H$4&\"'!B\"&H$6+L60)=H$5,C58<>\"\"),H$6+L60,\"\")","v":""},{"$f":"IF(C60<>\"\",\"#\"&IF(C60<>\"\",INDIRECT(\"'\"&$H$4&\"'!I\"&C60),\"\")&\" - \"&INDIRECT(\"'\"&$H$4&\"'!C\"&C60),\"\")","v":""},{"$f":"IFERROR(IF(IF(C60<>\"\",INDIRECT(\"'\"&$H$4&\"'!G\"&C60),\"\")=0,\"\",IF(C60<>\"\",INDIRECT(\"'\"&$H$4&\"'!G\"&C60),\"\")),\"\")","v":""},null,{"$f":"IF(C60<>\"\",INDIRECT(\"'\"&$H$4&\"'!D\"&C60),\"\")","v":""},{"$f":"IFERROR(G60*I60+G60,\"\")","v":""},{"$f":"IF(C60<>\"\",INDIRECT(\"'\"&$H$4&\"'!F\"&C60),\"\")","v":""},null,null,{"$f":"L58+1","v":30},{"$f":"IF(C60<>\"\",INDIRECT(\"'\"&$H$4&\"'!I\"&C60),\"\")","v":""}]
[null,null,{"$f":"IF(AND(INDIRECT(\"'\"&H$4&\"'!B\"&H$6+L61)=H$5,C59<>\"\"),H$6+L61,\"\")","v":""},"","",null,"","","",null,null,{"$f":"L59+1","v":31},""]
[null,null,"",{"$f":"IF(G62=\"\",\"\",\"Remise accordée\")","v":"Remise accordée"},null,null,{"$f":"IF(+IFERROR(-$E29*G29,0)+IFERROR(-$E30*G30,0)+IFERROR(-$E31*G31,0)+IFERROR(-$E32*G32,0)+IFERROR(-$E33*G33,0)+IFERROR(-$E34*G34,0)+IFERROR(-$E35*G35,0)+IFERROR(-$E36*G36,0)+IFERROR(-$E37*G37,0)+IFERROR(-$E38*G38,0)+IFERROR(-$E39*G39,0)+IFERROR(-$E40*G40,0)+IFERROR(-$E41*G41,0)+IFERROR(-$E42*G42,0)+IFERROR(-$E43*G43,0)+IFERROR(-$E44*G44,0)+IFERROR(-$E45*G45,0)+IFERROR(-$E46*G46,0)+IFERROR(-$E47*G47,0)+IFERROR(-$E48*G48,0)+IFERROR(-$E49*G49,0)+IFERROR(-$E50*G50,0)+IFERROR(-$E51*G51,0)+IFERROR(-$E52*G52,0)+IFERROR(-$E53*G53,0)+IFERROR(-$E54*G54,0)+IFERROR(-$E55*G55,0)+IFERROR(-$E56*G56,0)+IFERROR(-$E57*G57,0)+IFERROR(-$E58*G58,0)+IFERROR(-$E59*G59,0)+IFERROR(-$E60*G60,0)=0,\"\",+IFERROR(-$E29*G29,0)+IFERROR(-$E30*G30,0)+IFERROR(-$E31*G31,0)+IFERROR(-$E32*G32,0)+IFERROR(-$E33*G33,0)+IFERROR(-$E34*G34,0)+IFERROR(-$E35*G35,0)+IFERROR(-$E36*G36,0)+IFERROR(-$E37*G37,0)+IFERROR(-$E38*G38,0)+IFERROR(-$E39*G39,0)+IFERROR(-$E40*G40,0)+IFERROR(-$E41*G41,0)+IFERROR(-$E42*G42,0)+IFERROR(-$E43*G43,0)+IFERROR(-$E44*G44,0)+IFERROR(-$E45*G45,0)+IFERROR(-$E46*G46,0)+IFERROR(-$E47*G47,0)+IFERROR(-$E48*G48,0)+IFERROR(-$E49*G49,0)+IFERROR(-$E50*G50,0)+IFERROR(-$E51*G51,0)+IFERROR(-$E52*G52,0)+IFERROR(-$E53*G53,0)+IFERROR(-$E54*G54,0)+IFERROR(-$E55*G55,0)+IFERROR(-$E56*G56,0)+IFERROR(-$E57*G57,0)+IFERROR(-$E58*G58,0)+IFERROR(-$E59*G59,0)+IFERROR(-$E60*G60,0))","v":-20},{"$f":"IF(+IFERROR(-$E29*H29,0)+IFERROR(-$E30*H30,0)+IFERROR(-$E31*H31,0)+IFERROR(-$E32*H32,0)+IFERROR(-$E33*H33,0)+IFERROR(-$E34*H34,0)+IFERROR(-$E35*H35,0)+IFERROR(-$E36*H36,0)+IFERROR(-$E37*H37,0)+IFERROR(-$E38*H38,0)+IFERROR(-$E39*H39,0)+IFERROR(-$E40*H40,0)+IFERROR(-$E41*H41,0)+IFERROR(-$E42*H42,0)+IFERROR(-$E43*H43,0)+IFERROR(-$E44*H44,0)+IFERROR(-$E45*H45,0)+IFERROR(-$E46*H46,0)+IFERROR(-$E47*H47,0)+IFERROR(-$E48*H48,0)+IFERROR(-$E49*H49,0)+IFERROR(-$E50*H50,0)+IFERROR(-$E51*H51,0)+IFERROR(-$E52*H52,0)+IFERROR(-$E53*H53,0)+IFERROR(-$E54*H54,0)+IFERROR(-$E55*H55,0)+IFERROR(-$E56*H56,0)+IFERROR(-$E57*H57,0)+IFERROR(-$E58*H58,0)+IFERROR(-$E59*H59,0)+IFERROR(-$E60*H60,0)=0,\"\",+IFERROR(-$E29*H29,0)+IFERROR(-$E30*H30,0)+IFERROR(-$E31*H31,0)+IFERROR(-$E32*H32,0)+IFERROR(-$E33*H33,0)+IFERROR(-$E34*H34,0)+IFERROR(-$E35*H35,0)+IFERROR(-$E36*H36,0)+IFERROR(-$E37*H37,0)+IFERROR(-$E38*H38,0)+IFERROR(-$E39*H39,0)+IFERROR(-$E40*H40,0)+IFERROR(-$E41*H41,0)+IFERROR(-$E42*H42,0)+IFERROR(-$E43*H43,0)+IFERROR(-$E44*H44,0)+IFERROR(-$E45*H45,0)+IFERROR(-$E46*H46,0)+IFERROR(-$E47*H47,0)+IFERROR(-$E48*H48,0)+IFERROR(-$E49*H49,0)+IFERROR(-$E50*H50,0)+IFERROR(-$E51*H51,0)+IFERROR(-$E52*H52,0)+IFERROR(-$E53*H53,0)+IFERROR(-$E54*H54,0)+IFERROR(-$E55*H55,0)+IFERROR(-$E56*H56,0)+IFERROR(-$E57*H57,0)+IFERROR(-$E58*H58,0)+IFERROR(-$E59*H59,0)+IFERROR(-$E60*H60,0))","v":-22}]
[]
[]
[]
[null,null,"Relevé d'Identité Bancaire",null,null,null,"Montant HT","TVA","Montant TTC"]
[null,null,"Banque       Guichet       Numéro de compte       Clé ",null,null,"Total I",{"$f":"SUM(G29:G59)","v":700},{"$f":"I67-G67","v":100},{"$f":"SUM(H29:H59)","v":800}]
[null,null,"00000          00000         00000000000                  00",null,null,{"$f":"IF(G62=\"\",\"\",\"dont remises\")","v":"dont remises"},{"$f":"IF(G62=\"\",\"\",G62)","v":-20},{"$f":"IF(F68=\"\",\"\",I68-G68)","v":-2},{"$f":"IF(H62=\"\",\"\",H62)","v":-22}]
[null,null,"Bank",null,null,{"$f":"IF(G62=\"\",\"\",\"Total II\")","v":"Total II"},{"$f":"IF($F69=\"\",\"\",G67+G68)","v":680},{"$f":"IF($F69=\"\",\"\",H67+H68)","v":98},778]
[null,null,"IBAN : FR00 0000 0000 0000 0000 0000 000",null,null,{"$f":"IF(E10=\"OUI\",\"dont acompte:\",\"\")","v":"dont acompte:"},{"$f":"IF($E$10=\"oui\",-G67*0.3,\"\")","v":-210},{"$f":"IF($E$10=\"oui\",-H67*0.3,\"\")","v":-30},-240]
[null,null,"BIC :    CCCCCCCCCCCC",null,null,{"$f":"IF(AND(F69=\"\",F70<>\"\"),\"Total II\",IF(F70=\"\",\"\",\"Total III\"))","v":"Total III"},{"$f":"IFERROR(IF(G69=\"\",G67+G70,IF(G70=\"\",\"\",G69+G70)),\"\")","v":470},{"$f":"IFERROR(IF(H69=\"\",H67+H70,IF(H70=\"\",\"\",H69+H70)),\"\")","v":68},538]
[]
[null,null,"Règlement :",{"$f":"IF(C29<>\"\",INDIRECT(\"'\"&$H$4&\"'!H\"&C29),\"\")","v":"virement"}]
[]
[null,null,{"$f":"\"Merci de nous retourner ce devis signé avec la mention \"&\"\"\"bon pour accord\"\"\"&\" \"&IF(E10=\"OUI\",CONCATENATE(\"ainsi que le versement des 30% d'acompte soit \",TEXT(ROUND(I67*30%,2),\"#### 000\"),\" EUR.\"),\"compte tenu de nos relations, aucun acompte n'est demandé.\")","v":"Merci de nous retourner ce devis signé avec la mention \"bon pour accord\" ainsi que le versement des 30% d'acompte soit 240 EUR."}]
[]
[null,null,{"$f":"\"Fait à ______________________________________________ le  \"&IF(DAY(NOW())<10,\"0\"&DAY(NOW()),DAY(NOW()))&\"/\"&IF(MONTH(NOW())<10,\"0\"&MONTH(NOW()),MONTH(NOW()))&\"/\"&YEAR(NOW())","v":"Fait à ______________________________________________ le  11/08/2020"}]
[null,null,"Signature:",null,null,null,null,null,"Page 1 sur 1"]

{"sheet":"Facture","index":6,"n_rows":77,"n_cols":12,"rows_kept":77,"cut":false,"hidden":false,"merged":[[12,5,12,6],[17,6,17,7],[75,3,75,4],[76,3,76,4]]}
[]
[]
[]
[null,null,null,null,null,null,null,"Base prestations","Prestation ?"]
[null,null,"Ce devis se met à jour en fonction de la saisie de la colonne B de l'onglet Base Prestation",null,null,null,"sélection du code client","C0001",1]
[null,null,"Onglet automatique, ne pas modifier",null,null,null,"Ligne en cours de base prestation",{"$f":"IF(I6>MATCH(H5,INDIRECT(\"'\"&H4&\"'!B:B\"),0),I6,MATCH(H5,INDIRECT(\"'\"&H4&\"'!B:B\"),0))","v":7},{"$f":"MATCH(I5,INDIRECT(\"'\"&H4&\"'!I:I\"),0)","v":7}]
[null,null,null,"C:\\Users\\xavie\\OneDrive\\Documents\\T-WOOD",null,null,null,"Base clients"]
[null,null,null,null,null,null,null,{"$f":"IFERROR(INDIRECT(\"'\"&$H$7&\"'!C\"&MATCH(H5,INDIRECT(\"'\"&$H$7&\"'!B:B\"),0)),\"\")","v":"Pro"}]
[null,null,"Nom client",{"$f":"UPPER(IFERROR(IF($H$8=\"PRO\",\"Société \"&INDIRECT(\"'\"&$H$7&\"'!D\"&MATCH(H5,INDIRECT(\"'\"&$H$7&\"'!B:B\"),0)),\"\"),\"\")&\" \"&IFERROR(IF(H8=\"PRO\",\"A l'attention de \"&INDIRECT(\"'\"&$H$7&\"'!f\"&MATCH(H5,INDIRECT(\"'\"&$H$7&\"'!B:B\"),0))&\" \"&INDIRECT(\"'\"&$H$7&\"'!E\"&MATCH(H5,INDIRECT(\"'\"&$H$7&\"'!B:B\"),0)),INDIRECT(\"'\"&$H$7&\"'!h\"&MATCH(H5,INDIRECT(\"'\"&$H$7&\"'!B:B\"),0))&\" \"&INDIRECT(\"'\"&$H$7&\"'!g\"&MATCH(H5,INDIRECT(\"'\"&$H$7&\"'!B:B\"),0))),\"\"))","v":"SOCIÉTÉ SOCIÉTÉ X A L'ATTENTION DE THOMAS LE BLANC"}]
[null,null,null,"Acompte reçu ?",{"$f":"INDIRECT(\"'\"&H4&\"'!E\"&H6)","v":"OUI"}]
[]
[]
[null,null,null,null,null,"Facture n°",null,{"$f":"INDIRECT(\"'\"&H4&\"'!N\"&H6)","v":22001}]
[null,null,null,null,null,null,"Date :",{"$f":"INDIRECT(\"'\"&H4&\"'!K\"&H6)","v":"00:00:00"}]
[]
[null,null,""]
[null,null,{"$f":"IF(ISBLANK('Nos données'!C7),\"\",'Nos données'!C7)","v":""}]
[null,null,{"$f":"IF(ISBLANK('Nos données'!C8),\"\",'Nos données'!C8)","v":""},null,null,null,{"$f":"IFERROR(IF($H$8=\"PRO\",\"Société \"&INDIRECT(\"'\"&$H$7&\"'!D\"&MATCH(H5,INDIRECT(\"'\"&$H$7&\"'!B:B\"),0)),\"\"),\"\")","v":"Société société x"}]
[null,null,{"$f":"IF(ISBLANK('Nos données'!C9),\"\",'Nos données'!C9)","v":""},null,null,null,{"$f":"IFERROR(IF(H8=\"PRO\",\"A l'attention de \"&INDIRECT(\"'\"&$H$7&\"'!f\"&MATCH(H5,INDIRECT(\"'\"&$H$7&\"'!B:B\"),0))&\" \"&INDIRECT(\"'\"&$H$7&\"'!E\"&MATCH(H5,INDIRECT(\"'\"&$H$7&\"'!B:B\"),0)),INDIRECT(\"'\"&$H$7&\"'!h\"&MATCH(H5,INDIRECT(\"'\"&$H$7&\"'!B:B\"),0))&\" \"&INDIRECT(\"'\"&$H$7&\"'!g\"&MATCH(H5,INDIRECT(\"'\"&$H$7&\"'!B:B\"),0))),\"\")","v":"A l'attention de Thomas Le Blanc"}]
[null,null,{"$f":"IF(ISBLANK('Nos données'!C10),\"\",'Nos données'!C10)&\" \"&IF(ISBLANK('Nos données'!C11),\"\",'Nos données'!C11)","v":" "},null,null,null,{"$f":"IFERROR(INDIRECT(\"'\"&$H$7&\"'!i\"&MATCH(H5,INDIRECT(\"'\"&$H$7&\"'!B:B\"),0)),\"\")","v":"343 rue de Neuilly"}]
[null,null,{"$f":"\"Téléphone : \"&IF(ISBLANK('Nos données'!C12),\"\",'Nos données'!C12)","v":"Téléphone : "},null,null,null,{"$f":"IFERROR(INDIRECT(\"'\"&$H$7&\"'!j\"&MATCH(H5,INDIRECT(\"'\"&$H$7&\"'!B:B\"),0))&\"   \"&INDIRECT(\"'\"&$H$7&\"'!k\"&MATCH(H5,INDIRECT(\"'\"&$H$7&\"'!B:B\"),0)),\"\")","v":"75016   Paris"}]
[null,null,{"$f":"\"Siret : \"&IF(ISBLANK('Nos données'!C13),\"\",'Nos données'!C13)","v":"Siret : "}]
[null,null,{"$f":"IF(ISBLANK('Nos données'!C14),\"\",\"N° TVA : \"&'Nos données'!C14)","v":""}]
[null,null,"Police d'assurance : 302988832000"]
[]
[]
[null,null,"Description",null,{"$f":"IF(SUM(E29:E60)>0,\"Remise\",\"\")","v":"Remise"},null,"Montant HT","Montant TTC","Taux TVA"]
[]
[5,null,{"$f":"H6","v":7},{"$f":"IF(C29<>\"\",INDIRECT(\"'\"&$H$4&\"'!C\"&C29),\"\")","v":"prestation 1"},{"$f":"IFERROR(IF(IF(C29<>\"\",INDIRECT(\"'\"&$H$4&\"'!G\"&C29),\"\")=0,\"\",IF(C29<>\"\",INDIRECT(\"'\"&$H$4&\"'!G\"&C29),\"\")),\"\")","v":""},null,{"$f":"IF(C29<>\"\",INDIRECT(\"'\"&$H$4&\"'!D\"&C29),\"\")","v":300},{"$f":"IFERROR(G29*I29+G29,\"\")","v":360},{"$f":"IF(C29<>\"\",INDIRECT(\"'\"&$H$4&\"'!F\"&C29),\"\")","v":0.2}]
[null,null,{"$f":"IF(AND(INDIRECT(\"'\"&H$4&\"'!B\"&H$6+L30)=H$5,C29<>\"\"),H$6+L30,\"\")","v":8},{"$f":"IF(C30<>\"\",INDIRECT(\"'\"&$H$4&\"'!C\"&C30),\"\")","v":"Prestation 2"},{"$f":"IFERROR(IF(IF(C30<>\"\",INDIRECT(\"'\"&$H$4&\"'!G\"&C30),\"\")=0,\"\",IF(C30<>\"\",INDIRECT(\"'\"&$H$4&\"'!G\"&C30),\"\")),\"\")","v":0.05},null,{"$f":"IF(C30<>\"\",INDIRECT(\"'\"&$H$4&\"'!D\"&C30),\"\")","v":400},{"$f":"IFERROR(G30*I30+G30,\"\")","v":440},{"$f":"IF(C30<>\"\",INDIRECT(\"'\"&$H$4&\"'!F\"&C30),\"\")","v":0.1},null,null,1]
[null,null,"","","",null,"","","",null,null,{"$f":"L30+1","v":2}]
[null,null,"","","",null,"","","",null,null,{"$f":"L31+1","v":3}]
[null,null,"","","",null,"","","",null,null,4]
[null,null,"","","",null,"","","",null,null,5]
[null,null,"","","",null,"","","",null,null,6]
[null,null,"","","",null,"","","",null,null,7]
[null,null,"","","",null,"","","",null,null,8]
[null,null,"","","",null,"","","",null,null,9]
[null,null,"","","",null,"","","",null,null,10]
[null,null,"","","",null,"","","",null,null,11]
[null,null,"","","",null,"","","",null,null,12]
[null,null,"","","",null,"","","",null,null,13]
[null,null,"","","",null,"","","",null,null,14]
[null,null,"","","",null,"","","",null,null,15]
[null,null,"","","",null,"","","",null,null,16]
[null,null,"","","",null,"","","",null,null,17]
[null,null,"","","",null,"","","",null,null,18]
[null,null,"","","",null,"","","",null,null,19]
[null,null,"","","",null,"","","",null,null,20]
[null,null,"","","",null,"","","",null,null,21]
[null,null,"","","",null,"","","",null,null,22]
[null,null,"","","",null,"","","",null,null,23]
[null,null,"","","",null,"","","",null,null,24]
[null,null,"","","",null,"","","",null,null,25]
[null,null,"","","",null,"","","",null,null,26]
[null,null,"","","",null,"","","",null,null,27]
[null,null,"","","",null,"","","",null,null,28]
[null,null,"","","",null,"","","",null,null,29]
[null,null,"","","",null,"","","",null,null,30]
[null,null,"","","",null,{"$f":"IF(C60<>\"\",INEIRECT(\"'\"&$H$4&\"'!E\"&C60),\"\")","v":""},"","",null,null,31]
[null,null,"",{"$f":"IF(E10=\"OUI\",\"Acomptes déjà perçus\",\"\")","v":"Acomptes déjà perçus"},{"$f":"IF(D61=\"Acomptes déjà perçus\",30%,\"\")","v":0.3},null,{"$f":"IF(+IFERROR(IF(E60<>\"\",(G60*E60*$E$61)-(G60*$E$61),-(G60*$E$61)),0)+IFERROR(IF(E59<>\"\",(G59*E59*$E$61)-(G59*$E$61),-(G59*$E$61)),0)+IFERROR(IF(E58<>\"\",(G58*E58*$E$61)-(G58*$E$61),-(G58*$E$61)),0)+IFERROR(IF(E57<>\"\",(G57*E57*$E$61)-(G57*$E$61),-(G57*$E$61)),0)+IFERROR(IF(E56<>\"\",(G56*E56*$E$61)-(G56*$E$61),-(G56*$E$61)),0)+IFERROR(IF(E55<>\"\",(G55*E55*$E$61)-(G55*$E$61),-(G55*$E$61)),0)+IFERROR(IF(E54<>\"\",(G54*E54*$E$61)-(G54*$E$61),-(G54*$E$61)),0)+IFERROR(IF(E53<>\"\",(G53*E53*$E$61)-(G53*$E$61),-(G53*$E$61)),0)+IFERROR(IF(E52<>\"\",(G52*E52*$E$61)-(G52*$E$61),-(G52*$E$61)),0)+IFERROR(IF(E51<>\"\",(G51*E51*$E$61)-(G51*$E$61),-(G51*$E$61)),0)+IFERROR(IF(E50<>\"\",(G50*E50*$E$61)-(G50*$E$61),-(G50*$E$61)),0)+IFERROR(IF(E49<>\"\",(G49*E49*$E$61)-(G49*$E$61),-(G49*$E$61)),0)+IFERROR(IF(E48<>\"\",(G48*E48*$E$61)-(G48*$E$61),-(G48*$E$61)),0)+IFERROR(IF(E47<>\"\",(G47*E47*$E$61)-(G47*$E$61),-(G47*$E$61)),0)+IFERROR(IF(E46<>\"\",(G46*E46*$E$61)-(G46*$E$61),-(G46*$E$61)),0)+IFERROR(IF(E45<>\"\",(G45*E45*$E$61)-(G45*$E$61),-(G45*$E$61)),0)+IFERROR(IF(E44<>\"\",(G44*E44*$E$61)-(G44*$E$61),-(G44*$E$61)),0)+IFERROR(IF(E43<>\"\",(G43*E43*$E$61)-(G43*$E$61),-(G43*$E$61)),0)+IFERROR(IF(E42<>\"\",(G42*E42*$E$61)-(G42*$E$61),-(G42*$E$61)),0)+IFERROR(IF(E41<>\"\",(G41*E41*$E$61)-(G41*$E$61),-(G41*$E$61)),0)+IFERROR(IF(E40<>\"\",(G40*E40*$E$61)-(G40*$E$61),-(G40*$E$61)),0)+IFERROR(IF(E39<>\"\",(G39*E39*$E$61)-(G39*$E$61),-(G39*$E$61)),0)+IFERROR(IF(E38<>\"\",(G38*E38*$E$61)-(G38*$E$61),-(G38*$E$61)),0)+IFERROR(IF(E37<>\"\",(G37*E37*$E$61)-(G37*$E$61),-(G37*$E$61)),0)+IFERROR(IF(E36<>\"\",(G36*E36*$E$61)-(G36*$E$61),-(G36*$E$61)),0)+IFERROR(IF(E35<>\"\",(G35*E35*$E$61)-(G35*$E$61),-(G35*$E$61)),0)+IFERROR(IF(E34<>\"\",(G34*E34*$E$61)-(G34*$E$61),-(G34*$E$61)),0)+IFERROR(IF(E33<>\"\",(G33*E33*$E$61)-(G33*$E$61),-(G33*$E$61)),0)+IFERROR(IF(E32<>\"\",(G32*E32*$E$61)-(G32*$E$61),-(G32*$E$61)),0)+IFERROR(IF(E31<>\"\",(G31*E31*$E$61)-(G31*$E$61),-(G31*$E$61)),0)+IFERROR(IF(E30<>\"\",(G30*E30*$E$61)-(G30*$E$61),-(G30*$E$61)),0)+IFERROR(IF(E29<>\"\",(G29*E29*$E$61)-(G29*$E$61),-(G29*$E$61)),0)=0,\"\",+IFERROR(IF(E60<>\"\",(G60*E60*$E$61)-(G60*$E$61),-(G60*$E$61)),0)+IFERROR(IF(E59<>\"\",(G59*E59*$E$61)-(G59*$E$61),-(G59*$E$61)),0)+IFERROR(IF(E58<>\"\",(G58*E58*$E$61)-(G58*$E$61),-(G58*$E$61)),0)+IFERROR(IF(E57<>\"\",(G57*E57*$E$61)-(G57*$E$61),-(G57*$E$61)),0)+IFERROR(IF(E56<>\"\",(G56*E56*$E$61)-(G56*$E$61),-(G56*$E$61)),0)+IFERROR(IF(E55<>\"\",(G55*E55*$E$61)-(G55*$E$61),-(G55*$E$61)),0)+IFERROR(IF(E54<>\"\",(G54*E54*$E$61)-(G54*$E$61),-(G54*$E$61)),0)+IFERROR(IF(E53<>\"\",(G53*E53*$E$61)-(G53*$E$61),-(G53*$E$61)),0)+IFERROR(IF(E52<>\"\",(G52*E52*$E$61)-(G52*$E$61),-(G52*$E$61)),0)+IFERROR(IF(E51<>\"\",(G51*E51*$E$61)-(G51*$E$61),-(G51*$E$61)),0)+IFERROR(IF(E50<>\"\",(G50*E50*$E$61)-(G50*$E$61),-(G50*$E$61)),0)+IFERROR(IF(E49<>\"\",(G49*E49*$E$61)-(G49*$E$61),-(G49*$E$61)),0)+IFERROR(IF(E48<>\"\",(G48*E48*$E$61)-(G48*$E$61),-(G48*$E$61)),0)+IFERROR(IF(E47<>\"\",(G47*E47*$E$61)-(G47*$E$61),-(G47*$E$61)),0)+IFERROR(IF(E46<>\"\",(G46*E46*$E$61)-(G46*$E$61),-(G46*$E$61)),0)+IFERROR(IF(E45<>\"\",(G45*E45*$E$61)-(G45*$E$61),-(G45*$E$61)),0)+IFERROR(IF(E44<>\"\",(G44*E44*$E$61)-(G44*$E$61),-(G44*$E$61)),0)+IFERROR(IF(E43<>\"\",(G43*E43*$E$61)-(G43*$E$61),-(G43*$E$61)),0)+IFERROR(IF(E42<>\"\",(G42*E42*$E$61)-(G42*$E$61),-(G42*$E$61)),0)+IFERROR(IF(E41<>\"\",(G41*E41*$E$61)-(G41*$E$61),-(G41*$E$61)),0)+IFERROR(IF(E40<>\"\",(G40*E40*$E$61)-(G40*$E$61),-(G40*$E$61)),0)+IFERROR(IF(E39<>\"\",(G39*E39*$E$61)-(G39*$E$61),-(G39*$E$61)),0)+IFERROR(IF(E38<>\"\",(G38*E38*$E$61)-(G38*$E$61),-(G38*$E$61)),0)+IFERROR(IF(E37<>\"\",(G37*E37*$E$61)-(G37*$E$61),-(G37*$E$61)),0)+IFERROR(IF(E36<>\"\",(G36*E36*$E$61)-(G36*$E$61),-(G36*$E$61)),0)+IFERROR(IF(E35<>\"\",(G35*E35*$E$61)-(G35*$E$61),-(G35*$E$61)),0)+IFERROR(IF(E34<>\"\",(G34*E34*$E$61)-(G34*$E$61),-(G34*$E$61)),0)+IFERROR(IF(E33<>\"\",(G33*E33*$E$61)-(G33*$E$61),-(G33*$E$61)),0)+IFERROR(IF(E32<>\"\",(G32*E32*$E$61)-(G32*$E$61),-(G32*$E$61)),0)+IFERROR(IF(E31<>\"\",(G31*E31*$E$61)-(G31*$E$61),-(G31*$E$61)),0)+IFERROR(IF(E30<>\"\",(G30*E30*$E$61)-(G30*$E$61),-(G30*$E$61)),0)+IFERROR(IF(E29<>\"\",(G29*E29*$E$61)-(G29*$E$61),-(G29*$E$61)),0))","v":-204},{"$f":"IF(IFERROR(IF(E60<>\"\",(H60*E60*$E$61)-(H60*$E$61),-(H60*$E$61)),0)+IFERROR(IF(E59<>\"\",(H59*E59*$E$61)-(H59*$E$61),-(H59*$E$61)),0)+IFERROR(IF(E58<>\"\",(H58*E58*$E$61)-(H58*$E$61),-(H58*$E$61)),0)+IFERROR(IF(E57<>\"\",(H57*E57*$E$61)-(H57*$E$61),-(H57*$E$61)),0)+IFERROR(IF(E56<>\"\",(H56*E56*$E$61)-(H56*$E$61),-(H56*$E$61)),0)+IFERROR(IF(E55<>\"\",(H55*E55*$E$61)-(H55*$E$61),-(H55*$E$61)),0)+IFERROR(IF(E54<>\"\",(H54*E54*$E$61)-(H54*$E$61),-(H54*$E$61)),0)+IFERROR(IF(E53<>\"\",(H53*E53*$E$61)-(H53*$E$61),-(H53*$E$61)),0)+IFERROR(IF(E52<>\"\",(H52*E52*$E$61)-(H52*$E$61),-(H52*$E$61)),0)+IFERROR(IF(E51<>\"\",(H51*E51*$E$61)-(H51*$E$61),-(H51*$E$61)),0)+IFERROR(IF(E50<>\"\",(H50*E50*$E$61)-(H50*$E$61),-(H50*$E$61)),0)+IFERROR(IF(E49<>\"\",(H49*E49*$E$61)-(H49*$E$61),-(H49*$E$61)),0)+IFERROR(IF(E48<>\"\",(H48*E48*$E$61)-(H48*$E$61),-(H48*$E$61)),0)+IFERROR(IF(E47<>\"\",(H47*E47*$E$61)-(H47*$E$61),-(H47*$E$61)),0)+IFERROR(IF(E46<>\"\",(H46*E46*$E$61)-(H46*$E$61),-(H46*$E$61)),0)+IFERROR(IF(E45<>\"\",(H45*E45*$E$61)-(H45*$E$61),-(H45*$E$61)),0)+IFERROR(IF(E44<>\"\",(H44*E44*$E$61)-(H44*$E$61),-(H44*$E$61)),0)+IFERROR(IF(E43<>\"\",(H43*E43*$E$61)-(H43*$E$61),-(H43*$E$61)),0)+IFERROR(IF(E42<>\"\",(H42*E42*$E$61)-(H42*$E$61),-(H42*$E$61)),0)+IFERROR(IF(E41<>\"\",(H41*E41*$E$61)-(H41*$E$61),-(H41*$E$61)),0)+IFERROR(IF(E40<>\"\",(H40*E40*$E$61)-(H40*$E$61),-(H40*$E$61)),0)+IFERROR(IF(E39<>\"\",(H39*E39*$E$61)-(H39*$E$61),-(H39*$E$61)),0)+IFERROR(IF(E38<>\"\",(H38*E38*$E$61)-(H38*$E$61),-(H38*$E$61)),0)+IFERROR(IF(E37<>\"\",(H37*E37*$E$61)-(H37*$E$61),-(H37*$E$61)),0)+IFERROR(IF(E36<>\"\",(H36*E36*$E$61)-(H36*$E$61),-(H36*$E$61)),0)+IFERROR(IF(E35<>\"\",(H35*E35*$E$61)-(H35*$E$61),-(H35*$E$61)),0)+IFERROR(IF(E34<>\"\",(H34*E34*$E$61)-(H34*$E$61),-(H34*$E$61)),0)+IFERROR(IF(E33<>\"\",(H33*E33*$E$61)-(H33*$E$61),-(H33*$E$61)),0)+IFERROR(IF(E32<>\"\",(H32*E32*$E$61)-(H32*$E$61),-(H32*$E$61)),0)+IFERROR(IF(E31<>\"\",(H31*E31*$E$61)-(H31*$E$61),-(H31*$E$61)),0)+IFERROR(IF(E30<>\"\",(H30*E30*$E$61)-(H30*$E$61),-(H30*$E$61)),0)+IFERROR(IF(E29<>\"\",(H29*E29*$E$61)-(H29*$E$61),-(H29*$E$61)),0)=0,\"\",IFERROR(IF(E60<>\"\",(H60*E60*$E$61)-(H60*$E$61),-(H60*$E$61)),0)+IFERROR(IF(E59<>\"\",(H59*E59*$E$61)-(H59*$E$61),-(H59*$E$61)),0)+IFERROR(IF(E58<>\"\",(H58*E58*$E$61)-(H58*$E$61),-(H58*$E$61)),0)+IFERROR(IF(E57<>\"\",(H57*E57*$E$61)-(H57*$E$61),-(H57*$E$61)),0)+IFERROR(IF(E56<>\"\",(H56*E56*$E$61)-(H56*$E$61),-(H56*$E$61)),0)+IFERROR(IF(E55<>\"\",(H55*E55*$E$61)-(H55*$E$61),-(H55*$E$61)),0)+IFERROR(IF(E54<>\"\",(H54*E54*$E$61)-(H54*$E$61),-(H54*$E$61)),0)+IFERROR(IF(E53<>\"\",(H53*E53*$E$61)-(H53*$E$61),-(H53*$E$61)),0)+IFERROR(IF(E52<>\"\",(H52*E52*$E$61)-(H52*$E$61),-(H52*$E$61)),0)+IFERROR(IF(E51<>\"\",(H51*E51*$E$61)-(H51*$E$61),-(H51*$E$61)),0)+IFERROR(IF(E50<>\"\",(H50*E50*$E$61)-(H50*$E$61),-(H50*$E$61)),0)+IFERROR(IF(E49<>\"\",(H49*E49*$E$61)-(H49*$E$61),-(H49*$E$61)),0)+IFERROR(IF(E48<>\"\",(H48*E48*$E$61)-(H48*$E$61),-(H48*$E$61)),0)+IFERROR(IF(E47<>\"\",(H47*E47*$E$61)-(H47*$E$61),-(H47*$E$61)),0)+IFERROR(IF(E46<>\"\",(H46*E46*$E$61)-(H46*$E$61),-(H46*$E$61)),0)+IFERROR(IF(E45<>\"\",(H45*E45*$E$61)-(H45*$E$61),-(H45*$E$61)),0)+IFERROR(IF(E44<>\"\",(H44*E44*$E$61)-(H44*$E$61),-(H44*$E$61)),0)+IFERROR(IF(E43<>\"\",(H43*E43*$E$61)-(H43*$E$61),-(H43*$E$61)),0)+IFERROR(IF(E42<>\"\",(H42*E42*$E$61)-(H42*$E$61),-(H42*$E$61)),0)+IFERROR(IF(E41<>\"\",(H41*E41*$E$61)-(H41*$E$61),-(H41*$E$61)),0)+IFERROR(IF(E40<>\"\",(H40*E40*$E$61)-(H40*$E$61),-(H40*$E$61)),0)+IFERROR(IF(E39<>\"\",(H39*E39*$E$61)-(H39*$E$61),-(H39*$E$61)),0)+IFERROR(IF(E38<>\"\",(H38*E38*$E$61)-(H38*$E$61),-(H38*$E$61)),0)+IFERROR(IF(E37<>\"\",(H37*E37*$E$61)-(H37*$E$61),-(H37*$E$61)),0)+IFERROR(IF(E36<>\"\",(H36*E36*$E$61)-(H36*$E$61),-(H36*$E$61)),0)+IFERROR(IF(E35<>\"\",(H35*E35*$E$61)-(H35*$E$61),-(H35*$E$61)),0)+IFERROR(IF(E34<>\"\",(H34*E34*$E$61)-(H34*$E$61),-(H34*$E$61)),0)+IFERROR(IF(E33<>\"\",(H33*E33*$E$61)-(H33*$E$61),-(H33*$E$61)),0)+IFERROR(IF(E32<>\"\",(H32*E32*$E$61)-(H32*$E$61),-(H32*$E$61)),0)+IFERROR(IF(E31<>\"\",(H31*E31*$E$61)-(H31*$E$61),-(H31*$E$61)),0)+IFERROR(IF(E30<>\"\",(H30*E30*$E$61)-(H30*$E$61),-(H30*$E$61)),0)+IFERROR(IF(E29<>\"\",(H29*E29*$E$61)-(H29*$E$61),-(H29*$E$61)),0))","v":-233.4}]
[null,null,null,{"$f":"IF(G62=\"\",\"\",\"Remise accordée\")","v":"Remise accordée"},null,null,{"$f":"IF(+IFERROR(-$E29*G29,0)+IFERROR(-$E30*G30,0)+IFERROR(-$E31*G31,0)+IFERROR(-$E32*G32,0)+IFERROR(-$E33*G33,0)+IFERROR(-$E34*G34,0)+IFERROR(-$E35*G35,0)+IFERROR(-$E36*G36,0)+IFERROR(-$E37*G37,0)+IFERROR(-$E38*G38,0)+IFERROR(-$E39*G39,0)+IFERROR(-$E40*G40,0)+IFERROR(-$E41*G41,0)+IFERROR(-$E42*G42,0)+IFERROR(-$E43*G43,0)+IFERROR(-$E44*G44,0)+IFERROR(-$E45*G45,0)+IFERROR(-$E46*G46,0)+IFERROR(-$E47*G47,0)+IFERROR(-$E48*G48,0)+IFERROR(-$E49*G49,0)+IFERROR(-$E50*G50,0)+IFERROR(-$E51*G51,0)+IFERROR(-$E52*G52,0)+IFERROR(-$E53*G53,0)+IFERROR(-$E54*G54,0)+IFERROR(-$E55*G55,0)+IFERROR(-$E56*G56,0)+IFERROR(-$E57*G57,0)+IFERROR(-$E58*G58,0)+IFERROR(-$E59*G59,0)+IFERROR(-$E60*G60,0)=0,\"\",+IFERROR(-$E29*G29,0)+IFERROR(-$E30*G30,0)+IFERROR(-$E31*G31,0)+IFERROR(-$E32*G32,0)+IFERROR(-$E33*G33,0)+IFERROR(-$E34*G34,0)+IFERROR(-$E35*G35,0)+IFERROR(-$E36*G36,0)+IFERROR(-$E37*G37,0)+IFERROR(-$E38*G38,0)+IFERROR(-$E39*G39,0)+IFERROR(-$E40*G40,0)+IFERROR(-$E41*G41,0)+IFERROR(-$E42*G42,0)+IFERROR(-$E43*G43,0)+IFERROR(-$E44*G44,0)+IFERROR(-$E45*G45,0)+IFERROR(-$E46*G46,0)+IFERROR(-$E47*G47,0)+IFERROR(-$E48*G48,0)+IFERROR(-$E49*G49,0)+IFERROR(-$E50*G50,0)+IFERROR(-$E51*G51,0)+IFERROR(-$E52*G52,0)+IFERROR(-$E53*G53,0)+IFERROR(-$E54*G54,0)+IFERROR(-$E55*G55,0)+IFERROR(-$E56*G56,0)+IFERROR(-$E57*G57,0)+IFERROR(-$E58*G58,0)+IFERROR(-$E59*G59,0)+IFERROR(-$E60*G60,0))","v":-20},{"$f":"IF(+IFERROR(-$E29*H29,0)+IFERROR(-$E30*H30,0)+IFERROR(-$E31*H31,0)+IFERROR(-$E32*H32,0)+IFERROR(-$E33*H33,0)+IFERROR(-$E34*H34,0)+IFERROR(-$E35*H35,0)+IFERROR(-$E36*H36,0)+IFERROR(-$E37*H37,0)+IFERROR(-$E38*H38,0)+IFERROR(-$E39*H39,0)+IFERROR(-$E40*H40,0)+IFERROR(-$E41*H41,0)+IFERROR(-$E42*H42,0)+IFERROR(-$E43*H43,0)+IFERROR(-$E44*H44,0)+IFERROR(-$E45*H45,0)+IFERROR(-$E46*H46,0)+IFERROR(-$E47*H47,0)+IFERROR(-$E48*H48,0)+IFERROR(-$E49*H49,0)+IFERROR(-$E50*H50,0)+IFERROR(-$E51*H51,0)+IFERROR(-$E52*H52,0)+IFERROR(-$E53*H53,0)+IFERROR(-$E54*H54,0)+IFERROR(-$E55*H55,0)+IFERROR(-$E56*H56,0)+IFERROR(-$E57*H57,0)+IFERROR(-$E58*H58,0)+IFERROR(-$E59*H59,0)+IFERROR(-$E60*H60,0)=0,\"\",+IFERROR(-$E29*H29,0)+IFERROR(-$E30*H30,0)+IFERROR(-$E31*H31,0)+IFERROR(-$E32*H32,0)+IFERROR(-$E33*H33,0)+IFERROR(-$E34*H34,0)+IFERROR(-$E35*H35,0)+IFERROR(-$E36*H36,0)+IFERROR(-$E37*H37,0)+IFERROR(-$E38*H38,0)+IFERROR(-$E39*H39,0)+IFERROR(-$E40*H40,0)+IFERROR(-$E41*H41,0)+IFERROR(-$E42*H42,0)+IFERROR(-$E43*H43,0)+IFERROR(-$E44*H44,0)+IFERROR(-$E45*H45,0)+IFERROR(-$E46*H46,0)+IFERROR(-$E47*H47,0)+IFERROR(-$E48*H48,0)+IFERROR(-$E49*H49,0)+IFERROR(-$E50*H50,0)+IFERROR(-$E51*H51,0)+IFERROR(-$E52*H52,0)+IFERROR(-$E53*H53,0)+IFERROR(-$E54*H54,0)+IFERROR(-$E55*H55,0)+IFERROR(-$E56*H56,0)+IFERROR(-$E57*H57,0)+IFERROR(-$E58*H58,0)+IFERROR(-$E59*H59,0)+IFERROR(-$E60*H60,0))","v":-22}]
[]
[]
[]
[]
[]
[]
[null,null,"Relevé d'Identité Bancaire",null,null,null,"Montant HT","TVA","Montant TTC"]
[null,null,"Banque       Guichet       Numéro de compte       Clé ",null,null,"Total I",{"$f":"SUM(G29:G59)","v":700},{"$f":"I70-G70","v":100},{"$f":"SUM(H29:H59)","v":800}]
[null,null,"00000          00000         00000000000                  00",null,null,{"$f":"IF(G62=\"\",\"\",\"dont remises\")","v":"dont remises"},{"$f":"IF(G62=\"\",\"\",G62)","v":-20},{"$f":"IF(F71=\"\",\"\",I71-G71)","v":-2},{"$f":"IF(H62=\"\",\"\",H62)","v":-22}]
[null,null,"Bank",null,null,{"$f":"IF(G62=\"\",\"\",\"Total II\")","v":"Total II"},{"$f":"IF($F72=\"\",\"\",G70+G71)","v":680},{"$f":"IF($F72=\"\",\"\",H70+H71)","v":98},{"$f":"IF($F72=\"\",\"\",I70+I71)","v":778}]
[null,null,"IBAN : FR00 0000 0000 0000 0000 0000 000",null,null,{"$f":"IF(E10=\"OUI\",\"dont acompte:\",\"\")","v":"dont acompte:"},{"$f":"IF($E$10=\"oui\",-G70*0.3,\"\")","v":-210},{"$f":"IF($E$10=\"oui\",-H70*0.3,\"\")","v":-30},-240]
[null,null,"BIC :    CCCCCCCCCCCC",null,null,{"$f":"IF(AND(F73=\"\",F71=\"\"),\"\",IF(F72=\"\",\"Total II\",\"Total III\"))","v":"Total III"},{"$f":"IF(AND(F73=\"\",F71=\"\"),\"\",IF(F72=\"\",G70+G73,G72+G73))","v":470},{"$f":"IF(AND(G73=\"\",G71=\"\"),\"\",IF(G72=\"\",H70+H73,H72+H73))","v":68},538]
[null,null,null,null,null,{"$f":"CONCATENATE(\"Reste à régler : \",TEXT(ROUND(I75,2),\"#### 000\"),\" EUR par \",D76,\".\")","v":"Reste à régler : 538 EUR par virement."},null,null,{"$f":"IF(I74<>\"\",I74,IF(I72<>\"\",I72,I70))","v":538}]
[null,null,"Règlement :",{"$f":"IF(C29<>\"\",INDIRECT(\"'\"&$H$4&\"'!H\"&C29),\"\")","v":"virement"},null,"Merci de votre confiance."]
[null,null,"Échéance :",{"$f":"EOMONTH(H14+1,0)","v":"1900-01-31"},null,"www.xxx.fr",null,null,"Page 1 sur 1"]

{"sheet":"Chiffre affaires","index":7,"n_rows":49,"n_cols":13,"rows_kept":49,"cut":false,"hidden":false,"merged":[]}
["année","*","Taper * pour toutes les années"]
["Type","Réalisé"]
["Onglet","Base prestations"]
[]
["Mois",1,{"$f":"B5+1","v":2},{"$f":"C5+1","v":3},4,5,6,7,8,9,10,11,12]
["CA",{"$f":"IF($B$1=\"*\",SUMIFS('Base prestations'!$D:$D,'Base prestations'!$S:$S,B$5,'Base prestations'!$U:$U,$B$2),SUMIFS('Base prestations'!$D:$D,'Base prestations'!$S:$S,B$5,'Base prestations'!$T:$T,$B$1,'Base prestations'!$U:$U,$B$2))","v":0},{"$f":"IF($B$1=\"*\",SUMIFS('Base prestations'!$D:$D,'Base prestations'!$S:$S,C$5,'Base prestations'!$U:$U,$B$2),SUMIFS('Base prestations'!$D:$D,'Base prestations'!$S:$S,C$5,'Base prestations'!$T:$T,$B$1,'Base prestations'!$U:$U,$B$2))","v":0},{"$f":"IF($B$1=\"*\",SUMIFS('Base prestations'!$D:$D,'Base prestations'!$S:$S,D$5,'Base prestations'!$U:$U,$B$2),SUMIFS('Base prestations'!$D:$D,'Base prestations'!$S:$S,D$5,'Base prestations'!$T:$T,$B$1,'Base prestations'!$U:$U,$B$2))","v":0},{"$f":"IF($B$1=\"*\",SUMIFS('Base prestations'!$D:$D,'Base prestations'!$S:$S,E$5,'Base prestations'!$U:$U,$B$2),SUMIFS('Base prestations'!$D:$D,'Base prestations'!$S:$S,E$5,'Base prestations'!$T:$T,$B$1,'Base prestations'!$U:$U,$B$2))","v":0},{"$f":"IF($B$1=\"*\",SUMIFS('Base prestations'!$D:$D,'Base prestations'!$S:$S,F$5,'Base prestations'!$U:$U,$B$2),SUMIFS('Base prestations'!$D:$D,'Base prestations'!$S:$S,F$5,'Base prestations'!$T:$T,$B$1,'Base prestations'!$U:$U,$B$2))","v":300},{"$f":"IF($B$1=\"*\",SUMIFS('Base prestations'!$D:$D,'Base prestations'!$S:$S,G$5,'Base prestations'!$U:$U,$B$2),SUMIFS('Base prestations'!$D:$D,'Base prestations'!$S:$S,G$5,'Base prestations'!$T:$T,$B$1,'Base prestations'!$U:$U,$B$2))","v":0},{"$f":"IF($B$1=\"*\",SUMIFS('Base prestations'!$D:$D,'Base prestations'!$S:$S,H$5,'Base prestations'!$U:$U,$B$2),SUMIFS('Base prestations'!$D:$D,'Base prestations'!$S:$S,H$5,'Base prestations'!$T:$T,$B$1,'Base prestations'!$U:$U,$B$2))","v":0},{"$f":"IF($B$1=\"*\",SUMIFS('Base prestations'!$D:$D,'Base prestations'!$S:$S,I$5,'Base prestations'!$U:$U,$B$2),SUMIFS('Base prestations'!$D:$D,'Base prestations'!$S:$S,I$5,'Base prestations'!$T:$T,$B$1,'Base prestations'!$U:$U,$B$2))","v":0},{"$f":"IF($B$1=\"*\",SUMIFS('Base prestations'!$D:$D,'Base prestations'!$S:$S,J$5,'Base prestations'!$U:$U,$B$2),SUMIFS('Base prestations'!$D:$D,'Base prestations'!$S:$S,J$5,'Base prestations'!$T:$T,$B$1,'Base prestations'!$U:$U,$B$2))","v":0},{"$f":"IF($B$1=\"*\",SUMIFS('Base prestations'!$D:$D,'Base prestations'!$S:$S,K$5,'Base prestations'!$U:$U,$B$2),SUMIFS('Base prestations'!$D:$D,'Base prestations'!$S:$S,K$5,'Base prestations'!$T:$T,$B$1,'Base prestations'!$U:$U,$B$2))","v":0},{"$f":"IF($B$1=\"*\",SUMIFS('Base prestations'!$D:$D,'Base prestations'!$S:$S,L$5,'Base prestations'!$U:$U,$B$2),SUMIFS('Base prestations'!$D:$D,'Base prestations'!$S:$S,L$5,'Base prestations'!$T:$T,$B$1,'Base prestations'!$U:$U,$B$2))","v":0},{"$f":"IF($B$1=\"*\",SUMIFS('Base prestations'!$D:$D,'Base prestations'!$S:$S,M$5,'Base prestations'!$U:$U,$B$2),SUMIFS('Base prestations'!$D:$D,'Base prestations'!$S:$S,M$5,'Base prestations'!$T:$T,$B$1,'Base prestations'!$U:$U,$B$2))","v":0}]
[null,"Chiffre d'affaires"]
[null,"Ceci est un onglet de consultation, pas de modification possible"]
[]
[null,{"$f":"IF(B1=\"*\",\"Toutes les années\",B1)","v":"Toutes les années"},{"$f":"\"Chiffre d'affaires \"&B2","v":"Chiffre d'affaires Réalisé"}]
[1,"JANVIER",{"$f":"SUMIF($A$5:$ALL$5,A11,$A$6:$ALL$6)","v":0}]
[2,"FÉVRIER",{"$f":"SUMIF($A$5:$ALL$5,A12,$A$6:$ALL$6)","v":0}]
[3,"MARS",0]
[4,"AVRIL",0]
[5,"MAI",300]
[6,"JUIN",0]
[7,"JUILLET",0]
[8,"AOÛT",0]
[9,"SEPTEMBRE",0]
[10,"OCTOBRE",0]
[11,"NOVEMBRE",0]
[12,"DÉCEMBRE",0]
[]
[null,"TOTAL",{"$f":"SUM(C11:C22)","v":300}]
[]
["année","*","Taper * pour toutes les années"]
["Type","En attente"]
["Onglet","Base prestations"]
[]
["Mois",1,{"$f":"B30+1","v":2},{"$f":"C30+1","v":3},{"$f":"D30+1","v":4},{"$f":"E30+1","v":5},{"$f":"F30+1","v":6},{"$f":"G30+1","v":7},{"$f":"H30+1","v":8},{"$f":"I30+1","v":9},{"$f":"J30+1","v":10},{"$f":"K30+1","v":11},{"$f":"L30+1","v":12}]
["CA",{"$f":"IF($B$26=\"*\",SUMIFS('Base prestations'!$D:$D,'Base prestations'!$S:$S,B$30,'Base prestations'!$U:$U,$B$27),SUMIFS('Base prestations'!$D:$D,'Base prestations'!$S:$S,B$30,'Base prestations'!$T:$T,$B$26,'Base prestations'!$U:$U,$B$27))","v":0},{"$f":"IF($B$26=\"*\",SUMIFS('Base prestations'!$D:$D,'Base prestations'!$S:$S,C$30,'Base prestations'!$U:$U,$B$27),SUMIFS('Base prestations'!$D:$D,'Base prestations'!$S:$S,C$30,'Base prestations'!$T:$T,$B$26,'Base prestations'!$U:$U,$B$27))","v":0},{"$f":"IF($B$26=\"*\",SUMIFS('Base prestations'!$D:$D,'Base prestations'!$S:$S,D$30,'Base prestations'!$U:$U,$B$27),SUMIFS('Base prestations'!$D:$D,'Base prestations'!$S:$S,D$30,'Base prestations'!$T:$T,$B$26,'Base prestations'!$U:$U,$B$27))","v":0},{"$f":"IF($B$26=\"*\",SUMIFS('Base prestations'!$D:$D,'Base prestations'!$S:$S,E$30,'Base prestations'!$U:$U,$B$27),SUMIFS('Base prestations'!$D:$D,'Base prestations'!$S:$S,E$30,'Base prestations'!$T:$T,$B$26,'Base prestations'!$U:$U,$B$27))","v":0},{"$f":"IF($B$26=\"*\",SUMIFS('Base prestations'!$D:$D,'Base prestations'!$S:$S,F$30,'Base prestations'!$U:$U,$B$27),SUMIFS('Base prestations'!$D:$D,'Base prestations'!$S:$S,F$30,'Base prestations'!$T:$T,$B$26,'Base prestations'!$U:$U,$B$27))","v":0},{"$f":"IF($B$26=\"*\",SUMIFS('Base prestations'!$D:$D,'Base prestations'!$S:$S,G$30,'Base prestations'!$U:$U,$B$27),SUMIFS('Base prestations'!$D:$D,'Base prestations'!$S:$S,G$30,'Base prestations'!$T:$T,$B$26,'Base prestations'!$U:$U,$B$27))","v":0},{"$f":"IF($B$26=\"*\",SUMIFS('Base prestations'!$D:$D,'Base prestations'!$S:$S,H$30,'Base prestations'!$U:$U,$B$27),SUMIFS('Base prestations'!$D:$D,'Base prestations'!$S:$S,H$30,'Base prestations'!$T:$T,$B$26,'Base prestations'!$U:$U,$B$27))","v":0},{"$f":"IF($B$26=\"*\",SUMIFS('Base prestations'!$D:$D,'Base prestations'!$S:$S,I$30,'Base prestations'!$U:$U,$B$27),SUMIFS('Base prestations'!$D:$D,'Base prestations'!$S:$S,I$30,'Base prestations'!$T:$T,$B$26,'Base prestations'!$U:$U,$B$27))","v":0},{"$f":"IF($B$26=\"*\",SUMIFS('Base prestations'!$D:$D,'Base prestations'!$S:$S,J$30,'Base prestations'!$U:$U,$B$27),SUMIFS('Base prestations'!$D:$D,'Base prestations'!$S:$S,J$30,'Base prestations'!$T:$T,$B$26,'Base prestations'!$U:$U,$B$27))","v":0},{"$f":"IF($B$26=\"*\",SUMIFS('Base prestations'!$D:$D,'Base prestations'!$S:$S,K$30,'Base prestations'!$U:$U,$B$27),SUMIFS('Base prestations'!$D:$D,'Base prestations'!$S:$S,K$30,'Base prestations'!$T:$T,$B$26,'Base prestations'!$U:$U,$B$27))","v":0},{"$f":"IF($B$26=\"*\",SUMIFS('Base prestations'!$D:$D,'Base prestations'!$S:$S,L$30,'Base prestations'!$U:$U,$B$27),SUMIFS('Base prestations'!$D:$D,'Base prestations'!$S:$S,L$30,'Base prestations'!$T:$T,$B$26,'Base prestations'!$U:$U,$B$27))","v":0},{"$f":"IF($B$26=\"*\",SUMIFS('Base prestations'!$D:$D,'Base prestations'!$S:$S,M$30,'Base prestations'!$U:$U,$B$27),SUMIFS('Base prestations'!$D:$D,'Base prestations'!$S:$S,M$30,'Base prestations'!$T:$T,$B$26,'Base prestations'!$U:$U,$B$27))","v":0}]
[null,"Chiffre d'affaires"]
[null,"Ceci est un onglet de consultation, pas de modification possible"]
[]
[null,{"$f":"IF(B26=\"*\",\"Toutes les années\",B26)","v":"Toutes les années"},{"$f":"\"Chiffre d'affaires \"&B27","v":"Chiffre d'affaires En attente"}]
[1,"JANVIER",{"$f":"SUMIF($A$30:$ALL$30,A36,$A$31:$ALL$31)","v":0}]
[2,"FÉVRIER",{"$f":"SUMIF($A$30:$ALL$30,A37,$A$31:$ALL$31)","v":0}]
[3,"MARS",0]
[4,"AVRIL",0]
[5,"MAI",0]
[6,"JUIN",0]
[7,"JUILLET",0]
[8,"AOÛT",0]
[9,"SEPTEMBRE",0]
[10,"OCTOBRE",0]
[11,"NOVEMBRE",0]
[12,"DÉCEMBRE",0]
[]
[null,"TOTAL",{"$f":"SUM(C36:C47)","v":0}]

{"sheet":"outils TTC ou HT","index":8,"n_rows":13,"n_cols":5,"rows_kept":13,"cut":false,"hidden":false,"merged":[]}
[]
[]
[]
[]
[]
[]
[]
[]
[null,"Taux TVA","Montant HT","Montant TVA","Montant TTC"]
[null,0.2,{"$f":"2405.76-1749","v":656.76000000000022},{"$f":"E10-C10","v":131.35199999999998},{"$f":"C10*(1+B10)","v":788.11200000000019}]
[]
[null,"Taux TVA","Montant HT","Montant TVA","Montant TTC"]
[null,0.2,{"$f":"E13-D13","v":1155.7583333333334},{"$f":"-E13/(1+B13)+E13","v":231.15166666666664},1386.91]

{"sheet":"Table","index":9,"n_rows":2841,"n_cols":1,"rows_kept":2841,"cut":false,"hidden":true,"merged":[]}
["Prestations"]
[1]
[2]
[3]
[4]
[5]
[6]
[7]
[8]
[9]
[10]
[11]
[12]
[13]
[14]
[15]
[16]
[17]
[18]
[19]
[20]
[21]
[22]
[23]
[24]
[25]
[26]
[27]
[28]
[29]
[30]
[31]
[32]
[33]
[34]
[35]
[36]
[37]
[38]
[39]
[40]
[41]
[42]
[43]
[44]
[45]
[46]
[47]
[48]
[49]
[50]
[51]
[52]
[53]
[54]
[55]
[56]
[57]
[58]
[59]
[60]
[61]
[62]
[63]
[64]
[65]
[66]
[67]
[68]
[69]
[70]
[71]
[72]
[73]
[74]
[75]
[76]
[77]
[78]
[79]
[80]
[81]
[82]
[83]
[84]
[85]
[86]
[87]
[88]
[89]
[90]
[91]
[92]
[93]
[94]
[95]
[96]
[97]
[98]
[99]
[100]
[101]
[102]
[103]
[104]
[105]
[106]
[107]
[108]
[109]
[110]
[111]
[112]
[113]
[114]
[115]
[116]
[117]
[118]
[119]
[120]
[121]
[122]
[123]
[124]
[125]
[126]
[127]
[128]
[129]
[130]
[131]
[132]
[133]
[134]
[135]
[136]
[137]
[138]
[139]
[140]
[141]
[142]
[143]
[144]
[145]
[146]
[147]
[148]
[149]
[150]
[151]
[152]
[153]
[154]
[155]
[156]
[157]
[158]
[159]
[160]
[161]
[162]
[163]
[164]
[165]
[166]
[167]
[168]
[169]
[170]
[171]
[172]
[173]
[174]
[175]
[176]
[177]
[178]
[179]
[180]
[181]
[182]
[183]
[184]
[185]
[186]
[187]
[188]
[189]
[190]
[191]
[192]
[193]
[194]
[195]
[196]
[197]
[198]
[199]
[200]
[201]
[202]
[203]
[204]
[205]
[206]
[207]
[208]
[209]
[210]
[211]
[212]
[213]
[214]
[215]
[216]
[217]
[218]
[219]
[220]
[221]
[222]
[223]
[224]
[225]
[226]
[227]
[228]
[229]
[230]
[231]
[232]
[233]
[234]
[235]
[236]
[237]
[238]
[239]
[240]
[241]
[242]
[243]
[244]
[245]
[246]
[247]
[248]
[249]
[250]
[251]
[252]
[253]
[254]
[255]
[256]
[257]
[258]
[259]
[260]
[261]
[262]
[263]
[264]
[265]
[266]
[267]
[268]
[269]
[270]
[271]
[272]
[273]
[274]
[275]
[276]
[277]
[278]
[279]
[280]
[281]
[282]
[283]
[284]
[285]
[286]
[287]
[288]
[289]
[290]
[291]
[292]
[293]
[294]
[295]
[296]
[297]
[298]
[299]
[300]
[301]
[302]
[303]
[304]
[305]
[306]
[307]
[308]
[309]
[310]
[311]
[312]
[313]
[314]
[315]
[316]
[317]
[318]
[319]
[320]
[321]
[322]
[323]
[324]
[325]
[326]
[327]
[328]
[329]
[330]
[331]
[332]
[333]
[334]
[335]
[336]
[337]
[338]
[339]
[340]
[341]
[342]
[343]
[344]
[345]
[346]
[347]
[348]
[349]
[350]
[351]
[352]
[353]
[354]
[355]
[356]
[357]
[358]
[359]
[360]
[361]
[362]
[363]
[364]
[365]
[366]
[367]
[368]
[369]
[370]
[371]
[372]
[373]
[374]
[375]
[376]
[377]
[378]
[379]
[380]
[381]
[382]
[383]
[384]
[385]
[386]
[387]
[388]
[389]
[390]
[391]
[392]
[393]
[394]
[395]
[396]
[397]
[398]
[399]
[400]
[401]
[402]
[403]
[404]
[405]
[406]
[407]
[408]
[409]
[410]
[411]
[412]
[413]
[414]
[415]
[416]
[417]
[418]
[419]
[420]
[421]
[422]
[423]
[424]
[425]
[426]
[427]
[428]
[429]
[430]
[431]
[432]
[433]
[434]
[435]
[436]
[437]
[438]
[439]
[440]
[441]
[442]
[443]
[444]
[445]
[446]
[447]
[448]
[449]
[450]
[451]
[452]
[453]
[454]
[455]
[456]
[457]
[458]
[459]
[460]
[461]
[462]
[463]
[464]
[465]
[466]
[467]
[468]
[469]
[470]
[471]
[472]
[473]
[474]
[475]
[476]
[477]
[478]
[479]
[480]
[481]
[482]
[483]
[484]
[485]
[486]
[487]
[488]
[489]
[490]
[491]
[492]
[493]
[494]
[495]
[496]
[497]
[498]
[499]
[500]
[501]
[502]
[503]
[504]
[505]
[506]
[507]
[508]
[509]
[510]
[511]
[512]
[513]
[514]
[515]
[516]
[517]
[518]
[519]
[520]
[521]
[522]
[523]
[524]
[525]
[526]
[527]
[528]
[529]
[530]
[531]
[532]
[533]
[534]
[535]
[536]
[537]
[538]
[539]
[540]
[541]
[542]
[543]
[544]
[545]
[546]
[547]
[548]
[549]
[550]
[551]
[552]
[553]
[554]
[555]
[556]
[557]
[558]
[559]
[560]
[561]
[562]
[563]
[564]
[565]
[566]
[567]
[568]
[569]
[570]
[571]
[572]
[573]
[574]
[575]
[576]
[577]
[578]
[579]
[580]
[581]
[582]
[583]
[584]
[585]
[586]
[587]
[588]
[589]
[590]
[591]
[592]
[593]
[594]
[595]
[596]
[597]
[598]
[599]
[600]
[601]
[602]
[603]
[604]
[605]
[606]
[607]
[608]
[609]
[610]
[611]
[612]
[613]
[614]
[615]
[616]
[617]
[618]
[619]
[620]
[621]
[622]
[623]
[624]
[625]
[626]
[627]
[628]
[629]
[630]
[631]
[632]
[633]
[634]
[635]
[636]
[637]
[638]
[639]
[640]
[641]
[642]
[643]
[644]
[645]
[646]
[647]
[648]
[649]
[650]
[651]
[652]
[653]
[654]
[655]
[656]
[657]
[658]
[659]
[660]
[661]
[662]
[663]
[664]
[665]
[666]
[667]
[668]
[669]
[670]
[671]
[672]
[673]
[674]
[675]
[676]
[677]
[678]
[679]
[680]
[681]
[682]
[683]
[684]
[685]
[686]
[687]
[688]
[689]
[690]
[691]
[692]
[693]
[694]
[695]
[696]
[697]
[698]
[699]
[700]
[701]
[702]
[703]
[704]
[705]
[706]
[707]
[708]
[709]
[710]
[711]
[712]
[713]
[714]
[715]
[716]
[717]
[718]
[719]
[720]
[721]
[722]
[723]
[724]
[725]
[726]
[727]
[728]
[729]
[730]
[731]
[732]
[733]
[734]
[735]
[736]
[737]
[738]
[739]
[740]
[741]
[742]
[743]
[744]
[745]
[746]
[747]
[748]
[749]
[750]
[751]
[752]
[753]
[754]
[755]
[756]
[757]
[758]
[759]
[760]
[761]
[762]
[763]
[764]
[765]
[766]
[767]
[768]
[769]
[770]
[771]
[772]
[773]
[774]
[775]
[776]
[777]
[778]
[779]
[780]
[781]
[782]
[783]
[784]
[785]
[786]
[787]
[788]
[789]
[790]
[791]
[792]
[793]
[794]
[795]
[796]
[797]
[798]
[799]
[800]
[801]
[802]
[803]
[804]
[805]
[806]
[807]
[808]
[809]
[810]
[811]
[812]
[813]
[814]
[815]
[816]
[817]
[818]
[819]
[820]
[821]
[822]
[823]
[824]
[825]
[826]
[827]
[828]
[829]
[830]
[831]
[832]
[833]
[834]
[835]
[836]
[837]
[838]
[839]
[840]
[841]
[842]
[843]
[844]
[845]
[846]
[847]
[848]
[849]
[850]
[851]
[852]
[853]
[854]
[855]
[856]
[857]
[858]
[859]
[860]
[861]
[862]
[863]
[864]
[865]
[866]
[867]
[868]
[869]
[870]
[871]
[872]
[873]
[874]
[875]
[876]
[877]
[878]
[879]
[880]
[881]
[882]
[883]
[884]
[885]
[886]
[887]
[888]
[889]
[890]
[891]
[892]
[893]
[894]
[895]
[896]
[897]
[898]
[899]
[900]
[901]
[902]
[903]
[904]
[905]
[906]
[907]
[908]
[909]
[910]
[911]
[912]
[913]
[914]
[915]
[916]
[917]
[918]
[919]
[920]
[921]
[922]
[923]
[924]
[925]
[926]
[927]
[928]
[929]
[930]
[931]
[932]
[933]
[934]
[935]
[936]
[937]
[938]
[939]
[940]
[941]
[942]
[943]
[944]
[945]
[946]
[947]
[948]
[949]
[950]
[951]
[952]
[953]
[954]
[955]
[956]
[957]
[958]
[959]
[960]
[961]
[962]
[963]
[964]
[965]
[966]
[967]
[968]
[969]
[970]
[971]
[972]
[973]
[974]
[975]
[976]
[977]
[978]
[979]
[980]
[981]
[982]
[983]
[984]
[985]
[986]
[987]
[988]
[989]
[990]
[991]
[992]
[993]
[994]
[995]
[996]
[997]
[998]
[999]
[1000]
[1001]
[1002]
[1003]
[1004]
[1005]
[1006]
[1007]
[1008]
[1009]
[1010]
[1011]
[1012]
[1013]
[1014]
[1015]
[1016]
[1017]
[1018]
[1019]
[1020]
[1021]
[1022]
[1023]
[1024]
[1025]
[1026]
[1027]
[1028]
[1029]
[1030]
[1031]
[1032]
[1033]
[1034]
[1035]
[1036]
[1037]
[1038]
[1039]
[1040]
[1041]
[1042]
[1043]
[1044]
[1045]
[1046]
[1047]
[1048]
[1049]
[1050]
[1051]
[1052]
[1053]
[1054]
[1055]
[1056]
[1057]
[1058]
[1059]
[1060]
[1061]
[1062]
[1063]
[1064]
[1065]
[1066]
[1067]
[1068]
[1069]
[1070]
[1071]
[1072]
[1073]
[1074]
[1075]
[1076]
[1077]
[1078]
[1079]
[1080]
[1081]
[1082]
[1083]
[1084]
[1085]
[1086]
[1087]
[1088]
[1089]
[1090]
[1091]
[1092]
[1093]
[1094]
[1095]
[1096]
[1097]
[1098]
[1099]
[1100]
[1101]
[1102]
[1103]
[1104]
[1105]
[1106]
[1107]
[1108]
[1109]
[1110]
[1111]
[1112]
[1113]
[1114]
[1115]
[1116]
[1117]
[1118]
[1119]
[1120]
[1121]
[1122]
[1123]
[1124]
[1125]
[1126]
[1127]
[1128]
[1129]
[1130]
[1131]
[1132]
[1133]
[1134]
[1135]
[1136]
[1137]
[1138]
[1139]
[1140]
[1141]
[1142]
[1143]
[1144]
[1145]
[1146]
[1147]
[1148]
[1149]
[1150]
[1151]
[1152]
[1153]
[1154]
[1155]
[1156]
[1157]
[1158]
[1159]
[1160]
[1161]
[1162]
[1163]
[1164]
[1165]
[1166]
[1167]
[1168]
[1169]
[1170]
[1171]
[1172]
[1173]
[1174]
[1175]
[1176]
[1177]
[1178]
[1179]
[1180]
[1181]
[1182]
[1183]
[1184]
[1185]
[1186]
[1187]
[1188]
[1189]
[1190]
[1191]
[1192]
[1193]
[1194]
[1195]
[1196]
[1197]
[1198]
[1199]
[1200]
[1201]
[1202]
[1203]
[1204]
[1205]
[1206]
[1207]
[1208]
[1209]
[1210]
[1211]
[1212]
[1213]
[1214]
[1215]
[1216]
[1217]
[1218]
[1219]
[1220]
[1221]
[1222]
[1223]
[1224]
[1225]
[1226]
[1227]
[1228]
[1229]
[1230]
[1231]
[1232]
[1233]
[1234]
[1235]
[1236]
[1237]
[1238]
[1239]
[1240]
[1241]
[1242]
[1243]
[1244]
[1245]
[1246]
[1247]
[1248]
[1249]
[1250]
[1251]
[1252]
[1253]
[1254]
[1255]
[1256]
[1257]
[1258]
[1259]
[1260]
[1261]
[1262]
[1263]
[1264]
[1265]
[1266]
[1267]
[1268]
[1269]
[1270]
[1271]
[1272]
[1273]
[1274]
[1275]
[1276]
[1277]
[1278]
[1279]
[1280]
[1281]
[1282]
[1283]
[1284]
[1285]
[1286]
[1287]
[1288]
[1289]
[1290]
[1291]
[1292]
[1293]
[1294]
[1295]
[1296]
[1297]
[1298]
[1299]
[1300]
[1301]
[1302]
[1303]
[1304]
[1305]
[1306]
[1307]
[1308]
[1309]
[1310]
[1311]
[1312]
[1313]
[1314]
[1315]
[1316]
[1317]
[1318]
[1319]
[1320]
[1321]
[1322]
[1323]
[1324]
[1325]
[1326]
[1327]
[1328]
[1329]
[1330]
[1331]
[1332]
[1333]
[1334]
[1335]
[1336]
[1337]
[1338]
[1339]
[1340]
[1341]
[1342]
[1343]
[1344]
[1345]
[1346]
[1347]
[1348]
[1349]
[1350]
[1351]
[1352]
[1353]
[1354]
[1355]
[1356]
[1357]
[1358]
[1359]
[1360]
[1361]
[1362]
[1363]
[1364]
[1365]
[1366]
[1367]
[1368]
[1369]
[1370]
[1371]
[1372]
[1373]
[1374]
[1375]
[1376]
[1377]
[1378]
[1379]
[1380]
[1381]
[1382]
[1383]
[1384]
[1385]
[1386]
[1387]
[1388]
[1389]
[1390]
[1391]
[1392]
[1393]
[1394]
[1395]
[1396]
[1397]
[1398]
[1399]
[1400]
[1401]
[1402]
[1403]
[1404]
[1405]
[1406]
[1407]
[1408]
[1409]
[1410]
[1411]
[1412]
[1413]
[1414]
[1415]
[1416]
[1417]
[1418]
[1419]
[1420]
[1421]
[1422]
[1423]
[1424]
[1425]
[1426]
[1427]
[1428]
[1429]
[1430]
[1431]
[1432]
[1433]
[1434]
[1435]
[1436]
[1437]
[1438]
[1439]
[1440]
[1441]
[1442]
[1443]
[1444]
[1445]
[1446]
[1447]
[1448]
[1449]
[1450]
[1451]
[1452]
[1453]
[1454]
[1455]
[1456]
[1457]
[1458]
[1459]
[1460]
[1461]
[1462]
[1463]
[1464]
[1465]
[1466]
[1467]
[1468]
[1469]
[1470]
[1471]
[1472]
[1473]
[1474]
[1475]
[1476]
[1477]
[1478]
[1479]
[1480]
[1481]
[1482]
[1483]
[1484]
[1485]
[1486]
[1487]
[1488]
[1489]
[1490]
[1491]
[1492]
[1493]
[1494]
[1495]
[1496]
[1497]
[1498]
[1499]
[1500]
[1501]
[1502]
[1503]
[1504]
[1505]
[1506]
[1507]
[1508]
[1509]
[1510]
[1511]
[1512]
[1513]
[1514]
[1515]
[1516]
[1517]
[1518]
[1519]
[1520]
[1521]
[1522]
[1523]
[1524]
[1525]
[1526]
[1527]
[1528]
[1529]
[1530]
[1531]
[1532]
[1533]
[1534]
[1535]
[1536]
[1537]
[1538]
[1539]
[1540]
[1541]
[1542]
[1543]
[1544]
[1545]
[1546]
[1547]
[1548]
[1549]
[1550]
[1551]
[1552]
[1553]
[1554]
[1555]
[1556]
[1557]
[1558]
[1559]
[1560]
[1561]
[1562]
[1563]
[1564]
[1565]
[1566]
[1567]
[1568]
[1569]
[1570]
[1571]
[1572]
[1573]
[1574]
[1575]
[1576]
[1577]
[1578]
[1579]
[1580]
[1581]
[1582]
[1583]
[1584]
[1585]
[1586]
[1587]
[1588]
[1589]
[1590]
[1591]
[1592]
[1593]
[1594]
[1595]
[1596]
[1597]
[1598]
[1599]
[1600]
[1601]
[1602]
[1603]
[1604]
[1605]
[1606]
[1607]
[1608]
[1609]
[1610]
[1611]
[1612]
[1613]
[1614]
[1615]
[1616]
[1617]
[1618]
[1619]
[1620]
[1621]
[1622]
[1623]
[1624]
[1625]
[1626]
[1627]
[1628]
[1629]
[1630]
[1631]
[1632]
[1633]
[1634]
[1635]
[1636]
[1637]
[1638]
[1639]
[1640]
[1641]
[1642]
[1643]
[1644]
[1645]
[1646]
[1647]
[1648]
[1649]
[1650]
[1651]
[1652]
[1653]
[1654]
[1655]
[1656]
[1657]
[1658]
[1659]
[1660]
[1661]
[1662]
[1663]
[1664]
[1665]
[1666]
[1667]
[1668]
[1669]
[1670]
[1671]
[1672]
[1673]
[1674]
[1675]
[1676]
[1677]
[1678]
[1679]
[1680]
[1681]
[1682]
[1683]
[1684]
[1685]
[1686]
[1687]
[1688]
[1689]
[1690]
[1691]
[1692]
[1693]
[1694]
[1695]
[1696]
[1697]
[1698]
[1699]
[1700]
[1701]
[1702]
[1703]
[1704]
[1705]
[1706]
[1707]
[1708]
[1709]
[1710]
[1711]
[1712]
[1713]
[1714]
[1715]
[1716]
[1717]
[1718]
[1719]
[1720]
[1721]
[1722]
[1723]
[1724]
[1725]
[1726]
[1727]
[1728]
[1729]
[1730]
[1731]
[1732]
[1733]
[1734]
[1735]
[1736]
[1737]
[1738]
[1739]
[1740]
[1741]
[1742]
[1743]
[1744]
[1745]
[1746]
[1747]
[1748]
[1749]
[1750]
[1751]
[1752]
[1753]
[1754]
[1755]
[1756]
[1757]
[1758]
[1759]
[1760]
[1761]
[1762]
[1763]
[1764]
[1765]
[1766]
[1767]
[1768]
[1769]
[1770]
[1771]
[1772]
[1773]
[1774]
[1775]
[1776]
[1777]
[1778]
[1779]
[1780]
[1781]
[1782]
[1783]
[1784]
[1785]
[1786]
[1787]
[1788]
[1789]
[1790]
[1791]
[1792]
[1793]
[1794]
[1795]
[1796]
[1797]
[1798]
[1799]
[1800]
[1801]
[1802]
[1803]
[1804]
[1805]
[1806]
[1807]
[1808]
[1809]
[1810]
[1811]
[1812]
[1813]
[1814]
[1815]
[1816]
[1817]
[1818]
[1819]
[1820]
[1821]
[1822]
[1823]
[1824]
[1825]
[1826]
[1827]
[1828]
[1829]
[1830]
[1831]
[1832]
[1833]
[1834]
[1835]
[1836]
[1837]
[1838]
[1839]
[1840]
[1841]
[1842]
[1843]
[1844]
[1845]
[1846]
[1847]
[1848]
[1849]
[1850]
[1851]
[1852]
[1853]
[1854]
[1855]
[1856]
[1857]
[1858]
[1859]
[1860]
[1861]
[1862]
[1863]
[1864]
[1865]
[1866]
[1867]
[1868]
[1869]
[1870]
[1871]
[1872]
[1873]
[1874]
[1875]
[1876]
[1877]
[1878]
[1879]
[1880]
[1881]
[1882]
[1883]
[1884]
[1885]
[1886]
[1887]
[1888]
[1889]
[1890]
[1891]
[1892]
[1893]
[1894]
[1895]
[1896]
[1897]
[1898]
[1899]
[1900]
[1901]
[1902]
[1903]
[1904]
[1905]
[1906]
[1907]
[1908]
[1909]
[1910]
[1911]
[1912]
[1913]
[1914]
[1915]
[1916]
[1917]
[1918]
[1919]
[1920]
[1921]
[1922]
[1923]
[1924]
[1925]
[1926]
[1927]
[1928]
[1929]
[1930]
[1931]
[1932]
[1933]
[1934]
[1935]
[1936]
[1937]
[1938]
[1939]
[1940]
[1941]
[1942]
[1943]
[1944]
[1945]
[1946]
[1947]
[1948]
[1949]
[1950]
[1951]
[1952]
[1953]
[1954]
[1955]
[1956]
[1957]
[1958]
[1959]
[1960]
[1961]
[1962]
[1963]
[1964]
[1965]
[1966]
[1967]
[1968]
[1969]
[1970]
[1971]
[1972]
[1973]
[1974]
[1975]
[1976]
[1977]
[1978]
[1979]
[1980]
[1981]
[1982]
[1983]
[1984]
[1985]
[1986]
[1987]
[1988]
[1989]
[1990]
[1991]
[1992]
[1993]
[1994]
[1995]
[1996]
[1997]
[1998]
[1999]
[2000]
[2001]
[2002]
[2003]
[2004]
[2005]
[2006]
[2007]
[2008]
[2009]
[2010]
[2011]
[2012]
[2013]
[2014]
[2015]
[2016]
[2017]
[2018]
[2019]
[2020]
[2021]
[2022]
[2023]
[2024]
[2025]
[2026]
[2027]
[2028]
[2029]
[2030]
[2031]
[2032]
[2033]
[2034]
[2035]
[2036]
[2037]
[2038]
[2039]
[2040]
[2041]
[2042]
[2043]
[2044]
[2045]
[2046]
[2047]
[2048]
[2049]
[2050]
[2051]
[2052]
[2053]
[2054]
[2055]
[2056]
[2057]
[2058]
[2059]
[2060]
[2061]
[2062]
[2063]
[2064]
[2065]
[2066]
[2067]
[2068]
[2069]
[2070]
[2071]
[2072]
[2073]
[2074]
[2075]
[2076]
[2077]
[2078]
[2079]
[2080]
[2081]
[2082]
[2083]
[2084]
[2085]
[2086]
[2087]
[2088]
[2089]
[2090]
[2091]
[2092]
[2093]
[2094]
[2095]
[2096]
[2097]
[2098]
[2099]
[2100]
[2101]
[2102]
[2103]
[2104]
[2105]
[2106]
[2107]
[2108]
[2109]
[2110]
[2111]
[2112]
[2113]
[2114]
[2115]
[2116]
[2117]
[2118]
[2119]
[2120]
[2121]
[2122]
[2123]
[2124]
[2125]
[2126]
[2127]
[2128]
[2129]
[2130]
[2131]
[2132]
[2133]
[2134]
[2135]
[2136]
[2137]
[2138]
[2139]
[2140]
[2141]
[2142]
[2143]
[2144]
[2145]
[2146]
[2147]
[2148]
[2149]
[2150]
[2151]
[2152]
[2153]
[2154]
[2155]
[2156]
[2157]
[2158]
[2159]
[2160]
[2161]
[2162]
[2163]
[2164]
[2165]
[2166]
[2167]
[2168]
[2169]
[2170]
[2171]
[2172]
[2173]
[2174]
[2175]
[2176]
[2177]
[2178]
[2179]
[2180]
[2181]
[2182]
[2183]
[2184]
[2185]
[2186]
[2187]
[2188]
[2189]
[2190]
[2191]
[2192]
[2193]
[2194]
[2195]
[2196]
[2197]
[2198]
[2199]
[2200]
[2201]
[2202]
[2203]
[2204]
[2205]
[2206]
[2207]
[2208]
[2209]
[2210]
[2211]
[2212]
[2213]
[2214]
[2215]
[2216]
[2217]
[2218]
[2219]
[2220]
[2221]
[2222]
[2223]
[2224]
[2225]
[2226]
[2227]
[2228]
[2229]
[2230]
[2231]
[2232]
[2233]
[2234]
[2235]
[2236]
[2237]
[2238]
[2239]
[2240]
[2241]
[2242]
[2243]
[2244]
[2245]
[2246]
[2247]
[2248]
[2249]
[2250]
[2251]
[2252]
[2253]
[2254]
[2255]
[2256]
[2257]
[2258]
[2259]
[2260]
[2261]
[2262]
[2263]
[2264]
[2265]
[2266]
[2267]
[2268]
[2269]
[2270]
[2271]
[2272]
[2273]
[2274]
[2275]
[2276]
[2277]
[2278]
[2279]
[2280]
[2281]
[2282]
[2283]
[2284]
[2285]
[2286]
[2287]
[2288]
[2289]
[2290]
[2291]
[2292]
[2293]
[2294]
[2295]
[2296]
[2297]
[2298]
[2299]
[2300]
[2301]
[2302]
[2303]
[2304]
[2305]
[2306]
[2307]
[2308]
[2309]
[2310]
[2311]
[2312]
[2313]
[2314]
[2315]
[2316]
[2317]
[2318]
[2319]
[2320]
[2321]
[2322]
[2323]
[2324]
[2325]
[2326]
[2327]
[2328]
[2329]
[2330]
[2331]
[2332]
[2333]
[2334]
[2335]
[2336]
[2337]
[2338]
[2339]
[2340]
[2341]
[2342]
[2343]
[2344]
[2345]
[2346]
[2347]
[2348]
[2349]
[2350]
[2351]
[2352]
[2353]
[2354]
[2355]
[2356]
[2357]
[2358]
[2359]
[2360]
[2361]
[2362]
[2363]
[2364]
[2365]
[2366]
[2367]
[2368]
[2369]
[2370]
[2371]
[2372]
[2373]
[2374]
[2375]
[2376]
[2377]
[2378]
[2379]
[2380]
[2381]
[2382]
[2383]
[2384]
[2385]
[2386]
[2387]
[2388]
[2389]
[2390]
[2391]
[2392]
[2393]
[2394]
[2395]
[2396]
[2397]
[2398]
[2399]
[2400]
[2401]
[2402]
[2403]
[2404]
[2405]
[2406]
[2407]
[2408]
[2409]
[2410]
[2411]
[2412]
[2413]
[2414]
[2415]
[2416]
[2417]
[2418]
[2419]
[2420]
[2421]
[2422]
[2423]
[2424]
[2425]
[2426]
[2427]
[2428]
[2429]
[2430]
[2431]
[2432]
[2433]
[2434]
[2435]
[2436]
[2437]
[2438]
[2439]
[2440]
[2441]
[2442]
[2443]
[2444]
[2445]
[2446]
[2447]
[2448]
[2449]
[2450]
[2451]
[2452]
[2453]
[2454]
[2455]
[2456]
[2457]
[2458]
[2459]
[2460]
[2461]
[2462]
[2463]
[2464]
[2465]
[2466]
[2467]
[2468]
[2469]
[2470]
[2471]
[2472]
[2473]
[2474]
[2475]
[2476]
[2477]
[2478]
[2479]
[2480]
[2481]
[2482]
[2483]
[2484]
[2485]
[2486]
[2487]
[2488]
[2489]
[2490]
[2491]
[2492]
[2493]
[2494]
[2495]
[2496]
[2497]
[2498]
[2499]
[2500]
[2501]
[2502]
[2503]
[2504]
[2505]
[2506]
[2507]
[2508]
[2509]
[2510]
[2511]
[2512]
[2513]
[2514]
[2515]
[2516]
[2517]
[2518]
[2519]
[2520]
[2521]
[2522]
[2523]
[2524]
[2525]
[2526]
[2527]
[2528]
[2529]
[2530]
[2531]
[2532]
[2533]
[2534]
[2535]
[2536]
[2537]
[2538]
[2539]
[2540]
[2541]
[2542]
[2543]
[2544]
[2545]
[2546]
[2547]
[2548]
[2549]
[2550]
[2551]
[2552]
[2553]
[2554]
[2555]
[2556]
[2557]
[2558]
[2559]
[2560]
[2561]
[2562]
[2563]
[2564]
[2565]
[2566]
[2567]
[2568]
[2569]
[2570]
[2571]
[2572]
[2573]
[2574]
[2575]
[2576]
[2577]
[2578]
[2579]
[2580]
[2581]
[2582]
[2583]
[2584]
[2585]
[2586]
[2587]
[2588]
[2589]
[2590]
[2591]
[2592]
[2593]
[2594]
[2595]
[2596]
[2597]
[2598]
[2599]
[2600]
[2601]
[2602]
[2603]
[2604]
[2605]
[2606]
[2607]
[2608]
[2609]
[2610]
[2611]
[2612]
[2613]
[2614]
[2615]
[2616]
[2617]
[2618]
[2619]
[2620]
[2621]
[2622]
[2623]
[2624]
[2625]
[2626]
[2627]
[2628]
[2629]
[2630]
[2631]
[2632]
[2633]
[2634]
[2635]
[2636]
[2637]
[2638]
[2639]
[2640]
[2641]
[2642]
[2643]
[2644]
[2645]
[2646]
[2647]
[2648]
[2649]
[2650]
[2651]
[2652]
[2653]
[2654]
[2655]
[2656]
[2657]
[2658]
[2659]
[2660]
[2661]
[2662]
[2663]
[2664]
[2665]
[2666]
[2667]
[2668]
[2669]
[2670]
[2671]
[2672]
[2673]
[2674]
[2675]
[2676]
[2677]
[2678]
[2679]
[2680]
[2681]
[2682]
[2683]
[2684]
[2685]
[2686]
[2687]
[2688]
[2689]
[2690]
[2691]
[2692]
[2693]
[2694]
[2695]
[2696]
[2697]
[2698]
[2699]
[2700]
[2701]
[2702]
[2703]
[2704]
[2705]
[2706]
[2707]
[2708]
[2709]
[2710]
[2711]
[2712]
[2713]
[2714]
[2715]
[2716]
[2717]
[2718]
[2719]
[2720]
[2721]
[2722]
[2723]
[2724]
[2725]
[2726]
[2727]
[2728]
[2729]
[2730]
[2731]
[2732]
[2733]
[2734]
[2735]
[2736]
[2737]
[2738]
[2739]
[2740]
[2741]
[2742]
[2743]
[2744]
[2745]
[2746]
[2747]
[2748]
[2749]
[2750]
[2751]
[2752]
[2753]
[2754]
[2755]
[2756]
[2757]
[2758]
[2759]
[2760]
[2761]
[2762]
[2763]
[2764]
[2765]
[2766]
[2767]
[2768]
[2769]
[2770]
[2771]
[2772]
[2773]
[2774]
[2775]
[2776]
[2777]
[2778]
[2779]
[2780]
[2781]
[2782]
[2783]
[2784]
[2785]
[2786]
[2787]
[2788]
[2789]
[2790]
[2791]
[2792]
[2793]
[2794]
[2795]
[2796]
[2797]
[2798]
[2799]
[2800]
[2801]
[2802]
[2803]
[2804]
[2805]
[2806]
[2807]
[2808]
[2809]
[2810]
[2811]
[2812]
[2813]
[2814]
[2815]
[2816]
[2817]
[2818]
[2819]
[2820]
[2821]
[2822]
[2823]
[2824]
[2825]
[2826]
[2827]
[2828]
[2829]
[2830]
[2831]
[2832]
[2833]
[2834]
[2835]
[2836]
[2837]
[2838]
[2839]
["*"]