{"text_format":"1","workbook":"xlsx","n_sheets":3,"sheets":["Feuil1","Alea","Feuil3"],"not_rendered":{"charts":0,"images":20,"macros":1,"external_links":0,"defined_names":8,"comments":0,"pivot_tables":0},"unopened":[],"bounds":{"document_bytes":16777216,"sheet_cells":100000,"rows_first":2000,"rows_last":500,"rows_between":2000,"halvings":0,"cell_chars":16384,"cell_head_chars":4096},"cells_cut":0,"cells_raw":0,"read":"whole","date_system":"1900"}

{"sheet":"Feuil1","index":0,"n_rows":20,"n_cols":15,"rows_kept":20,"cut":false,"hidden":false,"merged":[[8,7,13,7],[8,8,13,8],[8,9,13,9],[15,9,16,9],[18,19,23,20],[8,11,9,13],[10,11,12,13],[16,11,18,13],[19,11,19,13],[3,11,3,13],[4,11,4,13],[5,11,5,13],[18,21,23,22],[6,11,6,13],[7,11,7,13],[13,12,13,13],[14,11,15,13]]}
[]
[{"$f":"INDEX(Alea!$A$1:$A$8,MATCH(LARGE(Alea!$B$1:$B$8,ROW()),Alea!$B$1:$B$8,0))","v":6},{"$f":"INDEX(Alea!$D$1:$D$8,MATCH(LARGE(Alea!$E$1:$E$8,ROW()),Alea!$E$1:$E$8,0))","v":4},{"$f":"INDEX(Alea!$G$1:$G$8,MATCH(LARGE(Alea!$H$1:$H$8,ROW()),Alea!$H$1:$H$8,0))","v":5}]
[]
[null,null,null,null,null,null,null,null,null,null,null,null,null,null,20]
[null,null,null,null,null,null,null,null,null,null,null,null,null,null,30]
[null,null,null,null,null,null,null,null,null,null,null,null,null,null,40]
[null,null,null,null,null,null,null,null,null,null,null,null,null,null,50]
[null,null,null,null,null,null,null,null,null,null,null,null,null,null,60]
[null,null,null,null,null,null,null,{"$f":"A2","v":6},{"$f":"B2","v":4},{"$f":"C2","v":5},null,null,null,null,80]
[]
[null,null,null,null,null,null,null,null,null,null,null,null,null,null,150]
[]
[]
[null,null,null,null,null,null,null,null,null,null,null,null,null,null,10]
[null,null,null,null,null,null,null,null,null,null,null,null,null,null,25]
[null,null,null,null,null,null,null,"Credits",{"$f":"I19","v":-5},525]
[]
[null,null,null,null,null,null,null,null,null,null,null,null,null,null,45]
[null,null,null,null,null,null,null,null,{"$f":"IF(AND(H9=1,I9=1,J9=1),O4,IF(AND(H9=2,I9=2,J9=2),O5,IF(AND(H9=3,I9=3,J9=3),O6,IF(AND(H9=4,I9=4,J9=4),O7,IF(AND(H9=5,I9=5,J9=5),O8,IF(AND(H9=6,I9=6,J9=6),O9,IF(AND(H9=7,I9=7,J9=7),O11,IF(AND(H9=5,I9=5),O14,IF(AND(H9=5,J9=5),O14,IF(AND(I9=5,J9=5),O14,IF(AND(H9=6,I9=6),O15,IF(AND(H9=6,J9=6),O15,IF(AND(I9=6,J9=6),O15,IF(AND(H9=7,I9=7),O18,IF(AND(H9=7,J9=7),O18,IF(AND(I9=7,J9=7),O18,IF(AND(H9=8,I9=8,J9=8),O20,-5)))))))))))))))))","v":-5}]
[null,null,null,null,null,null,null,null,null,null,null,null,null,null,300]

{"sheet":"Alea","index":1,"n_rows":8,"n_cols":8,"rows_kept":8,"cut":false,"hidden":false,"merged":[]}
[1,{"$f":"RAND()","v":0.4601423934225648},null,1,{"$f":"RAND()","v":0.97508282689301673},null,1,{"$f":"RAND()","v":0.83268035384645001}]
[2,0.38091956834168184,null,2,0.50398968826047719,null,2,0.31738360232366258]
[3,0.25835622091901933,null,3,0.68887214942654118,null,3,0.45503197253517247]
[4,0.38682695691708968,null,4,0.82771412317402504,null,4,9.6813470613357877E-2]
[5,0.81767775239348961,null,5,7.3653633536565066E-2,null,5,0.68533366974358767]
[6,0.9063423166355864,null,6,0.12083661777221644,null,6,9.90595731730185E-2]
[7,0.9247240216082474,null,7,1.8315803167324951E-2,null,7,0.5452285252554856]
[8,0.29547450002965348,null,8,1.6499400409185849E-2,null,8,0.66134493997468535]

{"sheet":"Feuil3","index":2,"n_rows":0,"n_cols":0,"rows_kept":0,"cut":false,"hidden":false,"merged":[]}