{"text_format":"1","workbook":"xlsx","n_sheets":8,"sheets":["Accueil","Performances","NCV","Cotes","Résumé","Feuil1 (2)","Feuil2 (2)"," eliminer le tiers des partants"],"not_rendered":{"charts":0,"images":6,"macros":1,"external_links":4,"defined_names":46,"comments":0,"pivot_tables":0},"unopened":[],"bounds":{"document_bytes":16777216,"sheet_cells":100000,"rows_first":2000,"rows_last":500,"rows_between":2000,"halvings":0,"cell_chars":16384,"cell_head_chars":4096},"cells_cut":0,"cells_raw":0,"read":"whole","date_system":"1900"}

{"sheet":"Accueil","index":0,"n_rows":36,"n_cols":17,"rows_kept":36,"cut":false,"hidden":false,"merged":[[0,6,1,16],[35,1,38,14],[11,1,11,14],[4,1,5,14],[7,1,7,14],[8,1,8,14],[9,1,9,14],[10,1,10,14]]}
[null,null,null,null,null,null,"Nouveaux Critères pour la Victoire"]
[]
[]
[]
[null,"Course du vendredi le 22 mai 2020"]
[]
{"$rows_left_out":31}
{"sheet":"Performances","index":1,"n_rows":137,"n_cols":16,"rows_kept":137,"cut":false,"hidden":false,"merged":[]}
["daika-vikland"]
["Date","Hippodrome","Dist.","Par.","Corde","Aut.","Spé.","Course","Q+","Alloc.","Rang","Réd. km","Déferré","Cotes","Partants"]
[" 20/10/19","Agen-Le Passage",2575,null,"D","A","Attelé",null,null,"3 000€",6,"1'17''2","D4",15,16,"Cote Fictive"]
[" 07/10/19","Castéra-Verduzan",2150,null,"D","A","Attelé","A Réc.",null,"5 000€",7,"1'19''6","D4",15,14,"Cote Fictive"]
[" 25/08/19","Jullianges",2425,null,"D",null,"Attelé",null,null,"13 000€",9,"1'18''0","D4",12,13,"Cote Fictive"]
[" 15/08/19","Gémozac",2625,null,"D",null,"Attelé",null,null,"4 000€",8,"1'24''3","D4",15,11,"Cote Fictive"]
{"$rows_left_out":132}
{"sheet":"NCV","index":2,"n_rows":30,"n_cols":255,"rows_kept":30,"cut":false,"hidden":false,"merged":[[30,1,30,3],[1,9,2,20],[4,2,4,3],[4,5,4,6],[4,7,4,11],[4,12,4,16],[4,17,4,21],[4,22,4,26],[26,1,26,3],[27,1,27,3],[28,1,28,3],[29,1,29,3]]}
[]
[]
[]
[null,null,null,null,null,null,null,1,2,3,4,5,1,2,3,4,5,1,2,3,4,5,1,2,3,4,5]
[null,null,"LTP",null,null,"SYO",null,"Cotes",null,null,null,null,"Rang",null,null,null,null,"Nbre Partants",null,null,null,null,"Allocation"]
[null,1,null,null,null,null,null,154,36,11,15,65,14,10,7,5,7,14,13,11,9,8,"100 000€","55 000€","35 000€","57 000€","100 000€"]
{"$rows_left_out":25}
{"sheet":"Cotes","index":3,"n_rows":48,"n_cols":25,"rows_kept":48,"cut":false,"hidden":false,"merged":[[25,2,25,3],[27,19,27,20]]}
[]
[]
[]
[null,"Musique","P1","P2","P3","P4","P5","P6","N° PMU","P1","P2","P3","P4","P5","P6","Nbre courses","Nbre courses dans l'année","Cotes PMU","% Cotes","Valeur Cotes","Courses","Victoires","Places","Gains","Moy. Gains"]
[null,{"$f":"IF(Accueil!B15<>\"\",MusiqueEpuree(Accueil!H15),\"\")","v":"679800"},{"$f":"IF(ISERROR((IF(B5=\"\",\"\",ABS(LEFT(B5,1))))),\"\",(IF(B5=\"\",\"\",ABS(LEFT(B5,1)))))","v":6},{"$f":"IF(ISERROR((IF(B5=\"\",\"\",IF(LEN(B5)<2,0,ABS(RIGHT((LEFT(B5,2)),1)))))),\"\",(IF(B5=\"\",\"\",IF(LEN(B5)<2,0,ABS(RIGHT((LEFT(B5,2)),1))))))","v":7},{"$f":"IF(ISERROR((IF(B5=\"\",\"\",IF(LEN(B5)<3,0,ABS(RIGHT((LEFT(B5,3)),1)))))),\"\",(IF(B5=\"\",\"\",IF(LEN(B5)<3,0,ABS(RIGHT((LEFT(B5,3)),1))))))","v":9},{"$f":"IF(ISERROR((IF(B5=\"\",\"\",IF(LEN(B5)<4,0,ABS(RIGHT((LEFT(B5,4)),1)))))),\"\",(IF(B5=\"\",\"\",IF(LEN(B5)<4,0,ABS(RIGHT((LEFT(B5,4)),1))))))","v":8},{"$f":"IF(ISERROR((IF(B5=\"\",\"\",IF(LEN(B5)<5,0,ABS(RIGHT((LEFT(B5,5)),1)))))),\"\",(IF(B5=\"\",\"\",IF(LEN(B5)<5,0,ABS(RIGHT((LEFT(B5,5)),1))))))","v":0},{"$f":"IF(ISERROR((IF(B5=\"\",\"\",IF(LEN(B5)<6,0,ABS(RIGHT((LEFT(B5,6)),1)))))),\"\",(IF(B5=\"\",\"\",IF(LEN(B5)<6,0,ABS(RIGHT((LEFT(B5,6)),1))))))","v":0},{"$f":"IF(Accueil!B15<>\"\",Accueil!B15,\"\")","v":1},{"$f":"IF($B5=\"\",\"\",IF(C5=0,10,C5))","v":6},{"$f":"IF($B5=\"\",\"\",IF(D5=0,10,D5))","v":7},9,8,10,10,{"$f":"IF(B5<>\"\",IFERROR(INT(LEN(MID(Accueil!N15,1,SEARCH(\"(\"&RIGHT(YEAR(TODAY()),2)-1&\")\",Accueil!N15)-1))/2),LEN(B5)),\"\")","v":6},{"$f":"IF(B5<>\"\",IFERROR(INT(LEN(MID(Accueil!N15,1,SEARCH(\"(\"&RIGHT(YEAR(TODAY()),2)-1&\")\",Accueil!N15)-1))/2),LEN(B5)),\"\")","v":6},{"$f":"IF(I5<>\"\",IF(Accueil!K15=\"-\",\"\",Accueil!K15),\"\")","v":14.4},{"$f":"IF(AND(R5<>0,R5<>\"\",R5<>\"-\"),(1/R5)*100,\"\")","v":6.9444444444444446},{"$f":"IF(OR(S5=\"\",$S$26=0,$S$25=0),\"\",(S5/$S$26)*100)","v":81.639001998586195},{"$f":"IF(I5<>\"\",Accueil!N15,\"\")","v":32},{"$f":"IF(J5<>\"\",Accueil!O15,\"\")","v":1},{"$f":"IF(K5<>\"\",Accueil!P15,\"\")","v":7},{"$f":"IF(L5<>\"\",Accueil!Q15,\"\")","v":23570},{"$f":"IF(OR(X5<>0,X5<>\"\"),IF(OR(U5=0,U5=\"\"),\"\",X5/U5),\"\")","v":736.5625}]
[null,{"$f":"IF(Accueil!B16<>\"\",MusiqueEpuree(Accueil!H16),\"\")","v":"007000"},0,0,7,0,0,{"$f":"IF(ISERROR((IF(B6=\"\",\"\",IF(LEN(B6)<6,0,ABS(RIGHT((LEFT(B6,6)),1)))))),\"\",(IF(B6=\"\",\"\",IF(LEN(B6)<6,0,ABS(RIGHT((LEFT(B6,6)),1))))))","v":0},{"$f":"IF(Accueil!B16<>\"\",Accueil!B16,\"\")","v":2},{"$f":"IF($B6=\"\",\"\",IF(C6=0,10,C6))","v":10},10,7,10,10,10,{"$f":"IF(B6<>\"\",IFERROR(INT(LEN(MID(Accueil!N16,1,SEARCH(\"(\"&RIGHT(YEAR(TODAY()),2)-1&\")\",Accueil!N16)-1))/2),LEN(B6)),\"\")","v":6},{"$f":"IF(B6<>\"\",IFERROR(INT(LEN(MID(Accueil!N16,1,SEARCH(\"(\"&RIGHT(YEAR(TODAY()),2)-1&\")\",Accueil!N16)-1))/2),LEN(B6)),\"\")","v":6},{"$f":"IF(I6<>\"\",IF(Accueil!K16=\"-\",\"\",Accueil!K16),\"\")","v":20},5,{"$f":"IF(OR(S6=\"\",$S$26=0,$S$25=0),\"\",(S6/$S$26)*100)","v":58.780081438982059},{"$f":"IF(I6<>\"\",Accueil!N16,\"\")","v":36},{"$f":"IF(J6<>\"\",Accueil!O16,\"\")","v":3},{"$f":"IF(K6<>\"\",Accueil!P16,\"\")","v":2},{"$f":"IF(L6<>\"\",Accueil!Q16,\"\")","v":30770},{"$f":"IF(OR(X6<>0,X6<>\"\"),IF(OR(U6=0,U6=\"\"),\"\",X6/U6),\"\")","v":854.72222222222217}]
{"$rows_left_out":43}
{"sheet":"Résumé","index":4,"n_rows":197,"n_cols":24,"rows_kept":197,"cut":false,"hidden":false,"merged":[[28,26,29,31],[0,10,0,12],[0,13,0,15],[0,16,0,18],[0,21,0,23],[24,9,24,24],[28,7,28,9]]}
[1,null,null,null,null,null,null,null,null,null,"Rang",null,null,"Nbre de partants",null,null,"Adversaires battus",null,null,"Total",null,"Rang"]
["Alloc.",null,null,"Cotes",null,"Rang",null,null,null,{"$f":"IF(Cotes!I5<>\"\",Cotes!I5,\"\")","v":1},{"$f":"IF(J2<>\"\",IF(ISERROR(MATCH(NCV!M6,{\"A\",\"D\",\"Dai\",\"Di\",\"T\",\"Db\"},0)),NCV!M6,NCV!R6),\"\")","v":14},{"$f":"IF(K2<>\"\",IF(ISERROR(MATCH(NCV!N6,{\"A\",\"D\",\"Dai\",\"Di\",\"T\",\"Db\"},0)),NCV!N6,NCV!S6),\"\")","v":10},{"$f":"IF(L2<>\"\",IF(ISERROR(MATCH(NCV!O6,{\"A\",\"D\",\"Dai\",\"Di\",\"T\",\"Db\"},0)),NCV!O6,NCV!T6),\"\")","v":7},{"$f":"IF(J2<>\"\",NCV!R6,\"\")","v":14},{"$f":"IF(K2<>\"\",NCV!S6,\"\")","v":13},{"$f":"IF(L2<>\"\",NCV!T6,\"\")","v":11},{"$f":"IF(J2<>\"\",N2-V2,\"\")","v":0},{"$f":"IF(K2<>\"\",O2-W2,\"\")","v":3},{"$f":"IF(L2<>\"\",P2-X2,\"\")","v":4},{"$f":"IF(J2<>\"\",SUM(Q2:S2),\"\")","v":7},null,{"$f":"IF(OR(K2=0,NOT(ISNUMBER(K2))),N2,K2)","v":14},{"$f":"IF(OR(L2=0,NOT(ISNUMBER(L2))),O2,L2)","v":10},7]
["100 000€",{"$f":"SUM(A3/1000)","v":{"$error":"#VALUE!"}},null,154,{"$f":"MIN(D3:D5)","v":11},14,{"$f":"IF(F3:F5=0,\"\",F3:F5)","v":14},{"$f":"MIN(G3:G5)","v":7},null,{"$f":"IF(Cotes!I6<>\"\",Cotes!I6,\"\")","v":2},{"$f":"IF(J3<>\"\",IF(ISERROR(MATCH(NCV!M7,{\"A\",\"D\",\"Dai\",\"Di\",\"T\",\"Db\"},0)),NCV!M7,NCV!R7),\"\")","v":11},{"$f":"IF(K3<>\"\",IF(ISERROR(MATCH(NCV!N7,{\"A\",\"D\",\"Dai\",\"Di\",\"T\",\"Db\"},0)),NCV!N7,NCV!S7),\"\")","v":2},{"$f":"IF(L3<>\"\",IF(ISERROR(MATCH(NCV!O7,{\"A\",\"D\",\"Dai\",\"Di\",\"T\",\"Db\"},0)),NCV!O7,NCV!T7),\"\")","v":4},{"$f":"IF(J3<>\"\",NCV!R7,\"\")","v":15},{"$f":"IF(K3<>\"\",NCV!S7,\"\")","v":16},{"$f":"IF(L3<>\"\",NCV!T7,\"\")","v":14},{"$f":"IF(J3<>\"\",N3-V3,\"\")","v":4},14,10,{"$f":"IF(J3<>\"\",SUM(Q3:S3),\"\")","v":28},null,{"$f":"IF(OR(K3=0,NOT(ISNUMBER(K3))),N3,K3)","v":11},2,4]
["55 000€",{"$f":"SUM(A4/1000)","v":{"$error":"#VALUE!"}},null,36,null,10,{"$f":"IF(F4:F6=0,\"\",F4:F6)","v":10},null,null,{"$f":"IF(Cotes!I7<>\"\",Cotes!I7,\"\")","v":3},{"$f":"IF(J4<>\"\",IF(ISERROR(MATCH(NCV!M8,{\"A\",\"D\",\"Dai\",\"Di\",\"T\",\"Db\"},0)),NCV!M8,NCV!R8),\"\")","v":8},{"$f":"IF(K4<>\"\",IF(ISERROR(MATCH(NCV!N8,{\"A\",\"D\",\"Dai\",\"Di\",\"T\",\"Db\"},0)),NCV!N8,NCV!S8),\"\")","v":14},{"$f":"IF(L4<>\"\",IF(ISERROR(MATCH(NCV!O8,{\"A\",\"D\",\"Dai\",\"Di\",\"T\",\"Db\"},0)),NCV!O8,NCV!T8),\"\")","v":15},{"$f":"IF(J4<>\"\",NCV!R8,\"\")","v":10},{"$f":"IF(K4<>\"\",NCV!S8,\"\")","v":17},{"$f":"IF(L4<>\"\",NCV!T8,\"\")","v":18},2,3,3,8,null,8,14,15]
["35 000€",{"$f":"SUM(A5/1000)","v":{"$error":"#VALUE!"}},null,11,null,7,{"$f":"IF(F5:F7=0,\"\",F5:F7)","v":7},null,null,{"$f":"IF(Cotes!I8<>\"\",Cotes!I8,\"\")","v":4},{"$f":"IF(J5<>\"\",IF(ISERROR(MATCH(NCV!M9,{\"A\",\"D\",\"Dai\",\"Di\",\"T\",\"Db\"},0)),NCV!M9,NCV!R9),\"\")","v":14},{"$f":"IF(K5<>\"\",IF(ISERROR(MATCH(NCV!N9,{\"A\",\"D\",\"Dai\",\"Di\",\"T\",\"Db\"},0)),NCV!N9,NCV!S9),\"\")","v":7},{"$f":"IF(L5<>\"\",IF(ISERROR(MATCH(NCV!O9,{\"A\",\"D\",\"Dai\",\"Di\",\"T\",\"Db\"},0)),NCV!O9,NCV!T9),\"\")","v":5},{"$f":"IF(J5<>\"\",NCV!R9,\"\")","v":15},{"$f":"IF(K5<>\"\",NCV!S9,\"\")","v":13},{"$f":"IF(L5<>\"\",NCV!T9,\"\")","v":10},1,6,5,12,null,14,7,5]
["57 000€",{"$f":"SUM(A6/1000)","v":{"$error":"#VALUE!"}},null,15,null,5,null,null,null,{"$f":"IF(Cotes!I9<>\"\",Cotes!I9,\"\")","v":5},{"$f":"IF(J6<>\"\",IF(ISERROR(MATCH(NCV!M10,{\"A\",\"D\",\"Dai\",\"Di\",\"T\",\"Db\"},0)),NCV!M10,NCV!R10),\"\")","v":5},{"$f":"IF(K6<>\"\",IF(ISERROR(MATCH(NCV!N10,{\"A\",\"D\",\"Dai\",\"Di\",\"T\",\"Db\"},0)),NCV!N10,NCV!S10),\"\")","v":8},{"$f":"IF(L6<>\"\",IF(ISERROR(MATCH(NCV!O10,{\"A\",\"D\",\"Dai\",\"Di\",\"T\",\"Db\"},0)),NCV!O10,NCV!T10),\"\")","v":7},{"$f":"IF(J6<>\"\",NCV!R10,\"\")","v":16},{"$f":"IF(K6<>\"\",NCV!S10,\"\")","v":13},{"$f":"IF(L6<>\"\",NCV!T10,\"\")","v":16},11,5,9,25,null,5,8,7]
{"$rows_left_out":192}
{"sheet":"Feuil1 (2)","index":5,"n_rows":33,"n_cols":21,"rows_kept":33,"cut":false,"hidden":true,"merged":[]}
[]
["PK","N° "]
[{"$f":"IF(#REF!=\"\",\"\",#REF!)","v":{"$error":"#REF!"}},{"$f":"IF(#REF!=\"\",\"\",#REF!)","v":{"$error":"#REF!"}}]
[{"$f":"IF(#REF!=\"\",\"\",#REF!)","v":{"$error":"#REF!"}},{"$f":"IF(#REF!=\"\",\"\",#REF!)","v":{"$error":"#REF!"}}]
[{"$f":"IF(#REF!=\"\",\"\",#REF!)","v":{"$error":"#REF!"}},{"$f":"IF(#REF!=\"\",\"\",#REF!)","v":{"$error":"#REF!"}}]
[{"$f":"IF(#REF!=\"\",\"\",#REF!)","v":{"$error":"#REF!"}},{"$f":"IF(#REF!=\"\",\"\",#REF!)","v":{"$error":"#REF!"}}]
{"$rows_left_out":28}
{"sheet":"Feuil2 (2)","index":6,"n_rows":52,"n_cols":55,"rows_kept":52,"cut":false,"hidden":true,"merged":[[1,6,3,47]]}
[]
["6 Ah",null,null,null,null,null,"Feuille réalisée par Phil59110 Un grand merci pour l'aide apporté",null,null,null,null,null,null,null,null,null,null,null,null,null,null,null,null,null,null,null,null,null,null,null,null,null,null,null,null,null,null,null,null,null,null,null,null,null,null,null,null,null,null,null,null,null,null,null,"SI(BB26=\"\";\"\";SI(OU(BB26=6);BE26;SI(OU(BB26<6);BA26;\"\")))"]
["6 Am",null,null,null,null,null,null,null,null,null,null,null,null,null,null,null,null,null,null,null,null,null,null,null,null,null,null,null,null,null,null,null,null,null,null,null,null,null,null,null,null,null,null,null,null,null,null,null,null,null,null,null,null,null,"SI(NB($AK68:$AY68)>1;RECHERCHE(9^9;$AK68:$AY68);\"\")"]
["6 Af",null,null,null,null,null,null,null,null,null,null,null,null,null,null,null,null,null,null,null,null,null,null,null,null,null,null,null,null,null,null,null,null,null,null,null,null,null,null,null,null,null,null,null,null,null,null,null,null,null,null,null,null,null,"SI(NB(BA$68:BA$74)>=LIGNES($68:68);INDEX(BA$68:BA$74;PETITE.VALEUR(SI(ESTNUM(BA$68:BA$74);LIGNE(INDIRECT(\"1:\"&LIGNES(BA$68:BA$74))));LIGNES($68:68)));\"\")"]
[]
["5Ah",null,null,null,null,"6Ah","6Am","6Af","5Ah","5Am","5Af","4Ah","4Am","4Af","3Ah","3Am","3Af","2Ah","2Am","2Af","1Ah","1Am","1Af","0Ah","0Am","0Af",null,"6Ah","6Am","6Af","5Ah","5Am","5Af","4Ah","4Am","4Af","3Ah","3Am","3Af","2Ah","2Am","2Af","1Ah","1Am","1Af","0Ah","0Am","0Af"]
{"$rows_left_out":47}
{"sheet":" eliminer le tiers des partants","index":7,"n_rows":30,"n_cols":41,"rows_kept":30,"cut":false,"hidden":false,"merged":[[1,1,1,15],[3,6,3,7],[6,3,6,5],[6,7,6,8],[29,2,29,4],[29,5,29,6],[29,7,29,12]]}
[]
[null,"Méthode TIERCÉS DE TROT \"Éliminez à coup sûr le tiers des partants\" "]
[]
[null,null,null,null,null,null,"Allocation du jour",null,70000]
[null,null,null,null,null,null,null,null,{"$f":"I4/1000","v":70}]
[]
{"$rows_left_out":24}