{"text_format":"1","workbook":"xlsx","n_sheets":8,"sheets":["Accueil","Performances","NCV","Cotes","Résumé","Feuil1 (2)","Feuil2 (2)"," eliminer le tiers des partants"],"not_rendered":{"charts":0,"images":6,"macros":1,"external_links":4,"defined_names":46,"comments":0,"pivot_tables":0},"unopened":[],"bounds":{"document_bytes":16777216,"sheet_cells":100000,"rows_first":2000,"rows_last":500,"rows_between":2000,"halvings":0,"cell_chars":16384,"cell_head_chars":4096},"cells_cut":0,"cells_raw":0,"read":"whole","date_system":"1900"}

{"sheet":"Accueil","index":0,"n_rows":36,"n_cols":17,"rows_kept":36,"cut":false,"hidden":false,"merged":[[0,6,1,16],[35,1,38,14],[11,1,11,14],[4,1,5,14],[7,1,7,14],[8,1,8,14],[9,1,9,14],[10,1,10,14]]}
[null,null,null,null,null,null,"Nouveaux Critères pour la Victoire"]
[]
[]
[]
[null,"Course du vendredi le 22 mai 2020"]
[]
[]
[null,"Vendredi :  Saint-Galmier (Genybet) (R5) "]
[null,"9ème course - Prix de la Ville de la Fouillouse "]
[null,"Départ 17h30"]
[]
[null,"Attelé - Course G (trot) - 3 000€ - 2050m - 14 partants - Pouzzolane - corde : à droite - - Amateurs"]
[]
[null,"N°","Cheval","SA","Dist.","Driver","Entraîneur","Musique","Gains","Cotes références","Dernières cotes","Oeil.","Déf.","Courues","Victoires","Places","Gains"]
[null,1,"Daika Vikland  ","F7",2025,"T. Clairet","A. Bonnefoy","(19)6a7a9a8a0a0a",23570,"-",14.4,null,"D4",32,1,7,23570]
[null,2,"Dalhium de Grez","H7",2025,"B. Jay","B. Fedry","0m(19)0a7aDa0a(18)Da",30770,"-",20,null,null,36,3,2,30770]
[null,3,"Espion Volsin  ","H6",2025,"J-P. Brechet","Mlle N. Desprès","6a0aDa(19)5a0a9a",32830,"-",8.3000000000000007,null,"DP",40,1,8,32830]
[null,4,"Duchesse Fouteau  ","F7",2025,"C. Ducroux","B. Cury","0a(19)0a9a4a0a7a",45690,"-",14.3,null,"D4",42,3,4,45690]
[null,5,"Chef des Plaines","H8",2025,"L. Viricel","P. Callier","0aDa5a6a(19)Da(18)Da",51300,"-",7.4,null,null,49,3,7,51300]
[null,6,"Cool Gahn","H8",2025,"R. Duport","M. Messager","0a3a7m(19)Da1a9a",55345,"-",48.3,null,null,78,5,7,55345]
[null,7,"Elton Magic  ","H6",2050,"Mlle M. Callier","J.-L. Verrière","(19)DaDa0a7a2a0a",39450,"-",5.8,null,"DP",29,2,6,39450]
[null,8,"Charly de Yor  ","H8",2050,"M. Monier","R. Mourlon","0a(19)DaDa2a9a2a",42080,"-",23.2,null,"D4",38,4,7,42080]
[null,9,"Chamar d'Ici   (E1)","H8",2050,"T. Valvo","F. Carpentier","7aDa8a(19)6a9a0a",42840,"-",28.4,null,"D4",64,2,13,42840]
[null,10,"Conflit (E1)","H8",2050,"S. Zeghouani","F. Carpentier","8aDaDa(19)5a5a0a",48675,"-",35.299999999999997,null,null,72,2,13,48675]
[null,11,"Daryl Impey","H7",2050,"A. Gaudin","E. Bouyer","4a7aDa4a(19)2a3a",53330,"-",30.9,null,null,75,3,12,53330]
[null,12,"Carla de Flosaille  ","F8",2050,"Mme C. Huguet","G. R. Huguet","5a2a0a(19)4a8aDa",54290,"-",4.5,null,"DP",47,3,10,54290]
[null,13,"Elverina Devavian","F6",2050,"J. Lasselin","M. Busset","1a0a8a(19)Da3a1a",62580,"-",6,null,null,32,6,5,62580]
[null,14,"Cisa du Mouchel  ","F8",2050,"P. F. Monier","S. Dumont","8aDa7a(19)0aDa0a",62980,"-",40.200000000000003,null,"D4",77,4,17,62980]
[]
[]
[]
[]
[]
[]
[]
[null,"Pour 6, 7 et 8 ans, n'ayant pas gagné 63.000. - Avance de 25 m. aux chevaux drivés par des personnes n'ayant pas gagné deux courses."]

{"sheet":"Performances","index":1,"n_rows":137,"n_cols":16,"rows_kept":137,"cut":false,"hidden":false,"merged":[]}
["daika-vikland"]
["Date","Hippodrome","Dist.","Par.","Corde","Aut.","Spé.","Course","Q+","Alloc.","Rang","Réd. km","Déferré","Cotes","Partants"]
[" 20/10/19","Agen-Le Passage",2575,null,"D","A","Attelé",null,null,"3 000€",6,"1'17''2","D4",15,16,"Cote Fictive"]
[" 07/10/19","Castéra-Verduzan",2150,null,"D","A","Attelé","A Réc.",null,"5 000€",7,"1'19''6","D4",15,14,"Cote Fictive"]
[" 25/08/19","Jullianges",2425,null,"D",null,"Attelé",null,null,"13 000€",9,"1'18''0","D4",12,13,"Cote Fictive"]
[" 15/08/19","Gémozac",2625,null,"D",null,"Attelé",null,null,"4 000€",8,"1'24''3","D4",15,11,"Cote Fictive"]
[" 29/07/19","Gabarret",2550,null,"G",null,"Attelé",null,null,"13 000€",0,null,"DP",12,15,"Cote Fictive"]
[]
[]
[]
["dalhium-de-grez"]
["Date","Hippodrome","Dist.","Par.","Corde","Aut.","Spé.","Course","Q+","Alloc.","Rang","Réd. km","Déferré","Cotes","Partants"]
[" 12/03/20","Lyon-La Soie",2700,null,"D",null,"Monté",null,null,"17 000€",12,"1'20''8",null,155,16]
[" 30/09/19","L'Isle-sur-la-Sorgue",2650,null,"D",null,"Attelé",null,null,"5 000€",11,"1'23''8","DP",12,13,"Cote Fictive"]
[" 15/09/19","Carpentras",2650,null,"D",null,"Attelé",null,null,"4 000€",7,"1'22''1","DP",15,9,"Cote Fictive"]
[" 25/08/19","Vittel",2700,null,"D",null,"Attelé",null,null,"4 000€","Dai",null,null,7,12,"Cote Fictive"]
[" 06/08/19","Aix-les-Bains",2725,null,"D",null,"Attelé",null,null,"4 000€",11,null,null,12,12,"Cote Fictive"]
[]
[]
[]
["espion-volsin"]
["Date","Hippodrome","Dist.","Par.","Corde","Aut.","Spé.","Course","Q+","Alloc.","Rang","Réd. km","Déferré","Cotes","Partants"]
[" 18/05/20","Lyon-Parilly",2875,null,"G",null,"Attelé","A Réc.",null,"9 000€",6,"1'17''3","D4",15,17,"Cote Fictive"]
[" 19/02/20","Saint-Galmier",2650,null,"D",null,"Attelé",null,null,"17 000€",14,"1'17''6","D4",31,18]
[" 10/02/20","Lyon-La Soie",2700,null,"D",null,"Attelé",null,null,"17 000€","Dai",null,"D4",65,17]
[" 01/12/19","Lyon-Parilly",2875,null,"G",null,"Attelé","A Réc.",null,"10 000€",5,"1'18''4","D4",15,15,"Cote Fictive"]
[" 24/11/19","Agen-Le Passage",2575,null,"D","A","Attelé","A Réc.",null,"10 000€",11,"1'17''4","D4",12,14,"Cote Fictive"]
[]
[]
[]
["duchesse-fouteau"]
["Date","Hippodrome","Dist.","Par.","Corde","Aut.","Spé.","Course","Q+","Alloc.","Rang","Réd. km","Déferré","Cotes","Partants"]
[" 13/01/20","Toulouse",2950,null,"D",null,"Attelé",null,null,"18 000€",13,"1'20''2","D4",62,14]
[" 28/12/19","Bordeaux-Le Bouscat",2650,null,"D",null,"Attelé",null,null,"6 000€",12,"1'17''6","D4",57,16]
[" 15/12/19","Grenade-sur-Garonne",2725,null,"G",null,"Attelé",null,null,"13 000€",9,"1'18''6","D4",12,15,"Cote Fictive"]
[" 17/11/19","Bordeaux-Le Bouscat",2650,null,"D",null,"Attelé",null,null,"5 000€",4,"1'19''1","D4",10,16,"Cote Fictive"]
[" 28/10/19","Toulouse",2750,null,"D","A","Attelé",null,null,"20 000€",14,"1'19''4","D4",140,16]
[]
[]
[]
["chef-des-plaines"]
["Date","Hippodrome","Dist.","Par.","Corde","Aut.","Spé.","Course","Q+","Alloc.","Rang","Réd. km","Déferré","Cotes","Partants"]
[" 07/03/20","Cagnes-sur-Mer",1609,null,"G","A","Attelé",null,null,"5 000€",11,"1'20''2",null,12,11,"Cote Fictive"]
[" 01/03/20","Paray-le-Monial",2025,null,"D",null,"Attelé",null,null,"4 000€","Dai",null,null,7,14,"Cote Fictive"]
[" 17/02/20","Saint-Galmier",2000,null,"D","A","Attelé",null,null,"6 000€",5,"1'16''1",null,13,16]
[" 19/01/20","Cagnes-sur-Mer",2150,null,"G","A","Attelé",null,null,"5 000€",6,"1'16''4",null,15,9,"Cote Fictive"]
[" 24/01/19","Lyon-La Soie",2700,null,"D",null,"Attelé",null,null,"18 000€","Dai",null,null,112,18]
[]
[]
[]
["cool-gahn"]
["Date","Hippodrome","Dist.","Par.","Corde","Aut.","Spé.","Course","Q+","Alloc.","Rang","Réd. km","Déferré","Cotes","Partants"]
[" 17/05/20","L'Isle-sur-la-Sorgue",2675,null,"D",null,"Attelé","A Réc.",null,"9 000€",11,"1'19''2",null,12,16,"Cote Fictive"]
[" 17/02/20","Montauban",2400,null,"D",null,"Attelé","A Réc.",null,"4 000€",3,"1'18''1",null,10,13,"Cote Fictive"]
[" 25/01/20","Saint-Galmier",3200,null,"D",null,"Monté","Européenne",null,"26 000€",7,"1'21''4",null,38,12]
[" 08/12/19","Grenade-sur-Garonne",2750,null,"G",null,"Attelé",null,null,"5 000€","Dai",null,null,7,16,"Cote Fictive"]
[" 24/11/19","Agen-Le Passage",2575,null,"D","A","Attelé","A Réc.",null,"4 000€",1,"1'16''1","DA",5,11,"Cote Fictive"]
[]
[]
[]
["elton-magic"]
["Date","Hippodrome","Dist.","Par.","Corde","Aut.","Spé.","Course","Q+","Alloc.","Rang","Réd. km","Déferré","Cotes","Partants"]
[" 11/11/19","Lyon-La Soie",2050,null,"D","A","Attelé",null,null,"17 000€","Dai",null,"D4",20,14]
[" 16/10/19","Feurs",2850,null,"G",null,"Attelé","Nationale",null,"19 000€","Dai",null,null,130,16]
[" 22/09/19","Lyon-Parilly",2850,null,"G",null,"Attelé",null,null,"15 000€",13,"1'19''8",null,12,17,"Cote Fictive"]
[" 29/07/19","Aix-les-Bains",2000,null,"D",null,"Attelé",null,null,"13 000€",7,null,"D4",15,12,"Cote Fictive"]
[" 04/07/19","Vichy",1609,null,"D","A","Attelé",null,null,"20 000€",2,"1'12''7","D4",5,13]
[]
[]
[]
["charly-de-yor"]
["Date","Hippodrome","Dist.","Par.","Corde","Aut.","Spé.","Course","Q+","Alloc.","Rang","Réd. km","Déferré","Cotes","Partants"]
[" 15/03/20","Feurs",2850,null,"G",null,"Attelé",null,null,"3 000€",11,"1'18''5",null,12,16,"Cote Fictive"]
[" 24/11/19","Lyon-Parilly",2850,null,"G",null,"Attelé",null,null,"5 000€","Dai",null,"D4",7,12,"Cote Fictive"]
[" 11/11/19","Lyon-La Soie",2700,null,"D",null,"Attelé",null,null,"6 000€","Dai",null,"D4",18,11]
[" 13/10/19","Lyon-Parilly",2850,null,"G",null,"Attelé",null,null,"5 000€",2,"1'20''7","D4",5,14,"Cote Fictive"]
[" 16/09/19","L'Isle-sur-la-Sorgue",2650,null,"D",null,"Attelé",null,null,"5 000€",9,"1'19''7","D4",12,13,"Cote Fictive"]
[]
[]
[]
["chamar-d-ici"]
["Date","Hippodrome","Dist.","Par.","Corde","Aut.","Spé.","Course","Q+","Alloc.","Rang","Réd. km","Déferré","Cotes","Partants"]
[" 15/03/20","Feurs",2850,null,"G",null,"Attelé",null,null,"3 000€",7,"1'18''0","D4",15,16,"Cote Fictive"]
[" 24/02/20","Châtillon-sur-Chalaronne",2600,null,"G","A","Attelé",null,null,"5 000€","Dai",null,"D4",7,14,"Cote Fictive"]
[" 17/02/20","Saint-Galmier",2000,null,"D","A","Attelé",null,null,"6 000€",8,"1'16''3","D4",38,16]
[" 24/11/19","Lyon-Parilly",2850,null,"G",null,"Attelé",null,null,"5 000€",6,"1'18''2","D4",15,12,"Cote Fictive"]
[" 08/11/19","Saint-Galmier",2600,null,"D","A","Attelé",null,null,"5 000€",9,"1'17''9","D4",12,15,"Cote Fictive"]
[]
[]
[]
["conflit"]
["Date","Hippodrome","Dist.","Par.","Corde","Aut.","Spé.","Course","Q+","Alloc.","Rang","Réd. km","Déferré","Cotes","Partants"]
[" 24/02/20","Châtillon-sur-Chalaronne",2600,null,"G","A","Attelé",null,null,"5 000€",8,"1'18''4",null,15,14,"Cote Fictive"]
[" 25/01/20","Saint-Galmier",2600,null,"D","A","Attelé",null,null,"6 000€","Dai",null,null,70,15]
[" 15/01/20","Marseille-Vivaux",2650,null,"G",null,"Attelé",null,null,"6 000€","Dai",null,"DP",48,12]
[" 01/12/19","Lyon-Parilly",2850,null,"G",null,"Attelé",null,null,"5 000€",5,"1'18''5","DP",15,16,"Cote Fictive"]
[" 08/11/19","Saint-Galmier",2600,null,"D","A","Attelé",null,null,"5 000€",5,"1'16''3","DP",15,15,"Cote Fictive"]
[]
[]
[]
["daryl-impey"]
["Date","Hippodrome","Dist.","Par.","Corde","Aut.","Spé.","Course","Q+","Alloc.","Rang","Réd. km","Déferré","Cotes","Partants"]
[" 12/03/20","Lyon-La Soie",2700,null,"D",null,"Attelé",null,null,"6 000€",4,"1'18''5","DP",15,14]
[" 20/02/20","Lyon-La Soie",2700,null,"D",null,"Attelé",null,null,"22 000€",7,"1'16''4","DP",8.1,18]
[" 17/02/20","Saint-Galmier",2000,null,"D","A","Attelé",null,null,"6 000€","Dai",null,null,2.8,16]
[" 30/01/20","Lyon-La Soie",2700,null,"D",null,"Attelé",null,null,"23 000€",4,"1'18''4","DP",8.6,18]
[" 15/12/19","Grenade-sur-Garonne",2725,null,"G",null,"Attelé",null,null,"13 000€",2,"1'17''3","DP",5,15,"Cote Fictive"]
[]
[]
[]
["carla-de-flosaille"]
["Date","Hippodrome","Dist.","Par.","Corde","Aut.","Spé.","Course","Q+","Alloc.","Rang","Réd. km","Déferré","Cotes","Partants"]
[" 12/03/20","Lyon-La Soie",2700,null,"D",null,"Attelé",null,null,"6 000€",5,"1'18''5","DP",12,14]
[" 17/02/20","Saint-Galmier",2000,null,"D","A","Attelé",null,null,"6 000€",2,"1'15''9","DP",6.6,16]
[" 20/01/20","Marseille-Vivaux",2650,null,"G",null,"Attelé",null,null,"6 000€",10,"1'17''6",null,78,13]
[" 14/10/19","Salon-de-Provence",2950,null,"D",null,"Attelé",null,null,"19 000€",4,"1'18''6","DP",10,16,"Cote Fictive"]
[" 07/10/19","Salon-de-Provence",2950,null,"D",null,"Attelé",null,null,"5 000€",8,"1'19''3","DP",15,11,"Cote Fictive"]
[]
[]
[]
["elverina-devavian"]
["Date","Hippodrome","Dist.","Par.","Corde","Aut.","Spé.","Course","Q+","Alloc.","Rang","Réd. km","Déferré","Cotes","Partants"]
[" 20/02/20","Lyon-La Soie",2700,null,"D",null,"Attelé",null,null,"22 000€",1,"1'15''5","D4",6,18]
[" 10/02/20","Lyon-La Soie",2700,null,"D",null,"Attelé",null,null,"17 000€",14,"1'17''8",null,40,17]
[" 25/01/20","Saint-Galmier",2650,null,"D",null,"Attelé",null,null,"17 000€",8,"1'17''0",null,24,18]
[" 08/12/19","Lyon-Parilly",2850,null,"G",null,"Attelé",null,null,"15 000€","Dai",null,"DP",7,18,"Cote Fictive"]
[" 24/11/19","Lyon-Parilly",2850,null,"G",null,"Attelé",null,null,"15 000€",3,"1'16''5","DP",10,18,"Cote Fictive"]
[]
[]
[]
["cisa-du-mouchel"]
["Date","Hippodrome","Dist.","Par.","Corde","Aut.","Spé.","Course","Q+","Alloc.","Rang","Réd. km","Déferré","Cotes","Partants"]
[" 15/03/20","Feurs",2850,null,"G",null,"Attelé",null,null,"5 000€",8,"1'20''4","D4",15,12,"Cote Fictive"]
[" 19/02/20","Saint-Galmier",2000,null,"D","A","Attelé",null,null,"6 000€","Di",null,"D4",116,16]
[" 20/01/20","Marseille-Vivaux",2650,null,"G",null,"Attelé",null,null,"22 000€",7,"1'17''8","D4",48,13]
[" 08/12/19","Lyon-Parilly",2600,null,"G","A","Attelé",null,null,"5 000€",10,"1'16''6","D4",12,16,"Cote Fictive"]
[" 15/08/19","La Clayette",2650,null,"D",null,"Attelé",null,null,"4 000€","Dai",null,"D4",7,12,"Cote Fictive"]

{"sheet":"NCV","index":2,"n_rows":30,"n_cols":255,"rows_kept":30,"cut":false,"hidden":false,"merged":[[30,1,30,3],[1,9,2,20],[4,2,4,3],[4,5,4,6],[4,7,4,11],[4,12,4,16],[4,17,4,21],[4,22,4,26],[26,1,26,3],[27,1,27,3],[28,1,28,3],[29,1,29,3]]}
[]
[]
[]
[null,null,null,null,null,null,null,1,2,3,4,5,1,2,3,4,5,1,2,3,4,5,1,2,3,4,5]
[null,null,"LTP",null,null,"SYO",null,"Cotes",null,null,null,null,"Rang",null,null,null,null,"Nbre Partants",null,null,null,null,"Allocation"]
[null,1,null,null,null,null,null,154,36,11,15,65,14,10,7,5,7,14,13,11,9,8,"100 000€","55 000€","35 000€","57 000€","100 000€"]
[null,2,null,null,null,null,null,106,4.9000000000000004,3,1.9,2,11,2,4,1,2,15,16,14,16,13,"90 000€","80 000€","11 000€","80 000€","80 000€"]
[null,3,null,null,null,null,null,25,84,21,18,5,8,14,15,3,1,10,17,18,15,13,"80 000€","110 000€","110 000€","130 000€","80 000€"]
[null,4,null,null,null,null,null,131,8.1999999999999993,14,7.8,4.5,14,7,5,4,3,15,13,10,18,18,"49 000€","85 000€","90 000€","64 000€","64 000€"]
[null,5,null,null,null,null,null,25,61,35,8.9,21,5,8,7,3,3,16,13,16,18,18,"80 000€","90 000€","80 000€","60 000€","65 000€"]
[null,6,null,null,null,null,null,31,50,13,119,10,9,4,7,"Dai",11,10,16,13,16,13,"80 000€","80 000€","55 000€","80 000€","120 000€"]
[null,7,null,null,null,null,null,3.7,9.4,162,22,5.7,1,3,10,11,11,12,11,16,18,12,"53 000€","35 000€","85 000€","40 000€","53 000€"]
[null,8,null,null,null,null,null,56,21,51,59,41,7,2,9,4,2,16,13,16,8,13,"80 000€","55 000€","80 000€","80 000€","120 000€"]
[null,9,null,null,null,null,null,132,87,129,49,80,7,6,8,6,6,10,8,13,7,8,"100 000€","90 000€","80 000€","100 000€","90 000€"]
[null,10,null,null,null,null,null,20,24,9.4,4.8,6.1,6,6,5,5,1,15,16,9,18,11,"90 000€","80 000€","67 000€","65 000€","67 000€"]
[null,11,null,null,null,null,null,62,22,64,49,74,4,"Dai",3,11,11,15,16,11,11,16,"90 000€","80 000€","80 000€","35 000€","39 000€"]
[null,12,null,null,null,null,null,9.1,6.6,16,22,1.7,13,8,6,3,1,15,15,10,16,16,"36 000€","90 000€","80 000€","80 000€","67 000€"]
[null,13,null,null,null,null,null,10,65,25,3.3,171,3,12,5,4,0,12,16,13,9,18,"53 000€","80 000€","80 000€","67 000€","65 000€"]
[null,14,null,null,null,null,null,98,6.3,15,7.7,47,10,10,11,8,6,16,12,13,15,16,"67 000€","53 000€","55 000€","44 000€","80 000€"]
[null,15,null,null,null,null,null,9.4,16,25,91,4.0999999999999996,1,2,4,6,5,16,16,16,16,14,"67 000€","67 000€","64 000€","85 000€","36 000€"]
[null,16,null,null,null,null,null,19,178,105,166,25,2,11,12,0,13,12,15,13,18,15,"53 000€","80 000€","80 000€","49 000€","45 000€"]
[null,17]
[null,18]
[null,19]
[null,20]
[]
[]
[]
[]
[null,null,null,null,null,null,null,null,null,null,null,null,null,null,null,null,null,null,null,null,null,null,null,null,null,null,null,null,null,null,null,null,null,null,null,null,null,null,null,null,null,null,null,null,null,null,null,null,null,null,null,null,null,null,null,null,null,null,null,null,null,null,null,null,null,null,null,null,null,null,null,12,15,12,15,12,15,12,15,12,15,12,15,12,15,12,15,12,15,12,15,12,15,12,15,12,15,12,15,12,15,12,15,12,15,12,15,12,15,12,15,12,15,12,15,12,15,12,15,12,15,12,15,12,15,12,15,12,15,12,15,12,15,12,15,12,15,12,15,12,15,12,15,12,15,12,15,12,15,12,15,12,15,12,15,12,15,12,15,12,15,12,15,12,15,12,15,12,15,12,15,12,15,12,15,12,15,12,15,12,15,12,15,12,15,12,15,12,15,12,15,12,15,12,15,12,15,12,15,12,15,12,15,12,15,12,15,12,15,12,15,12,15,12,15,12,15,12,15,12,15,12,15,12,15,12,15,12,15,12,15,12,15,12,15,12,15,12,15,12,15,12,15,12,15,12,15,12,15,12,15,12,15,12,15]

{"sheet":"Cotes","index":3,"n_rows":48,"n_cols":25,"rows_kept":48,"cut":false,"hidden":false,"merged":[[25,2,25,3],[27,19,27,20]]}
[]
[]
[]
[null,"Musique","P1","P2","P3","P4","P5","P6","N° PMU","P1","P2","P3","P4","P5","P6","Nbre courses","Nbre courses dans l'année","Cotes PMU","% Cotes","Valeur Cotes","Courses","Victoires","Places","Gains","Moy. Gains"]
[null,{"$f":"IF(Accueil!B15<>\"\",MusiqueEpuree(Accueil!H15),\"\")","v":"679800"},{"$f":"IF(ISERROR((IF(B5=\"\",\"\",ABS(LEFT(B5,1))))),\"\",(IF(B5=\"\",\"\",ABS(LEFT(B5,1)))))","v":6},{"$f":"IF(ISERROR((IF(B5=\"\",\"\",IF(LEN(B5)<2,0,ABS(RIGHT((LEFT(B5,2)),1)))))),\"\",(IF(B5=\"\",\"\",IF(LEN(B5)<2,0,ABS(RIGHT((LEFT(B5,2)),1))))))","v":7},{"$f":"IF(ISERROR((IF(B5=\"\",\"\",IF(LEN(B5)<3,0,ABS(RIGHT((LEFT(B5,3)),1)))))),\"\",(IF(B5=\"\",\"\",IF(LEN(B5)<3,0,ABS(RIGHT((LEFT(B5,3)),1))))))","v":9},{"$f":"IF(ISERROR((IF(B5=\"\",\"\",IF(LEN(B5)<4,0,ABS(RIGHT((LEFT(B5,4)),1)))))),\"\",(IF(B5=\"\",\"\",IF(LEN(B5)<4,0,ABS(RIGHT((LEFT(B5,4)),1))))))","v":8},{"$f":"IF(ISERROR((IF(B5=\"\",\"\",IF(LEN(B5)<5,0,ABS(RIGHT((LEFT(B5,5)),1)))))),\"\",(IF(B5=\"\",\"\",IF(LEN(B5)<5,0,ABS(RIGHT((LEFT(B5,5)),1))))))","v":0},{"$f":"IF(ISERROR((IF(B5=\"\",\"\",IF(LEN(B5)<6,0,ABS(RIGHT((LEFT(B5,6)),1)))))),\"\",(IF(B5=\"\",\"\",IF(LEN(B5)<6,0,ABS(RIGHT((LEFT(B5,6)),1))))))","v":0},{"$f":"IF(Accueil!B15<>\"\",Accueil!B15,\"\")","v":1},{"$f":"IF($B5=\"\",\"\",IF(C5=0,10,C5))","v":6},{"$f":"IF($B5=\"\",\"\",IF(D5=0,10,D5))","v":7},9,8,10,10,{"$f":"IF(B5<>\"\",IFERROR(INT(LEN(MID(Accueil!N15,1,SEARCH(\"(\"&RIGHT(YEAR(TODAY()),2)-1&\")\",Accueil!N15)-1))/2),LEN(B5)),\"\")","v":6},{"$f":"IF(B5<>\"\",IFERROR(INT(LEN(MID(Accueil!N15,1,SEARCH(\"(\"&RIGHT(YEAR(TODAY()),2)-1&\")\",Accueil!N15)-1))/2),LEN(B5)),\"\")","v":6},{"$f":"IF(I5<>\"\",IF(Accueil!K15=\"-\",\"\",Accueil!K15),\"\")","v":14.4},{"$f":"IF(AND(R5<>0,R5<>\"\",R5<>\"-\"),(1/R5)*100,\"\")","v":6.9444444444444446},{"$f":"IF(OR(S5=\"\",$S$26=0,$S$25=0),\"\",(S5/$S$26)*100)","v":81.639001998586195},{"$f":"IF(I5<>\"\",Accueil!N15,\"\")","v":32},{"$f":"IF(J5<>\"\",Accueil!O15,\"\")","v":1},{"$f":"IF(K5<>\"\",Accueil!P15,\"\")","v":7},{"$f":"IF(L5<>\"\",Accueil!Q15,\"\")","v":23570},{"$f":"IF(OR(X5<>0,X5<>\"\"),IF(OR(U5=0,U5=\"\"),\"\",X5/U5),\"\")","v":736.5625}]
[null,{"$f":"IF(Accueil!B16<>\"\",MusiqueEpuree(Accueil!H16),\"\")","v":"007000"},0,0,7,0,0,{"$f":"IF(ISERROR((IF(B6=\"\",\"\",IF(LEN(B6)<6,0,ABS(RIGHT((LEFT(B6,6)),1)))))),\"\",(IF(B6=\"\",\"\",IF(LEN(B6)<6,0,ABS(RIGHT((LEFT(B6,6)),1))))))","v":0},{"$f":"IF(Accueil!B16<>\"\",Accueil!B16,\"\")","v":2},{"$f":"IF($B6=\"\",\"\",IF(C6=0,10,C6))","v":10},10,7,10,10,10,{"$f":"IF(B6<>\"\",IFERROR(INT(LEN(MID(Accueil!N16,1,SEARCH(\"(\"&RIGHT(YEAR(TODAY()),2)-1&\")\",Accueil!N16)-1))/2),LEN(B6)),\"\")","v":6},{"$f":"IF(B6<>\"\",IFERROR(INT(LEN(MID(Accueil!N16,1,SEARCH(\"(\"&RIGHT(YEAR(TODAY()),2)-1&\")\",Accueil!N16)-1))/2),LEN(B6)),\"\")","v":6},{"$f":"IF(I6<>\"\",IF(Accueil!K16=\"-\",\"\",Accueil!K16),\"\")","v":20},5,{"$f":"IF(OR(S6=\"\",$S$26=0,$S$25=0),\"\",(S6/$S$26)*100)","v":58.780081438982059},{"$f":"IF(I6<>\"\",Accueil!N16,\"\")","v":36},{"$f":"IF(J6<>\"\",Accueil!O16,\"\")","v":3},{"$f":"IF(K6<>\"\",Accueil!P16,\"\")","v":2},{"$f":"IF(L6<>\"\",Accueil!Q16,\"\")","v":30770},{"$f":"IF(OR(X6<>0,X6<>\"\"),IF(OR(U6=0,U6=\"\"),\"\",X6/U6),\"\")","v":854.72222222222217}]
[null,{"$f":"IF(Accueil!B17<>\"\",MusiqueEpuree(Accueil!H17),\"\")","v":"600509"},6,0,0,5,0,9,{"$f":"IF(Accueil!B17<>\"\",Accueil!B17,\"\")","v":3},6,10,10,5,10,9,{"$f":"IF(B7<>\"\",IFERROR(INT(LEN(MID(Accueil!N17,1,SEARCH(\"(\"&RIGHT(YEAR(TODAY()),2)-1&\")\",Accueil!N17)-1))/2),LEN(B7)),\"\")","v":6},{"$f":"IF(B7<>\"\",IFERROR(INT(LEN(MID(Accueil!N17,1,SEARCH(\"(\"&RIGHT(YEAR(TODAY()),2)-1&\")\",Accueil!N17)-1))/2),LEN(B7)),\"\")","v":6},{"$f":"IF(I7<>\"\",IF(Accueil!K17=\"-\",\"\",Accueil!K17),\"\")","v":8.3000000000000007},12.048192771084336,141.63875045537844,{"$f":"IF(I7<>\"\",Accueil!N17,\"\")","v":40},{"$f":"IF(J7<>\"\",Accueil!O17,\"\")","v":1},{"$f":"IF(K7<>\"\",Accueil!P17,\"\")","v":8},{"$f":"IF(L7<>\"\",Accueil!Q17,\"\")","v":32830},820.75]
[null,{"$f":"IF(Accueil!B18<>\"\",MusiqueEpuree(Accueil!H18),\"\")","v":"009407"},0,0,9,4,0,7,{"$f":"IF(Accueil!B18<>\"\",Accueil!B18,\"\")","v":4},10,10,9,4,10,7,{"$f":"IF(B8<>\"\",IFERROR(INT(LEN(MID(Accueil!N18,1,SEARCH(\"(\"&RIGHT(YEAR(TODAY()),2)-1&\")\",Accueil!N18)-1))/2),LEN(B8)),\"\")","v":6},{"$f":"IF(B8<>\"\",IFERROR(INT(LEN(MID(Accueil!N18,1,SEARCH(\"(\"&RIGHT(YEAR(TODAY()),2)-1&\")\",Accueil!N18)-1))/2),LEN(B8)),\"\")","v":6},{"$f":"IF(I8<>\"\",IF(Accueil!K18=\"-\",\"\",Accueil!K18),\"\")","v":14.3},{"$f":"IF(AND(R8<>0,R8<>\"\",R8<>\"-\"),(1/R8)*100,\"\")","v":6.9930069930069925},82.209904110464407,{"$f":"IF(I8<>\"\",Accueil!N18,\"\")","v":42},{"$f":"IF(J8<>\"\",Accueil!O18,\"\")","v":3},{"$f":"IF(K8<>\"\",Accueil!P18,\"\")","v":4},{"$f":"IF(L8<>\"\",Accueil!Q18,\"\")","v":45690},1087.8571428571429]
[null,{"$f":"IF(Accueil!B19<>\"\",MusiqueEpuree(Accueil!H19),\"\")","v":"005600"},0,0,5,6,0,0,{"$f":"IF(Accueil!B19<>\"\",Accueil!B19,\"\")","v":5},10,10,5,6,10,10,{"$f":"IF(B9<>\"\",IFERROR(INT(LEN(MID(Accueil!N19,1,SEARCH(\"(\"&RIGHT(YEAR(TODAY()),2)-1&\")\",Accueil!N19)-1))/2),LEN(B9)),\"\")","v":6},{"$f":"IF(B9<>\"\",IFERROR(INT(LEN(MID(Accueil!N19,1,SEARCH(\"(\"&RIGHT(YEAR(TODAY()),2)-1&\")\",Accueil!N19)-1))/2),LEN(B9)),\"\")","v":6},{"$f":"IF(I9<>\"\",IF(Accueil!K19=\"-\",\"\",Accueil!K19),\"\")","v":7.4},{"$f":"IF(AND(R9<>0,R9<>\"\",R9<>\"-\"),(1/R9)*100,\"\")","v":13.513513513513512},158.86508497022177,{"$f":"IF(I9<>\"\",Accueil!N19,\"\")","v":49},{"$f":"IF(J9<>\"\",Accueil!O19,\"\")","v":3},{"$f":"IF(K9<>\"\",Accueil!P19,\"\")","v":7},{"$f":"IF(L9<>\"\",Accueil!Q19,\"\")","v":51300},1046.9387755102041]
[null,{"$f":"IF(Accueil!B20<>\"\",MusiqueEpuree(Accueil!H20),\"\")","v":"037019"},0,3,7,0,1,9,{"$f":"IF(Accueil!B20<>\"\",Accueil!B20,\"\")","v":6},10,3,7,10,1,9,{"$f":"IF(B10<>\"\",IFERROR(INT(LEN(MID(Accueil!N20,1,SEARCH(\"(\"&RIGHT(YEAR(TODAY()),2)-1&\")\",Accueil!N20)-1))/2),LEN(B10)),\"\")","v":6},{"$f":"IF(B10<>\"\",IFERROR(INT(LEN(MID(Accueil!N20,1,SEARCH(\"(\"&RIGHT(YEAR(TODAY()),2)-1&\")\",Accueil!N20)-1))/2),LEN(B10)),\"\")","v":6},{"$f":"IF(I10<>\"\",IF(Accueil!K20=\"-\",\"\",Accueil!K20),\"\")","v":48.3},2.0703933747412009,24.339578235603334,{"$f":"IF(I10<>\"\",Accueil!N20,\"\")","v":78},{"$f":"IF(J10<>\"\",Accueil!O20,\"\")","v":5},{"$f":"IF(K10<>\"\",Accueil!P20,\"\")","v":7},{"$f":"IF(L10<>\"\",Accueil!Q20,\"\")","v":55345},709.5512820512821]
[null,{"$f":"IF(Accueil!B21<>\"\",MusiqueEpuree(Accueil!H21),\"\")","v":"000720"},0,0,0,7,2,0,{"$f":"IF(Accueil!B21<>\"\",Accueil!B21,\"\")","v":7},10,10,10,7,2,10,{"$f":"IF(B11<>\"\",IFERROR(INT(LEN(MID(Accueil!N21,1,SEARCH(\"(\"&RIGHT(YEAR(TODAY()),2)-1&\")\",Accueil!N21)-1))/2),LEN(B11)),\"\")","v":6},{"$f":"IF(B11<>\"\",IFERROR(INT(LEN(MID(Accueil!N21,1,SEARCH(\"(\"&RIGHT(YEAR(TODAY()),2)-1&\")\",Accueil!N21)-1))/2),LEN(B11)),\"\")","v":6},{"$f":"IF(I11<>\"\",IF(Accueil!K21=\"-\",\"\",Accueil!K21),\"\")","v":5.8},17.241379310344829,202.68993599648985,{"$f":"IF(I11<>\"\",Accueil!N21,\"\")","v":29},{"$f":"IF(J11<>\"\",Accueil!O21,\"\")","v":2},{"$f":"IF(K11<>\"\",Accueil!P21,\"\")","v":6},{"$f":"IF(L11<>\"\",Accueil!Q21,\"\")","v":39450},1360.344827586207]
[null,{"$f":"IF(Accueil!B22<>\"\",MusiqueEpuree(Accueil!H22),\"\")","v":"000292"},0,0,0,2,9,2,{"$f":"IF(Accueil!B22<>\"\",Accueil!B22,\"\")","v":8},10,10,10,2,9,2,{"$f":"IF(B12<>\"\",IFERROR(INT(LEN(MID(Accueil!N22,1,SEARCH(\"(\"&RIGHT(YEAR(TODAY()),2)-1&\")\",Accueil!N22)-1))/2),LEN(B12)),\"\")","v":6},{"$f":"IF(B12<>\"\",IFERROR(INT(LEN(MID(Accueil!N22,1,SEARCH(\"(\"&RIGHT(YEAR(TODAY()),2)-1&\")\",Accueil!N22)-1))/2),LEN(B12)),\"\")","v":6},{"$f":"IF(I12<>\"\",IF(Accueil!K22=\"-\",\"\",Accueil!K22),\"\")","v":23.2},4.3103448275862073,50.672483999122463,{"$f":"IF(I12<>\"\",Accueil!N22,\"\")","v":38},{"$f":"IF(J12<>\"\",Accueil!O22,\"\")","v":4},{"$f":"IF(K12<>\"\",Accueil!P22,\"\")","v":7},{"$f":"IF(L12<>\"\",Accueil!Q22,\"\")","v":42080},1107.3684210526317]
[null,{"$f":"IF(Accueil!B23<>\"\",MusiqueEpuree(Accueil!H23),\"\")","v":"708690"},7,0,8,6,9,0,{"$f":"IF(Accueil!B23<>\"\",Accueil!B23,\"\")","v":9},7,10,8,6,9,10,{"$f":"IF(B13<>\"\",IFERROR(INT(LEN(MID(Accueil!N23,1,SEARCH(\"(\"&RIGHT(YEAR(TODAY()),2)-1&\")\",Accueil!N23)-1))/2),LEN(B13)),\"\")","v":6},{"$f":"IF(B13<>\"\",IFERROR(INT(LEN(MID(Accueil!N23,1,SEARCH(\"(\"&RIGHT(YEAR(TODAY()),2)-1&\")\",Accueil!N23)-1))/2),LEN(B13)),\"\")","v":6},{"$f":"IF(I13<>\"\",IF(Accueil!K23=\"-\",\"\",Accueil!K23),\"\")","v":28.4},3.5211267605633805,41.394423548578914,{"$f":"IF(I13<>\"\",Accueil!N23,\"\")","v":64},{"$f":"IF(J13<>\"\",Accueil!O23,\"\")","v":2},{"$f":"IF(K13<>\"\",Accueil!P23,\"\")","v":13},{"$f":"IF(L13<>\"\",Accueil!Q23,\"\")","v":42840},669.375]
[null,{"$f":"IF(Accueil!B24<>\"\",MusiqueEpuree(Accueil!H24),\"\")","v":"800550"},8,0,0,5,5,0,{"$f":"IF(Accueil!B24<>\"\",Accueil!B24,\"\")","v":10},8,10,10,5,5,10,{"$f":"IF(B14<>\"\",IFERROR(INT(LEN(MID(Accueil!N24,1,SEARCH(\"(\"&RIGHT(YEAR(TODAY()),2)-1&\")\",Accueil!N24)-1))/2),LEN(B14)),\"\")","v":6},{"$f":"IF(B14<>\"\",IFERROR(INT(LEN(MID(Accueil!N24,1,SEARCH(\"(\"&RIGHT(YEAR(TODAY()),2)-1&\")\",Accueil!N24)-1))/2),LEN(B14)),\"\")","v":6},{"$f":"IF(I14<>\"\",IF(Accueil!K24=\"-\",\"\",Accueil!K24),\"\")","v":35.299999999999997},2.8328611898017,33.303162288375106,{"$f":"IF(I14<>\"\",Accueil!N24,\"\")","v":72},{"$f":"IF(J14<>\"\",Accueil!O24,\"\")","v":2},{"$f":"IF(K14<>\"\",Accueil!P24,\"\")","v":13},{"$f":"IF(L14<>\"\",Accueil!Q24,\"\")","v":48675},676.04166666666663]
[null,{"$f":"IF(Accueil!B25<>\"\",MusiqueEpuree(Accueil!H25),\"\")","v":"470423"},4,7,0,4,2,3,{"$f":"IF(Accueil!B25<>\"\",Accueil!B25,\"\")","v":11},4,7,10,4,2,3,{"$f":"IF(B15<>\"\",IFERROR(INT(LEN(MID(Accueil!N25,1,SEARCH(\"(\"&RIGHT(YEAR(TODAY()),2)-1&\")\",Accueil!N25)-1))/2),LEN(B15)),\"\")","v":6},{"$f":"IF(B15<>\"\",IFERROR(INT(LEN(MID(Accueil!N25,1,SEARCH(\"(\"&RIGHT(YEAR(TODAY()),2)-1&\")\",Accueil!N25)-1))/2),LEN(B15)),\"\")","v":6},{"$f":"IF(I15<>\"\",IF(Accueil!K25=\"-\",\"\",Accueil!K25),\"\")","v":30.9},3.2362459546925573,38.045360154680949,{"$f":"IF(I15<>\"\",Accueil!N25,\"\")","v":75},{"$f":"IF(J15<>\"\",Accueil!O25,\"\")","v":3},{"$f":"IF(K15<>\"\",Accueil!P25,\"\")","v":12},{"$f":"IF(L15<>\"\",Accueil!Q25,\"\")","v":53330},711.06666666666672]
[null,{"$f":"IF(Accueil!B26<>\"\",MusiqueEpuree(Accueil!H26),\"\")","v":"520480"},5,2,0,4,8,0,{"$f":"IF(Accueil!B26<>\"\",Accueil!B26,\"\")","v":12},5,2,10,4,8,10,{"$f":"IF(B16<>\"\",IFERROR(INT(LEN(MID(Accueil!N26,1,SEARCH(\"(\"&RIGHT(YEAR(TODAY()),2)-1&\")\",Accueil!N26)-1))/2),LEN(B16)),\"\")","v":6},{"$f":"IF(B16<>\"\",IFERROR(INT(LEN(MID(Accueil!N26,1,SEARCH(\"(\"&RIGHT(YEAR(TODAY()),2)-1&\")\",Accueil!N26)-1))/2),LEN(B16)),\"\")","v":6},{"$f":"IF(I16<>\"\",IF(Accueil!K26=\"-\",\"\",Accueil!K26),\"\")","v":4.5},22.222222222222221,261.24480639547579,{"$f":"IF(I16<>\"\",Accueil!N26,\"\")","v":47},{"$f":"IF(J16<>\"\",Accueil!O26,\"\")","v":3},{"$f":"IF(K16<>\"\",Accueil!P26,\"\")","v":10},{"$f":"IF(L16<>\"\",Accueil!Q26,\"\")","v":54290},1155.1063829787233]
[null,{"$f":"IF(Accueil!B27<>\"\",MusiqueEpuree(Accueil!H27),\"\")","v":"108031"},1,0,8,0,3,1,{"$f":"IF(Accueil!B27<>\"\",Accueil!B27,\"\")","v":13},1,10,8,10,3,1,{"$f":"IF(B17<>\"\",IFERROR(INT(LEN(MID(Accueil!N27,1,SEARCH(\"(\"&RIGHT(YEAR(TODAY()),2)-1&\")\",Accueil!N27)-1))/2),LEN(B17)),\"\")","v":6},{"$f":"IF(B17<>\"\",IFERROR(INT(LEN(MID(Accueil!N27,1,SEARCH(\"(\"&RIGHT(YEAR(TODAY()),2)-1&\")\",Accueil!N27)-1))/2),LEN(B17)),\"\")","v":6},{"$f":"IF(I17<>\"\",IF(Accueil!K27=\"-\",\"\",Accueil!K27),\"\")","v":6},16.666666666666664,195.93360479660683,{"$f":"IF(I17<>\"\",Accueil!N27,\"\")","v":32},{"$f":"IF(J17<>\"\",Accueil!O27,\"\")","v":6},{"$f":"IF(K17<>\"\",Accueil!P27,\"\")","v":5},{"$f":"IF(L17<>\"\",Accueil!Q27,\"\")","v":62580},1955.625]
[null,{"$f":"IF(Accueil!B28<>\"\",MusiqueEpuree(Accueil!H28),\"\")","v":"807000"},8,0,7,0,0,0,{"$f":"IF(Accueil!B28<>\"\",Accueil!B28,\"\")","v":14},8,10,7,10,10,10,{"$f":"IF(B18<>\"\",IFERROR(INT(LEN(MID(Accueil!N28,1,SEARCH(\"(\"&RIGHT(YEAR(TODAY()),2)-1&\")\",Accueil!N28)-1))/2),LEN(B18)),\"\")","v":6},{"$f":"IF(B18<>\"\",IFERROR(INT(LEN(MID(Accueil!N28,1,SEARCH(\"(\"&RIGHT(YEAR(TODAY()),2)-1&\")\",Accueil!N28)-1))/2),LEN(B18)),\"\")","v":6},{"$f":"IF(I18<>\"\",IF(Accueil!K28=\"-\",\"\",Accueil!K28),\"\")","v":40.200000000000003},2.4875621890547261,29.243821611433855,{"$f":"IF(I18<>\"\",Accueil!N28,\"\")","v":77},{"$f":"IF(J18<>\"\",Accueil!O28,\"\")","v":4},{"$f":"IF(K18<>\"\",Accueil!P28,\"\")","v":17},{"$f":"IF(L18<>\"\",Accueil!Q28,\"\")","v":62980},817.92207792207796]
[null,{"$f":"IF(Accueil!B29<>\"\",MusiqueEpuree(Accueil!H29),\"\")","v":""},"","","","","","",{"$f":"IF(Accueil!B29<>\"\",Accueil!B29,\"\")","v":""},"","","","","","",{"$f":"IF(B19<>\"\",IFERROR(INT(LEN(MID(Accueil!N29,1,SEARCH(\"(\"&RIGHT(YEAR(TODAY()),2)-1&\")\",Accueil!N29)-1))/2),LEN(B19)),\"\")","v":""},{"$f":"IF(B19<>\"\",IFERROR(INT(LEN(MID(Accueil!N29,1,SEARCH(\"(\"&RIGHT(YEAR(TODAY()),2)-1&\")\",Accueil!N29)-1))/2),LEN(B19)),\"\")","v":""},{"$f":"IF(I19<>\"\",IF(Accueil!K29=\"-\",\"\",Accueil!K29),\"\")","v":""},"","",{"$f":"IF(I19<>\"\",Accueil!N29,\"\")","v":""},{"$f":"IF(J19<>\"\",Accueil!O29,\"\")","v":""},{"$f":"IF(K19<>\"\",Accueil!P29,\"\")","v":""},{"$f":"IF(L19<>\"\",Accueil!Q29,\"\")","v":""},""]
[null,{"$f":"IF(Accueil!B30<>\"\",MusiqueEpuree(Accueil!H30),\"\")","v":""},"","","","","","",{"$f":"IF(Accueil!B30<>\"\",Accueil!B30,\"\")","v":""},"","","","","","",{"$f":"IF(B20<>\"\",IFERROR(INT(LEN(MID(Accueil!N30,1,SEARCH(\"(\"&RIGHT(YEAR(TODAY()),2)-1&\")\",Accueil!N30)-1))/2),LEN(B20)),\"\")","v":""},{"$f":"IF(B20<>\"\",IFERROR(INT(LEN(MID(Accueil!N30,1,SEARCH(\"(\"&RIGHT(YEAR(TODAY()),2)-1&\")\",Accueil!N30)-1))/2),LEN(B20)),\"\")","v":""},{"$f":"IF(I20<>\"\",IF(Accueil!K30=\"-\",\"\",Accueil!K30),\"\")","v":""},"","",{"$f":"IF(I20<>\"\",Accueil!N30,\"\")","v":""},{"$f":"IF(J20<>\"\",Accueil!O30,\"\")","v":""},{"$f":"IF(K20<>\"\",Accueil!P30,\"\")","v":""},{"$f":"IF(L20<>\"\",Accueil!Q30,\"\")","v":""},""]
[null,{"$f":"IF(Accueil!B31<>\"\",MusiqueEpuree(Accueil!H31),\"\")","v":""},"","","","","","",{"$f":"IF(Accueil!B31<>\"\",Accueil!B31,\"\")","v":""},"","","","","","",{"$f":"IF(B21<>\"\",IFERROR(INT(LEN(MID(Accueil!N31,1,SEARCH(\"(\"&RIGHT(YEAR(TODAY()),2)-1&\")\",Accueil!N31)-1))/2),LEN(B21)),\"\")","v":""},{"$f":"IF(B21<>\"\",IFERROR(INT(LEN(MID(Accueil!N31,1,SEARCH(\"(\"&RIGHT(YEAR(TODAY()),2)-1&\")\",Accueil!N31)-1))/2),LEN(B21)),\"\")","v":""},{"$f":"IF(I21<>\"\",IF(Accueil!K31=\"-\",\"\",Accueil!K31),\"\")","v":""},"","",{"$f":"IF(I21<>\"\",Accueil!N31,\"\")","v":""},{"$f":"IF(J21<>\"\",Accueil!O31,\"\")","v":""},{"$f":"IF(K21<>\"\",Accueil!P31,\"\")","v":""},{"$f":"IF(L21<>\"\",Accueil!Q31,\"\")","v":""},""]
[null,{"$f":"IF(Accueil!B32<>\"\",MusiqueEpuree(Accueil!H32),\"\")","v":""},"","","","","","",{"$f":"IF(Accueil!B32<>\"\",Accueil!B32,\"\")","v":""},"","","","","","",{"$f":"IF(B22<>\"\",IFERROR(INT(LEN(MID(Accueil!N32,1,SEARCH(\"(\"&RIGHT(YEAR(TODAY()),2)-1&\")\",Accueil!N32)-1))/2),LEN(B22)),\"\")","v":""},{"$f":"IF(B22<>\"\",IFERROR(INT(LEN(MID(Accueil!N32,1,SEARCH(\"(\"&RIGHT(YEAR(TODAY()),2)-1&\")\",Accueil!N32)-1))/2),LEN(B22)),\"\")","v":""},{"$f":"IF(I22<>\"\",IF(Accueil!K32=\"-\",\"\",Accueil!K32),\"\")","v":""},"","",{"$f":"IF(I22<>\"\",Accueil!N32,\"\")","v":""},{"$f":"IF(J22<>\"\",Accueil!O32,\"\")","v":""},{"$f":"IF(K22<>\"\",Accueil!P32,\"\")","v":""},{"$f":"IF(L22<>\"\",Accueil!Q32,\"\")","v":""},""]
[null,{"$f":"IF(Accueil!B33<>\"\",MusiqueEpuree(Accueil!H33),\"\")","v":""},"","","","","","",{"$f":"IF(Accueil!B33<>\"\",Accueil!B33,\"\")","v":""},"","","","","","",{"$f":"IF(B23<>\"\",IFERROR(INT(LEN(MID(Accueil!N33,1,SEARCH(\"(\"&RIGHT(YEAR(TODAY()),2)-1&\")\",Accueil!N33)-1))/2),LEN(B23)),\"\")","v":""},{"$f":"IF(B23<>\"\",IFERROR(INT(LEN(MID(Accueil!N33,1,SEARCH(\"(\"&RIGHT(YEAR(TODAY()),2)-1&\")\",Accueil!N33)-1))/2),LEN(B23)),\"\")","v":""},{"$f":"IF(I23<>\"\",IF(Accueil!K33=\"-\",\"\",Accueil!K33),\"\")","v":""},"","",{"$f":"IF(I23<>\"\",Accueil!N33,\"\")","v":""},{"$f":"IF(J23<>\"\",Accueil!O33,\"\")","v":""},{"$f":"IF(K23<>\"\",Accueil!P33,\"\")","v":""},{"$f":"IF(L23<>\"\",Accueil!Q33,\"\")","v":""},""]
[null,{"$f":"IF(Accueil!B34<>\"\",MusiqueEpuree(Accueil!H34),\"\")","v":""},"","","","","","",{"$f":"IF(Accueil!B34<>\"\",Accueil!B34,\"\")","v":""},"","","","","","",{"$f":"IF(B24<>\"\",IFERROR(INT(LEN(MID(Accueil!N34,1,SEARCH(\"(\"&RIGHT(YEAR(TODAY()),2)-1&\")\",Accueil!N34)-1))/2),LEN(B24)),\"\")","v":""},{"$f":"IF(B24<>\"\",IFERROR(INT(LEN(MID(Accueil!N34,1,SEARCH(\"(\"&RIGHT(YEAR(TODAY()),2)-1&\")\",Accueil!N34)-1))/2),LEN(B24)),\"\")","v":""},{"$f":"IF(I24<>\"\",IF(Accueil!K34=\"-\",\"\",Accueil!K34),\"\")","v":""},"","",{"$f":"IF(I24<>\"\",Accueil!N34,\"\")","v":""},{"$f":"IF(J24<>\"\",Accueil!O34,\"\")","v":""},{"$f":"IF(K24<>\"\",Accueil!P34,\"\")","v":""},{"$f":"IF(L24<>\"\",Accueil!Q34,\"\")","v":""},""]
[null,null,null,null,null,null,null,null,null,null,null,null,null,null,null,null,null,null,{"$f":"SUM(S5:S24)","v":119.08796021772278}]
[null,null,"Nb Partants ",null,{"$f":"MAX(I5:I24)","v":14},null,null,null,null,null,null,null,null,null,null,null,null,null,{"$f":"S25/E26","v":8.5062828726944844}]
[]
[null,null,null,null,null,null,null,null,null,null,null,null,null,null,null,null,null,null,null,"Valeur Cotes"]
[null,null,null,null,null,null,null,null,null,null,null,null,null,null,null,null,null,{"$f":"I5","v":1},{"$f":"IF(R29<>\"\",T5,\"\")","v":81.639001998586195},{"$f":"IF(U29=\"\",\"\",LARGE(IF(S$29:S$48=U29,R$29:R$48),COUNTIF(U$29:U29,U29)))","v":12},{"$f":"IFERROR(LARGE($S$29:$S$48,ROWS($32:32)),\"\")","v":261.24480639547579}]
[null,null,null,null,null,null,null,null,null,null,null,null,null,null,null,null,null,2,58.780081438982059,{"$f":"IF(U30=\"\",\"\",LARGE(IF(S$29:S$48=U30,R$29:R$48),COUNTIF(U$29:U30,U30)))","v":7},{"$f":"IFERROR(LARGE($S$29:$S$48,ROWS($32:33)),\"\")","v":202.68993599648985}]
[null,null,null,null,null,null,null,null,null,null,null,null,null,null,null,null,null,3,141.63875045537844,{"$f":"IF(U31=\"\",\"\",LARGE(IF(S$29:S$48=U31,R$29:R$48),COUNTIF(U$29:U31,U31)))","v":13},{"$f":"IFERROR(LARGE($S$29:$S$48,ROWS($32:34)),\"\")","v":195.93360479660683}]
[null,null,null,null,null,null,null,null,null,null,null,null,null,null,null,null,null,4,82.209904110464407,{"$f":"IF(U32=\"\",\"\",LARGE(IF(S$29:S$48=U32,R$29:R$48),COUNTIF(U$29:U32,U32)))","v":5},{"$f":"IFERROR(LARGE($S$29:$S$48,ROWS($32:35)),\"\")","v":158.86508497022177}]
[null,null,null,null,null,null,null,null,null,null,null,null,null,null,null,null,null,5,158.86508497022177,{"$f":"IF(U33=\"\",\"\",LARGE(IF(S$29:S$48=U33,R$29:R$48),COUNTIF(U$29:U33,U33)))","v":3},{"$f":"IFERROR(LARGE($S$29:$S$48,ROWS($32:36)),\"\")","v":141.63875045537844}]
[null,null,null,null,null,null,null,null,null,null,null,null,null,null,null,null,null,6,24.339578235603334,{"$f":"IF(U34=\"\",\"\",LARGE(IF(S$29:S$48=U34,R$29:R$48),COUNTIF(U$29:U34,U34)))","v":4},{"$f":"IFERROR(LARGE($S$29:$S$48,ROWS($32:37)),\"\")","v":82.209904110464407}]
[null,null,null,null,null,null,null,null,null,null,null,null,null,null,null,null,null,7,202.68993599648985,{"$f":"IF(U35=\"\",\"\",LARGE(IF(S$29:S$48=U35,R$29:R$48),COUNTIF(U$29:U35,U35)))","v":1},{"$f":"IFERROR(LARGE($S$29:$S$48,ROWS($32:38)),\"\")","v":81.639001998586195}]
[null,null,null,null,null,null,null,null,null,null,null,null,null,null,null,null,null,8,50.672483999122463,{"$f":"IF(U36=\"\",\"\",LARGE(IF(S$29:S$48=U36,R$29:R$48),COUNTIF(U$29:U36,U36)))","v":2},{"$f":"IFERROR(LARGE($S$29:$S$48,ROWS($32:39)),\"\")","v":58.780081438982059}]
[null,null,null,null,null,null,null,null,null,null,null,null,null,null,null,null,null,9,41.394423548578914,{"$f":"IF(U37=\"\",\"\",LARGE(IF(S$29:S$48=U37,R$29:R$48),COUNTIF(U$29:U37,U37)))","v":8},{"$f":"IFERROR(LARGE($S$29:$S$48,ROWS($32:40)),\"\")","v":50.672483999122463}]
[null,null,null,null,null,null,null,null,null,null,null,null,null,null,null,null,null,10,33.303162288375106,{"$f":"IF(U38=\"\",\"\",LARGE(IF(S$29:S$48=U38,R$29:R$48),COUNTIF(U$29:U38,U38)))","v":9},{"$f":"IFERROR(LARGE($S$29:$S$48,ROWS($32:41)),\"\")","v":41.394423548578914}]
[null,null,null,null,null,null,null,null,null,null,null,null,null,null,null,null,null,11,38.045360154680949,{"$f":"IF(U39=\"\",\"\",LARGE(IF(S$29:S$48=U39,R$29:R$48),COUNTIF(U$29:U39,U39)))","v":11},{"$f":"IFERROR(LARGE($S$29:$S$48,ROWS($32:42)),\"\")","v":38.045360154680949}]
[null,null,null,null,null,null,null,null,null,null,null,null,null,null,null,null,null,12,261.24480639547579,{"$f":"IF(U40=\"\",\"\",LARGE(IF(S$29:S$48=U40,R$29:R$48),COUNTIF(U$29:U40,U40)))","v":10},{"$f":"IFERROR(LARGE($S$29:$S$48,ROWS($32:43)),\"\")","v":33.303162288375106}]
[null,null,null,null,null,null,null,null,null,null,null,null,null,null,null,null,null,13,195.93360479660683,{"$f":"IF(U41=\"\",\"\",LARGE(IF(S$29:S$48=U41,R$29:R$48),COUNTIF(U$29:U41,U41)))","v":14},{"$f":"IFERROR(LARGE($S$29:$S$48,ROWS($32:44)),\"\")","v":29.243821611433855}]
[null,null,null,null,null,null,null,null,null,null,null,null,null,null,null,null,null,14,29.243821611433855,{"$f":"IF(U42=\"\",\"\",LARGE(IF(S$29:S$48=U42,R$29:R$48),COUNTIF(U$29:U42,U42)))","v":6},{"$f":"IFERROR(LARGE($S$29:$S$48,ROWS($32:45)),\"\")","v":24.339578235603334}]
[null,null,null,null,null,null,null,null,null,null,null,null,null,null,null,null,null,"","",{"$f":"IF(U43=\"\",\"\",LARGE(IF(S$29:S$48=U43,R$29:R$48),COUNTIF(U$29:U43,U43)))","v":""},{"$f":"IFERROR(LARGE($S$29:$S$48,ROWS($32:46)),\"\")","v":""}]
[null,null,null,null,null,null,null,null,null,null,null,null,null,null,null,null,null,"","",{"$f":"IF(U44=\"\",\"\",LARGE(IF(S$29:S$48=U44,R$29:R$48),COUNTIF(U$29:U44,U44)))","v":""},{"$f":"IFERROR(LARGE($S$29:$S$48,ROWS($32:47)),\"\")","v":""}]
[null,null,null,null,null,null,null,null,null,null,null,null,null,null,null,null,null,"","",{"$f":"IF(U45=\"\",\"\",LARGE(IF(S$29:S$48=U45,R$29:R$48),COUNTIF(U$29:U45,U45)))","v":""},{"$f":"IFERROR(LARGE($S$29:$S$48,ROWS($32:48)),\"\")","v":""}]
[null,null,null,null,null,null,null,null,null,null,null,null,null,null,null,null,null,"","",{"$f":"IF(U46=\"\",\"\",LARGE(IF(S$29:S$48=U46,R$29:R$48),COUNTIF(U$29:U46,U46)))","v":""},{"$f":"IFERROR(LARGE($S$29:$S$48,ROWS($32:49)),\"\")","v":""}]
[null,null,null,null,null,null,null,null,null,null,null,null,null,null,null,null,null,"","",{"$f":"IF(U47=\"\",\"\",LARGE(IF(S$29:S$48=U47,R$29:R$48),COUNTIF(U$29:U47,U47)))","v":""},{"$f":"IFERROR(LARGE($R$29:$R$48,ROWS($32:50)),\"\")","v":""}]
[null,null,null,null,null,null,null,null,null,null,null,null,null,null,null,null,null,"","",{"$f":"IF(U48=\"\",\"\",LARGE(IF(S$29:S$48=U48,R$29:R$48),COUNTIF(U$29:U48,U48)))","v":""},{"$f":"IFERROR(LARGE($R$29:$R$48,ROWS($32:51)),\"\")","v":""}]

{"sheet":"Résumé","index":4,"n_rows":197,"n_cols":24,"rows_kept":197,"cut":false,"hidden":false,"merged":[[28,26,29,31],[0,10,0,12],[0,13,0,15],[0,16,0,18],[0,21,0,23],[24,9,24,24],[28,7,28,9]]}
[1,null,null,null,null,null,null,null,null,null,"Rang",null,null,"Nbre de partants",null,null,"Adversaires battus",null,null,"Total",null,"Rang"]
["Alloc.",null,null,"Cotes",null,"Rang",null,null,null,{"$f":"IF(Cotes!I5<>\"\",Cotes!I5,\"\")","v":1},{"$f":"IF(J2<>\"\",IF(ISERROR(MATCH(NCV!M6,{\"A\",\"D\",\"Dai\",\"Di\",\"T\",\"Db\"},0)),NCV!M6,NCV!R6),\"\")","v":14},{"$f":"IF(K2<>\"\",IF(ISERROR(MATCH(NCV!N6,{\"A\",\"D\",\"Dai\",\"Di\",\"T\",\"Db\"},0)),NCV!N6,NCV!S6),\"\")","v":10},{"$f":"IF(L2<>\"\",IF(ISERROR(MATCH(NCV!O6,{\"A\",\"D\",\"Dai\",\"Di\",\"T\",\"Db\"},0)),NCV!O6,NCV!T6),\"\")","v":7},{"$f":"IF(J2<>\"\",NCV!R6,\"\")","v":14},{"$f":"IF(K2<>\"\",NCV!S6,\"\")","v":13},{"$f":"IF(L2<>\"\",NCV!T6,\"\")","v":11},{"$f":"IF(J2<>\"\",N2-V2,\"\")","v":0},{"$f":"IF(K2<>\"\",O2-W2,\"\")","v":3},{"$f":"IF(L2<>\"\",P2-X2,\"\")","v":4},{"$f":"IF(J2<>\"\",SUM(Q2:S2),\"\")","v":7},null,{"$f":"IF(OR(K2=0,NOT(ISNUMBER(K2))),N2,K2)","v":14},{"$f":"IF(OR(L2=0,NOT(ISNUMBER(L2))),O2,L2)","v":10},7]
["100 000€",{"$f":"SUM(A3/1000)","v":{"$error":"#VALUE!"}},null,154,{"$f":"MIN(D3:D5)","v":11},14,{"$f":"IF(F3:F5=0,\"\",F3:F5)","v":14},{"$f":"MIN(G3:G5)","v":7},null,{"$f":"IF(Cotes!I6<>\"\",Cotes!I6,\"\")","v":2},{"$f":"IF(J3<>\"\",IF(ISERROR(MATCH(NCV!M7,{\"A\",\"D\",\"Dai\",\"Di\",\"T\",\"Db\"},0)),NCV!M7,NCV!R7),\"\")","v":11},{"$f":"IF(K3<>\"\",IF(ISERROR(MATCH(NCV!N7,{\"A\",\"D\",\"Dai\",\"Di\",\"T\",\"Db\"},0)),NCV!N7,NCV!S7),\"\")","v":2},{"$f":"IF(L3<>\"\",IF(ISERROR(MATCH(NCV!O7,{\"A\",\"D\",\"Dai\",\"Di\",\"T\",\"Db\"},0)),NCV!O7,NCV!T7),\"\")","v":4},{"$f":"IF(J3<>\"\",NCV!R7,\"\")","v":15},{"$f":"IF(K3<>\"\",NCV!S7,\"\")","v":16},{"$f":"IF(L3<>\"\",NCV!T7,\"\")","v":14},{"$f":"IF(J3<>\"\",N3-V3,\"\")","v":4},14,10,{"$f":"IF(J3<>\"\",SUM(Q3:S3),\"\")","v":28},null,{"$f":"IF(OR(K3=0,NOT(ISNUMBER(K3))),N3,K3)","v":11},2,4]
["55 000€",{"$f":"SUM(A4/1000)","v":{"$error":"#VALUE!"}},null,36,null,10,{"$f":"IF(F4:F6=0,\"\",F4:F6)","v":10},null,null,{"$f":"IF(Cotes!I7<>\"\",Cotes!I7,\"\")","v":3},{"$f":"IF(J4<>\"\",IF(ISERROR(MATCH(NCV!M8,{\"A\",\"D\",\"Dai\",\"Di\",\"T\",\"Db\"},0)),NCV!M8,NCV!R8),\"\")","v":8},{"$f":"IF(K4<>\"\",IF(ISERROR(MATCH(NCV!N8,{\"A\",\"D\",\"Dai\",\"Di\",\"T\",\"Db\"},0)),NCV!N8,NCV!S8),\"\")","v":14},{"$f":"IF(L4<>\"\",IF(ISERROR(MATCH(NCV!O8,{\"A\",\"D\",\"Dai\",\"Di\",\"T\",\"Db\"},0)),NCV!O8,NCV!T8),\"\")","v":15},{"$f":"IF(J4<>\"\",NCV!R8,\"\")","v":10},{"$f":"IF(K4<>\"\",NCV!S8,\"\")","v":17},{"$f":"IF(L4<>\"\",NCV!T8,\"\")","v":18},2,3,3,8,null,8,14,15]
["35 000€",{"$f":"SUM(A5/1000)","v":{"$error":"#VALUE!"}},null,11,null,7,{"$f":"IF(F5:F7=0,\"\",F5:F7)","v":7},null,null,{"$f":"IF(Cotes!I8<>\"\",Cotes!I8,\"\")","v":4},{"$f":"IF(J5<>\"\",IF(ISERROR(MATCH(NCV!M9,{\"A\",\"D\",\"Dai\",\"Di\",\"T\",\"Db\"},0)),NCV!M9,NCV!R9),\"\")","v":14},{"$f":"IF(K5<>\"\",IF(ISERROR(MATCH(NCV!N9,{\"A\",\"D\",\"Dai\",\"Di\",\"T\",\"Db\"},0)),NCV!N9,NCV!S9),\"\")","v":7},{"$f":"IF(L5<>\"\",IF(ISERROR(MATCH(NCV!O9,{\"A\",\"D\",\"Dai\",\"Di\",\"T\",\"Db\"},0)),NCV!O9,NCV!T9),\"\")","v":5},{"$f":"IF(J5<>\"\",NCV!R9,\"\")","v":15},{"$f":"IF(K5<>\"\",NCV!S9,\"\")","v":13},{"$f":"IF(L5<>\"\",NCV!T9,\"\")","v":10},1,6,5,12,null,14,7,5]
["57 000€",{"$f":"SUM(A6/1000)","v":{"$error":"#VALUE!"}},null,15,null,5,null,null,null,{"$f":"IF(Cotes!I9<>\"\",Cotes!I9,\"\")","v":5},{"$f":"IF(J6<>\"\",IF(ISERROR(MATCH(NCV!M10,{\"A\",\"D\",\"Dai\",\"Di\",\"T\",\"Db\"},0)),NCV!M10,NCV!R10),\"\")","v":5},{"$f":"IF(K6<>\"\",IF(ISERROR(MATCH(NCV!N10,{\"A\",\"D\",\"Dai\",\"Di\",\"T\",\"Db\"},0)),NCV!N10,NCV!S10),\"\")","v":8},{"$f":"IF(L6<>\"\",IF(ISERROR(MATCH(NCV!O10,{\"A\",\"D\",\"Dai\",\"Di\",\"T\",\"Db\"},0)),NCV!O10,NCV!T10),\"\")","v":7},{"$f":"IF(J6<>\"\",NCV!R10,\"\")","v":16},{"$f":"IF(K6<>\"\",NCV!S10,\"\")","v":13},{"$f":"IF(L6<>\"\",NCV!T10,\"\")","v":16},11,5,9,25,null,5,8,7]
["100 000€",{"$f":"SUM(A7/1000)","v":{"$error":"#VALUE!"}},null,65,null,7,null,null,null,{"$f":"IF(Cotes!I10<>\"\",Cotes!I10,\"\")","v":6},{"$f":"IF(J7<>\"\",IF(ISERROR(MATCH(NCV!M11,{\"A\",\"D\",\"Dai\",\"Di\",\"T\",\"Db\"},0)),NCV!M11,NCV!R11),\"\")","v":9},{"$f":"IF(K7<>\"\",IF(ISERROR(MATCH(NCV!N11,{\"A\",\"D\",\"Dai\",\"Di\",\"T\",\"Db\"},0)),NCV!N11,NCV!S11),\"\")","v":4},{"$f":"IF(L7<>\"\",IF(ISERROR(MATCH(NCV!O11,{\"A\",\"D\",\"Dai\",\"Di\",\"T\",\"Db\"},0)),NCV!O11,NCV!T11),\"\")","v":7},{"$f":"IF(J7<>\"\",NCV!R11,\"\")","v":10},{"$f":"IF(K7<>\"\",NCV!S11,\"\")","v":16},{"$f":"IF(L7<>\"\",NCV!T11,\"\")","v":13},1,12,6,19,null,9,4,7]
[null,null,null,null,null,null,null,null,null,{"$f":"IF(Cotes!I11<>\"\",Cotes!I11,\"\")","v":7},{"$f":"IF(J8<>\"\",IF(ISERROR(MATCH(NCV!M12,{\"A\",\"D\",\"Dai\",\"Di\",\"T\",\"Db\"},0)),NCV!M12,NCV!R12),\"\")","v":1},{"$f":"IF(K8<>\"\",IF(ISERROR(MATCH(NCV!N12,{\"A\",\"D\",\"Dai\",\"Di\",\"T\",\"Db\"},0)),NCV!N12,NCV!S12),\"\")","v":3},{"$f":"IF(L8<>\"\",IF(ISERROR(MATCH(NCV!O12,{\"A\",\"D\",\"Dai\",\"Di\",\"T\",\"Db\"},0)),NCV!O12,NCV!T12),\"\")","v":10},{"$f":"IF(J8<>\"\",NCV!R12,\"\")","v":12},{"$f":"IF(K8<>\"\",NCV!S12,\"\")","v":11},{"$f":"IF(L8<>\"\",NCV!T12,\"\")","v":16},11,8,6,25,null,1,3,10]
[null,null,null,null,null,null,null,null,null,{"$f":"IF(Cotes!I12<>\"\",Cotes!I12,\"\")","v":8},{"$f":"IF(J9<>\"\",IF(ISERROR(MATCH(NCV!M13,{\"A\",\"D\",\"Dai\",\"Di\",\"T\",\"Db\"},0)),NCV!M13,NCV!R13),\"\")","v":7},{"$f":"IF(K9<>\"\",IF(ISERROR(MATCH(NCV!N13,{\"A\",\"D\",\"Dai\",\"Di\",\"T\",\"Db\"},0)),NCV!N13,NCV!S13),\"\")","v":2},{"$f":"IF(L9<>\"\",IF(ISERROR(MATCH(NCV!O13,{\"A\",\"D\",\"Dai\",\"Di\",\"T\",\"Db\"},0)),NCV!O13,NCV!T13),\"\")","v":9},{"$f":"IF(J9<>\"\",NCV!R13,\"\")","v":16},{"$f":"IF(K9<>\"\",NCV!S13,\"\")","v":13},{"$f":"IF(L9<>\"\",NCV!T13,\"\")","v":16},9,11,7,27,null,7,2,9]
[null,null,null,null,null,null,null,null,null,{"$f":"IF(Cotes!I13<>\"\",Cotes!I13,\"\")","v":9},{"$f":"IF(J10<>\"\",IF(ISERROR(MATCH(NCV!M14,{\"A\",\"D\",\"Dai\",\"Di\",\"T\",\"Db\"},0)),NCV!M14,NCV!R14),\"\")","v":7},{"$f":"IF(K10<>\"\",IF(ISERROR(MATCH(NCV!N14,{\"A\",\"D\",\"Dai\",\"Di\",\"T\",\"Db\"},0)),NCV!N14,NCV!S14),\"\")","v":6},{"$f":"IF(L10<>\"\",IF(ISERROR(MATCH(NCV!O14,{\"A\",\"D\",\"Dai\",\"Di\",\"T\",\"Db\"},0)),NCV!O14,NCV!T14),\"\")","v":8},{"$f":"IF(J10<>\"\",NCV!R14,\"\")","v":10},{"$f":"IF(K10<>\"\",NCV!S14,\"\")","v":8},{"$f":"IF(L10<>\"\",NCV!T14,\"\")","v":13},3,2,5,10,null,7,6,8]
[2,null,null,null,null,null,null,null,null,{"$f":"IF(Cotes!I14<>\"\",Cotes!I14,\"\")","v":10},{"$f":"IF(J11<>\"\",IF(ISERROR(MATCH(NCV!M15,{\"A\",\"D\",\"Dai\",\"Di\",\"T\",\"Db\"},0)),NCV!M15,NCV!R15),\"\")","v":6},{"$f":"IF(K11<>\"\",IF(ISERROR(MATCH(NCV!N15,{\"A\",\"D\",\"Dai\",\"Di\",\"T\",\"Db\"},0)),NCV!N15,NCV!S15),\"\")","v":6},{"$f":"IF(L11<>\"\",IF(ISERROR(MATCH(NCV!O15,{\"A\",\"D\",\"Dai\",\"Di\",\"T\",\"Db\"},0)),NCV!O15,NCV!T15),\"\")","v":5},{"$f":"IF(J11<>\"\",NCV!R15,\"\")","v":15},{"$f":"IF(K11<>\"\",NCV!S15,\"\")","v":16},{"$f":"IF(L11<>\"\",NCV!T15,\"\")","v":9},9,10,4,23,null,6,6,5]
["Alloc.",null,null,"Cotes",null,"Rang",null,null,null,{"$f":"IF(Cotes!I15<>\"\",Cotes!I15,\"\")","v":11},{"$f":"IF(J12<>\"\",IF(ISERROR(MATCH(NCV!M16,{\"A\",\"D\",\"Dai\",\"Di\",\"T\",\"Db\"},0)),NCV!M16,NCV!R16),\"\")","v":4},{"$f":"IF(K12<>\"\",IF(ISERROR(MATCH(NCV!N16,{\"A\",\"D\",\"Dai\",\"Di\",\"T\",\"Db\"},0)),NCV!N16,NCV!S16),\"\")","v":16},{"$f":"IF(L12<>\"\",IF(ISERROR(MATCH(NCV!O16,{\"A\",\"D\",\"Dai\",\"Di\",\"T\",\"Db\"},0)),NCV!O16,NCV!T16),\"\")","v":3},{"$f":"IF(J12<>\"\",NCV!R16,\"\")","v":15},{"$f":"IF(K12<>\"\",NCV!S16,\"\")","v":16},{"$f":"IF(L12<>\"\",NCV!T16,\"\")","v":11},11,0,8,19,null,4,16,3]
["90 000€",{"$f":"SUM(A13/1000)","v":{"$error":"#VALUE!"}},null,106,{"$f":"MIN(D13:D15)","v":3},11,{"$f":"IF(F13:F15=0,\"\",F13:F15)","v":11},{"$f":"MIN(G13:G15)","v":2},null,{"$f":"IF(Cotes!I16<>\"\",Cotes!I16,\"\")","v":12},{"$f":"IF(J13<>\"\",IF(ISERROR(MATCH(NCV!M17,{\"A\",\"D\",\"Dai\",\"Di\",\"T\",\"Db\"},0)),NCV!M17,NCV!R17),\"\")","v":13},{"$f":"IF(K13<>\"\",IF(ISERROR(MATCH(NCV!N17,{\"A\",\"D\",\"Dai\",\"Di\",\"T\",\"Db\"},0)),NCV!N17,NCV!S17),\"\")","v":8},{"$f":"IF(L13<>\"\",IF(ISERROR(MATCH(NCV!O17,{\"A\",\"D\",\"Dai\",\"Di\",\"T\",\"Db\"},0)),NCV!O17,NCV!T17),\"\")","v":6},{"$f":"IF(J13<>\"\",NCV!R17,\"\")","v":15},{"$f":"IF(K13<>\"\",NCV!S17,\"\")","v":15},{"$f":"IF(L13<>\"\",NCV!T17,\"\")","v":10},2,7,4,13,null,13,8,6]
["80 000€",{"$f":"SUM(A14/1000)","v":{"$error":"#VALUE!"}},null,4.9000000000000004,null,2,{"$f":"IF(F14:F16=0,\"\",F14:F16)","v":2},null,null,{"$f":"IF(Cotes!I17<>\"\",Cotes!I17,\"\")","v":13},{"$f":"IF(J14<>\"\",IF(ISERROR(MATCH(NCV!M18,{\"A\",\"D\",\"Dai\",\"Di\",\"T\",\"Db\"},0)),NCV!M18,NCV!R18),\"\")","v":3},{"$f":"IF(K14<>\"\",IF(ISERROR(MATCH(NCV!N18,{\"A\",\"D\",\"Dai\",\"Di\",\"T\",\"Db\"},0)),NCV!N18,NCV!S18),\"\")","v":12},{"$f":"IF(L14<>\"\",IF(ISERROR(MATCH(NCV!O18,{\"A\",\"D\",\"Dai\",\"Di\",\"T\",\"Db\"},0)),NCV!O18,NCV!T18),\"\")","v":5},{"$f":"IF(J14<>\"\",NCV!R18,\"\")","v":12},{"$f":"IF(K14<>\"\",NCV!S18,\"\")","v":16},{"$f":"IF(L14<>\"\",NCV!T18,\"\")","v":13},9,4,8,21,null,3,12,5]
["11 000€",{"$f":"SUM(A15/1000)","v":{"$error":"#VALUE!"}},null,3,null,4,4,null,null,{"$f":"IF(Cotes!I18<>\"\",Cotes!I18,\"\")","v":14},{"$f":"IF(J15<>\"\",IF(ISERROR(MATCH(NCV!M19,{\"A\",\"D\",\"Dai\",\"Di\",\"T\",\"Db\"},0)),NCV!M19,NCV!R19),\"\")","v":10},{"$f":"IF(K15<>\"\",IF(ISERROR(MATCH(NCV!N19,{\"A\",\"D\",\"Dai\",\"Di\",\"T\",\"Db\"},0)),NCV!N19,NCV!S19),\"\")","v":10},{"$f":"IF(L15<>\"\",IF(ISERROR(MATCH(NCV!O19,{\"A\",\"D\",\"Dai\",\"Di\",\"T\",\"Db\"},0)),NCV!O19,NCV!T19),\"\")","v":11},{"$f":"IF(J15<>\"\",NCV!R19,\"\")","v":16},{"$f":"IF(K15<>\"\",NCV!S19,\"\")","v":12},{"$f":"IF(L15<>\"\",NCV!T19,\"\")","v":13},6,2,2,10,null,10,10,11]
["80 000€",{"$f":"SUM(A16/1000)","v":{"$error":"#VALUE!"}},null,1.9,null,1,null,null,null,{"$f":"IF(Cotes!I19<>\"\",Cotes!I19,\"\")","v":""},{"$f":"IF(J16<>\"\",IF(ISERROR(MATCH(NCV!M20,{\"A\",\"D\",\"Dai\",\"Di\",\"T\",\"Db\"},0)),NCV!M20,NCV!R20),\"\")","v":""},{"$f":"IF(K16<>\"\",IF(ISERROR(MATCH(NCV!N20,{\"A\",\"D\",\"Dai\",\"Di\",\"T\",\"Db\"},0)),NCV!N20,NCV!S20),\"\")","v":""},{"$f":"IF(L16<>\"\",IF(ISERROR(MATCH(NCV!O20,{\"A\",\"D\",\"Dai\",\"Di\",\"T\",\"Db\"},0)),NCV!O20,NCV!T20),\"\")","v":""},{"$f":"IF(J16<>\"\",NCV!R20,\"\")","v":""},{"$f":"IF(K16<>\"\",NCV!S20,\"\")","v":""},{"$f":"IF(L16<>\"\",NCV!T20,\"\")","v":""},"","","","",null,"","",""]
["80 000€",{"$f":"SUM(A17/1000)","v":{"$error":"#VALUE!"}},null,2,null,2,null,null,null,{"$f":"IF(Cotes!I20<>\"\",Cotes!I20,\"\")","v":""},{"$f":"IF(J17<>\"\",IF(ISERROR(MATCH(NCV!M21,{\"A\",\"D\",\"Dai\",\"Di\",\"T\",\"Db\"},0)),NCV!M21,NCV!R21),\"\")","v":""},{"$f":"IF(K17<>\"\",IF(ISERROR(MATCH(NCV!N21,{\"A\",\"D\",\"Dai\",\"Di\",\"T\",\"Db\"},0)),NCV!N21,NCV!S21),\"\")","v":""},{"$f":"IF(L17<>\"\",IF(ISERROR(MATCH(NCV!O21,{\"A\",\"D\",\"Dai\",\"Di\",\"T\",\"Db\"},0)),NCV!O21,NCV!T21),\"\")","v":""},{"$f":"IF(J17<>\"\",NCV!R21,\"\")","v":""},{"$f":"IF(K17<>\"\",NCV!S21,\"\")","v":""},{"$f":"IF(L17<>\"\",NCV!T21,\"\")","v":""},"","","","",null,"","",""]
[null,null,null,null,null,null,null,null,null,{"$f":"IF(Cotes!I21<>\"\",Cotes!I21,\"\")","v":""},{"$f":"IF(J18<>\"\",IF(ISERROR(MATCH(NCV!M22,{\"A\",\"D\",\"Dai\",\"Di\",\"T\",\"Db\"},0)),NCV!M22,NCV!R22),\"\")","v":""},{"$f":"IF(K18<>\"\",IF(ISERROR(MATCH(NCV!N22,{\"A\",\"D\",\"Dai\",\"Di\",\"T\",\"Db\"},0)),NCV!N22,NCV!S22),\"\")","v":""},{"$f":"IF(L18<>\"\",IF(ISERROR(MATCH(NCV!O22,{\"A\",\"D\",\"Dai\",\"Di\",\"T\",\"Db\"},0)),NCV!O22,NCV!T22),\"\")","v":""},{"$f":"IF(J18<>\"\",NCV!R22,\"\")","v":""},{"$f":"IF(K18<>\"\",NCV!S22,\"\")","v":""},{"$f":"IF(L18<>\"\",NCV!T22,\"\")","v":""},"","","","",null,"","",""]
[null,null,null,null,null,null,null,null,null,{"$f":"IF(Cotes!I22<>\"\",Cotes!I22,\"\")","v":""},{"$f":"IF(J19<>\"\",IF(ISERROR(MATCH(NCV!M23,{\"A\",\"D\",\"Dai\",\"Di\",\"T\",\"Db\"},0)),NCV!M23,NCV!R23),\"\")","v":""},{"$f":"IF(K19<>\"\",IF(ISERROR(MATCH(NCV!N23,{\"A\",\"D\",\"Dai\",\"Di\",\"T\",\"Db\"},0)),NCV!N23,NCV!S23),\"\")","v":""},{"$f":"IF(L19<>\"\",IF(ISERROR(MATCH(NCV!O23,{\"A\",\"D\",\"Dai\",\"Di\",\"T\",\"Db\"},0)),NCV!O23,NCV!T23),\"\")","v":""},{"$f":"IF(J19<>\"\",NCV!R23,\"\")","v":""},{"$f":"IF(K19<>\"\",NCV!S23,\"\")","v":""},{"$f":"IF(L19<>\"\",NCV!T23,\"\")","v":""},"","","","",null,"","",""]
[null,null,null,null,null,null,null,null,null,{"$f":"IF(Cotes!I23<>\"\",Cotes!I23,\"\")","v":""},{"$f":"IF(J20<>\"\",IF(ISERROR(MATCH(NCV!M24,{\"A\",\"D\",\"Dai\",\"Di\",\"T\",\"Db\"},0)),NCV!M24,NCV!R24),\"\")","v":""},{"$f":"IF(K20<>\"\",IF(ISERROR(MATCH(NCV!N24,{\"A\",\"D\",\"Dai\",\"Di\",\"T\",\"Db\"},0)),NCV!N24,NCV!S24),\"\")","v":""},{"$f":"IF(L20<>\"\",IF(ISERROR(MATCH(NCV!O24,{\"A\",\"D\",\"Dai\",\"Di\",\"T\",\"Db\"},0)),NCV!O24,NCV!T24),\"\")","v":""},{"$f":"IF(J20<>\"\",NCV!R24,\"\")","v":""},{"$f":"IF(K20<>\"\",NCV!S24,\"\")","v":""},{"$f":"IF(L20<>\"\",NCV!T24,\"\")","v":""},"","","","",null,"","",""]
[3,null,null,null,null,null,null,null,null,{"$f":"IF(Cotes!I24<>\"\",Cotes!I24,\"\")","v":""},{"$f":"IF(J21<>\"\",IF(ISERROR(MATCH(NCV!M25,{\"A\",\"D\",\"Dai\",\"Di\",\"T\",\"Db\"},0)),NCV!M25,NCV!R25),\"\")","v":""},{"$f":"IF(K21<>\"\",IF(ISERROR(MATCH(NCV!N25,{\"A\",\"D\",\"Dai\",\"Di\",\"T\",\"Db\"},0)),NCV!N25,NCV!S25),\"\")","v":""},{"$f":"IF(L21<>\"\",IF(ISERROR(MATCH(NCV!O25,{\"A\",\"D\",\"Dai\",\"Di\",\"T\",\"Db\"},0)),NCV!O25,NCV!T25),\"\")","v":""},{"$f":"IF(J21<>\"\",NCV!R25,\"\")","v":""},{"$f":"IF(K21<>\"\",NCV!S25,\"\")","v":""},{"$f":"IF(L21<>\"\",NCV!T25,\"\")","v":""},"","","","",null,"","",""]
["Alloc.",null,null,"Cotes",null,"Rang"]
["80 000€",{"$f":"SUM(A23/1000)","v":{"$error":"#VALUE!"}},null,25,{"$f":"MIN(D23:D25)","v":21},8,{"$f":"IF(F23:F25=0,\"\",F23:F25)","v":8},{"$f":"MIN(G23:G25)","v":8}]
["110 000€",{"$f":"SUM(A24/1000)","v":{"$error":"#VALUE!"}},null,84,null,14,{"$f":"IF(F24:F26=0,\"\",F24:F26)","v":14}]
["110 000€",{"$f":"SUM(A25/1000)","v":{"$error":"#VALUE!"}},null,21,null,15,15]
["130 000€",{"$f":"SUM(A26/1000)","v":{"$error":"#VALUE!"}},null,18,null,3]
["80 000€",{"$f":"SUM(A27/1000)","v":{"$error":"#VALUE!"}},null,5,null,1]
[]
[]
[]
[4]
["Alloc.",null,null,"Cotes",null,"Rang"]
["49 000€",{"$f":"SUM(A33/1000)","v":{"$error":"#VALUE!"}},null,131,{"$f":"MIN(D33:D35)","v":8.1999999999999993},14,{"$f":"IF(F33:F35=0,\"\",F33:F35)","v":14},{"$f":"MIN(G33:G35)","v":5}]
["85 000€",{"$f":"SUM(A34/1000)","v":{"$error":"#VALUE!"}},null,8.1999999999999993,null,7,{"$f":"IF(F34:F36=0,\"\",F34:F36)","v":7}]
["90 000€",{"$f":"SUM(A35/1000)","v":{"$error":"#VALUE!"}},null,14,null,5,5]
["64 000€",{"$f":"SUM(A36/1000)","v":{"$error":"#VALUE!"}},null,7.8,null,4]
["64 000€",{"$f":"SUM(A37/1000)","v":{"$error":"#VALUE!"}},null,4.5,null,3]
[]
[]
[]
[5]
["Alloc.",null,null,"Cotes",null,"Rang"]
["80 000€",{"$f":"SUM(A43/1000)","v":{"$error":"#VALUE!"}},null,25,{"$f":"MIN(D43:D45)","v":25},5,{"$f":"IF(F43:F45=0,\"\",F43:F45)","v":5},{"$f":"MIN(G43:G45)","v":5}]
["90 000€",{"$f":"SUM(A44/1000)","v":{"$error":"#VALUE!"}},null,61,null,8,{"$f":"IF(F44:F46=0,\"\",F44:F46)","v":8}]
["80 000€",{"$f":"SUM(A45/1000)","v":{"$error":"#VALUE!"}},null,35,null,7,7]
["60 000€",{"$f":"SUM(A46/1000)","v":{"$error":"#VALUE!"}},null,8.9,null,3]
["65 000€",{"$f":"SUM(A47/1000)","v":{"$error":"#VALUE!"}},null,21,null,3]
[]
[]
[]
[6]
["Alloc.",null,null,"Cotes",null,"Rang"]
["80 000€",{"$f":"SUM(A53/1000)","v":{"$error":"#VALUE!"}},null,31,{"$f":"MIN(D53:D55)","v":13},9,{"$f":"IF(F53:F55=0,\"\",F53:F55)","v":9},{"$f":"MIN(G53:G55)","v":4}]
["80 000€",{"$f":"SUM(A54/1000)","v":{"$error":"#VALUE!"}},null,50,null,4,{"$f":"IF(F54:F56=0,\"\",F54:F56)","v":4}]
["55 000€",{"$f":"SUM(A55/1000)","v":{"$error":"#VALUE!"}},null,13,null,7,7]
["80 000€",{"$f":"SUM(A56/1000)","v":{"$error":"#VALUE!"}},null,119,null,"Dai"]
["120 000€",{"$f":"SUM(A57/1000)","v":{"$error":"#VALUE!"}},null,10,null,11]
[]
[]
[]
[7]
["Alloc.",null,null,"Cotes",null,"Rang"]
["53 000€",{"$f":"SUM(A63/1000)","v":{"$error":"#VALUE!"}},null,3.7,{"$f":"MIN(D63:D65)","v":3.7},1,{"$f":"IF(F63:F65=0,\"\",F63:F65)","v":1},{"$f":"MIN(G63:G65)","v":1}]
["35 000€",{"$f":"SUM(A64/1000)","v":{"$error":"#VALUE!"}},null,9.4,null,3,{"$f":"IF(F64:F66=0,\"\",F64:F66)","v":3}]
["85 000€",{"$f":"SUM(A65/1000)","v":{"$error":"#VALUE!"}},null,162,null,10,10]
["40 000€",{"$f":"SUM(A66/1000)","v":{"$error":"#VALUE!"}},null,22,null,11]
["53 000€",{"$f":"SUM(A67/1000)","v":{"$error":"#VALUE!"}},null,5.7,null,11]
[]
[]
[]
[8]
["Alloc.",null,null,"Cotes",null,"Rang"]
["80 000€",{"$f":"SUM(A73/1000)","v":{"$error":"#VALUE!"}},null,56,{"$f":"MIN(D73:D75)","v":21},7,{"$f":"IF(F73:F75=0,\"\",F73:F75)","v":7},{"$f":"MIN(G73:G75)","v":2}]
["55 000€",{"$f":"SUM(A74/1000)","v":{"$error":"#VALUE!"}},null,21,null,2,{"$f":"IF(F74:F76=0,\"\",F74:F76)","v":2}]
["80 000€",{"$f":"SUM(A75/1000)","v":{"$error":"#VALUE!"}},null,51,null,9,9]
["80 000€",{"$f":"SUM(A76/1000)","v":{"$error":"#VALUE!"}},null,59,null,4]
["120 000€",{"$f":"SUM(A77/1000)","v":{"$error":"#VALUE!"}},null,41,null,2]
[]
[]
[]
[9]
["Alloc.",null,null,"Cotes",null,"Rang"]
["100 000€",{"$f":"SUM(A83/1000)","v":{"$error":"#VALUE!"}},null,132,{"$f":"MIN(D83:D85)","v":87},7,{"$f":"IF(F83:F85=0,\"\",F83:F85)","v":7},{"$f":"MIN(G83:G85)","v":6}]
["90 000€",{"$f":"SUM(A84/1000)","v":{"$error":"#VALUE!"}},null,87,null,6,{"$f":"IF(F84:F86=0,\"\",F84:F86)","v":6}]
["80 000€",{"$f":"SUM(A85/1000)","v":{"$error":"#VALUE!"}},null,129,null,8,8]
["100 000€",{"$f":"SUM(A86/1000)","v":{"$error":"#VALUE!"}},null,49,null,6]
["90 000€",{"$f":"SUM(A87/1000)","v":{"$error":"#VALUE!"}},null,80,null,6]
[]
[]
[]
[10]
["Alloc.",null,null,"Cotes",null,"Rang"]
["90 000€",{"$f":"SUM(A93/1000)","v":{"$error":"#VALUE!"}},null,20,{"$f":"MIN(D93:D95)","v":9.4},6,{"$f":"IF(F93:F95=0,\"\",F93:F95)","v":6},{"$f":"MIN(G93:G95)","v":5}]
["80 000€",{"$f":"SUM(A94/1000)","v":{"$error":"#VALUE!"}},null,24,null,6,{"$f":"IF(F94:F96=0,\"\",F94:F96)","v":6}]
["67 000€",{"$f":"SUM(A95/1000)","v":{"$error":"#VALUE!"}},null,9.4,null,5,5]
["65 000€",{"$f":"SUM(A96/1000)","v":{"$error":"#VALUE!"}},null,4.8,null,5]
["67 000€",{"$f":"SUM(A97/1000)","v":{"$error":"#VALUE!"}},null,6.1,null,1]
[]
[]
[]
[11]
["Alloc.",null,null,"Cotes",null,"Rang"]
["90 000€",{"$f":"SUM(A103/1000)","v":{"$error":"#VALUE!"}},null,62,{"$f":"MIN(D103:D105)","v":22},4,{"$f":"IF(F103:F105=0,\"\",F103:F105)","v":4},{"$f":"MIN(G103:G105)","v":3}]
["80 000€",{"$f":"SUM(A104/1000)","v":{"$error":"#VALUE!"}},null,22,null,"Dai",{"$f":"IF(F104:F106=0,\"\",F104:F106)","v":"Dai"}]
["80 000€",{"$f":"SUM(A105/1000)","v":{"$error":"#VALUE!"}},null,64,null,3,3]
["35 000€",{"$f":"SUM(A106/1000)","v":{"$error":"#VALUE!"}},null,49,null,11]
["39 000€",{"$f":"SUM(A107/1000)","v":{"$error":"#VALUE!"}},null,74,null,11]
[]
[]
[]
[12]
["Alloc.",null,null,"Cotes",null,"Rang"]
["36 000€",{"$f":"SUM(A113/1000)","v":{"$error":"#VALUE!"}},null,9.1,{"$f":"MIN(D113:D115)","v":6.6},13,{"$f":"IF(F113:F115=0,\"\",F113:F115)","v":13},{"$f":"MIN(G113:G115)","v":6}]
["90 000€",{"$f":"SUM(A114/1000)","v":{"$error":"#VALUE!"}},null,6.6,null,8,{"$f":"IF(F114:F116=0,\"\",F114:F116)","v":8}]
["80 000€",{"$f":"SUM(A115/1000)","v":{"$error":"#VALUE!"}},null,16,null,6,6]
["80 000€",{"$f":"SUM(A116/1000)","v":{"$error":"#VALUE!"}},null,22,null,3]
["67 000€",{"$f":"SUM(A117/1000)","v":{"$error":"#VALUE!"}},null,1.7,null,1]
[]
[]
[]
[13]
["Alloc.",null,null,"Cotes",null,"Rang"]
["53 000€",{"$f":"SUM(A123/1000)","v":{"$error":"#VALUE!"}},null,10,{"$f":"MIN(D123:D125)","v":10},3,{"$f":"IF(F123:F125=0,\"\",F123:F125)","v":3},{"$f":"MIN(G123:G125)","v":3}]
["80 000€",{"$f":"SUM(A124/1000)","v":{"$error":"#VALUE!"}},null,65,null,12,{"$f":"IF(F124:F126=0,\"\",F124:F126)","v":12}]
["80 000€",{"$f":"SUM(A125/1000)","v":{"$error":"#VALUE!"}},null,25,null,5,5]
["67 000€",{"$f":"SUM(A126/1000)","v":{"$error":"#VALUE!"}},null,3.3,null,4]
["65 000€",{"$f":"SUM(A127/1000)","v":{"$error":"#VALUE!"}},null,171,null,0]
[]
[]
[]
[14]
["Alloc.",null,null,"Cotes",null,"Rang"]
["67 000€",{"$f":"SUM(A133/1000)","v":{"$error":"#VALUE!"}},null,98,{"$f":"MIN(D133:D135)","v":6.3},10,{"$f":"IF(F133:F135=0,\"\",F133:F135)","v":10},{"$f":"MIN(G133:G135)","v":10}]
["53 000€",{"$f":"SUM(A134/1000)","v":{"$error":"#VALUE!"}},null,6.3,null,10,{"$f":"IF(F134:F136=0,\"\",F134:F136)","v":10}]
["55 000€",{"$f":"SUM(A135/1000)","v":{"$error":"#VALUE!"}},null,15,null,11,11]
["44 000€",{"$f":"SUM(A136/1000)","v":{"$error":"#VALUE!"}},null,7.7,null,8]
["80 000€",{"$f":"SUM(A137/1000)","v":{"$error":"#VALUE!"}},null,47,null,6]
[]
[]
[]
[15]
["Alloc.",null,null,"Cotes",null,"Rang"]
["67 000€",{"$f":"SUM(A143/1000)","v":{"$error":"#VALUE!"}},null,9.4,{"$f":"MIN(D143:D145)","v":9.4},1,{"$f":"IF(F143:F145=0,\"\",F143:F145)","v":1},{"$f":"MIN(G143:G145)","v":1}]
["67 000€",{"$f":"SUM(A144/1000)","v":{"$error":"#VALUE!"}},null,16,null,2,{"$f":"IF(F144:F146=0,\"\",F144:F146)","v":2}]
["64 000€",{"$f":"SUM(A145/1000)","v":{"$error":"#VALUE!"}},null,25,null,4,4]
["85 000€",{"$f":"SUM(A146/1000)","v":{"$error":"#VALUE!"}},null,91,null,6]
["36 000€",{"$f":"SUM(A147/1000)","v":{"$error":"#VALUE!"}},null,4.0999999999999996,null,5]
[]
[]
[]
[16]
["Alloc.",null,null,"Cotes",null,"Rang"]
["53 000€",{"$f":"SUM(A153/1000)","v":{"$error":"#VALUE!"}},null,19,{"$f":"MIN(D153:D155)","v":19},2,{"$f":"IF(F153:F155=0,\"\",F153:F155)","v":2},{"$f":"MIN(G153:G155)","v":2}]
["80 000€",{"$f":"SUM(A154/1000)","v":{"$error":"#VALUE!"}},null,178,null,11,{"$f":"IF(F154:F156=0,\"\",F154:F156)","v":11}]
["80 000€",{"$f":"SUM(A155/1000)","v":{"$error":"#VALUE!"}},null,105,null,12,12]
["49 000€",{"$f":"SUM(A156/1000)","v":{"$error":"#VALUE!"}},null,166,null,0]
["45 000€",{"$f":"SUM(A157/1000)","v":{"$error":"#VALUE!"}},null,25,null,13]
[]
[]
[]
[17]
["Alloc.",null,null,"Cotes",null,"Rang"]
[null,{"$f":"SUM(A163/1000)","v":0},null,null,{"$f":"MIN(D163:D165)","v":0},null,{"$f":"IF(F163:F165=0,\"\",F163:F165)","v":""},{"$f":"MIN(G163:G165)","v":0}]
[null,{"$f":"SUM(A164/1000)","v":0},null,null,null,null,{"$f":"IF(F164:F166=0,\"\",F164:F166)","v":""}]
[null,{"$f":"SUM(A165/1000)","v":0},null,null,null,null,""]
[null,{"$f":"SUM(A166/1000)","v":0}]
[null,{"$f":"SUM(A167/1000)","v":0}]
[]
[]
[]
[18]
["Alloc.",null,null,"Cotes",null,"Rang"]
[null,{"$f":"SUM(A173/1000)","v":0},null,null,{"$f":"MIN(D173:D175)","v":0},null,{"$f":"IF(F173:F175=0,\"\",F173:F175)","v":""},{"$f":"MIN(G173:G175)","v":0}]
[null,{"$f":"SUM(A174/1000)","v":0},null,null,null,null,{"$f":"IF(F174:F176=0,\"\",F174:F176)","v":""}]
[null,{"$f":"SUM(A175/1000)","v":0},null,null,null,null,""]
[null,{"$f":"SUM(A176/1000)","v":0}]
[null,{"$f":"SUM(A177/1000)","v":0}]
[]
[]
[]
[19]
["Alloc.",null,null,"Cotes",null,"Rang"]
[null,{"$f":"SUM(A183/1000)","v":0},null,null,{"$f":"MIN(D183:D185)","v":0},null,{"$f":"IF(F183:F185=0,\"\",F183:F185)","v":""},{"$f":"MIN(G183:G185)","v":0}]
[null,{"$f":"SUM(A184/1000)","v":0}]
[null,{"$f":"SUM(A185/1000)","v":0}]
[null,{"$f":"SUM(A186/1000)","v":0}]
[null,{"$f":"SUM(A187/1000)","v":0}]
[]
[]
[]
[20]
["Alloc.",null,null,"Cotes",null,"Rang"]
[null,{"$f":"SUM(A193/1000)","v":0},null,null,null,null,null,{"$f":"MIN(G193:G195)","v":0}]
[null,{"$f":"SUM(A194/1000)","v":0}]
[null,{"$f":"SUM(A195/1000)","v":0}]
[null,{"$f":"SUM(A196/1000)","v":0}]
[null,{"$f":"SUM(A197/1000)","v":0}]

{"sheet":"Feuil1 (2)","index":5,"n_rows":33,"n_cols":21,"rows_kept":33,"cut":false,"hidden":true,"merged":[]}
[]
["PK","N° "]
[{"$f":"IF(#REF!=\"\",\"\",#REF!)","v":{"$error":"#REF!"}},{"$f":"IF(#REF!=\"\",\"\",#REF!)","v":{"$error":"#REF!"}}]
[{"$f":"IF(#REF!=\"\",\"\",#REF!)","v":{"$error":"#REF!"}},{"$f":"IF(#REF!=\"\",\"\",#REF!)","v":{"$error":"#REF!"}}]
[{"$f":"IF(#REF!=\"\",\"\",#REF!)","v":{"$error":"#REF!"}},{"$f":"IF(#REF!=\"\",\"\",#REF!)","v":{"$error":"#REF!"}}]
[{"$f":"IF(#REF!=\"\",\"\",#REF!)","v":{"$error":"#REF!"}},{"$f":"IF(#REF!=\"\",\"\",#REF!)","v":{"$error":"#REF!"}}]
[{"$f":"IF(#REF!=\"\",\"\",#REF!)","v":{"$error":"#REF!"}},{"$f":"IF(#REF!=\"\",\"\",#REF!)","v":{"$error":"#REF!"}}]
[{"$f":"IF(#REF!=\"\",\"\",#REF!)","v":{"$error":"#REF!"}},{"$f":"IF(#REF!=\"\",\"\",#REF!)","v":{"$error":"#REF!"}}]
[{"$f":"IF(#REF!=\"\",\"\",#REF!)","v":{"$error":"#REF!"}},{"$f":"IF(#REF!=\"\",\"\",#REF!)","v":{"$error":"#REF!"}},null,null,null,null,null,null,null,null,null,null,null,"PK6","PK5","PK4","PK3","PK2","PK1","PK0"]
[{"$f":"IF(#REF!=\"\",\"\",#REF!)","v":{"$error":"#REF!"}},{"$f":"IF(#REF!=\"\",\"\",#REF!)","v":{"$error":"#REF!"}},null,null,null,null,null,null,null,null,null,null,"Df",{"$f":"IFERROR(INDEX($B3:$B18,MATCH(1,(\"PK\"&$A3:$A18=N9)*(COUNTIF($N13:$T13,$B3:$B18)=0),0)),\"\")","v":""},{"$f":"IFERROR(INDEX($B3:$B18,MATCH(1,(\"PK\"&$A3:$A18=O9)*(COUNTIF($N13:$T13,$B3:$B18)=0),0)),\"\")","v":""},{"$f":"IFERROR(INDEX($B3:$B18,MATCH(1,(\"PK\"&$A3:$A18=P9)*(COUNTIF($N13:$T13,$B3:$B18)=0),0)),\"\")","v":""},{"$f":"IFERROR(INDEX($B3:$B18,MATCH(1,(\"PK\"&$A3:$A18=Q9)*(COUNTIF($N13:$T13,$B3:$B18)=0),0)),\"\")","v":""},{"$f":"IFERROR(INDEX($B3:$B18,MATCH(1,(\"PK\"&$A3:$A18=R9)*(COUNTIF($N13:$T13,$B3:$B18)=0),0)),\"\")","v":""},{"$f":"IFERROR(INDEX($B3:$B18,MATCH(1,(\"PK\"&$A3:$A18=S9)*(COUNTIF($N13:$T13,$B3:$B18)=0),0)),\"\")","v":""},{"$f":"IFERROR(INDEX($B3:$B18,MATCH(1,(\"PK\"&$A3:$A18=T9)*(COUNTIF($N13:$T13,$B3:$B18)=0),0)),\"\")","v":""}," -"]
[{"$f":"IF(#REF!=\"\",\"\",#REF!)","v":{"$error":"#REF!"}},{"$f":"IF(#REF!=\"\",\"\",#REF!)","v":{"$error":"#REF!"}},null,null,null,null,null,null,null,null,null,null,"Pg",{"$f":"IFERROR(INDEX($B3:$B18,LARGE(IF((\"PK\"&$A3:$A18=N9)*(COUNTIF($N13:$T13,$B3:$B18)=0),ROW(INDIRECT(\"1:\"&ROWS($A3:$A18)))),1)),\"\")","v":""},{"$f":"IFERROR(INDEX($B3:$B18,LARGE(IF((\"PK\"&$A3:$A18=O9)*(COUNTIF($N13:$T13,$B3:$B18)=0),ROW(INDIRECT(\"1:\"&ROWS($A3:$A18)))),1)),\"\")","v":""},{"$f":"IFERROR(INDEX($B3:$B18,LARGE(IF((\"PK\"&$A3:$A18=P9)*(COUNTIF($N13:$T13,$B3:$B18)=0),ROW(INDIRECT(\"1:\"&ROWS($A3:$A18)))),1)),\"\")","v":""},{"$f":"IFERROR(INDEX($B3:$B18,LARGE(IF((\"PK\"&$A3:$A18=Q9)*(COUNTIF($N13:$T13,$B3:$B18)=0),ROW(INDIRECT(\"1:\"&ROWS($A3:$A18)))),1)),\"\")","v":""},{"$f":"IFERROR(INDEX($B3:$B18,LARGE(IF((\"PK\"&$A3:$A18=R9)*(COUNTIF($N13:$T13,$B3:$B18)=0),ROW(INDIRECT(\"1:\"&ROWS($A3:$A18)))),1)),\"\")","v":""},{"$f":"IFERROR(INDEX($B3:$B18,LARGE(IF((\"PK\"&$A3:$A18=S9)*(COUNTIF($N13:$T13,$B3:$B18)=0),ROW(INDIRECT(\"1:\"&ROWS($A3:$A18)))),1)),\"\")","v":""},{"$f":"IFERROR(INDEX($B3:$B18,LARGE(IF((\"PK\"&$A3:$A18=T9)*(COUNTIF($N13:$T13,$B3:$B18)=0),ROW(INDIRECT(\"1:\"&ROWS($A3:$A18)))),1)),\"\")","v":""}," -"]
[{"$f":"IF(#REF!=\"\",\"\",#REF!)","v":{"$error":"#REF!"}},{"$f":"IF(#REF!=\"\",\"\",#REF!)","v":{"$error":"#REF!"}},null,null,null,null,null,null,null,null,null,null,"median",{"$f":"IF(AND(MOD(COUNTIF($A3:$A18,RIGHT(N9)*1),2)=1,COUNTIF($A3:$A18,RIGHT(N9)*1)>1),INDEX($B3:$B18,MATCH(RIGHT(N9)*1,$A3:$A18,0)+COUNTIF($A3:$A18,RIGHT(N9)*1)/2),\"\")","v":""},{"$f":"IF(AND(MOD(COUNTIF($A3:$A18,RIGHT(O9)*1),2)=1,COUNTIF($A3:$A18,RIGHT(O9)*1)>1),INDEX($B3:$B18,MATCH(RIGHT(O9)*1,$A3:$A18,0)+COUNTIF($A3:$A18,RIGHT(O9)*1)/2),\"\")","v":""},{"$f":"IF(AND(MOD(COUNTIF($A3:$A18,RIGHT(P9)*1),2)=1,COUNTIF($A3:$A18,RIGHT(P9)*1)>1),INDEX($B3:$B18,MATCH(RIGHT(P9)*1,$A3:$A18,0)+COUNTIF($A3:$A18,RIGHT(P9)*1)/2),\"\")","v":""},{"$f":"IF(AND(MOD(COUNTIF($A3:$A18,RIGHT(Q9)*1),2)=1,COUNTIF($A3:$A18,RIGHT(Q9)*1)>1),INDEX($B3:$B18,MATCH(RIGHT(Q9)*1,$A3:$A18,0)+COUNTIF($A3:$A18,RIGHT(Q9)*1)/2),\"\")","v":""},{"$f":"IF(AND(MOD(COUNTIF($A3:$A18,RIGHT(R9)*1),2)=1,COUNTIF($A3:$A18,RIGHT(R9)*1)>1),INDEX($B3:$B18,MATCH(RIGHT(R9)*1,$A3:$A18,0)+COUNTIF($A3:$A18,RIGHT(R9)*1)/2),\"\")","v":""},{"$f":"IF(AND(MOD(COUNTIF($A3:$A18,RIGHT(S9)*1),2)=1,COUNTIF($A3:$A18,RIGHT(S9)*1)>1),INDEX($B3:$B18,MATCH(RIGHT(S9)*1,$A3:$A18,0)+COUNTIF($A3:$A18,RIGHT(S9)*1)/2),\"\")","v":""},{"$f":"IF(AND(MOD(COUNTIF($A3:$A18,RIGHT(T9)*1),2)=1,COUNTIF($A3:$A18,RIGHT(T9)*1)>1),INDEX($B3:$B18,MATCH(RIGHT(T9)*1,$A3:$A18,0)+COUNTIF($A3:$A18,RIGHT(T9)*1)/2),\"\")","v":""}," -"]
[{"$f":"IF(#REF!=\"\",\"\",#REF!)","v":{"$error":"#REF!"}},{"$f":"IF(#REF!=\"\",\"\",#REF!)","v":{"$error":"#REF!"}},null,null,null,null,null,null,null,null,null,null,"Re",{"$f":"IFERROR(SMALL(IF((COUNTIF($A$3:$A$18,$A$3:$A$18)=1)*($A$3:$A$18=RIGHT(N9)*1),$B$3:$B$18),1),\"\")","v":""},{"$f":"IFERROR(SMALL(IF((COUNTIF($A$3:$A$18,$A$3:$A$18)=1)*($A$3:$A$18=RIGHT(O9)*1),$B$3:$B$18),1),\"\")","v":""},{"$f":"IFERROR(SMALL(IF((COUNTIF($A$3:$A$18,$A$3:$A$18)=1)*($A$3:$A$18=RIGHT(P9)*1),$B$3:$B$18),1),\"\")","v":""},{"$f":"IFERROR(SMALL(IF((COUNTIF($A$3:$A$18,$A$3:$A$18)=1)*($A$3:$A$18=RIGHT(Q9)*1),$B$3:$B$18),1),\"\")","v":""},{"$f":"IFERROR(SMALL(IF((COUNTIF($A$3:$A$18,$A$3:$A$18)=1)*($A$3:$A$18=RIGHT(R9)*1),$B$3:$B$18),1),\"\")","v":""},{"$f":"IFERROR(SMALL(IF((COUNTIF($A$3:$A$18,$A$3:$A$18)=1)*($A$3:$A$18=RIGHT(S9)*1),$B$3:$B$18),1),\"\")","v":""},{"$f":"IFERROR(SMALL(IF((COUNTIF($A$3:$A$18,$A$3:$A$18)=1)*($A$3:$A$18=RIGHT(T9)*1),$B$3:$B$18),1),\"\")","v":""}," -"]
[{"$f":"IF(#REF!=\"\",\"\",#REF!)","v":{"$error":"#REF!"}},{"$f":"IF(#REF!=\"\",\"\",#REF!)","v":{"$error":"#REF!"}}]
[{"$f":"IF(#REF!=\"\",\"\",#REF!)","v":{"$error":"#REF!"}},{"$f":"IF(#REF!=\"\",\"\",#REF!)","v":{"$error":"#REF!"}}]
[{"$f":"IF(#REF!=\"\",\"\",#REF!)","v":{"$error":"#REF!"}},{"$f":"IF(#REF!=\"\",\"\",#REF!)","v":{"$error":"#REF!"}}]
[{"$f":"IF(#REF!=\"\",\"\",#REF!)","v":{"$error":"#REF!"}},{"$f":"IF(#REF!=\"\",\"\",#REF!)","v":{"$error":"#REF!"}}]
[{"$f":"IF(#REF!=\"\",\"\",#REF!)","v":{"$error":"#REF!"}},{"$f":"IF(#REF!=\"\",\"\",#REF!)","v":{"$error":"#REF!"}}]
[{"$f":"IF(#REF!=\"\",\"\",#REF!)","v":{"$error":"#REF!"}},{"$f":"IF(#REF!=\"\",\"\",#REF!)","v":{"$error":"#REF!"}}]
[{"$f":"IF(#REF!=\"\",\"\",#REF!)","v":{"$error":"#REF!"}},{"$f":"IF(#REF!=\"\",\"\",#REF!)","v":{"$error":"#REF!"}}]
[{"$f":"IF(#REF!=\"\",\"\",#REF!)","v":{"$error":"#REF!"}},{"$f":"IF(#REF!=\"\",\"\",#REF!)","v":{"$error":"#REF!"}}]
[{"$f":"IF(#REF!=\"\",\"\",#REF!)","v":{"$error":"#REF!"}},{"$f":"IF(#REF!=\"\",\"\",#REF!)","v":{"$error":"#REF!"}}]
[{"$f":"IF(#REF!=\"\",\"\",#REF!)","v":{"$error":"#REF!"}},{"$f":"IF(#REF!=\"\",\"\",#REF!)","v":{"$error":"#REF!"}}]
[{"$f":"IF(#REF!=\"\",\"\",#REF!)","v":{"$error":"#REF!"}},{"$f":"IF(#REF!=\"\",\"\",#REF!)","v":{"$error":"#REF!"}}]
[{"$f":"IF(#REF!=\"\",\"\",#REF!)","v":{"$error":"#REF!"}},{"$f":"IF(#REF!=\"\",\"\",#REF!)","v":{"$error":"#REF!"}}]
[{"$f":"IF(#REF!=\"\",\"\",#REF!)","v":{"$error":"#REF!"}},{"$f":"IF(#REF!=\"\",\"\",#REF!)","v":{"$error":"#REF!"}}]
[{"$f":"IF(#REF!=\"\",\"\",#REF!)","v":{"$error":"#REF!"}},{"$f":"IF(#REF!=\"\",\"\",#REF!)","v":{"$error":"#REF!"}}]
[{"$f":"IF(#REF!=\"\",\"\",#REF!)","v":{"$error":"#REF!"}},{"$f":"IF(#REF!=\"\",\"\",#REF!)","v":{"$error":"#REF!"}}]
[{"$f":"IF(#REF!=\"\",\"\",#REF!)","v":{"$error":"#REF!"}},{"$f":"IF(#REF!=\"\",\"\",#REF!)","v":{"$error":"#REF!"}}]
[{"$f":"IF(#REF!=\"\",\"\",#REF!)","v":{"$error":"#REF!"}},{"$f":"IF(#REF!=\"\",\"\",#REF!)","v":{"$error":"#REF!"}}]
[{"$f":"IF(#REF!=\"\",\"\",#REF!)","v":{"$error":"#REF!"}},{"$f":"IF(#REF!=\"\",\"\",#REF!)","v":{"$error":"#REF!"}}]
[{"$f":"IF(#REF!=\"\",\"\",#REF!)","v":{"$error":"#REF!"}},{"$f":"IF(#REF!=\"\",\"\",#REF!)","v":{"$error":"#REF!"}}]
[{"$f":"IF(#REF!=\"\",\"\",#REF!)","v":{"$error":"#REF!"}},{"$f":"IF(#REF!=\"\",\"\",#REF!)","v":{"$error":"#REF!"}}]

{"sheet":"Feuil2 (2)","index":6,"n_rows":52,"n_cols":55,"rows_kept":52,"cut":false,"hidden":true,"merged":[[1,6,3,47]]}
[]
["6 Ah",null,null,null,null,null,"Feuille réalisée par Phil59110 Un grand merci pour l'aide apporté",null,null,null,null,null,null,null,null,null,null,null,null,null,null,null,null,null,null,null,null,null,null,null,null,null,null,null,null,null,null,null,null,null,null,null,null,null,null,null,null,null,null,null,null,null,null,null,"SI(BB26=\"\";\"\";SI(OU(BB26=6);BE26;SI(OU(BB26<6);BA26;\"\")))"]
["6 Am",null,null,null,null,null,null,null,null,null,null,null,null,null,null,null,null,null,null,null,null,null,null,null,null,null,null,null,null,null,null,null,null,null,null,null,null,null,null,null,null,null,null,null,null,null,null,null,null,null,null,null,null,null,"SI(NB($AK68:$AY68)>1;RECHERCHE(9^9;$AK68:$AY68);\"\")"]
["6 Af",null,null,null,null,null,null,null,null,null,null,null,null,null,null,null,null,null,null,null,null,null,null,null,null,null,null,null,null,null,null,null,null,null,null,null,null,null,null,null,null,null,null,null,null,null,null,null,null,null,null,null,null,null,"SI(NB(BA$68:BA$74)>=LIGNES($68:68);INDEX(BA$68:BA$74;PETITE.VALEUR(SI(ESTNUM(BA$68:BA$74);LIGNE(INDIRECT(\"1:\"&LIGNES(BA$68:BA$74))));LIGNES($68:68)));\"\")"]
[]
["5Ah",null,null,null,null,"6Ah","6Am","6Af","5Ah","5Am","5Af","4Ah","4Am","4Af","3Ah","3Am","3Af","2Ah","2Am","2Af","1Ah","1Am","1Af","0Ah","0Am","0Af",null,"6Ah","6Am","6Af","5Ah","5Am","5Af","4Ah","4Am","4Af","3Ah","3Am","3Af","2Ah","2Am","2Af","1Ah","1Am","1Af","0Ah","0Am","0Af"]
["5Am",1,{"$f":"IF(#REF!=\"\",\"\",VALUE(#REF!))","v":{"$error":"#REF!"}},{"$f":"IF(Accueil!B15=0,\"\",IF(Accueil!B15=\"\",\"\",Accueil!B15))","v":1},{"$f":"IF(C7=\"\",\"\",MID(Accueil!D15,1,1))","v":{"$error":"#REF!"}},{"$f":"IF(C7=\"\",\"\",IF(AND(C7=6,E7=\"H\"),D7,\"\"))","v":{"$error":"#REF!"}},{"$f":"IF(C7=\"\",\"\",IF(AND(C7=6,E7=\"m\"),D7,\"\"))","v":{"$error":"#REF!"}},{"$f":"IF(C7=\"\",\"\",IF(AND(C7=6,E7=\"f\"),D7,\"\"))","v":{"$error":"#REF!"}},{"$f":"IF(C7=\"\",\"\",IF(AND(C7=5,E7=\"h\"),D7,\"\"))","v":{"$error":"#REF!"}},{"$f":"IF(C7=\"\",\"\",IF(AND(C7=5,E7=\"m\"),D7,\"\"))","v":{"$error":"#REF!"}},{"$f":"IF(C7=\"\",\"\",IF(AND(C7=5,E7=\"f\"),D7,\"\"))","v":{"$error":"#REF!"}},{"$f":"IF(C7=\"\",\"\",IF(AND(C7=4,E7=\"h\"),D7,\"\"))","v":{"$error":"#REF!"}},{"$f":"IF(C7=\"\",\"\",IF(AND(C7=4,E7=\"m\"),D7,\"\"))","v":{"$error":"#REF!"}},{"$f":"IF(C7=\"\",\"\",IF(AND(C7=4,E7=\"f\"),D7,\"\"))","v":{"$error":"#REF!"}},{"$f":"IF(C7=\"\",\"\",IF(AND(C7=3,E7=\"h\"),D7,\"\"))","v":{"$error":"#REF!"}},{"$f":"IF(C7=\"\",\"\",IF(AND(C7=3,E7=\"m\"),D7,\"\"))","v":{"$error":"#REF!"}},{"$f":"IF(C7=\"\",\"\",IF(AND(C7=3,E7=\"f\"),D7,\"\"))","v":{"$error":"#REF!"}},{"$f":"IF(C7=\"\",\"\",IF(AND(C7=2,E7=\"h\"),D7,\"\"))","v":{"$error":"#REF!"}},{"$f":"IF(C7=\"\",\"\",IF(AND(C7=2,E7=\"m\"),D7,\"\"))","v":{"$error":"#REF!"}},{"$f":"IF(C7=\"\",\"\",IF(AND(C7=2,E7=\"f\"),D7,\"\"))","v":{"$error":"#REF!"}},{"$f":"IF(C7=\"\",\"\",IF(AND(C7=1,E7=\"h\"),D7,\"\"))","v":{"$error":"#REF!"}},{"$f":"IF(C7=\"\",\"\",IF(AND(C7=1,E7=\"m\"),D7,\"\"))","v":{"$error":"#REF!"}},{"$f":"IF(C7=\"\",\"\",IF(AND(C7=1,E7=\"f\"),D7,\"\"))","v":{"$error":"#REF!"}},{"$f":"IF(C7=\"\",\"\",IF(AND(C7=0,E7=\"h\"),D7,\"\"))","v":{"$error":"#REF!"}},{"$f":"IF(C7=\"\",\"\",IF(AND(C7=0,E7=\"m\"),D7,\"\"))","v":{"$error":"#REF!"}},{"$f":"IF(C7=\"\",\"\",IF(AND(C7=0,E7=\"f\"),D7,\"\"))","v":{"$error":"#REF!"}},null,{"$f":"IF(COUNT(F$7:F$26)>=ROWS($7:7),INDEX(F$7:F$26,SMALL(IF(ISNUMBER(F$7:F$26),ROW(INDIRECT(\"1:\"&ROWS(F$7:F$26)))),ROWS($7:7))),\"\")","v":""},{"$f":"IF(COUNT(G$7:G$26)>=ROWS($7:7),INDEX(G$7:G$26,SMALL(IF(ISNUMBER(G$7:G$26),ROW(INDIRECT(\"1:\"&ROWS(G$7:G$26)))),ROWS($7:7))),\"\")","v":""},{"$f":"IF(COUNT(H$7:H$26)>=ROWS($7:7),INDEX(H$7:H$26,SMALL(IF(ISNUMBER(H$7:H$26),ROW(INDIRECT(\"1:\"&ROWS(H$7:H$26)))),ROWS($7:7))),\"\")","v":""},{"$f":"IF(COUNT(I$7:I$26)>=ROWS($7:7),INDEX(I$7:I$26,SMALL(IF(ISNUMBER(I$7:I$26),ROW(INDIRECT(\"1:\"&ROWS(I$7:I$26)))),ROWS($7:7))),\"\")","v":""},{"$f":"IF(COUNT(J$7:J$26)>=ROWS($7:7),INDEX(J$7:J$26,SMALL(IF(ISNUMBER(J$7:J$26),ROW(INDIRECT(\"1:\"&ROWS(J$7:J$26)))),ROWS($7:7))),\"\")","v":""},{"$f":"IF(COUNT(K$7:K$26)>=ROWS($7:7),INDEX(K$7:K$26,SMALL(IF(ISNUMBER(K$7:K$26),ROW(INDIRECT(\"1:\"&ROWS(K$7:K$26)))),ROWS($7:7))),\"\")","v":""},{"$f":"IF(COUNT(L$7:L$26)>=ROWS($7:7),INDEX(L$7:L$26,SMALL(IF(ISNUMBER(L$7:L$26),ROW(INDIRECT(\"1:\"&ROWS(L$7:L$26)))),ROWS($7:7))),\"\")","v":""},{"$f":"IF(COUNT(M$7:M$26)>=ROWS($7:7),INDEX(M$7:M$26,SMALL(IF(ISNUMBER(M$7:M$26),ROW(INDIRECT(\"1:\"&ROWS(M$7:M$26)))),ROWS($7:7))),\"\")","v":""},{"$f":"IF(COUNT(N$7:N$26)>=ROWS($7:7),INDEX(N$7:N$26,SMALL(IF(ISNUMBER(N$7:N$26),ROW(INDIRECT(\"1:\"&ROWS(N$7:N$26)))),ROWS($7:7))),\"\")","v":""},{"$f":"IF(COUNT(O$7:O$26)>=ROWS($7:7),INDEX(O$7:O$26,SMALL(IF(ISNUMBER(O$7:O$26),ROW(INDIRECT(\"1:\"&ROWS(O$7:O$26)))),ROWS($7:7))),\"\")","v":""},{"$f":"IF(COUNT(P$7:P$26)>=ROWS($7:7),INDEX(P$7:P$26,SMALL(IF(ISNUMBER(P$7:P$26),ROW(INDIRECT(\"1:\"&ROWS(P$7:P$26)))),ROWS($7:7))),\"\")","v":""},{"$f":"IF(COUNT(Q$7:Q$26)>=ROWS($7:7),INDEX(Q$7:Q$26,SMALL(IF(ISNUMBER(Q$7:Q$26),ROW(INDIRECT(\"1:\"&ROWS(Q$7:Q$26)))),ROWS($7:7))),\"\")","v":""},{"$f":"IF(COUNT(R$7:R$26)>=ROWS($7:7),INDEX(R$7:R$26,SMALL(IF(ISNUMBER(R$7:R$26),ROW(INDIRECT(\"1:\"&ROWS(R$7:R$26)))),ROWS($7:7))),\"\")","v":""},{"$f":"IF(COUNT(S$7:S$26)>=ROWS($7:7),INDEX(S$7:S$26,SMALL(IF(ISNUMBER(S$7:S$26),ROW(INDIRECT(\"1:\"&ROWS(S$7:S$26)))),ROWS($7:7))),\"\")","v":""},{"$f":"IF(COUNT(T$7:T$26)>=ROWS($7:7),INDEX(T$7:T$26,SMALL(IF(ISNUMBER(T$7:T$26),ROW(INDIRECT(\"1:\"&ROWS(T$7:T$26)))),ROWS($7:7))),\"\")","v":""},{"$f":"IF(COUNT(U$7:U$26)>=ROWS($7:7),INDEX(U$7:U$26,SMALL(IF(ISNUMBER(U$7:U$26),ROW(INDIRECT(\"1:\"&ROWS(U$7:U$26)))),ROWS($7:7))),\"\")","v":""},{"$f":"IF(COUNT(V$7:V$26)>=ROWS($7:7),INDEX(V$7:V$26,SMALL(IF(ISNUMBER(V$7:V$26),ROW(INDIRECT(\"1:\"&ROWS(V$7:V$26)))),ROWS($7:7))),\"\")","v":""},{"$f":"IF(COUNT(W$7:W$26)>=ROWS($7:7),INDEX(W$7:W$26,SMALL(IF(ISNUMBER(W$7:W$26),ROW(INDIRECT(\"1:\"&ROWS(W$7:W$26)))),ROWS($7:7))),\"\")","v":""},{"$f":"IF(COUNT(X$7:X$26)>=ROWS($7:7),INDEX(X$7:X$26,SMALL(IF(ISNUMBER(X$7:X$26),ROW(INDIRECT(\"1:\"&ROWS(X$7:X$26)))),ROWS($7:7))),\"\")","v":""},{"$f":"IF(COUNT(Y$7:Y$26)>=ROWS($7:7),INDEX(Y$7:Y$26,SMALL(IF(ISNUMBER(Y$7:Y$26),ROW(INDIRECT(\"1:\"&ROWS(Y$7:Y$26)))),ROWS($7:7))),\"\")","v":""},{"$f":"IF(COUNT(Z$7:Z$26)>=ROWS($7:7),INDEX(Z$7:Z$26,SMALL(IF(ISNUMBER(Z$7:Z$26),ROW(INDIRECT(\"1:\"&ROWS(Z$7:Z$26)))),ROWS($7:7))),\"\")","v":""}]
["5Af",2,{"$f":"IF(#REF!=\"\",\"\",VALUE(#REF!))","v":{"$error":"#REF!"}},{"$f":"IF(Accueil!B16=0,\"\",IF(Accueil!B16=\"\",\"\",Accueil!B16))","v":2},{"$f":"IF(C8=\"\",\"\",MID(Accueil!D16,1,1))","v":{"$error":"#REF!"}},{"$f":"IF(C8=\"\",\"\",IF(AND(C8=6,E8=\"h\"),D8,\"\"))","v":{"$error":"#REF!"}},{"$f":"IF(C8=\"\",\"\",IF(AND(C8=6,E8=\"m\"),D8,\"\"))","v":{"$error":"#REF!"}},{"$f":"IF(C8=\"\",\"\",IF(AND(C8=6,E8=\"f\"),D8,\"\"))","v":{"$error":"#REF!"}},{"$f":"IF(C8=\"\",\"\",IF(AND(C8=5,E8=\"h\"),D8,\"\"))","v":{"$error":"#REF!"}},{"$f":"IF(C8=\"\",\"\",IF(AND(C8=5,E8=\"m\"),D8,\"\"))","v":{"$error":"#REF!"}},{"$f":"IF(C8=\"\",\"\",IF(AND(C8=5,E8=\"f\"),D8,\"\"))","v":{"$error":"#REF!"}},{"$f":"IF(C8=\"\",\"\",IF(AND(C8=4,E8=\"h\"),D8,\"\"))","v":{"$error":"#REF!"}},{"$f":"IF(C8=\"\",\"\",IF(AND(C8=4,E8=\"m\"),D8,\"\"))","v":{"$error":"#REF!"}},{"$f":"IF(C8=\"\",\"\",IF(AND(C8=4,E8=\"f\"),D8,\"\"))","v":{"$error":"#REF!"}},{"$f":"IF(C8=\"\",\"\",IF(AND(C8=3,E8=\"h\"),D8,\"\"))","v":{"$error":"#REF!"}},{"$f":"IF(C8=\"\",\"\",IF(AND(C8=3,E8=\"m\"),D8,\"\"))","v":{"$error":"#REF!"}},{"$f":"IF(C8=\"\",\"\",IF(AND(C8=3,E8=\"f\"),D8,\"\"))","v":{"$error":"#REF!"}},{"$f":"IF(C8=\"\",\"\",IF(AND(C8=2,E8=\"h\"),D8,\"\"))","v":{"$error":"#REF!"}},{"$f":"IF(C8=\"\",\"\",IF(AND(C8=2,E8=\"m\"),D8,\"\"))","v":{"$error":"#REF!"}},{"$f":"IF(C8=\"\",\"\",IF(AND(C8=2,E8=\"f\"),D8,\"\"))","v":{"$error":"#REF!"}},{"$f":"IF(C8=\"\",\"\",IF(AND(C8=1,E8=\"h\"),D8,\"\"))","v":{"$error":"#REF!"}},{"$f":"IF(C8=\"\",\"\",IF(AND(C8=1,E8=\"m\"),D8,\"\"))","v":{"$error":"#REF!"}},{"$f":"IF(C8=\"\",\"\",IF(AND(C8=1,E8=\"f\"),D8,\"\"))","v":{"$error":"#REF!"}},{"$f":"IF(C8=\"\",\"\",IF(AND(C8=0,E8=\"h\"),D8,\"\"))","v":{"$error":"#REF!"}},{"$f":"IF(C8=\"\",\"\",IF(AND(C8=0,E8=\"m\"),D8,\"\"))","v":{"$error":"#REF!"}},{"$f":"IF(C8=\"\",\"\",IF(AND(C8=0,E8=\"f\"),D8,\"\"))","v":{"$error":"#REF!"}},null,{"$f":"IF(COUNT(F$7:F$26)>=ROWS($7:8),INDEX(F$7:F$26,SMALL(IF(ISNUMBER(F$7:F$26),ROW(INDIRECT(\"1:\"&ROWS(F$7:F$26)))),ROWS($7:8))),\"\")","v":""},{"$f":"IF(COUNT(G$7:G$26)>=ROWS($7:8),INDEX(G$7:G$26,SMALL(IF(ISNUMBER(G$7:G$26),ROW(INDIRECT(\"1:\"&ROWS(G$7:G$26)))),ROWS($7:8))),\"\")","v":""},{"$f":"IF(COUNT(H$7:H$26)>=ROWS($7:8),INDEX(H$7:H$26,SMALL(IF(ISNUMBER(H$7:H$26),ROW(INDIRECT(\"1:\"&ROWS(H$7:H$26)))),ROWS($7:8))),\"\")","v":""},{"$f":"IF(COUNT(I$7:I$26)>=ROWS($7:8),INDEX(I$7:I$26,SMALL(IF(ISNUMBER(I$7:I$26),ROW(INDIRECT(\"1:\"&ROWS(I$7:I$26)))),ROWS($7:8))),\"\")","v":""},{"$f":"IF(COUNT(J$7:J$26)>=ROWS($7:8),INDEX(J$7:J$26,SMALL(IF(ISNUMBER(J$7:J$26),ROW(INDIRECT(\"1:\"&ROWS(J$7:J$26)))),ROWS($7:8))),\"\")","v":""},{"$f":"IF(COUNT(K$7:K$26)>=ROWS($7:8),INDEX(K$7:K$26,SMALL(IF(ISNUMBER(K$7:K$26),ROW(INDIRECT(\"1:\"&ROWS(K$7:K$26)))),ROWS($7:8))),\"\")","v":""},{"$f":"IF(COUNT(L$7:L$26)>=ROWS($7:8),INDEX(L$7:L$26,SMALL(IF(ISNUMBER(L$7:L$26),ROW(INDIRECT(\"1:\"&ROWS(L$7:L$26)))),ROWS($7:8))),\"\")","v":""},{"$f":"IF(COUNT(M$7:M$26)>=ROWS($7:8),INDEX(M$7:M$26,SMALL(IF(ISNUMBER(M$7:M$26),ROW(INDIRECT(\"1:\"&ROWS(M$7:M$26)))),ROWS($7:8))),\"\")","v":""},{"$f":"IF(COUNT(N$7:N$26)>=ROWS($7:8),INDEX(N$7:N$26,SMALL(IF(ISNUMBER(N$7:N$26),ROW(INDIRECT(\"1:\"&ROWS(N$7:N$26)))),ROWS($7:8))),\"\")","v":""},{"$f":"IF(COUNT(O$7:O$26)>=ROWS($7:8),INDEX(O$7:O$26,SMALL(IF(ISNUMBER(O$7:O$26),ROW(INDIRECT(\"1:\"&ROWS(O$7:O$26)))),ROWS($7:8))),\"\")","v":""},{"$f":"IF(COUNT(P$7:P$26)>=ROWS($7:8),INDEX(P$7:P$26,SMALL(IF(ISNUMBER(P$7:P$26),ROW(INDIRECT(\"1:\"&ROWS(P$7:P$26)))),ROWS($7:8))),\"\")","v":""},{"$f":"IF(COUNT(Q$7:Q$26)>=ROWS($7:8),INDEX(Q$7:Q$26,SMALL(IF(ISNUMBER(Q$7:Q$26),ROW(INDIRECT(\"1:\"&ROWS(Q$7:Q$26)))),ROWS($7:8))),\"\")","v":""},{"$f":"IF(COUNT(R$7:R$26)>=ROWS($7:8),INDEX(R$7:R$26,SMALL(IF(ISNUMBER(R$7:R$26),ROW(INDIRECT(\"1:\"&ROWS(R$7:R$26)))),ROWS($7:8))),\"\")","v":""},{"$f":"IF(COUNT(S$7:S$26)>=ROWS($7:8),INDEX(S$7:S$26,SMALL(IF(ISNUMBER(S$7:S$26),ROW(INDIRECT(\"1:\"&ROWS(S$7:S$26)))),ROWS($7:8))),\"\")","v":""},{"$f":"IF(COUNT(T$7:T$26)>=ROWS($7:8),INDEX(T$7:T$26,SMALL(IF(ISNUMBER(T$7:T$26),ROW(INDIRECT(\"1:\"&ROWS(T$7:T$26)))),ROWS($7:8))),\"\")","v":""},{"$f":"IF(COUNT(U$7:U$26)>=ROWS($7:8),INDEX(U$7:U$26,SMALL(IF(ISNUMBER(U$7:U$26),ROW(INDIRECT(\"1:\"&ROWS(U$7:U$26)))),ROWS($7:8))),\"\")","v":""},{"$f":"IF(COUNT(V$7:V$26)>=ROWS($7:8),INDEX(V$7:V$26,SMALL(IF(ISNUMBER(V$7:V$26),ROW(INDIRECT(\"1:\"&ROWS(V$7:V$26)))),ROWS($7:8))),\"\")","v":""},{"$f":"IF(COUNT(W$7:W$26)>=ROWS($7:8),INDEX(W$7:W$26,SMALL(IF(ISNUMBER(W$7:W$26),ROW(INDIRECT(\"1:\"&ROWS(W$7:W$26)))),ROWS($7:8))),\"\")","v":""},{"$f":"IF(COUNT(X$7:X$26)>=ROWS($7:8),INDEX(X$7:X$26,SMALL(IF(ISNUMBER(X$7:X$26),ROW(INDIRECT(\"1:\"&ROWS(X$7:X$26)))),ROWS($7:8))),\"\")","v":""},{"$f":"IF(COUNT(Y$7:Y$26)>=ROWS($7:8),INDEX(Y$7:Y$26,SMALL(IF(ISNUMBER(Y$7:Y$26),ROW(INDIRECT(\"1:\"&ROWS(Y$7:Y$26)))),ROWS($7:8))),\"\")","v":""},{"$f":"IF(COUNT(Z$7:Z$26)>=ROWS($7:8),INDEX(Z$7:Z$26,SMALL(IF(ISNUMBER(Z$7:Z$26),ROW(INDIRECT(\"1:\"&ROWS(Z$7:Z$26)))),ROWS($7:8))),\"\")","v":""}]
[null,3,{"$f":"IF(#REF!=\"\",\"\",VALUE(#REF!))","v":{"$error":"#REF!"}},{"$f":"IF(Accueil!B17=0,\"\",IF(Accueil!B17=\"\",\"\",Accueil!B17))","v":3},{"$f":"IF(C9=\"\",\"\",MID(Accueil!D17,1,1))","v":{"$error":"#REF!"}},{"$error":"#REF!"},{"$error":"#REF!"},{"$error":"#REF!"},{"$error":"#REF!"},{"$error":"#REF!"},{"$error":"#REF!"},{"$error":"#REF!"},{"$error":"#REF!"},{"$error":"#REF!"},{"$error":"#REF!"},{"$error":"#REF!"},{"$error":"#REF!"},{"$error":"#REF!"},{"$error":"#REF!"},{"$error":"#REF!"},{"$error":"#REF!"},{"$error":"#REF!"},{"$error":"#REF!"},{"$error":"#REF!"},{"$error":"#REF!"},{"$error":"#REF!"},null,{"$f":"IF(COUNT(F$7:F$26)>=ROWS($7:9),INDEX(F$7:F$26,SMALL(IF(ISNUMBER(F$7:F$26),ROW(INDIRECT(\"1:\"&ROWS(F$7:F$26)))),ROWS($7:9))),\"\")","v":""},{"$f":"IF(COUNT(G$7:G$26)>=ROWS($7:9),INDEX(G$7:G$26,SMALL(IF(ISNUMBER(G$7:G$26),ROW(INDIRECT(\"1:\"&ROWS(G$7:G$26)))),ROWS($7:9))),\"\")","v":""},{"$f":"IF(COUNT(H$7:H$26)>=ROWS($7:9),INDEX(H$7:H$26,SMALL(IF(ISNUMBER(H$7:H$26),ROW(INDIRECT(\"1:\"&ROWS(H$7:H$26)))),ROWS($7:9))),\"\")","v":""},{"$f":"IF(COUNT(I$7:I$26)>=ROWS($7:9),INDEX(I$7:I$26,SMALL(IF(ISNUMBER(I$7:I$26),ROW(INDIRECT(\"1:\"&ROWS(I$7:I$26)))),ROWS($7:9))),\"\")","v":""},{"$f":"IF(COUNT(J$7:J$26)>=ROWS($7:9),INDEX(J$7:J$26,SMALL(IF(ISNUMBER(J$7:J$26),ROW(INDIRECT(\"1:\"&ROWS(J$7:J$26)))),ROWS($7:9))),\"\")","v":""},{"$f":"IF(COUNT(K$7:K$26)>=ROWS($7:9),INDEX(K$7:K$26,SMALL(IF(ISNUMBER(K$7:K$26),ROW(INDIRECT(\"1:\"&ROWS(K$7:K$26)))),ROWS($7:9))),\"\")","v":""},{"$f":"IF(COUNT(L$7:L$26)>=ROWS($7:9),INDEX(L$7:L$26,SMALL(IF(ISNUMBER(L$7:L$26),ROW(INDIRECT(\"1:\"&ROWS(L$7:L$26)))),ROWS($7:9))),\"\")","v":""},{"$f":"IF(COUNT(M$7:M$26)>=ROWS($7:9),INDEX(M$7:M$26,SMALL(IF(ISNUMBER(M$7:M$26),ROW(INDIRECT(\"1:\"&ROWS(M$7:M$26)))),ROWS($7:9))),\"\")","v":""},{"$f":"IF(COUNT(N$7:N$26)>=ROWS($7:9),INDEX(N$7:N$26,SMALL(IF(ISNUMBER(N$7:N$26),ROW(INDIRECT(\"1:\"&ROWS(N$7:N$26)))),ROWS($7:9))),\"\")","v":""},{"$f":"IF(COUNT(O$7:O$26)>=ROWS($7:9),INDEX(O$7:O$26,SMALL(IF(ISNUMBER(O$7:O$26),ROW(INDIRECT(\"1:\"&ROWS(O$7:O$26)))),ROWS($7:9))),\"\")","v":""},{"$f":"IF(COUNT(P$7:P$26)>=ROWS($7:9),INDEX(P$7:P$26,SMALL(IF(ISNUMBER(P$7:P$26),ROW(INDIRECT(\"1:\"&ROWS(P$7:P$26)))),ROWS($7:9))),\"\")","v":""},{"$f":"IF(COUNT(Q$7:Q$26)>=ROWS($7:9),INDEX(Q$7:Q$26,SMALL(IF(ISNUMBER(Q$7:Q$26),ROW(INDIRECT(\"1:\"&ROWS(Q$7:Q$26)))),ROWS($7:9))),\"\")","v":""},{"$f":"IF(COUNT(R$7:R$26)>=ROWS($7:9),INDEX(R$7:R$26,SMALL(IF(ISNUMBER(R$7:R$26),ROW(INDIRECT(\"1:\"&ROWS(R$7:R$26)))),ROWS($7:9))),\"\")","v":""},{"$f":"IF(COUNT(S$7:S$26)>=ROWS($7:9),INDEX(S$7:S$26,SMALL(IF(ISNUMBER(S$7:S$26),ROW(INDIRECT(\"1:\"&ROWS(S$7:S$26)))),ROWS($7:9))),\"\")","v":""},{"$f":"IF(COUNT(T$7:T$26)>=ROWS($7:9),INDEX(T$7:T$26,SMALL(IF(ISNUMBER(T$7:T$26),ROW(INDIRECT(\"1:\"&ROWS(T$7:T$26)))),ROWS($7:9))),\"\")","v":""},{"$f":"IF(COUNT(U$7:U$26)>=ROWS($7:9),INDEX(U$7:U$26,SMALL(IF(ISNUMBER(U$7:U$26),ROW(INDIRECT(\"1:\"&ROWS(U$7:U$26)))),ROWS($7:9))),\"\")","v":""},{"$f":"IF(COUNT(V$7:V$26)>=ROWS($7:9),INDEX(V$7:V$26,SMALL(IF(ISNUMBER(V$7:V$26),ROW(INDIRECT(\"1:\"&ROWS(V$7:V$26)))),ROWS($7:9))),\"\")","v":""},{"$f":"IF(COUNT(W$7:W$26)>=ROWS($7:9),INDEX(W$7:W$26,SMALL(IF(ISNUMBER(W$7:W$26),ROW(INDIRECT(\"1:\"&ROWS(W$7:W$26)))),ROWS($7:9))),\"\")","v":""},{"$f":"IF(COUNT(X$7:X$26)>=ROWS($7:9),INDEX(X$7:X$26,SMALL(IF(ISNUMBER(X$7:X$26),ROW(INDIRECT(\"1:\"&ROWS(X$7:X$26)))),ROWS($7:9))),\"\")","v":""},{"$f":"IF(COUNT(Y$7:Y$26)>=ROWS($7:9),INDEX(Y$7:Y$26,SMALL(IF(ISNUMBER(Y$7:Y$26),ROW(INDIRECT(\"1:\"&ROWS(Y$7:Y$26)))),ROWS($7:9))),\"\")","v":""},{"$f":"IF(COUNT(Z$7:Z$26)>=ROWS($7:9),INDEX(Z$7:Z$26,SMALL(IF(ISNUMBER(Z$7:Z$26),ROW(INDIRECT(\"1:\"&ROWS(Z$7:Z$26)))),ROWS($7:9))),\"\")","v":""}]
["4Ah",4,{"$f":"IF(#REF!=\"\",\"\",VALUE(#REF!))","v":{"$error":"#REF!"}},{"$f":"IF(Accueil!B18=0,\"\",IF(Accueil!B18=\"\",\"\",Accueil!B18))","v":4},{"$f":"IF(C10=\"\",\"\",MID(Accueil!D18,1,1))","v":{"$error":"#REF!"}},{"$error":"#REF!"},{"$error":"#REF!"},{"$error":"#REF!"},{"$error":"#REF!"},{"$error":"#REF!"},{"$error":"#REF!"},{"$error":"#REF!"},{"$error":"#REF!"},{"$error":"#REF!"},{"$error":"#REF!"},{"$error":"#REF!"},{"$error":"#REF!"},{"$error":"#REF!"},{"$error":"#REF!"},{"$error":"#REF!"},{"$error":"#REF!"},{"$error":"#REF!"},{"$error":"#REF!"},{"$error":"#REF!"},{"$error":"#REF!"},{"$error":"#REF!"},null,{"$f":"IF(COUNT(F$7:F$26)>=ROWS($7:10),INDEX(F$7:F$26,SMALL(IF(ISNUMBER(F$7:F$26),ROW(INDIRECT(\"1:\"&ROWS(F$7:F$26)))),ROWS($7:10))),\"\")","v":""},{"$f":"IF(COUNT(G$7:G$26)>=ROWS($7:10),INDEX(G$7:G$26,SMALL(IF(ISNUMBER(G$7:G$26),ROW(INDIRECT(\"1:\"&ROWS(G$7:G$26)))),ROWS($7:10))),\"\")","v":""},{"$f":"IF(COUNT(H$7:H$26)>=ROWS($7:10),INDEX(H$7:H$26,SMALL(IF(ISNUMBER(H$7:H$26),ROW(INDIRECT(\"1:\"&ROWS(H$7:H$26)))),ROWS($7:10))),\"\")","v":""},{"$f":"IF(COUNT(I$7:I$26)>=ROWS($7:10),INDEX(I$7:I$26,SMALL(IF(ISNUMBER(I$7:I$26),ROW(INDIRECT(\"1:\"&ROWS(I$7:I$26)))),ROWS($7:10))),\"\")","v":""},{"$f":"IF(COUNT(J$7:J$26)>=ROWS($7:10),INDEX(J$7:J$26,SMALL(IF(ISNUMBER(J$7:J$26),ROW(INDIRECT(\"1:\"&ROWS(J$7:J$26)))),ROWS($7:10))),\"\")","v":""},{"$f":"IF(COUNT(K$7:K$26)>=ROWS($7:10),INDEX(K$7:K$26,SMALL(IF(ISNUMBER(K$7:K$26),ROW(INDIRECT(\"1:\"&ROWS(K$7:K$26)))),ROWS($7:10))),\"\")","v":""},{"$f":"IF(COUNT(L$7:L$26)>=ROWS($7:10),INDEX(L$7:L$26,SMALL(IF(ISNUMBER(L$7:L$26),ROW(INDIRECT(\"1:\"&ROWS(L$7:L$26)))),ROWS($7:10))),\"\")","v":""},{"$f":"IF(COUNT(M$7:M$26)>=ROWS($7:10),INDEX(M$7:M$26,SMALL(IF(ISNUMBER(M$7:M$26),ROW(INDIRECT(\"1:\"&ROWS(M$7:M$26)))),ROWS($7:10))),\"\")","v":""},{"$f":"IF(COUNT(N$7:N$26)>=ROWS($7:10),INDEX(N$7:N$26,SMALL(IF(ISNUMBER(N$7:N$26),ROW(INDIRECT(\"1:\"&ROWS(N$7:N$26)))),ROWS($7:10))),\"\")","v":""},{"$f":"IF(COUNT(O$7:O$26)>=ROWS($7:10),INDEX(O$7:O$26,SMALL(IF(ISNUMBER(O$7:O$26),ROW(INDIRECT(\"1:\"&ROWS(O$7:O$26)))),ROWS($7:10))),\"\")","v":""},{"$f":"IF(COUNT(P$7:P$26)>=ROWS($7:10),INDEX(P$7:P$26,SMALL(IF(ISNUMBER(P$7:P$26),ROW(INDIRECT(\"1:\"&ROWS(P$7:P$26)))),ROWS($7:10))),\"\")","v":""},{"$f":"IF(COUNT(Q$7:Q$26)>=ROWS($7:10),INDEX(Q$7:Q$26,SMALL(IF(ISNUMBER(Q$7:Q$26),ROW(INDIRECT(\"1:\"&ROWS(Q$7:Q$26)))),ROWS($7:10))),\"\")","v":""},{"$f":"IF(COUNT(R$7:R$26)>=ROWS($7:10),INDEX(R$7:R$26,SMALL(IF(ISNUMBER(R$7:R$26),ROW(INDIRECT(\"1:\"&ROWS(R$7:R$26)))),ROWS($7:10))),\"\")","v":""},{"$f":"IF(COUNT(S$7:S$26)>=ROWS($7:10),INDEX(S$7:S$26,SMALL(IF(ISNUMBER(S$7:S$26),ROW(INDIRECT(\"1:\"&ROWS(S$7:S$26)))),ROWS($7:10))),\"\")","v":""},{"$f":"IF(COUNT(T$7:T$26)>=ROWS($7:10),INDEX(T$7:T$26,SMALL(IF(ISNUMBER(T$7:T$26),ROW(INDIRECT(\"1:\"&ROWS(T$7:T$26)))),ROWS($7:10))),\"\")","v":""},{"$f":"IF(COUNT(U$7:U$26)>=ROWS($7:10),INDEX(U$7:U$26,SMALL(IF(ISNUMBER(U$7:U$26),ROW(INDIRECT(\"1:\"&ROWS(U$7:U$26)))),ROWS($7:10))),\"\")","v":""},{"$f":"IF(COUNT(V$7:V$26)>=ROWS($7:10),INDEX(V$7:V$26,SMALL(IF(ISNUMBER(V$7:V$26),ROW(INDIRECT(\"1:\"&ROWS(V$7:V$26)))),ROWS($7:10))),\"\")","v":""},{"$f":"IF(COUNT(W$7:W$26)>=ROWS($7:10),INDEX(W$7:W$26,SMALL(IF(ISNUMBER(W$7:W$26),ROW(INDIRECT(\"1:\"&ROWS(W$7:W$26)))),ROWS($7:10))),\"\")","v":""},{"$f":"IF(COUNT(X$7:X$26)>=ROWS($7:10),INDEX(X$7:X$26,SMALL(IF(ISNUMBER(X$7:X$26),ROW(INDIRECT(\"1:\"&ROWS(X$7:X$26)))),ROWS($7:10))),\"\")","v":""},{"$f":"IF(COUNT(Y$7:Y$26)>=ROWS($7:10),INDEX(Y$7:Y$26,SMALL(IF(ISNUMBER(Y$7:Y$26),ROW(INDIRECT(\"1:\"&ROWS(Y$7:Y$26)))),ROWS($7:10))),\"\")","v":""},{"$f":"IF(COUNT(Z$7:Z$26)>=ROWS($7:10),INDEX(Z$7:Z$26,SMALL(IF(ISNUMBER(Z$7:Z$26),ROW(INDIRECT(\"1:\"&ROWS(Z$7:Z$26)))),ROWS($7:10))),\"\")","v":""}]
["4Am",5,{"$f":"IF(#REF!=\"\",\"\",VALUE(#REF!))","v":{"$error":"#REF!"}},{"$f":"IF(Accueil!B19=0,\"\",IF(Accueil!B19=\"\",\"\",Accueil!B19))","v":5},{"$f":"IF(C11=\"\",\"\",MID(Accueil!D19,1,1))","v":{"$error":"#REF!"}},{"$error":"#REF!"},{"$error":"#REF!"},{"$error":"#REF!"},{"$error":"#REF!"},{"$error":"#REF!"},{"$error":"#REF!"},{"$error":"#REF!"},{"$error":"#REF!"},{"$error":"#REF!"},{"$error":"#REF!"},{"$error":"#REF!"},{"$error":"#REF!"},{"$error":"#REF!"},{"$error":"#REF!"},{"$error":"#REF!"},{"$error":"#REF!"},{"$error":"#REF!"},{"$error":"#REF!"},{"$error":"#REF!"},{"$error":"#REF!"},{"$error":"#REF!"},null,{"$f":"IF(COUNT(F$7:F$26)>=ROWS($7:11),INDEX(F$7:F$26,SMALL(IF(ISNUMBER(F$7:F$26),ROW(INDIRECT(\"1:\"&ROWS(F$7:F$26)))),ROWS($7:11))),\"\")","v":""},{"$f":"IF(COUNT(G$7:G$26)>=ROWS($7:11),INDEX(G$7:G$26,SMALL(IF(ISNUMBER(G$7:G$26),ROW(INDIRECT(\"1:\"&ROWS(G$7:G$26)))),ROWS($7:11))),\"\")","v":""},{"$f":"IF(COUNT(H$7:H$26)>=ROWS($7:11),INDEX(H$7:H$26,SMALL(IF(ISNUMBER(H$7:H$26),ROW(INDIRECT(\"1:\"&ROWS(H$7:H$26)))),ROWS($7:11))),\"\")","v":""},{"$f":"IF(COUNT(I$7:I$26)>=ROWS($7:11),INDEX(I$7:I$26,SMALL(IF(ISNUMBER(I$7:I$26),ROW(INDIRECT(\"1:\"&ROWS(I$7:I$26)))),ROWS($7:11))),\"\")","v":""},{"$f":"IF(COUNT(J$7:J$26)>=ROWS($7:11),INDEX(J$7:J$26,SMALL(IF(ISNUMBER(J$7:J$26),ROW(INDIRECT(\"1:\"&ROWS(J$7:J$26)))),ROWS($7:11))),\"\")","v":""},{"$f":"IF(COUNT(K$7:K$26)>=ROWS($7:11),INDEX(K$7:K$26,SMALL(IF(ISNUMBER(K$7:K$26),ROW(INDIRECT(\"1:\"&ROWS(K$7:K$26)))),ROWS($7:11))),\"\")","v":""},{"$f":"IF(COUNT(L$7:L$26)>=ROWS($7:11),INDEX(L$7:L$26,SMALL(IF(ISNUMBER(L$7:L$26),ROW(INDIRECT(\"1:\"&ROWS(L$7:L$26)))),ROWS($7:11))),\"\")","v":""},{"$f":"IF(COUNT(M$7:M$26)>=ROWS($7:11),INDEX(M$7:M$26,SMALL(IF(ISNUMBER(M$7:M$26),ROW(INDIRECT(\"1:\"&ROWS(M$7:M$26)))),ROWS($7:11))),\"\")","v":""},{"$f":"IF(COUNT(N$7:N$26)>=ROWS($7:11),INDEX(N$7:N$26,SMALL(IF(ISNUMBER(N$7:N$26),ROW(INDIRECT(\"1:\"&ROWS(N$7:N$26)))),ROWS($7:11))),\"\")","v":""},{"$f":"IF(COUNT(O$7:O$26)>=ROWS($7:11),INDEX(O$7:O$26,SMALL(IF(ISNUMBER(O$7:O$26),ROW(INDIRECT(\"1:\"&ROWS(O$7:O$26)))),ROWS($7:11))),\"\")","v":""},{"$f":"IF(COUNT(P$7:P$26)>=ROWS($7:11),INDEX(P$7:P$26,SMALL(IF(ISNUMBER(P$7:P$26),ROW(INDIRECT(\"1:\"&ROWS(P$7:P$26)))),ROWS($7:11))),\"\")","v":""},{"$f":"IF(COUNT(Q$7:Q$26)>=ROWS($7:11),INDEX(Q$7:Q$26,SMALL(IF(ISNUMBER(Q$7:Q$26),ROW(INDIRECT(\"1:\"&ROWS(Q$7:Q$26)))),ROWS($7:11))),\"\")","v":""},{"$f":"IF(COUNT(R$7:R$26)>=ROWS($7:11),INDEX(R$7:R$26,SMALL(IF(ISNUMBER(R$7:R$26),ROW(INDIRECT(\"1:\"&ROWS(R$7:R$26)))),ROWS($7:11))),\"\")","v":""},{"$f":"IF(COUNT(S$7:S$26)>=ROWS($7:11),INDEX(S$7:S$26,SMALL(IF(ISNUMBER(S$7:S$26),ROW(INDIRECT(\"1:\"&ROWS(S$7:S$26)))),ROWS($7:11))),\"\")","v":""},{"$f":"IF(COUNT(T$7:T$26)>=ROWS($7:11),INDEX(T$7:T$26,SMALL(IF(ISNUMBER(T$7:T$26),ROW(INDIRECT(\"1:\"&ROWS(T$7:T$26)))),ROWS($7:11))),\"\")","v":""},{"$f":"IF(COUNT(U$7:U$26)>=ROWS($7:11),INDEX(U$7:U$26,SMALL(IF(ISNUMBER(U$7:U$26),ROW(INDIRECT(\"1:\"&ROWS(U$7:U$26)))),ROWS($7:11))),\"\")","v":""},{"$f":"IF(COUNT(V$7:V$26)>=ROWS($7:11),INDEX(V$7:V$26,SMALL(IF(ISNUMBER(V$7:V$26),ROW(INDIRECT(\"1:\"&ROWS(V$7:V$26)))),ROWS($7:11))),\"\")","v":""},{"$f":"IF(COUNT(W$7:W$26)>=ROWS($7:11),INDEX(W$7:W$26,SMALL(IF(ISNUMBER(W$7:W$26),ROW(INDIRECT(\"1:\"&ROWS(W$7:W$26)))),ROWS($7:11))),\"\")","v":""},{"$f":"IF(COUNT(X$7:X$26)>=ROWS($7:11),INDEX(X$7:X$26,SMALL(IF(ISNUMBER(X$7:X$26),ROW(INDIRECT(\"1:\"&ROWS(X$7:X$26)))),ROWS($7:11))),\"\")","v":""},{"$f":"IF(COUNT(Y$7:Y$26)>=ROWS($7:11),INDEX(Y$7:Y$26,SMALL(IF(ISNUMBER(Y$7:Y$26),ROW(INDIRECT(\"1:\"&ROWS(Y$7:Y$26)))),ROWS($7:11))),\"\")","v":""},{"$f":"IF(COUNT(Z$7:Z$26)>=ROWS($7:11),INDEX(Z$7:Z$26,SMALL(IF(ISNUMBER(Z$7:Z$26),ROW(INDIRECT(\"1:\"&ROWS(Z$7:Z$26)))),ROWS($7:11))),\"\")","v":""}]
["4Af",6,{"$f":"IF(#REF!=\"\",\"\",VALUE(#REF!))","v":{"$error":"#REF!"}},{"$f":"IF(Accueil!B20=0,\"\",IF(Accueil!B20=\"\",\"\",Accueil!B20))","v":6},{"$f":"IF(C12=\"\",\"\",MID(Accueil!D20,1,1))","v":{"$error":"#REF!"}},{"$error":"#REF!"},{"$error":"#REF!"},{"$error":"#REF!"},{"$error":"#REF!"},{"$error":"#REF!"},{"$error":"#REF!"},{"$error":"#REF!"},{"$error":"#REF!"},{"$error":"#REF!"},{"$error":"#REF!"},{"$error":"#REF!"},{"$error":"#REF!"},{"$error":"#REF!"},{"$error":"#REF!"},{"$error":"#REF!"},{"$error":"#REF!"},{"$error":"#REF!"},{"$error":"#REF!"},{"$error":"#REF!"},{"$error":"#REF!"},{"$error":"#REF!"},null,{"$f":"IF(COUNT(F$7:F$26)>=ROWS($7:12),INDEX(F$7:F$26,SMALL(IF(ISNUMBER(F$7:F$26),ROW(INDIRECT(\"1:\"&ROWS(F$7:F$26)))),ROWS($7:12))),\"\")","v":""},{"$f":"IF(COUNT(G$7:G$26)>=ROWS($7:12),INDEX(G$7:G$26,SMALL(IF(ISNUMBER(G$7:G$26),ROW(INDIRECT(\"1:\"&ROWS(G$7:G$26)))),ROWS($7:12))),\"\")","v":""},{"$f":"IF(COUNT(H$7:H$26)>=ROWS($7:12),INDEX(H$7:H$26,SMALL(IF(ISNUMBER(H$7:H$26),ROW(INDIRECT(\"1:\"&ROWS(H$7:H$26)))),ROWS($7:12))),\"\")","v":""},{"$f":"IF(COUNT(I$7:I$26)>=ROWS($7:12),INDEX(I$7:I$26,SMALL(IF(ISNUMBER(I$7:I$26),ROW(INDIRECT(\"1:\"&ROWS(I$7:I$26)))),ROWS($7:12))),\"\")","v":""},{"$f":"IF(COUNT(J$7:J$26)>=ROWS($7:12),INDEX(J$7:J$26,SMALL(IF(ISNUMBER(J$7:J$26),ROW(INDIRECT(\"1:\"&ROWS(J$7:J$26)))),ROWS($7:12))),\"\")","v":""},{"$f":"IF(COUNT(K$7:K$26)>=ROWS($7:12),INDEX(K$7:K$26,SMALL(IF(ISNUMBER(K$7:K$26),ROW(INDIRECT(\"1:\"&ROWS(K$7:K$26)))),ROWS($7:12))),\"\")","v":""},{"$f":"IF(COUNT(L$7:L$26)>=ROWS($7:12),INDEX(L$7:L$26,SMALL(IF(ISNUMBER(L$7:L$26),ROW(INDIRECT(\"1:\"&ROWS(L$7:L$26)))),ROWS($7:12))),\"\")","v":""},{"$f":"IF(COUNT(M$7:M$26)>=ROWS($7:12),INDEX(M$7:M$26,SMALL(IF(ISNUMBER(M$7:M$26),ROW(INDIRECT(\"1:\"&ROWS(M$7:M$26)))),ROWS($7:12))),\"\")","v":""},{"$f":"IF(COUNT(N$7:N$26)>=ROWS($7:12),INDEX(N$7:N$26,SMALL(IF(ISNUMBER(N$7:N$26),ROW(INDIRECT(\"1:\"&ROWS(N$7:N$26)))),ROWS($7:12))),\"\")","v":""},{"$f":"IF(COUNT(O$7:O$26)>=ROWS($7:12),INDEX(O$7:O$26,SMALL(IF(ISNUMBER(O$7:O$26),ROW(INDIRECT(\"1:\"&ROWS(O$7:O$26)))),ROWS($7:12))),\"\")","v":""},{"$f":"IF(COUNT(P$7:P$26)>=ROWS($7:12),INDEX(P$7:P$26,SMALL(IF(ISNUMBER(P$7:P$26),ROW(INDIRECT(\"1:\"&ROWS(P$7:P$26)))),ROWS($7:12))),\"\")","v":""},{"$f":"IF(COUNT(Q$7:Q$26)>=ROWS($7:12),INDEX(Q$7:Q$26,SMALL(IF(ISNUMBER(Q$7:Q$26),ROW(INDIRECT(\"1:\"&ROWS(Q$7:Q$26)))),ROWS($7:12))),\"\")","v":""},{"$f":"IF(COUNT(R$7:R$26)>=ROWS($7:12),INDEX(R$7:R$26,SMALL(IF(ISNUMBER(R$7:R$26),ROW(INDIRECT(\"1:\"&ROWS(R$7:R$26)))),ROWS($7:12))),\"\")","v":""},{"$f":"IF(COUNT(S$7:S$26)>=ROWS($7:12),INDEX(S$7:S$26,SMALL(IF(ISNUMBER(S$7:S$26),ROW(INDIRECT(\"1:\"&ROWS(S$7:S$26)))),ROWS($7:12))),\"\")","v":""},{"$f":"IF(COUNT(T$7:T$26)>=ROWS($7:12),INDEX(T$7:T$26,SMALL(IF(ISNUMBER(T$7:T$26),ROW(INDIRECT(\"1:\"&ROWS(T$7:T$26)))),ROWS($7:12))),\"\")","v":""},{"$f":"IF(COUNT(U$7:U$26)>=ROWS($7:12),INDEX(U$7:U$26,SMALL(IF(ISNUMBER(U$7:U$26),ROW(INDIRECT(\"1:\"&ROWS(U$7:U$26)))),ROWS($7:12))),\"\")","v":""},{"$f":"IF(COUNT(V$7:V$26)>=ROWS($7:12),INDEX(V$7:V$26,SMALL(IF(ISNUMBER(V$7:V$26),ROW(INDIRECT(\"1:\"&ROWS(V$7:V$26)))),ROWS($7:12))),\"\")","v":""},{"$f":"IF(COUNT(W$7:W$26)>=ROWS($7:12),INDEX(W$7:W$26,SMALL(IF(ISNUMBER(W$7:W$26),ROW(INDIRECT(\"1:\"&ROWS(W$7:W$26)))),ROWS($7:12))),\"\")","v":""},{"$f":"IF(COUNT(X$7:X$26)>=ROWS($7:12),INDEX(X$7:X$26,SMALL(IF(ISNUMBER(X$7:X$26),ROW(INDIRECT(\"1:\"&ROWS(X$7:X$26)))),ROWS($7:12))),\"\")","v":""},{"$f":"IF(COUNT(Y$7:Y$26)>=ROWS($7:12),INDEX(Y$7:Y$26,SMALL(IF(ISNUMBER(Y$7:Y$26),ROW(INDIRECT(\"1:\"&ROWS(Y$7:Y$26)))),ROWS($7:12))),\"\")","v":""},{"$f":"IF(COUNT(Z$7:Z$26)>=ROWS($7:12),INDEX(Z$7:Z$26,SMALL(IF(ISNUMBER(Z$7:Z$26),ROW(INDIRECT(\"1:\"&ROWS(Z$7:Z$26)))),ROWS($7:12))),\"\")","v":""}]
[null,7,{"$f":"IF(#REF!=\"\",\"\",VALUE(#REF!))","v":{"$error":"#REF!"}},{"$f":"IF(Accueil!B21=0,\"\",IF(Accueil!B21=\"\",\"\",Accueil!B21))","v":7},{"$f":"IF(C13=\"\",\"\",MID(Accueil!D21,1,1))","v":{"$error":"#REF!"}},{"$error":"#REF!"},{"$error":"#REF!"},{"$error":"#REF!"},{"$error":"#REF!"},{"$error":"#REF!"},{"$error":"#REF!"},{"$error":"#REF!"},{"$error":"#REF!"},{"$error":"#REF!"},{"$error":"#REF!"},{"$error":"#REF!"},{"$error":"#REF!"},{"$error":"#REF!"},{"$error":"#REF!"},{"$error":"#REF!"},{"$error":"#REF!"},{"$error":"#REF!"},{"$error":"#REF!"},{"$error":"#REF!"},{"$error":"#REF!"},{"$error":"#REF!"},null,{"$f":"IF(COUNT(F$7:F$26)>=ROWS($7:13),INDEX(F$7:F$26,SMALL(IF(ISNUMBER(F$7:F$26),ROW(INDIRECT(\"1:\"&ROWS(F$7:F$26)))),ROWS($7:13))),\"\")","v":""},{"$f":"IF(COUNT(G$7:G$26)>=ROWS($7:13),INDEX(G$7:G$26,SMALL(IF(ISNUMBER(G$7:G$26),ROW(INDIRECT(\"1:\"&ROWS(G$7:G$26)))),ROWS($7:13))),\"\")","v":""},{"$f":"IF(COUNT(H$7:H$26)>=ROWS($7:13),INDEX(H$7:H$26,SMALL(IF(ISNUMBER(H$7:H$26),ROW(INDIRECT(\"1:\"&ROWS(H$7:H$26)))),ROWS($7:13))),\"\")","v":""},{"$f":"IF(COUNT(I$7:I$26)>=ROWS($7:13),INDEX(I$7:I$26,SMALL(IF(ISNUMBER(I$7:I$26),ROW(INDIRECT(\"1:\"&ROWS(I$7:I$26)))),ROWS($7:13))),\"\")","v":""},{"$f":"IF(COUNT(J$7:J$26)>=ROWS($7:13),INDEX(J$7:J$26,SMALL(IF(ISNUMBER(J$7:J$26),ROW(INDIRECT(\"1:\"&ROWS(J$7:J$26)))),ROWS($7:13))),\"\")","v":""},{"$f":"IF(COUNT(K$7:K$26)>=ROWS($7:13),INDEX(K$7:K$26,SMALL(IF(ISNUMBER(K$7:K$26),ROW(INDIRECT(\"1:\"&ROWS(K$7:K$26)))),ROWS($7:13))),\"\")","v":""},{"$f":"IF(COUNT(L$7:L$26)>=ROWS($7:13),INDEX(L$7:L$26,SMALL(IF(ISNUMBER(L$7:L$26),ROW(INDIRECT(\"1:\"&ROWS(L$7:L$26)))),ROWS($7:13))),\"\")","v":""},{"$f":"IF(COUNT(M$7:M$26)>=ROWS($7:13),INDEX(M$7:M$26,SMALL(IF(ISNUMBER(M$7:M$26),ROW(INDIRECT(\"1:\"&ROWS(M$7:M$26)))),ROWS($7:13))),\"\")","v":""},{"$f":"IF(COUNT(N$7:N$26)>=ROWS($7:13),INDEX(N$7:N$26,SMALL(IF(ISNUMBER(N$7:N$26),ROW(INDIRECT(\"1:\"&ROWS(N$7:N$26)))),ROWS($7:13))),\"\")","v":""},{"$f":"IF(COUNT(O$7:O$26)>=ROWS($7:13),INDEX(O$7:O$26,SMALL(IF(ISNUMBER(O$7:O$26),ROW(INDIRECT(\"1:\"&ROWS(O$7:O$26)))),ROWS($7:13))),\"\")","v":""},{"$f":"IF(COUNT(P$7:P$26)>=ROWS($7:13),INDEX(P$7:P$26,SMALL(IF(ISNUMBER(P$7:P$26),ROW(INDIRECT(\"1:\"&ROWS(P$7:P$26)))),ROWS($7:13))),\"\")","v":""},{"$f":"IF(COUNT(Q$7:Q$26)>=ROWS($7:13),INDEX(Q$7:Q$26,SMALL(IF(ISNUMBER(Q$7:Q$26),ROW(INDIRECT(\"1:\"&ROWS(Q$7:Q$26)))),ROWS($7:13))),\"\")","v":""},{"$f":"IF(COUNT(R$7:R$26)>=ROWS($7:13),INDEX(R$7:R$26,SMALL(IF(ISNUMBER(R$7:R$26),ROW(INDIRECT(\"1:\"&ROWS(R$7:R$26)))),ROWS($7:13))),\"\")","v":""},{"$f":"IF(COUNT(S$7:S$26)>=ROWS($7:13),INDEX(S$7:S$26,SMALL(IF(ISNUMBER(S$7:S$26),ROW(INDIRECT(\"1:\"&ROWS(S$7:S$26)))),ROWS($7:13))),\"\")","v":""},{"$f":"IF(COUNT(T$7:T$26)>=ROWS($7:13),INDEX(T$7:T$26,SMALL(IF(ISNUMBER(T$7:T$26),ROW(INDIRECT(\"1:\"&ROWS(T$7:T$26)))),ROWS($7:13))),\"\")","v":""},{"$f":"IF(COUNT(U$7:U$26)>=ROWS($7:13),INDEX(U$7:U$26,SMALL(IF(ISNUMBER(U$7:U$26),ROW(INDIRECT(\"1:\"&ROWS(U$7:U$26)))),ROWS($7:13))),\"\")","v":""},{"$f":"IF(COUNT(V$7:V$26)>=ROWS($7:13),INDEX(V$7:V$26,SMALL(IF(ISNUMBER(V$7:V$26),ROW(INDIRECT(\"1:\"&ROWS(V$7:V$26)))),ROWS($7:13))),\"\")","v":""},{"$f":"IF(COUNT(W$7:W$26)>=ROWS($7:13),INDEX(W$7:W$26,SMALL(IF(ISNUMBER(W$7:W$26),ROW(INDIRECT(\"1:\"&ROWS(W$7:W$26)))),ROWS($7:13))),\"\")","v":""},{"$f":"IF(COUNT(X$7:X$26)>=ROWS($7:13),INDEX(X$7:X$26,SMALL(IF(ISNUMBER(X$7:X$26),ROW(INDIRECT(\"1:\"&ROWS(X$7:X$26)))),ROWS($7:13))),\"\")","v":""},{"$f":"IF(COUNT(Y$7:Y$26)>=ROWS($7:13),INDEX(Y$7:Y$26,SMALL(IF(ISNUMBER(Y$7:Y$26),ROW(INDIRECT(\"1:\"&ROWS(Y$7:Y$26)))),ROWS($7:13))),\"\")","v":""},{"$f":"IF(COUNT(Z$7:Z$26)>=ROWS($7:13),INDEX(Z$7:Z$26,SMALL(IF(ISNUMBER(Z$7:Z$26),ROW(INDIRECT(\"1:\"&ROWS(Z$7:Z$26)))),ROWS($7:13))),\"\")","v":""}]
["3Ah",8,{"$f":"IF(#REF!=\"\",\"\",VALUE(#REF!))","v":{"$error":"#REF!"}},{"$f":"IF(Accueil!B22=0,\"\",IF(Accueil!B22=\"\",\"\",Accueil!B22))","v":8},{"$f":"IF(C14=\"\",\"\",MID(Accueil!D22,1,1))","v":{"$error":"#REF!"}},{"$error":"#REF!"},{"$error":"#REF!"},{"$error":"#REF!"},{"$error":"#REF!"},{"$error":"#REF!"},{"$error":"#REF!"},{"$error":"#REF!"},{"$error":"#REF!"},{"$error":"#REF!"},{"$error":"#REF!"},{"$error":"#REF!"},{"$error":"#REF!"},{"$error":"#REF!"},{"$error":"#REF!"},{"$error":"#REF!"},{"$error":"#REF!"},{"$error":"#REF!"},{"$error":"#REF!"},{"$error":"#REF!"},{"$error":"#REF!"},{"$error":"#REF!"},null,{"$f":"IF(COUNT(F$7:F$26)>=ROWS($7:14),INDEX(F$7:F$26,SMALL(IF(ISNUMBER(F$7:F$26),ROW(INDIRECT(\"1:\"&ROWS(F$7:F$26)))),ROWS($7:14))),\"\")","v":""},{"$f":"IF(COUNT(G$7:G$26)>=ROWS($7:14),INDEX(G$7:G$26,SMALL(IF(ISNUMBER(G$7:G$26),ROW(INDIRECT(\"1:\"&ROWS(G$7:G$26)))),ROWS($7:14))),\"\")","v":""},{"$f":"IF(COUNT(H$7:H$26)>=ROWS($7:14),INDEX(H$7:H$26,SMALL(IF(ISNUMBER(H$7:H$26),ROW(INDIRECT(\"1:\"&ROWS(H$7:H$26)))),ROWS($7:14))),\"\")","v":""},{"$f":"IF(COUNT(I$7:I$26)>=ROWS($7:14),INDEX(I$7:I$26,SMALL(IF(ISNUMBER(I$7:I$26),ROW(INDIRECT(\"1:\"&ROWS(I$7:I$26)))),ROWS($7:14))),\"\")","v":""},{"$f":"IF(COUNT(J$7:J$26)>=ROWS($7:14),INDEX(J$7:J$26,SMALL(IF(ISNUMBER(J$7:J$26),ROW(INDIRECT(\"1:\"&ROWS(J$7:J$26)))),ROWS($7:14))),\"\")","v":""},{"$f":"IF(COUNT(K$7:K$26)>=ROWS($7:14),INDEX(K$7:K$26,SMALL(IF(ISNUMBER(K$7:K$26),ROW(INDIRECT(\"1:\"&ROWS(K$7:K$26)))),ROWS($7:14))),\"\")","v":""},{"$f":"IF(COUNT(L$7:L$26)>=ROWS($7:14),INDEX(L$7:L$26,SMALL(IF(ISNUMBER(L$7:L$26),ROW(INDIRECT(\"1:\"&ROWS(L$7:L$26)))),ROWS($7:14))),\"\")","v":""},{"$f":"IF(COUNT(M$7:M$26)>=ROWS($7:14),INDEX(M$7:M$26,SMALL(IF(ISNUMBER(M$7:M$26),ROW(INDIRECT(\"1:\"&ROWS(M$7:M$26)))),ROWS($7:14))),\"\")","v":""},{"$f":"IF(COUNT(N$7:N$26)>=ROWS($7:14),INDEX(N$7:N$26,SMALL(IF(ISNUMBER(N$7:N$26),ROW(INDIRECT(\"1:\"&ROWS(N$7:N$26)))),ROWS($7:14))),\"\")","v":""},{"$f":"IF(COUNT(O$7:O$26)>=ROWS($7:14),INDEX(O$7:O$26,SMALL(IF(ISNUMBER(O$7:O$26),ROW(INDIRECT(\"1:\"&ROWS(O$7:O$26)))),ROWS($7:14))),\"\")","v":""},{"$f":"IF(COUNT(P$7:P$26)>=ROWS($7:14),INDEX(P$7:P$26,SMALL(IF(ISNUMBER(P$7:P$26),ROW(INDIRECT(\"1:\"&ROWS(P$7:P$26)))),ROWS($7:14))),\"\")","v":""},{"$f":"IF(COUNT(Q$7:Q$26)>=ROWS($7:14),INDEX(Q$7:Q$26,SMALL(IF(ISNUMBER(Q$7:Q$26),ROW(INDIRECT(\"1:\"&ROWS(Q$7:Q$26)))),ROWS($7:14))),\"\")","v":""},{"$f":"IF(COUNT(R$7:R$26)>=ROWS($7:14),INDEX(R$7:R$26,SMALL(IF(ISNUMBER(R$7:R$26),ROW(INDIRECT(\"1:\"&ROWS(R$7:R$26)))),ROWS($7:14))),\"\")","v":""},{"$f":"IF(COUNT(S$7:S$26)>=ROWS($7:14),INDEX(S$7:S$26,SMALL(IF(ISNUMBER(S$7:S$26),ROW(INDIRECT(\"1:\"&ROWS(S$7:S$26)))),ROWS($7:14))),\"\")","v":""},{"$f":"IF(COUNT(T$7:T$26)>=ROWS($7:14),INDEX(T$7:T$26,SMALL(IF(ISNUMBER(T$7:T$26),ROW(INDIRECT(\"1:\"&ROWS(T$7:T$26)))),ROWS($7:14))),\"\")","v":""},{"$f":"IF(COUNT(U$7:U$26)>=ROWS($7:14),INDEX(U$7:U$26,SMALL(IF(ISNUMBER(U$7:U$26),ROW(INDIRECT(\"1:\"&ROWS(U$7:U$26)))),ROWS($7:14))),\"\")","v":""},{"$f":"IF(COUNT(V$7:V$26)>=ROWS($7:14),INDEX(V$7:V$26,SMALL(IF(ISNUMBER(V$7:V$26),ROW(INDIRECT(\"1:\"&ROWS(V$7:V$26)))),ROWS($7:14))),\"\")","v":""},{"$f":"IF(COUNT(W$7:W$26)>=ROWS($7:14),INDEX(W$7:W$26,SMALL(IF(ISNUMBER(W$7:W$26),ROW(INDIRECT(\"1:\"&ROWS(W$7:W$26)))),ROWS($7:14))),\"\")","v":""},{"$f":"IF(COUNT(X$7:X$26)>=ROWS($7:14),INDEX(X$7:X$26,SMALL(IF(ISNUMBER(X$7:X$26),ROW(INDIRECT(\"1:\"&ROWS(X$7:X$26)))),ROWS($7:14))),\"\")","v":""},{"$f":"IF(COUNT(Y$7:Y$26)>=ROWS($7:14),INDEX(Y$7:Y$26,SMALL(IF(ISNUMBER(Y$7:Y$26),ROW(INDIRECT(\"1:\"&ROWS(Y$7:Y$26)))),ROWS($7:14))),\"\")","v":""},{"$f":"IF(COUNT(Z$7:Z$26)>=ROWS($7:14),INDEX(Z$7:Z$26,SMALL(IF(ISNUMBER(Z$7:Z$26),ROW(INDIRECT(\"1:\"&ROWS(Z$7:Z$26)))),ROWS($7:14))),\"\")","v":""}]
["3Am",9,{"$f":"IF(#REF!=\"\",\"\",VALUE(#REF!))","v":{"$error":"#REF!"}},{"$f":"IF(Accueil!B23=0,\"\",IF(Accueil!B23=\"\",\"\",Accueil!B23))","v":9},{"$f":"IF(C15=\"\",\"\",MID(Accueil!D23,1,1))","v":{"$error":"#REF!"}},{"$error":"#REF!"},{"$error":"#REF!"},{"$error":"#REF!"},{"$error":"#REF!"},{"$error":"#REF!"},{"$error":"#REF!"},{"$error":"#REF!"},{"$error":"#REF!"},{"$error":"#REF!"},{"$error":"#REF!"},{"$error":"#REF!"},{"$error":"#REF!"},{"$error":"#REF!"},{"$error":"#REF!"},{"$error":"#REF!"},{"$error":"#REF!"},{"$error":"#REF!"},{"$error":"#REF!"},{"$error":"#REF!"},{"$error":"#REF!"},{"$error":"#REF!"},null,{"$f":"IF(COUNT(F$7:F$26)>=ROWS($7:15),INDEX(F$7:F$26,SMALL(IF(ISNUMBER(F$7:F$26),ROW(INDIRECT(\"1:\"&ROWS(F$7:F$26)))),ROWS($7:15))),\"\")","v":""},{"$f":"IF(COUNT(G$7:G$26)>=ROWS($7:15),INDEX(G$7:G$26,SMALL(IF(ISNUMBER(G$7:G$26),ROW(INDIRECT(\"1:\"&ROWS(G$7:G$26)))),ROWS($7:15))),\"\")","v":""},{"$f":"IF(COUNT(H$7:H$26)>=ROWS($7:15),INDEX(H$7:H$26,SMALL(IF(ISNUMBER(H$7:H$26),ROW(INDIRECT(\"1:\"&ROWS(H$7:H$26)))),ROWS($7:15))),\"\")","v":""},{"$f":"IF(COUNT(I$7:I$26)>=ROWS($7:15),INDEX(I$7:I$26,SMALL(IF(ISNUMBER(I$7:I$26),ROW(INDIRECT(\"1:\"&ROWS(I$7:I$26)))),ROWS($7:15))),\"\")","v":""},{"$f":"IF(COUNT(J$7:J$26)>=ROWS($7:15),INDEX(J$7:J$26,SMALL(IF(ISNUMBER(J$7:J$26),ROW(INDIRECT(\"1:\"&ROWS(J$7:J$26)))),ROWS($7:15))),\"\")","v":""},{"$f":"IF(COUNT(K$7:K$26)>=ROWS($7:15),INDEX(K$7:K$26,SMALL(IF(ISNUMBER(K$7:K$26),ROW(INDIRECT(\"1:\"&ROWS(K$7:K$26)))),ROWS($7:15))),\"\")","v":""},{"$f":"IF(COUNT(L$7:L$26)>=ROWS($7:15),INDEX(L$7:L$26,SMALL(IF(ISNUMBER(L$7:L$26),ROW(INDIRECT(\"1:\"&ROWS(L$7:L$26)))),ROWS($7:15))),\"\")","v":""},{"$f":"IF(COUNT(M$7:M$26)>=ROWS($7:15),INDEX(M$7:M$26,SMALL(IF(ISNUMBER(M$7:M$26),ROW(INDIRECT(\"1:\"&ROWS(M$7:M$26)))),ROWS($7:15))),\"\")","v":""},{"$f":"IF(COUNT(N$7:N$26)>=ROWS($7:15),INDEX(N$7:N$26,SMALL(IF(ISNUMBER(N$7:N$26),ROW(INDIRECT(\"1:\"&ROWS(N$7:N$26)))),ROWS($7:15))),\"\")","v":""},{"$f":"IF(COUNT(O$7:O$26)>=ROWS($7:15),INDEX(O$7:O$26,SMALL(IF(ISNUMBER(O$7:O$26),ROW(INDIRECT(\"1:\"&ROWS(O$7:O$26)))),ROWS($7:15))),\"\")","v":""},{"$f":"IF(COUNT(P$7:P$26)>=ROWS($7:15),INDEX(P$7:P$26,SMALL(IF(ISNUMBER(P$7:P$26),ROW(INDIRECT(\"1:\"&ROWS(P$7:P$26)))),ROWS($7:15))),\"\")","v":""},{"$f":"IF(COUNT(Q$7:Q$26)>=ROWS($7:15),INDEX(Q$7:Q$26,SMALL(IF(ISNUMBER(Q$7:Q$26),ROW(INDIRECT(\"1:\"&ROWS(Q$7:Q$26)))),ROWS($7:15))),\"\")","v":""},{"$f":"IF(COUNT(R$7:R$26)>=ROWS($7:15),INDEX(R$7:R$26,SMALL(IF(ISNUMBER(R$7:R$26),ROW(INDIRECT(\"1:\"&ROWS(R$7:R$26)))),ROWS($7:15))),\"\")","v":""},{"$f":"IF(COUNT(S$7:S$26)>=ROWS($7:15),INDEX(S$7:S$26,SMALL(IF(ISNUMBER(S$7:S$26),ROW(INDIRECT(\"1:\"&ROWS(S$7:S$26)))),ROWS($7:15))),\"\")","v":""},{"$f":"IF(COUNT(T$7:T$26)>=ROWS($7:15),INDEX(T$7:T$26,SMALL(IF(ISNUMBER(T$7:T$26),ROW(INDIRECT(\"1:\"&ROWS(T$7:T$26)))),ROWS($7:15))),\"\")","v":""},{"$f":"IF(COUNT(U$7:U$26)>=ROWS($7:15),INDEX(U$7:U$26,SMALL(IF(ISNUMBER(U$7:U$26),ROW(INDIRECT(\"1:\"&ROWS(U$7:U$26)))),ROWS($7:15))),\"\")","v":""},{"$f":"IF(COUNT(V$7:V$26)>=ROWS($7:15),INDEX(V$7:V$26,SMALL(IF(ISNUMBER(V$7:V$26),ROW(INDIRECT(\"1:\"&ROWS(V$7:V$26)))),ROWS($7:15))),\"\")","v":""},{"$f":"IF(COUNT(W$7:W$26)>=ROWS($7:15),INDEX(W$7:W$26,SMALL(IF(ISNUMBER(W$7:W$26),ROW(INDIRECT(\"1:\"&ROWS(W$7:W$26)))),ROWS($7:15))),\"\")","v":""},{"$f":"IF(COUNT(X$7:X$26)>=ROWS($7:15),INDEX(X$7:X$26,SMALL(IF(ISNUMBER(X$7:X$26),ROW(INDIRECT(\"1:\"&ROWS(X$7:X$26)))),ROWS($7:15))),\"\")","v":""},{"$f":"IF(COUNT(Y$7:Y$26)>=ROWS($7:15),INDEX(Y$7:Y$26,SMALL(IF(ISNUMBER(Y$7:Y$26),ROW(INDIRECT(\"1:\"&ROWS(Y$7:Y$26)))),ROWS($7:15))),\"\")","v":""},{"$f":"IF(COUNT(Z$7:Z$26)>=ROWS($7:15),INDEX(Z$7:Z$26,SMALL(IF(ISNUMBER(Z$7:Z$26),ROW(INDIRECT(\"1:\"&ROWS(Z$7:Z$26)))),ROWS($7:15))),\"\")","v":""}]
["3Af",10,{"$f":"IF(#REF!=\"\",\"\",VALUE(#REF!))","v":{"$error":"#REF!"}},{"$f":"IF(Accueil!B24=0,\"\",IF(Accueil!B24=\"\",\"\",Accueil!B24))","v":10},{"$f":"IF(C16=\"\",\"\",MID(Accueil!D24,1,1))","v":{"$error":"#REF!"}},{"$error":"#REF!"},{"$error":"#REF!"},{"$error":"#REF!"},{"$error":"#REF!"},{"$error":"#REF!"},{"$error":"#REF!"},{"$error":"#REF!"},{"$error":"#REF!"},{"$error":"#REF!"},{"$error":"#REF!"},{"$error":"#REF!"},{"$error":"#REF!"},{"$error":"#REF!"},{"$error":"#REF!"},{"$error":"#REF!"},{"$error":"#REF!"},{"$error":"#REF!"},{"$error":"#REF!"},{"$error":"#REF!"},{"$error":"#REF!"},{"$error":"#REF!"},null,{"$f":"IF(COUNT(F$7:F$26)>=ROWS($7:16),INDEX(F$7:F$26,SMALL(IF(ISNUMBER(F$7:F$26),ROW(INDIRECT(\"1:\"&ROWS(F$7:F$26)))),ROWS($7:16))),\"\")","v":""},{"$f":"IF(COUNT(G$7:G$26)>=ROWS($7:16),INDEX(G$7:G$26,SMALL(IF(ISNUMBER(G$7:G$26),ROW(INDIRECT(\"1:\"&ROWS(G$7:G$26)))),ROWS($7:16))),\"\")","v":""},{"$f":"IF(COUNT(H$7:H$26)>=ROWS($7:16),INDEX(H$7:H$26,SMALL(IF(ISNUMBER(H$7:H$26),ROW(INDIRECT(\"1:\"&ROWS(H$7:H$26)))),ROWS($7:16))),\"\")","v":""},{"$f":"IF(COUNT(I$7:I$26)>=ROWS($7:16),INDEX(I$7:I$26,SMALL(IF(ISNUMBER(I$7:I$26),ROW(INDIRECT(\"1:\"&ROWS(I$7:I$26)))),ROWS($7:16))),\"\")","v":""},{"$f":"IF(COUNT(J$7:J$26)>=ROWS($7:16),INDEX(J$7:J$26,SMALL(IF(ISNUMBER(J$7:J$26),ROW(INDIRECT(\"1:\"&ROWS(J$7:J$26)))),ROWS($7:16))),\"\")","v":""},{"$f":"IF(COUNT(K$7:K$26)>=ROWS($7:16),INDEX(K$7:K$26,SMALL(IF(ISNUMBER(K$7:K$26),ROW(INDIRECT(\"1:\"&ROWS(K$7:K$26)))),ROWS($7:16))),\"\")","v":""},{"$f":"IF(COUNT(L$7:L$26)>=ROWS($7:16),INDEX(L$7:L$26,SMALL(IF(ISNUMBER(L$7:L$26),ROW(INDIRECT(\"1:\"&ROWS(L$7:L$26)))),ROWS($7:16))),\"\")","v":""},{"$f":"IF(COUNT(M$7:M$26)>=ROWS($7:16),INDEX(M$7:M$26,SMALL(IF(ISNUMBER(M$7:M$26),ROW(INDIRECT(\"1:\"&ROWS(M$7:M$26)))),ROWS($7:16))),\"\")","v":""},{"$f":"IF(COUNT(N$7:N$26)>=ROWS($7:16),INDEX(N$7:N$26,SMALL(IF(ISNUMBER(N$7:N$26),ROW(INDIRECT(\"1:\"&ROWS(N$7:N$26)))),ROWS($7:16))),\"\")","v":""},{"$f":"IF(COUNT(O$7:O$26)>=ROWS($7:16),INDEX(O$7:O$26,SMALL(IF(ISNUMBER(O$7:O$26),ROW(INDIRECT(\"1:\"&ROWS(O$7:O$26)))),ROWS($7:16))),\"\")","v":""},{"$f":"IF(COUNT(P$7:P$26)>=ROWS($7:16),INDEX(P$7:P$26,SMALL(IF(ISNUMBER(P$7:P$26),ROW(INDIRECT(\"1:\"&ROWS(P$7:P$26)))),ROWS($7:16))),\"\")","v":""},{"$f":"IF(COUNT(Q$7:Q$26)>=ROWS($7:16),INDEX(Q$7:Q$26,SMALL(IF(ISNUMBER(Q$7:Q$26),ROW(INDIRECT(\"1:\"&ROWS(Q$7:Q$26)))),ROWS($7:16))),\"\")","v":""},{"$f":"IF(COUNT(R$7:R$26)>=ROWS($7:16),INDEX(R$7:R$26,SMALL(IF(ISNUMBER(R$7:R$26),ROW(INDIRECT(\"1:\"&ROWS(R$7:R$26)))),ROWS($7:16))),\"\")","v":""},{"$f":"IF(COUNT(S$7:S$26)>=ROWS($7:16),INDEX(S$7:S$26,SMALL(IF(ISNUMBER(S$7:S$26),ROW(INDIRECT(\"1:\"&ROWS(S$7:S$26)))),ROWS($7:16))),\"\")","v":""},{"$f":"IF(COUNT(T$7:T$26)>=ROWS($7:16),INDEX(T$7:T$26,SMALL(IF(ISNUMBER(T$7:T$26),ROW(INDIRECT(\"1:\"&ROWS(T$7:T$26)))),ROWS($7:16))),\"\")","v":""},{"$f":"IF(COUNT(U$7:U$26)>=ROWS($7:16),INDEX(U$7:U$26,SMALL(IF(ISNUMBER(U$7:U$26),ROW(INDIRECT(\"1:\"&ROWS(U$7:U$26)))),ROWS($7:16))),\"\")","v":""},{"$f":"IF(COUNT(V$7:V$26)>=ROWS($7:16),INDEX(V$7:V$26,SMALL(IF(ISNUMBER(V$7:V$26),ROW(INDIRECT(\"1:\"&ROWS(V$7:V$26)))),ROWS($7:16))),\"\")","v":""},{"$f":"IF(COUNT(W$7:W$26)>=ROWS($7:16),INDEX(W$7:W$26,SMALL(IF(ISNUMBER(W$7:W$26),ROW(INDIRECT(\"1:\"&ROWS(W$7:W$26)))),ROWS($7:16))),\"\")","v":""},{"$f":"IF(COUNT(X$7:X$26)>=ROWS($7:16),INDEX(X$7:X$26,SMALL(IF(ISNUMBER(X$7:X$26),ROW(INDIRECT(\"1:\"&ROWS(X$7:X$26)))),ROWS($7:16))),\"\")","v":""},{"$f":"IF(COUNT(Y$7:Y$26)>=ROWS($7:16),INDEX(Y$7:Y$26,SMALL(IF(ISNUMBER(Y$7:Y$26),ROW(INDIRECT(\"1:\"&ROWS(Y$7:Y$26)))),ROWS($7:16))),\"\")","v":""},{"$f":"IF(COUNT(Z$7:Z$26)>=ROWS($7:16),INDEX(Z$7:Z$26,SMALL(IF(ISNUMBER(Z$7:Z$26),ROW(INDIRECT(\"1:\"&ROWS(Z$7:Z$26)))),ROWS($7:16))),\"\")","v":""}]
[null,11,{"$f":"IF(#REF!=\"\",\"\",VALUE(#REF!))","v":{"$error":"#REF!"}},{"$f":"IF(Accueil!B25=0,\"\",IF(Accueil!B25=\"\",\"\",Accueil!B25))","v":11},{"$f":"IF(C17=\"\",\"\",MID(Accueil!D25,1,1))","v":{"$error":"#REF!"}},{"$error":"#REF!"},{"$error":"#REF!"},{"$error":"#REF!"},{"$error":"#REF!"},{"$error":"#REF!"},{"$error":"#REF!"},{"$error":"#REF!"},{"$error":"#REF!"},{"$error":"#REF!"},{"$error":"#REF!"},{"$error":"#REF!"},{"$error":"#REF!"},{"$error":"#REF!"},{"$error":"#REF!"},{"$error":"#REF!"},{"$error":"#REF!"},{"$error":"#REF!"},{"$error":"#REF!"},{"$error":"#REF!"},{"$error":"#REF!"},{"$error":"#REF!"},null,{"$f":"IF(COUNT(F$7:F$26)>=ROWS($7:17),INDEX(F$7:F$26,SMALL(IF(ISNUMBER(F$7:F$26),ROW(INDIRECT(\"1:\"&ROWS(F$7:F$26)))),ROWS($7:17))),\"\")","v":""},{"$f":"IF(COUNT(G$7:G$26)>=ROWS($7:17),INDEX(G$7:G$26,SMALL(IF(ISNUMBER(G$7:G$26),ROW(INDIRECT(\"1:\"&ROWS(G$7:G$26)))),ROWS($7:17))),\"\")","v":""},{"$f":"IF(COUNT(H$7:H$26)>=ROWS($7:17),INDEX(H$7:H$26,SMALL(IF(ISNUMBER(H$7:H$26),ROW(INDIRECT(\"1:\"&ROWS(H$7:H$26)))),ROWS($7:17))),\"\")","v":""},{"$f":"IF(COUNT(I$7:I$26)>=ROWS($7:17),INDEX(I$7:I$26,SMALL(IF(ISNUMBER(I$7:I$26),ROW(INDIRECT(\"1:\"&ROWS(I$7:I$26)))),ROWS($7:17))),\"\")","v":""},{"$f":"IF(COUNT(J$7:J$26)>=ROWS($7:17),INDEX(J$7:J$26,SMALL(IF(ISNUMBER(J$7:J$26),ROW(INDIRECT(\"1:\"&ROWS(J$7:J$26)))),ROWS($7:17))),\"\")","v":""},{"$f":"IF(COUNT(K$7:K$26)>=ROWS($7:17),INDEX(K$7:K$26,SMALL(IF(ISNUMBER(K$7:K$26),ROW(INDIRECT(\"1:\"&ROWS(K$7:K$26)))),ROWS($7:17))),\"\")","v":""},{"$f":"IF(COUNT(L$7:L$26)>=ROWS($7:17),INDEX(L$7:L$26,SMALL(IF(ISNUMBER(L$7:L$26),ROW(INDIRECT(\"1:\"&ROWS(L$7:L$26)))),ROWS($7:17))),\"\")","v":""},{"$f":"IF(COUNT(M$7:M$26)>=ROWS($7:17),INDEX(M$7:M$26,SMALL(IF(ISNUMBER(M$7:M$26),ROW(INDIRECT(\"1:\"&ROWS(M$7:M$26)))),ROWS($7:17))),\"\")","v":""},{"$f":"IF(COUNT(N$7:N$26)>=ROWS($7:17),INDEX(N$7:N$26,SMALL(IF(ISNUMBER(N$7:N$26),ROW(INDIRECT(\"1:\"&ROWS(N$7:N$26)))),ROWS($7:17))),\"\")","v":""},{"$f":"IF(COUNT(O$7:O$26)>=ROWS($7:17),INDEX(O$7:O$26,SMALL(IF(ISNUMBER(O$7:O$26),ROW(INDIRECT(\"1:\"&ROWS(O$7:O$26)))),ROWS($7:17))),\"\")","v":""},{"$f":"IF(COUNT(P$7:P$26)>=ROWS($7:17),INDEX(P$7:P$26,SMALL(IF(ISNUMBER(P$7:P$26),ROW(INDIRECT(\"1:\"&ROWS(P$7:P$26)))),ROWS($7:17))),\"\")","v":""},{"$f":"IF(COUNT(Q$7:Q$26)>=ROWS($7:17),INDEX(Q$7:Q$26,SMALL(IF(ISNUMBER(Q$7:Q$26),ROW(INDIRECT(\"1:\"&ROWS(Q$7:Q$26)))),ROWS($7:17))),\"\")","v":""},{"$f":"IF(COUNT(R$7:R$26)>=ROWS($7:17),INDEX(R$7:R$26,SMALL(IF(ISNUMBER(R$7:R$26),ROW(INDIRECT(\"1:\"&ROWS(R$7:R$26)))),ROWS($7:17))),\"\")","v":""},{"$f":"IF(COUNT(S$7:S$26)>=ROWS($7:17),INDEX(S$7:S$26,SMALL(IF(ISNUMBER(S$7:S$26),ROW(INDIRECT(\"1:\"&ROWS(S$7:S$26)))),ROWS($7:17))),\"\")","v":""},{"$f":"IF(COUNT(T$7:T$26)>=ROWS($7:17),INDEX(T$7:T$26,SMALL(IF(ISNUMBER(T$7:T$26),ROW(INDIRECT(\"1:\"&ROWS(T$7:T$26)))),ROWS($7:17))),\"\")","v":""},{"$f":"IF(COUNT(U$7:U$26)>=ROWS($7:17),INDEX(U$7:U$26,SMALL(IF(ISNUMBER(U$7:U$26),ROW(INDIRECT(\"1:\"&ROWS(U$7:U$26)))),ROWS($7:17))),\"\")","v":""},{"$f":"IF(COUNT(V$7:V$26)>=ROWS($7:17),INDEX(V$7:V$26,SMALL(IF(ISNUMBER(V$7:V$26),ROW(INDIRECT(\"1:\"&ROWS(V$7:V$26)))),ROWS($7:17))),\"\")","v":""},{"$f":"IF(COUNT(W$7:W$26)>=ROWS($7:17),INDEX(W$7:W$26,SMALL(IF(ISNUMBER(W$7:W$26),ROW(INDIRECT(\"1:\"&ROWS(W$7:W$26)))),ROWS($7:17))),\"\")","v":""},{"$f":"IF(COUNT(X$7:X$26)>=ROWS($7:17),INDEX(X$7:X$26,SMALL(IF(ISNUMBER(X$7:X$26),ROW(INDIRECT(\"1:\"&ROWS(X$7:X$26)))),ROWS($7:17))),\"\")","v":""},{"$f":"IF(COUNT(Y$7:Y$26)>=ROWS($7:17),INDEX(Y$7:Y$26,SMALL(IF(ISNUMBER(Y$7:Y$26),ROW(INDIRECT(\"1:\"&ROWS(Y$7:Y$26)))),ROWS($7:17))),\"\")","v":""},{"$f":"IF(COUNT(Z$7:Z$26)>=ROWS($7:17),INDEX(Z$7:Z$26,SMALL(IF(ISNUMBER(Z$7:Z$26),ROW(INDIRECT(\"1:\"&ROWS(Z$7:Z$26)))),ROWS($7:17))),\"\")","v":""}]
["2Ah",12,{"$f":"IF(#REF!=\"\",\"\",VALUE(#REF!))","v":{"$error":"#REF!"}},{"$f":"IF(Accueil!B26=0,\"\",IF(Accueil!B26=\"\",\"\",Accueil!B26))","v":12},{"$f":"IF(C18=\"\",\"\",MID(Accueil!D26,1,1))","v":{"$error":"#REF!"}},{"$error":"#REF!"},{"$error":"#REF!"},{"$error":"#REF!"},{"$error":"#REF!"},{"$error":"#REF!"},{"$error":"#REF!"},{"$error":"#REF!"},{"$error":"#REF!"},{"$error":"#REF!"},{"$error":"#REF!"},{"$error":"#REF!"},{"$error":"#REF!"},{"$error":"#REF!"},{"$error":"#REF!"},{"$error":"#REF!"},{"$error":"#REF!"},{"$error":"#REF!"},{"$error":"#REF!"},{"$error":"#REF!"},{"$error":"#REF!"},{"$error":"#REF!"},null,{"$f":"IF(COUNT(F$7:F$26)>=ROWS($7:18),INDEX(F$7:F$26,SMALL(IF(ISNUMBER(F$7:F$26),ROW(INDIRECT(\"1:\"&ROWS(F$7:F$26)))),ROWS($7:18))),\"\")","v":""},{"$f":"IF(COUNT(G$7:G$26)>=ROWS($7:18),INDEX(G$7:G$26,SMALL(IF(ISNUMBER(G$7:G$26),ROW(INDIRECT(\"1:\"&ROWS(G$7:G$26)))),ROWS($7:18))),\"\")","v":""},{"$f":"IF(COUNT(H$7:H$26)>=ROWS($7:18),INDEX(H$7:H$26,SMALL(IF(ISNUMBER(H$7:H$26),ROW(INDIRECT(\"1:\"&ROWS(H$7:H$26)))),ROWS($7:18))),\"\")","v":""},{"$f":"IF(COUNT(I$7:I$26)>=ROWS($7:18),INDEX(I$7:I$26,SMALL(IF(ISNUMBER(I$7:I$26),ROW(INDIRECT(\"1:\"&ROWS(I$7:I$26)))),ROWS($7:18))),\"\")","v":""},{"$f":"IF(COUNT(J$7:J$26)>=ROWS($7:18),INDEX(J$7:J$26,SMALL(IF(ISNUMBER(J$7:J$26),ROW(INDIRECT(\"1:\"&ROWS(J$7:J$26)))),ROWS($7:18))),\"\")","v":""},{"$f":"IF(COUNT(K$7:K$26)>=ROWS($7:18),INDEX(K$7:K$26,SMALL(IF(ISNUMBER(K$7:K$26),ROW(INDIRECT(\"1:\"&ROWS(K$7:K$26)))),ROWS($7:18))),\"\")","v":""},{"$f":"IF(COUNT(L$7:L$26)>=ROWS($7:18),INDEX(L$7:L$26,SMALL(IF(ISNUMBER(L$7:L$26),ROW(INDIRECT(\"1:\"&ROWS(L$7:L$26)))),ROWS($7:18))),\"\")","v":""},{"$f":"IF(COUNT(M$7:M$26)>=ROWS($7:18),INDEX(M$7:M$26,SMALL(IF(ISNUMBER(M$7:M$26),ROW(INDIRECT(\"1:\"&ROWS(M$7:M$26)))),ROWS($7:18))),\"\")","v":""},{"$f":"IF(COUNT(N$7:N$26)>=ROWS($7:18),INDEX(N$7:N$26,SMALL(IF(ISNUMBER(N$7:N$26),ROW(INDIRECT(\"1:\"&ROWS(N$7:N$26)))),ROWS($7:18))),\"\")","v":""},{"$f":"IF(COUNT(O$7:O$26)>=ROWS($7:18),INDEX(O$7:O$26,SMALL(IF(ISNUMBER(O$7:O$26),ROW(INDIRECT(\"1:\"&ROWS(O$7:O$26)))),ROWS($7:18))),\"\")","v":""},{"$f":"IF(COUNT(P$7:P$26)>=ROWS($7:18),INDEX(P$7:P$26,SMALL(IF(ISNUMBER(P$7:P$26),ROW(INDIRECT(\"1:\"&ROWS(P$7:P$26)))),ROWS($7:18))),\"\")","v":""},{"$f":"IF(COUNT(Q$7:Q$26)>=ROWS($7:18),INDEX(Q$7:Q$26,SMALL(IF(ISNUMBER(Q$7:Q$26),ROW(INDIRECT(\"1:\"&ROWS(Q$7:Q$26)))),ROWS($7:18))),\"\")","v":""},{"$f":"IF(COUNT(R$7:R$26)>=ROWS($7:18),INDEX(R$7:R$26,SMALL(IF(ISNUMBER(R$7:R$26),ROW(INDIRECT(\"1:\"&ROWS(R$7:R$26)))),ROWS($7:18))),\"\")","v":""},{"$f":"IF(COUNT(S$7:S$26)>=ROWS($7:18),INDEX(S$7:S$26,SMALL(IF(ISNUMBER(S$7:S$26),ROW(INDIRECT(\"1:\"&ROWS(S$7:S$26)))),ROWS($7:18))),\"\")","v":""},{"$f":"IF(COUNT(T$7:T$26)>=ROWS($7:18),INDEX(T$7:T$26,SMALL(IF(ISNUMBER(T$7:T$26),ROW(INDIRECT(\"1:\"&ROWS(T$7:T$26)))),ROWS($7:18))),\"\")","v":""},{"$f":"IF(COUNT(U$7:U$26)>=ROWS($7:18),INDEX(U$7:U$26,SMALL(IF(ISNUMBER(U$7:U$26),ROW(INDIRECT(\"1:\"&ROWS(U$7:U$26)))),ROWS($7:18))),\"\")","v":""},{"$f":"IF(COUNT(V$7:V$26)>=ROWS($7:18),INDEX(V$7:V$26,SMALL(IF(ISNUMBER(V$7:V$26),ROW(INDIRECT(\"1:\"&ROWS(V$7:V$26)))),ROWS($7:18))),\"\")","v":""},{"$f":"IF(COUNT(W$7:W$26)>=ROWS($7:18),INDEX(W$7:W$26,SMALL(IF(ISNUMBER(W$7:W$26),ROW(INDIRECT(\"1:\"&ROWS(W$7:W$26)))),ROWS($7:18))),\"\")","v":""},{"$f":"IF(COUNT(X$7:X$26)>=ROWS($7:18),INDEX(X$7:X$26,SMALL(IF(ISNUMBER(X$7:X$26),ROW(INDIRECT(\"1:\"&ROWS(X$7:X$26)))),ROWS($7:18))),\"\")","v":""},{"$f":"IF(COUNT(Y$7:Y$26)>=ROWS($7:18),INDEX(Y$7:Y$26,SMALL(IF(ISNUMBER(Y$7:Y$26),ROW(INDIRECT(\"1:\"&ROWS(Y$7:Y$26)))),ROWS($7:18))),\"\")","v":""},{"$f":"IF(COUNT(Z$7:Z$26)>=ROWS($7:18),INDEX(Z$7:Z$26,SMALL(IF(ISNUMBER(Z$7:Z$26),ROW(INDIRECT(\"1:\"&ROWS(Z$7:Z$26)))),ROWS($7:18))),\"\")","v":""}]
["2Am",13,{"$f":"IF(#REF!=\"\",\"\",VALUE(#REF!))","v":{"$error":"#REF!"}},{"$f":"IF(Accueil!B27=0,\"\",IF(Accueil!B27=\"\",\"\",Accueil!B27))","v":13},{"$f":"IF(C19=\"\",\"\",MID(Accueil!D27,1,1))","v":{"$error":"#REF!"}},{"$error":"#REF!"},{"$error":"#REF!"},{"$error":"#REF!"},{"$error":"#REF!"},{"$error":"#REF!"},{"$error":"#REF!"},{"$error":"#REF!"},{"$error":"#REF!"},{"$error":"#REF!"},{"$error":"#REF!"},{"$error":"#REF!"},{"$error":"#REF!"},{"$error":"#REF!"},{"$error":"#REF!"},{"$error":"#REF!"},{"$error":"#REF!"},{"$error":"#REF!"},{"$error":"#REF!"},{"$error":"#REF!"},{"$error":"#REF!"},{"$error":"#REF!"},null,{"$f":"IF(COUNT(F$7:F$26)>=ROWS($7:19),INDEX(F$7:F$26,SMALL(IF(ISNUMBER(F$7:F$26),ROW(INDIRECT(\"1:\"&ROWS(F$7:F$26)))),ROWS($7:19))),\"\")","v":""},{"$f":"IF(COUNT(G$7:G$26)>=ROWS($7:19),INDEX(G$7:G$26,SMALL(IF(ISNUMBER(G$7:G$26),ROW(INDIRECT(\"1:\"&ROWS(G$7:G$26)))),ROWS($7:19))),\"\")","v":""},{"$f":"IF(COUNT(H$7:H$26)>=ROWS($7:19),INDEX(H$7:H$26,SMALL(IF(ISNUMBER(H$7:H$26),ROW(INDIRECT(\"1:\"&ROWS(H$7:H$26)))),ROWS($7:19))),\"\")","v":""},{"$f":"IF(COUNT(I$7:I$26)>=ROWS($7:19),INDEX(I$7:I$26,SMALL(IF(ISNUMBER(I$7:I$26),ROW(INDIRECT(\"1:\"&ROWS(I$7:I$26)))),ROWS($7:19))),\"\")","v":""},{"$f":"IF(COUNT(J$7:J$26)>=ROWS($7:19),INDEX(J$7:J$26,SMALL(IF(ISNUMBER(J$7:J$26),ROW(INDIRECT(\"1:\"&ROWS(J$7:J$26)))),ROWS($7:19))),\"\")","v":""},{"$f":"IF(COUNT(K$7:K$26)>=ROWS($7:19),INDEX(K$7:K$26,SMALL(IF(ISNUMBER(K$7:K$26),ROW(INDIRECT(\"1:\"&ROWS(K$7:K$26)))),ROWS($7:19))),\"\")","v":""},{"$f":"IF(COUNT(L$7:L$26)>=ROWS($7:19),INDEX(L$7:L$26,SMALL(IF(ISNUMBER(L$7:L$26),ROW(INDIRECT(\"1:\"&ROWS(L$7:L$26)))),ROWS($7:19))),\"\")","v":""},{"$f":"IF(COUNT(M$7:M$26)>=ROWS($7:19),INDEX(M$7:M$26,SMALL(IF(ISNUMBER(M$7:M$26),ROW(INDIRECT(\"1:\"&ROWS(M$7:M$26)))),ROWS($7:19))),\"\")","v":""},{"$f":"IF(COUNT(N$7:N$26)>=ROWS($7:19),INDEX(N$7:N$26,SMALL(IF(ISNUMBER(N$7:N$26),ROW(INDIRECT(\"1:\"&ROWS(N$7:N$26)))),ROWS($7:19))),\"\")","v":""},{"$f":"IF(COUNT(O$7:O$26)>=ROWS($7:19),INDEX(O$7:O$26,SMALL(IF(ISNUMBER(O$7:O$26),ROW(INDIRECT(\"1:\"&ROWS(O$7:O$26)))),ROWS($7:19))),\"\")","v":""},{"$f":"IF(COUNT(P$7:P$26)>=ROWS($7:19),INDEX(P$7:P$26,SMALL(IF(ISNUMBER(P$7:P$26),ROW(INDIRECT(\"1:\"&ROWS(P$7:P$26)))),ROWS($7:19))),\"\")","v":""},{"$f":"IF(COUNT(Q$7:Q$26)>=ROWS($7:19),INDEX(Q$7:Q$26,SMALL(IF(ISNUMBER(Q$7:Q$26),ROW(INDIRECT(\"1:\"&ROWS(Q$7:Q$26)))),ROWS($7:19))),\"\")","v":""},{"$f":"IF(COUNT(R$7:R$26)>=ROWS($7:19),INDEX(R$7:R$26,SMALL(IF(ISNUMBER(R$7:R$26),ROW(INDIRECT(\"1:\"&ROWS(R$7:R$26)))),ROWS($7:19))),\"\")","v":""},{"$f":"IF(COUNT(S$7:S$26)>=ROWS($7:19),INDEX(S$7:S$26,SMALL(IF(ISNUMBER(S$7:S$26),ROW(INDIRECT(\"1:\"&ROWS(S$7:S$26)))),ROWS($7:19))),\"\")","v":""},{"$f":"IF(COUNT(T$7:T$26)>=ROWS($7:19),INDEX(T$7:T$26,SMALL(IF(ISNUMBER(T$7:T$26),ROW(INDIRECT(\"1:\"&ROWS(T$7:T$26)))),ROWS($7:19))),\"\")","v":""},{"$f":"IF(COUNT(U$7:U$26)>=ROWS($7:19),INDEX(U$7:U$26,SMALL(IF(ISNUMBER(U$7:U$26),ROW(INDIRECT(\"1:\"&ROWS(U$7:U$26)))),ROWS($7:19))),\"\")","v":""},{"$f":"IF(COUNT(V$7:V$26)>=ROWS($7:19),INDEX(V$7:V$26,SMALL(IF(ISNUMBER(V$7:V$26),ROW(INDIRECT(\"1:\"&ROWS(V$7:V$26)))),ROWS($7:19))),\"\")","v":""},{"$f":"IF(COUNT(W$7:W$26)>=ROWS($7:19),INDEX(W$7:W$26,SMALL(IF(ISNUMBER(W$7:W$26),ROW(INDIRECT(\"1:\"&ROWS(W$7:W$26)))),ROWS($7:19))),\"\")","v":""},{"$f":"IF(COUNT(X$7:X$26)>=ROWS($7:19),INDEX(X$7:X$26,SMALL(IF(ISNUMBER(X$7:X$26),ROW(INDIRECT(\"1:\"&ROWS(X$7:X$26)))),ROWS($7:19))),\"\")","v":""},{"$f":"IF(COUNT(Y$7:Y$26)>=ROWS($7:19),INDEX(Y$7:Y$26,SMALL(IF(ISNUMBER(Y$7:Y$26),ROW(INDIRECT(\"1:\"&ROWS(Y$7:Y$26)))),ROWS($7:19))),\"\")","v":""},{"$f":"IF(COUNT(Z$7:Z$26)>=ROWS($7:19),INDEX(Z$7:Z$26,SMALL(IF(ISNUMBER(Z$7:Z$26),ROW(INDIRECT(\"1:\"&ROWS(Z$7:Z$26)))),ROWS($7:19))),\"\")","v":""}]
["2Af",14,{"$f":"IF(#REF!=\"\",\"\",VALUE(#REF!))","v":{"$error":"#REF!"}},{"$f":"IF(Accueil!B28=0,\"\",IF(Accueil!B28=\"\",\"\",Accueil!B28))","v":14},{"$f":"IF(C20=\"\",\"\",MID(Accueil!D28,1,1))","v":{"$error":"#REF!"}},{"$error":"#REF!"},{"$error":"#REF!"},{"$error":"#REF!"},{"$error":"#REF!"},{"$error":"#REF!"},{"$error":"#REF!"},{"$error":"#REF!"},{"$error":"#REF!"},{"$error":"#REF!"},{"$error":"#REF!"},{"$error":"#REF!"},{"$error":"#REF!"},{"$error":"#REF!"},{"$error":"#REF!"},{"$error":"#REF!"},{"$error":"#REF!"},{"$error":"#REF!"},{"$error":"#REF!"},{"$error":"#REF!"},{"$error":"#REF!"},{"$error":"#REF!"},null,{"$f":"IF(COUNT(F$7:F$26)>=ROWS($7:20),INDEX(F$7:F$26,SMALL(IF(ISNUMBER(F$7:F$26),ROW(INDIRECT(\"1:\"&ROWS(F$7:F$26)))),ROWS($7:20))),\"\")","v":""},{"$f":"IF(COUNT(G$7:G$26)>=ROWS($7:20),INDEX(G$7:G$26,SMALL(IF(ISNUMBER(G$7:G$26),ROW(INDIRECT(\"1:\"&ROWS(G$7:G$26)))),ROWS($7:20))),\"\")","v":""},{"$f":"IF(COUNT(H$7:H$26)>=ROWS($7:20),INDEX(H$7:H$26,SMALL(IF(ISNUMBER(H$7:H$26),ROW(INDIRECT(\"1:\"&ROWS(H$7:H$26)))),ROWS($7:20))),\"\")","v":""},{"$f":"IF(COUNT(I$7:I$26)>=ROWS($7:20),INDEX(I$7:I$26,SMALL(IF(ISNUMBER(I$7:I$26),ROW(INDIRECT(\"1:\"&ROWS(I$7:I$26)))),ROWS($7:20))),\"\")","v":""},{"$f":"IF(COUNT(J$7:J$26)>=ROWS($7:20),INDEX(J$7:J$26,SMALL(IF(ISNUMBER(J$7:J$26),ROW(INDIRECT(\"1:\"&ROWS(J$7:J$26)))),ROWS($7:20))),\"\")","v":""},{"$f":"IF(COUNT(K$7:K$26)>=ROWS($7:20),INDEX(K$7:K$26,SMALL(IF(ISNUMBER(K$7:K$26),ROW(INDIRECT(\"1:\"&ROWS(K$7:K$26)))),ROWS($7:20))),\"\")","v":""},{"$f":"IF(COUNT(L$7:L$26)>=ROWS($7:20),INDEX(L$7:L$26,SMALL(IF(ISNUMBER(L$7:L$26),ROW(INDIRECT(\"1:\"&ROWS(L$7:L$26)))),ROWS($7:20))),\"\")","v":""},{"$f":"IF(COUNT(M$7:M$26)>=ROWS($7:20),INDEX(M$7:M$26,SMALL(IF(ISNUMBER(M$7:M$26),ROW(INDIRECT(\"1:\"&ROWS(M$7:M$26)))),ROWS($7:20))),\"\")","v":""},{"$f":"IF(COUNT(N$7:N$26)>=ROWS($7:20),INDEX(N$7:N$26,SMALL(IF(ISNUMBER(N$7:N$26),ROW(INDIRECT(\"1:\"&ROWS(N$7:N$26)))),ROWS($7:20))),\"\")","v":""},{"$f":"IF(COUNT(O$7:O$26)>=ROWS($7:20),INDEX(O$7:O$26,SMALL(IF(ISNUMBER(O$7:O$26),ROW(INDIRECT(\"1:\"&ROWS(O$7:O$26)))),ROWS($7:20))),\"\")","v":""},{"$f":"IF(COUNT(P$7:P$26)>=ROWS($7:20),INDEX(P$7:P$26,SMALL(IF(ISNUMBER(P$7:P$26),ROW(INDIRECT(\"1:\"&ROWS(P$7:P$26)))),ROWS($7:20))),\"\")","v":""},{"$f":"IF(COUNT(Q$7:Q$26)>=ROWS($7:20),INDEX(Q$7:Q$26,SMALL(IF(ISNUMBER(Q$7:Q$26),ROW(INDIRECT(\"1:\"&ROWS(Q$7:Q$26)))),ROWS($7:20))),\"\")","v":""},{"$f":"IF(COUNT(R$7:R$26)>=ROWS($7:20),INDEX(R$7:R$26,SMALL(IF(ISNUMBER(R$7:R$26),ROW(INDIRECT(\"1:\"&ROWS(R$7:R$26)))),ROWS($7:20))),\"\")","v":""},{"$f":"IF(COUNT(S$7:S$26)>=ROWS($7:20),INDEX(S$7:S$26,SMALL(IF(ISNUMBER(S$7:S$26),ROW(INDIRECT(\"1:\"&ROWS(S$7:S$26)))),ROWS($7:20))),\"\")","v":""},{"$f":"IF(COUNT(T$7:T$26)>=ROWS($7:20),INDEX(T$7:T$26,SMALL(IF(ISNUMBER(T$7:T$26),ROW(INDIRECT(\"1:\"&ROWS(T$7:T$26)))),ROWS($7:20))),\"\")","v":""},{"$f":"IF(COUNT(U$7:U$26)>=ROWS($7:20),INDEX(U$7:U$26,SMALL(IF(ISNUMBER(U$7:U$26),ROW(INDIRECT(\"1:\"&ROWS(U$7:U$26)))),ROWS($7:20))),\"\")","v":""},{"$f":"IF(COUNT(V$7:V$26)>=ROWS($7:20),INDEX(V$7:V$26,SMALL(IF(ISNUMBER(V$7:V$26),ROW(INDIRECT(\"1:\"&ROWS(V$7:V$26)))),ROWS($7:20))),\"\")","v":""},{"$f":"IF(COUNT(W$7:W$26)>=ROWS($7:20),INDEX(W$7:W$26,SMALL(IF(ISNUMBER(W$7:W$26),ROW(INDIRECT(\"1:\"&ROWS(W$7:W$26)))),ROWS($7:20))),\"\")","v":""},{"$f":"IF(COUNT(X$7:X$26)>=ROWS($7:20),INDEX(X$7:X$26,SMALL(IF(ISNUMBER(X$7:X$26),ROW(INDIRECT(\"1:\"&ROWS(X$7:X$26)))),ROWS($7:20))),\"\")","v":""},{"$f":"IF(COUNT(Y$7:Y$26)>=ROWS($7:20),INDEX(Y$7:Y$26,SMALL(IF(ISNUMBER(Y$7:Y$26),ROW(INDIRECT(\"1:\"&ROWS(Y$7:Y$26)))),ROWS($7:20))),\"\")","v":""},{"$f":"IF(COUNT(Z$7:Z$26)>=ROWS($7:20),INDEX(Z$7:Z$26,SMALL(IF(ISNUMBER(Z$7:Z$26),ROW(INDIRECT(\"1:\"&ROWS(Z$7:Z$26)))),ROWS($7:20))),\"\")","v":""}]
[null,15,{"$f":"IF(#REF!=\"\",\"\",VALUE(#REF!))","v":{"$error":"#REF!"}},{"$f":"IF(Accueil!B29=0,\"\",IF(Accueil!B29=\"\",\"\",Accueil!B29))","v":""},{"$f":"IF(C21=\"\",\"\",MID(Accueil!D29,1,1))","v":{"$error":"#REF!"}},{"$error":"#REF!"},{"$error":"#REF!"},{"$error":"#REF!"},{"$error":"#REF!"},{"$error":"#REF!"},{"$error":"#REF!"},{"$error":"#REF!"},{"$error":"#REF!"},{"$error":"#REF!"},{"$error":"#REF!"},{"$error":"#REF!"},{"$error":"#REF!"},{"$error":"#REF!"},{"$error":"#REF!"},{"$error":"#REF!"},{"$error":"#REF!"},{"$error":"#REF!"},{"$error":"#REF!"},{"$error":"#REF!"},{"$error":"#REF!"},{"$error":"#REF!"},null,{"$f":"IF(COUNT(F$7:F$26)>=ROWS($7:21),INDEX(F$7:F$26,SMALL(IF(ISNUMBER(F$7:F$26),ROW(INDIRECT(\"1:\"&ROWS(F$7:F$26)))),ROWS($7:21))),\"\")","v":""},{"$f":"IF(COUNT(G$7:G$26)>=ROWS($7:21),INDEX(G$7:G$26,SMALL(IF(ISNUMBER(G$7:G$26),ROW(INDIRECT(\"1:\"&ROWS(G$7:G$26)))),ROWS($7:21))),\"\")","v":""},{"$f":"IF(COUNT(H$7:H$26)>=ROWS($7:21),INDEX(H$7:H$26,SMALL(IF(ISNUMBER(H$7:H$26),ROW(INDIRECT(\"1:\"&ROWS(H$7:H$26)))),ROWS($7:21))),\"\")","v":""},{"$f":"IF(COUNT(I$7:I$26)>=ROWS($7:21),INDEX(I$7:I$26,SMALL(IF(ISNUMBER(I$7:I$26),ROW(INDIRECT(\"1:\"&ROWS(I$7:I$26)))),ROWS($7:21))),\"\")","v":""},{"$f":"IF(COUNT(J$7:J$26)>=ROWS($7:21),INDEX(J$7:J$26,SMALL(IF(ISNUMBER(J$7:J$26),ROW(INDIRECT(\"1:\"&ROWS(J$7:J$26)))),ROWS($7:21))),\"\")","v":""},{"$f":"IF(COUNT(K$7:K$26)>=ROWS($7:21),INDEX(K$7:K$26,SMALL(IF(ISNUMBER(K$7:K$26),ROW(INDIRECT(\"1:\"&ROWS(K$7:K$26)))),ROWS($7:21))),\"\")","v":""},{"$f":"IF(COUNT(L$7:L$26)>=ROWS($7:21),INDEX(L$7:L$26,SMALL(IF(ISNUMBER(L$7:L$26),ROW(INDIRECT(\"1:\"&ROWS(L$7:L$26)))),ROWS($7:21))),\"\")","v":""},{"$f":"IF(COUNT(M$7:M$26)>=ROWS($7:21),INDEX(M$7:M$26,SMALL(IF(ISNUMBER(M$7:M$26),ROW(INDIRECT(\"1:\"&ROWS(M$7:M$26)))),ROWS($7:21))),\"\")","v":""},{"$f":"IF(COUNT(N$7:N$26)>=ROWS($7:21),INDEX(N$7:N$26,SMALL(IF(ISNUMBER(N$7:N$26),ROW(INDIRECT(\"1:\"&ROWS(N$7:N$26)))),ROWS($7:21))),\"\")","v":""},{"$f":"IF(COUNT(O$7:O$26)>=ROWS($7:21),INDEX(O$7:O$26,SMALL(IF(ISNUMBER(O$7:O$26),ROW(INDIRECT(\"1:\"&ROWS(O$7:O$26)))),ROWS($7:21))),\"\")","v":""},{"$f":"IF(COUNT(P$7:P$26)>=ROWS($7:21),INDEX(P$7:P$26,SMALL(IF(ISNUMBER(P$7:P$26),ROW(INDIRECT(\"1:\"&ROWS(P$7:P$26)))),ROWS($7:21))),\"\")","v":""},{"$f":"IF(COUNT(Q$7:Q$26)>=ROWS($7:21),INDEX(Q$7:Q$26,SMALL(IF(ISNUMBER(Q$7:Q$26),ROW(INDIRECT(\"1:\"&ROWS(Q$7:Q$26)))),ROWS($7:21))),\"\")","v":""},{"$f":"IF(COUNT(R$7:R$26)>=ROWS($7:21),INDEX(R$7:R$26,SMALL(IF(ISNUMBER(R$7:R$26),ROW(INDIRECT(\"1:\"&ROWS(R$7:R$26)))),ROWS($7:21))),\"\")","v":""},{"$f":"IF(COUNT(S$7:S$26)>=ROWS($7:21),INDEX(S$7:S$26,SMALL(IF(ISNUMBER(S$7:S$26),ROW(INDIRECT(\"1:\"&ROWS(S$7:S$26)))),ROWS($7:21))),\"\")","v":""},{"$f":"IF(COUNT(T$7:T$26)>=ROWS($7:21),INDEX(T$7:T$26,SMALL(IF(ISNUMBER(T$7:T$26),ROW(INDIRECT(\"1:\"&ROWS(T$7:T$26)))),ROWS($7:21))),\"\")","v":""},{"$f":"IF(COUNT(U$7:U$26)>=ROWS($7:21),INDEX(U$7:U$26,SMALL(IF(ISNUMBER(U$7:U$26),ROW(INDIRECT(\"1:\"&ROWS(U$7:U$26)))),ROWS($7:21))),\"\")","v":""},{"$f":"IF(COUNT(V$7:V$26)>=ROWS($7:21),INDEX(V$7:V$26,SMALL(IF(ISNUMBER(V$7:V$26),ROW(INDIRECT(\"1:\"&ROWS(V$7:V$26)))),ROWS($7:21))),\"\")","v":""},{"$f":"IF(COUNT(W$7:W$26)>=ROWS($7:21),INDEX(W$7:W$26,SMALL(IF(ISNUMBER(W$7:W$26),ROW(INDIRECT(\"1:\"&ROWS(W$7:W$26)))),ROWS($7:21))),\"\")","v":""},{"$f":"IF(COUNT(X$7:X$26)>=ROWS($7:21),INDEX(X$7:X$26,SMALL(IF(ISNUMBER(X$7:X$26),ROW(INDIRECT(\"1:\"&ROWS(X$7:X$26)))),ROWS($7:21))),\"\")","v":""},{"$f":"IF(COUNT(Y$7:Y$26)>=ROWS($7:21),INDEX(Y$7:Y$26,SMALL(IF(ISNUMBER(Y$7:Y$26),ROW(INDIRECT(\"1:\"&ROWS(Y$7:Y$26)))),ROWS($7:21))),\"\")","v":""},{"$f":"IF(COUNT(Z$7:Z$26)>=ROWS($7:21),INDEX(Z$7:Z$26,SMALL(IF(ISNUMBER(Z$7:Z$26),ROW(INDIRECT(\"1:\"&ROWS(Z$7:Z$26)))),ROWS($7:21))),\"\")","v":""}]
["1Ah",16,{"$f":"IF(#REF!=\"\",\"\",VALUE(#REF!))","v":{"$error":"#REF!"}},{"$f":"IF(Accueil!B30=0,\"\",IF(Accueil!B30=\"\",\"\",Accueil!B30))","v":""},{"$f":"IF(C22=\"\",\"\",MID(Accueil!D30,1,1))","v":{"$error":"#REF!"}},{"$error":"#REF!"},{"$error":"#REF!"},{"$error":"#REF!"},{"$error":"#REF!"},{"$error":"#REF!"},{"$error":"#REF!"},{"$error":"#REF!"},{"$error":"#REF!"},{"$error":"#REF!"},{"$error":"#REF!"},{"$error":"#REF!"},{"$error":"#REF!"},{"$error":"#REF!"},{"$error":"#REF!"},{"$error":"#REF!"},{"$error":"#REF!"},{"$error":"#REF!"},{"$error":"#REF!"},{"$error":"#REF!"},{"$error":"#REF!"},{"$error":"#REF!"},null,{"$f":"IF(COUNT(F$7:F$26)>=ROWS($7:22),INDEX(F$7:F$26,SMALL(IF(ISNUMBER(F$7:F$26),ROW(INDIRECT(\"1:\"&ROWS(F$7:F$26)))),ROWS($7:22))),\"\")","v":""},{"$f":"IF(COUNT(G$7:G$26)>=ROWS($7:22),INDEX(G$7:G$26,SMALL(IF(ISNUMBER(G$7:G$26),ROW(INDIRECT(\"1:\"&ROWS(G$7:G$26)))),ROWS($7:22))),\"\")","v":""},{"$f":"IF(COUNT(H$7:H$26)>=ROWS($7:22),INDEX(H$7:H$26,SMALL(IF(ISNUMBER(H$7:H$26),ROW(INDIRECT(\"1:\"&ROWS(H$7:H$26)))),ROWS($7:22))),\"\")","v":""},{"$f":"IF(COUNT(I$7:I$26)>=ROWS($7:22),INDEX(I$7:I$26,SMALL(IF(ISNUMBER(I$7:I$26),ROW(INDIRECT(\"1:\"&ROWS(I$7:I$26)))),ROWS($7:22))),\"\")","v":""},{"$f":"IF(COUNT(J$7:J$26)>=ROWS($7:22),INDEX(J$7:J$26,SMALL(IF(ISNUMBER(J$7:J$26),ROW(INDIRECT(\"1:\"&ROWS(J$7:J$26)))),ROWS($7:22))),\"\")","v":""},{"$f":"IF(COUNT(K$7:K$26)>=ROWS($7:22),INDEX(K$7:K$26,SMALL(IF(ISNUMBER(K$7:K$26),ROW(INDIRECT(\"1:\"&ROWS(K$7:K$26)))),ROWS($7:22))),\"\")","v":""},{"$f":"IF(COUNT(L$7:L$26)>=ROWS($7:22),INDEX(L$7:L$26,SMALL(IF(ISNUMBER(L$7:L$26),ROW(INDIRECT(\"1:\"&ROWS(L$7:L$26)))),ROWS($7:22))),\"\")","v":""},{"$f":"IF(COUNT(M$7:M$26)>=ROWS($7:22),INDEX(M$7:M$26,SMALL(IF(ISNUMBER(M$7:M$26),ROW(INDIRECT(\"1:\"&ROWS(M$7:M$26)))),ROWS($7:22))),\"\")","v":""},{"$f":"IF(COUNT(N$7:N$26)>=ROWS($7:22),INDEX(N$7:N$26,SMALL(IF(ISNUMBER(N$7:N$26),ROW(INDIRECT(\"1:\"&ROWS(N$7:N$26)))),ROWS($7:22))),\"\")","v":""},{"$f":"IF(COUNT(O$7:O$26)>=ROWS($7:22),INDEX(O$7:O$26,SMALL(IF(ISNUMBER(O$7:O$26),ROW(INDIRECT(\"1:\"&ROWS(O$7:O$26)))),ROWS($7:22))),\"\")","v":""},{"$f":"IF(COUNT(P$7:P$26)>=ROWS($7:22),INDEX(P$7:P$26,SMALL(IF(ISNUMBER(P$7:P$26),ROW(INDIRECT(\"1:\"&ROWS(P$7:P$26)))),ROWS($7:22))),\"\")","v":""},{"$f":"IF(COUNT(Q$7:Q$26)>=ROWS($7:22),INDEX(Q$7:Q$26,SMALL(IF(ISNUMBER(Q$7:Q$26),ROW(INDIRECT(\"1:\"&ROWS(Q$7:Q$26)))),ROWS($7:22))),\"\")","v":""},{"$f":"IF(COUNT(R$7:R$26)>=ROWS($7:22),INDEX(R$7:R$26,SMALL(IF(ISNUMBER(R$7:R$26),ROW(INDIRECT(\"1:\"&ROWS(R$7:R$26)))),ROWS($7:22))),\"\")","v":""},{"$f":"IF(COUNT(S$7:S$26)>=ROWS($7:22),INDEX(S$7:S$26,SMALL(IF(ISNUMBER(S$7:S$26),ROW(INDIRECT(\"1:\"&ROWS(S$7:S$26)))),ROWS($7:22))),\"\")","v":""},{"$f":"IF(COUNT(T$7:T$26)>=ROWS($7:22),INDEX(T$7:T$26,SMALL(IF(ISNUMBER(T$7:T$26),ROW(INDIRECT(\"1:\"&ROWS(T$7:T$26)))),ROWS($7:22))),\"\")","v":""},{"$f":"IF(COUNT(U$7:U$26)>=ROWS($7:22),INDEX(U$7:U$26,SMALL(IF(ISNUMBER(U$7:U$26),ROW(INDIRECT(\"1:\"&ROWS(U$7:U$26)))),ROWS($7:22))),\"\")","v":""},{"$f":"IF(COUNT(V$7:V$26)>=ROWS($7:22),INDEX(V$7:V$26,SMALL(IF(ISNUMBER(V$7:V$26),ROW(INDIRECT(\"1:\"&ROWS(V$7:V$26)))),ROWS($7:22))),\"\")","v":""},{"$f":"IF(COUNT(W$7:W$26)>=ROWS($7:22),INDEX(W$7:W$26,SMALL(IF(ISNUMBER(W$7:W$26),ROW(INDIRECT(\"1:\"&ROWS(W$7:W$26)))),ROWS($7:22))),\"\")","v":""},{"$f":"IF(COUNT(X$7:X$26)>=ROWS($7:22),INDEX(X$7:X$26,SMALL(IF(ISNUMBER(X$7:X$26),ROW(INDIRECT(\"1:\"&ROWS(X$7:X$26)))),ROWS($7:22))),\"\")","v":""},{"$f":"IF(COUNT(Y$7:Y$26)>=ROWS($7:22),INDEX(Y$7:Y$26,SMALL(IF(ISNUMBER(Y$7:Y$26),ROW(INDIRECT(\"1:\"&ROWS(Y$7:Y$26)))),ROWS($7:22))),\"\")","v":""},{"$f":"IF(COUNT(Z$7:Z$26)>=ROWS($7:22),INDEX(Z$7:Z$26,SMALL(IF(ISNUMBER(Z$7:Z$26),ROW(INDIRECT(\"1:\"&ROWS(Z$7:Z$26)))),ROWS($7:22))),\"\")","v":""}]
["1Am",17,{"$f":"IF(#REF!=\"\",\"\",VALUE(#REF!))","v":{"$error":"#REF!"}},{"$f":"IF(Accueil!B31=0,\"\",IF(Accueil!B31=\"\",\"\",Accueil!B31))","v":""},{"$f":"IF(C23=\"\",\"\",MID(Accueil!D31,1,1))","v":{"$error":"#REF!"}},{"$error":"#REF!"},{"$error":"#REF!"},{"$error":"#REF!"},{"$error":"#REF!"},{"$error":"#REF!"},{"$error":"#REF!"},{"$error":"#REF!"},{"$error":"#REF!"},{"$error":"#REF!"},{"$error":"#REF!"},{"$error":"#REF!"},{"$error":"#REF!"},{"$error":"#REF!"},{"$error":"#REF!"},{"$error":"#REF!"},{"$error":"#REF!"},{"$error":"#REF!"},{"$error":"#REF!"},{"$error":"#REF!"},{"$error":"#REF!"},{"$error":"#REF!"},null,{"$f":"IF(COUNT(F$7:F$26)>=ROWS($7:23),INDEX(F$7:F$26,SMALL(IF(ISNUMBER(F$7:F$26),ROW(INDIRECT(\"1:\"&ROWS(F$7:F$26)))),ROWS($7:23))),\"\")","v":""},{"$f":"IF(COUNT(G$7:G$26)>=ROWS($7:23),INDEX(G$7:G$26,SMALL(IF(ISNUMBER(G$7:G$26),ROW(INDIRECT(\"1:\"&ROWS(G$7:G$26)))),ROWS($7:23))),\"\")","v":""},{"$f":"IF(COUNT(H$7:H$26)>=ROWS($7:23),INDEX(H$7:H$26,SMALL(IF(ISNUMBER(H$7:H$26),ROW(INDIRECT(\"1:\"&ROWS(H$7:H$26)))),ROWS($7:23))),\"\")","v":""},{"$f":"IF(COUNT(I$7:I$26)>=ROWS($7:23),INDEX(I$7:I$26,SMALL(IF(ISNUMBER(I$7:I$26),ROW(INDIRECT(\"1:\"&ROWS(I$7:I$26)))),ROWS($7:23))),\"\")","v":""},{"$f":"IF(COUNT(J$7:J$26)>=ROWS($7:23),INDEX(J$7:J$26,SMALL(IF(ISNUMBER(J$7:J$26),ROW(INDIRECT(\"1:\"&ROWS(J$7:J$26)))),ROWS($7:23))),\"\")","v":""},{"$f":"IF(COUNT(K$7:K$26)>=ROWS($7:23),INDEX(K$7:K$26,SMALL(IF(ISNUMBER(K$7:K$26),ROW(INDIRECT(\"1:\"&ROWS(K$7:K$26)))),ROWS($7:23))),\"\")","v":""},{"$f":"IF(COUNT(L$7:L$26)>=ROWS($7:23),INDEX(L$7:L$26,SMALL(IF(ISNUMBER(L$7:L$26),ROW(INDIRECT(\"1:\"&ROWS(L$7:L$26)))),ROWS($7:23))),\"\")","v":""},{"$f":"IF(COUNT(M$7:M$26)>=ROWS($7:23),INDEX(M$7:M$26,SMALL(IF(ISNUMBER(M$7:M$26),ROW(INDIRECT(\"1:\"&ROWS(M$7:M$26)))),ROWS($7:23))),\"\")","v":""},{"$f":"IF(COUNT(N$7:N$26)>=ROWS($7:23),INDEX(N$7:N$26,SMALL(IF(ISNUMBER(N$7:N$26),ROW(INDIRECT(\"1:\"&ROWS(N$7:N$26)))),ROWS($7:23))),\"\")","v":""},{"$f":"IF(COUNT(O$7:O$26)>=ROWS($7:23),INDEX(O$7:O$26,SMALL(IF(ISNUMBER(O$7:O$26),ROW(INDIRECT(\"1:\"&ROWS(O$7:O$26)))),ROWS($7:23))),\"\")","v":""},{"$f":"IF(COUNT(P$7:P$26)>=ROWS($7:23),INDEX(P$7:P$26,SMALL(IF(ISNUMBER(P$7:P$26),ROW(INDIRECT(\"1:\"&ROWS(P$7:P$26)))),ROWS($7:23))),\"\")","v":""},{"$f":"IF(COUNT(Q$7:Q$26)>=ROWS($7:23),INDEX(Q$7:Q$26,SMALL(IF(ISNUMBER(Q$7:Q$26),ROW(INDIRECT(\"1:\"&ROWS(Q$7:Q$26)))),ROWS($7:23))),\"\")","v":""},{"$f":"IF(COUNT(R$7:R$26)>=ROWS($7:23),INDEX(R$7:R$26,SMALL(IF(ISNUMBER(R$7:R$26),ROW(INDIRECT(\"1:\"&ROWS(R$7:R$26)))),ROWS($7:23))),\"\")","v":""},{"$f":"IF(COUNT(S$7:S$26)>=ROWS($7:23),INDEX(S$7:S$26,SMALL(IF(ISNUMBER(S$7:S$26),ROW(INDIRECT(\"1:\"&ROWS(S$7:S$26)))),ROWS($7:23))),\"\")","v":""},{"$f":"IF(COUNT(T$7:T$26)>=ROWS($7:23),INDEX(T$7:T$26,SMALL(IF(ISNUMBER(T$7:T$26),ROW(INDIRECT(\"1:\"&ROWS(T$7:T$26)))),ROWS($7:23))),\"\")","v":""},{"$f":"IF(COUNT(U$7:U$26)>=ROWS($7:23),INDEX(U$7:U$26,SMALL(IF(ISNUMBER(U$7:U$26),ROW(INDIRECT(\"1:\"&ROWS(U$7:U$26)))),ROWS($7:23))),\"\")","v":""},{"$f":"IF(COUNT(V$7:V$26)>=ROWS($7:23),INDEX(V$7:V$26,SMALL(IF(ISNUMBER(V$7:V$26),ROW(INDIRECT(\"1:\"&ROWS(V$7:V$26)))),ROWS($7:23))),\"\")","v":""},{"$f":"IF(COUNT(W$7:W$26)>=ROWS($7:23),INDEX(W$7:W$26,SMALL(IF(ISNUMBER(W$7:W$26),ROW(INDIRECT(\"1:\"&ROWS(W$7:W$26)))),ROWS($7:23))),\"\")","v":""},{"$f":"IF(COUNT(X$7:X$26)>=ROWS($7:23),INDEX(X$7:X$26,SMALL(IF(ISNUMBER(X$7:X$26),ROW(INDIRECT(\"1:\"&ROWS(X$7:X$26)))),ROWS($7:23))),\"\")","v":""},{"$f":"IF(COUNT(Y$7:Y$26)>=ROWS($7:23),INDEX(Y$7:Y$26,SMALL(IF(ISNUMBER(Y$7:Y$26),ROW(INDIRECT(\"1:\"&ROWS(Y$7:Y$26)))),ROWS($7:23))),\"\")","v":""},{"$f":"IF(COUNT(Z$7:Z$26)>=ROWS($7:23),INDEX(Z$7:Z$26,SMALL(IF(ISNUMBER(Z$7:Z$26),ROW(INDIRECT(\"1:\"&ROWS(Z$7:Z$26)))),ROWS($7:23))),\"\")","v":""}]
["1Af",18,{"$f":"IF(#REF!=\"\",\"\",VALUE(#REF!))","v":{"$error":"#REF!"}},{"$f":"IF(Accueil!B32=0,\"\",IF(Accueil!B32=\"\",\"\",Accueil!B32))","v":""},{"$f":"IF(C24=\"\",\"\",MID(Accueil!D32,1,1))","v":{"$error":"#REF!"}},{"$error":"#REF!"},{"$error":"#REF!"},{"$error":"#REF!"},{"$error":"#REF!"},{"$error":"#REF!"},{"$error":"#REF!"},{"$error":"#REF!"},{"$error":"#REF!"},{"$error":"#REF!"},{"$error":"#REF!"},{"$error":"#REF!"},{"$error":"#REF!"},{"$error":"#REF!"},{"$error":"#REF!"},{"$error":"#REF!"},{"$error":"#REF!"},{"$error":"#REF!"},{"$error":"#REF!"},{"$error":"#REF!"},{"$error":"#REF!"},{"$error":"#REF!"},null,{"$f":"IF(COUNT(F$7:F$26)>=ROWS($7:24),INDEX(F$7:F$26,SMALL(IF(ISNUMBER(F$7:F$26),ROW(INDIRECT(\"1:\"&ROWS(F$7:F$26)))),ROWS($7:24))),\"\")","v":""},{"$f":"IF(COUNT(G$7:G$26)>=ROWS($7:24),INDEX(G$7:G$26,SMALL(IF(ISNUMBER(G$7:G$26),ROW(INDIRECT(\"1:\"&ROWS(G$7:G$26)))),ROWS($7:24))),\"\")","v":""},{"$f":"IF(COUNT(H$7:H$26)>=ROWS($7:24),INDEX(H$7:H$26,SMALL(IF(ISNUMBER(H$7:H$26),ROW(INDIRECT(\"1:\"&ROWS(H$7:H$26)))),ROWS($7:24))),\"\")","v":""},{"$f":"IF(COUNT(I$7:I$26)>=ROWS($7:24),INDEX(I$7:I$26,SMALL(IF(ISNUMBER(I$7:I$26),ROW(INDIRECT(\"1:\"&ROWS(I$7:I$26)))),ROWS($7:24))),\"\")","v":""},{"$f":"IF(COUNT(J$7:J$26)>=ROWS($7:24),INDEX(J$7:J$26,SMALL(IF(ISNUMBER(J$7:J$26),ROW(INDIRECT(\"1:\"&ROWS(J$7:J$26)))),ROWS($7:24))),\"\")","v":""},{"$f":"IF(COUNT(K$7:K$26)>=ROWS($7:24),INDEX(K$7:K$26,SMALL(IF(ISNUMBER(K$7:K$26),ROW(INDIRECT(\"1:\"&ROWS(K$7:K$26)))),ROWS($7:24))),\"\")","v":""},{"$f":"IF(COUNT(L$7:L$26)>=ROWS($7:24),INDEX(L$7:L$26,SMALL(IF(ISNUMBER(L$7:L$26),ROW(INDIRECT(\"1:\"&ROWS(L$7:L$26)))),ROWS($7:24))),\"\")","v":""},{"$f":"IF(COUNT(M$7:M$26)>=ROWS($7:24),INDEX(M$7:M$26,SMALL(IF(ISNUMBER(M$7:M$26),ROW(INDIRECT(\"1:\"&ROWS(M$7:M$26)))),ROWS($7:24))),\"\")","v":""},{"$f":"IF(COUNT(N$7:N$26)>=ROWS($7:24),INDEX(N$7:N$26,SMALL(IF(ISNUMBER(N$7:N$26),ROW(INDIRECT(\"1:\"&ROWS(N$7:N$26)))),ROWS($7:24))),\"\")","v":""},{"$f":"IF(COUNT(O$7:O$26)>=ROWS($7:24),INDEX(O$7:O$26,SMALL(IF(ISNUMBER(O$7:O$26),ROW(INDIRECT(\"1:\"&ROWS(O$7:O$26)))),ROWS($7:24))),\"\")","v":""},{"$f":"IF(COUNT(P$7:P$26)>=ROWS($7:24),INDEX(P$7:P$26,SMALL(IF(ISNUMBER(P$7:P$26),ROW(INDIRECT(\"1:\"&ROWS(P$7:P$26)))),ROWS($7:24))),\"\")","v":""},{"$f":"IF(COUNT(Q$7:Q$26)>=ROWS($7:24),INDEX(Q$7:Q$26,SMALL(IF(ISNUMBER(Q$7:Q$26),ROW(INDIRECT(\"1:\"&ROWS(Q$7:Q$26)))),ROWS($7:24))),\"\")","v":""},{"$f":"IF(COUNT(R$7:R$26)>=ROWS($7:24),INDEX(R$7:R$26,SMALL(IF(ISNUMBER(R$7:R$26),ROW(INDIRECT(\"1:\"&ROWS(R$7:R$26)))),ROWS($7:24))),\"\")","v":""},{"$f":"IF(COUNT(S$7:S$26)>=ROWS($7:24),INDEX(S$7:S$26,SMALL(IF(ISNUMBER(S$7:S$26),ROW(INDIRECT(\"1:\"&ROWS(S$7:S$26)))),ROWS($7:24))),\"\")","v":""},{"$f":"IF(COUNT(T$7:T$26)>=ROWS($7:24),INDEX(T$7:T$26,SMALL(IF(ISNUMBER(T$7:T$26),ROW(INDIRECT(\"1:\"&ROWS(T$7:T$26)))),ROWS($7:24))),\"\")","v":""},{"$f":"IF(COUNT(U$7:U$26)>=ROWS($7:24),INDEX(U$7:U$26,SMALL(IF(ISNUMBER(U$7:U$26),ROW(INDIRECT(\"1:\"&ROWS(U$7:U$26)))),ROWS($7:24))),\"\")","v":""},{"$f":"IF(COUNT(V$7:V$26)>=ROWS($7:24),INDEX(V$7:V$26,SMALL(IF(ISNUMBER(V$7:V$26),ROW(INDIRECT(\"1:\"&ROWS(V$7:V$26)))),ROWS($7:24))),\"\")","v":""},{"$f":"IF(COUNT(W$7:W$26)>=ROWS($7:24),INDEX(W$7:W$26,SMALL(IF(ISNUMBER(W$7:W$26),ROW(INDIRECT(\"1:\"&ROWS(W$7:W$26)))),ROWS($7:24))),\"\")","v":""},{"$f":"IF(COUNT(X$7:X$26)>=ROWS($7:24),INDEX(X$7:X$26,SMALL(IF(ISNUMBER(X$7:X$26),ROW(INDIRECT(\"1:\"&ROWS(X$7:X$26)))),ROWS($7:24))),\"\")","v":""},{"$f":"IF(COUNT(Y$7:Y$26)>=ROWS($7:24),INDEX(Y$7:Y$26,SMALL(IF(ISNUMBER(Y$7:Y$26),ROW(INDIRECT(\"1:\"&ROWS(Y$7:Y$26)))),ROWS($7:24))),\"\")","v":""},{"$f":"IF(COUNT(Z$7:Z$26)>=ROWS($7:24),INDEX(Z$7:Z$26,SMALL(IF(ISNUMBER(Z$7:Z$26),ROW(INDIRECT(\"1:\"&ROWS(Z$7:Z$26)))),ROWS($7:24))),\"\")","v":""}]
[null,19,{"$f":"IF(#REF!=\"\",\"\",VALUE(#REF!))","v":{"$error":"#REF!"}},{"$f":"IF(Accueil!B33=0,\"\",IF(Accueil!B33=\"\",\"\",Accueil!B33))","v":""},{"$f":"IF(C25=\"\",\"\",MID(Accueil!D33,1,1))","v":{"$error":"#REF!"}},{"$error":"#REF!"},{"$error":"#REF!"},{"$error":"#REF!"},{"$error":"#REF!"},{"$error":"#REF!"},{"$error":"#REF!"},{"$error":"#REF!"},{"$error":"#REF!"},{"$error":"#REF!"},{"$error":"#REF!"},{"$error":"#REF!"},{"$error":"#REF!"},{"$error":"#REF!"},{"$error":"#REF!"},{"$error":"#REF!"},{"$error":"#REF!"},{"$error":"#REF!"},{"$error":"#REF!"},{"$error":"#REF!"},{"$error":"#REF!"},{"$error":"#REF!"},null,{"$f":"IF(COUNT(F$7:F$26)>=ROWS($7:25),INDEX(F$7:F$26,SMALL(IF(ISNUMBER(F$7:F$26),ROW(INDIRECT(\"1:\"&ROWS(F$7:F$26)))),ROWS($7:25))),\"\")","v":""},{"$f":"IF(COUNT(G$7:G$26)>=ROWS($7:25),INDEX(G$7:G$26,SMALL(IF(ISNUMBER(G$7:G$26),ROW(INDIRECT(\"1:\"&ROWS(G$7:G$26)))),ROWS($7:25))),\"\")","v":""},{"$f":"IF(COUNT(H$7:H$26)>=ROWS($7:25),INDEX(H$7:H$26,SMALL(IF(ISNUMBER(H$7:H$26),ROW(INDIRECT(\"1:\"&ROWS(H$7:H$26)))),ROWS($7:25))),\"\")","v":""},{"$f":"IF(COUNT(I$7:I$26)>=ROWS($7:25),INDEX(I$7:I$26,SMALL(IF(ISNUMBER(I$7:I$26),ROW(INDIRECT(\"1:\"&ROWS(I$7:I$26)))),ROWS($7:25))),\"\")","v":""},{"$f":"IF(COUNT(J$7:J$26)>=ROWS($7:25),INDEX(J$7:J$26,SMALL(IF(ISNUMBER(J$7:J$26),ROW(INDIRECT(\"1:\"&ROWS(J$7:J$26)))),ROWS($7:25))),\"\")","v":""},{"$f":"IF(COUNT(K$7:K$26)>=ROWS($7:25),INDEX(K$7:K$26,SMALL(IF(ISNUMBER(K$7:K$26),ROW(INDIRECT(\"1:\"&ROWS(K$7:K$26)))),ROWS($7:25))),\"\")","v":""},{"$f":"IF(COUNT(L$7:L$26)>=ROWS($7:25),INDEX(L$7:L$26,SMALL(IF(ISNUMBER(L$7:L$26),ROW(INDIRECT(\"1:\"&ROWS(L$7:L$26)))),ROWS($7:25))),\"\")","v":""},{"$f":"IF(COUNT(M$7:M$26)>=ROWS($7:25),INDEX(M$7:M$26,SMALL(IF(ISNUMBER(M$7:M$26),ROW(INDIRECT(\"1:\"&ROWS(M$7:M$26)))),ROWS($7:25))),\"\")","v":""},{"$f":"IF(COUNT(N$7:N$26)>=ROWS($7:25),INDEX(N$7:N$26,SMALL(IF(ISNUMBER(N$7:N$26),ROW(INDIRECT(\"1:\"&ROWS(N$7:N$26)))),ROWS($7:25))),\"\")","v":""},{"$f":"IF(COUNT(O$7:O$26)>=ROWS($7:25),INDEX(O$7:O$26,SMALL(IF(ISNUMBER(O$7:O$26),ROW(INDIRECT(\"1:\"&ROWS(O$7:O$26)))),ROWS($7:25))),\"\")","v":""},{"$f":"IF(COUNT(P$7:P$26)>=ROWS($7:25),INDEX(P$7:P$26,SMALL(IF(ISNUMBER(P$7:P$26),ROW(INDIRECT(\"1:\"&ROWS(P$7:P$26)))),ROWS($7:25))),\"\")","v":""},{"$f":"IF(COUNT(Q$7:Q$26)>=ROWS($7:25),INDEX(Q$7:Q$26,SMALL(IF(ISNUMBER(Q$7:Q$26),ROW(INDIRECT(\"1:\"&ROWS(Q$7:Q$26)))),ROWS($7:25))),\"\")","v":""},{"$f":"IF(COUNT(R$7:R$26)>=ROWS($7:25),INDEX(R$7:R$26,SMALL(IF(ISNUMBER(R$7:R$26),ROW(INDIRECT(\"1:\"&ROWS(R$7:R$26)))),ROWS($7:25))),\"\")","v":""},{"$f":"IF(COUNT(S$7:S$26)>=ROWS($7:25),INDEX(S$7:S$26,SMALL(IF(ISNUMBER(S$7:S$26),ROW(INDIRECT(\"1:\"&ROWS(S$7:S$26)))),ROWS($7:25))),\"\")","v":""},{"$f":"IF(COUNT(T$7:T$26)>=ROWS($7:25),INDEX(T$7:T$26,SMALL(IF(ISNUMBER(T$7:T$26),ROW(INDIRECT(\"1:\"&ROWS(T$7:T$26)))),ROWS($7:25))),\"\")","v":""},{"$f":"IF(COUNT(U$7:U$26)>=ROWS($7:25),INDEX(U$7:U$26,SMALL(IF(ISNUMBER(U$7:U$26),ROW(INDIRECT(\"1:\"&ROWS(U$7:U$26)))),ROWS($7:25))),\"\")","v":""},{"$f":"IF(COUNT(V$7:V$26)>=ROWS($7:25),INDEX(V$7:V$26,SMALL(IF(ISNUMBER(V$7:V$26),ROW(INDIRECT(\"1:\"&ROWS(V$7:V$26)))),ROWS($7:25))),\"\")","v":""},{"$f":"IF(COUNT(W$7:W$26)>=ROWS($7:25),INDEX(W$7:W$26,SMALL(IF(ISNUMBER(W$7:W$26),ROW(INDIRECT(\"1:\"&ROWS(W$7:W$26)))),ROWS($7:25))),\"\")","v":""},{"$f":"IF(COUNT(X$7:X$26)>=ROWS($7:25),INDEX(X$7:X$26,SMALL(IF(ISNUMBER(X$7:X$26),ROW(INDIRECT(\"1:\"&ROWS(X$7:X$26)))),ROWS($7:25))),\"\")","v":""},{"$f":"IF(COUNT(Y$7:Y$26)>=ROWS($7:25),INDEX(Y$7:Y$26,SMALL(IF(ISNUMBER(Y$7:Y$26),ROW(INDIRECT(\"1:\"&ROWS(Y$7:Y$26)))),ROWS($7:25))),\"\")","v":""},{"$f":"IF(COUNT(Z$7:Z$26)>=ROWS($7:25),INDEX(Z$7:Z$26,SMALL(IF(ISNUMBER(Z$7:Z$26),ROW(INDIRECT(\"1:\"&ROWS(Z$7:Z$26)))),ROWS($7:25))),\"\")","v":""}]
["0Ah",20,{"$f":"IF(#REF!=\"\",\"\",VALUE(#REF!))","v":{"$error":"#REF!"}},{"$f":"IF(Accueil!B34=0,\"\",IF(Accueil!B34=\"\",\"\",Accueil!B34))","v":""},{"$f":"IF(C26=\"\",\"\",MID(Accueil!D34,1,1))","v":{"$error":"#REF!"}},{"$error":"#REF!"},{"$error":"#REF!"},{"$error":"#REF!"},{"$error":"#REF!"},{"$error":"#REF!"},{"$error":"#REF!"},{"$error":"#REF!"},{"$error":"#REF!"},{"$error":"#REF!"},{"$error":"#REF!"},{"$error":"#REF!"},{"$error":"#REF!"},{"$error":"#REF!"},{"$error":"#REF!"},{"$error":"#REF!"},{"$error":"#REF!"},{"$error":"#REF!"},{"$error":"#REF!"},{"$error":"#REF!"},{"$error":"#REF!"},{"$error":"#REF!"},null,{"$f":"IF(COUNT(F$7:F$26)>=ROWS($7:26),INDEX(F$7:F$26,SMALL(IF(ISNUMBER(F$7:F$26),ROW(INDIRECT(\"1:\"&ROWS(F$7:F$26)))),ROWS($7:26))),\"\")","v":""},{"$f":"IF(COUNT(G$7:G$26)>=ROWS($7:26),INDEX(G$7:G$26,SMALL(IF(ISNUMBER(G$7:G$26),ROW(INDIRECT(\"1:\"&ROWS(G$7:G$26)))),ROWS($7:26))),\"\")","v":""},{"$f":"IF(COUNT(H$7:H$26)>=ROWS($7:26),INDEX(H$7:H$26,SMALL(IF(ISNUMBER(H$7:H$26),ROW(INDIRECT(\"1:\"&ROWS(H$7:H$26)))),ROWS($7:26))),\"\")","v":""},{"$f":"IF(COUNT(I$7:I$26)>=ROWS($7:26),INDEX(I$7:I$26,SMALL(IF(ISNUMBER(I$7:I$26),ROW(INDIRECT(\"1:\"&ROWS(I$7:I$26)))),ROWS($7:26))),\"\")","v":""},{"$f":"IF(COUNT(J$7:J$26)>=ROWS($7:26),INDEX(J$7:J$26,SMALL(IF(ISNUMBER(J$7:J$26),ROW(INDIRECT(\"1:\"&ROWS(J$7:J$26)))),ROWS($7:26))),\"\")","v":""},{"$f":"IF(COUNT(K$7:K$26)>=ROWS($7:26),INDEX(K$7:K$26,SMALL(IF(ISNUMBER(K$7:K$26),ROW(INDIRECT(\"1:\"&ROWS(K$7:K$26)))),ROWS($7:26))),\"\")","v":""},{"$f":"IF(COUNT(L$7:L$26)>=ROWS($7:26),INDEX(L$7:L$26,SMALL(IF(ISNUMBER(L$7:L$26),ROW(INDIRECT(\"1:\"&ROWS(L$7:L$26)))),ROWS($7:26))),\"\")","v":""},{"$f":"IF(COUNT(M$7:M$26)>=ROWS($7:26),INDEX(M$7:M$26,SMALL(IF(ISNUMBER(M$7:M$26),ROW(INDIRECT(\"1:\"&ROWS(M$7:M$26)))),ROWS($7:26))),\"\")","v":""},{"$f":"IF(COUNT(N$7:N$26)>=ROWS($7:26),INDEX(N$7:N$26,SMALL(IF(ISNUMBER(N$7:N$26),ROW(INDIRECT(\"1:\"&ROWS(N$7:N$26)))),ROWS($7:26))),\"\")","v":""},{"$f":"IF(COUNT(O$7:O$26)>=ROWS($7:26),INDEX(O$7:O$26,SMALL(IF(ISNUMBER(O$7:O$26),ROW(INDIRECT(\"1:\"&ROWS(O$7:O$26)))),ROWS($7:26))),\"\")","v":""},{"$f":"IF(COUNT(P$7:P$26)>=ROWS($7:26),INDEX(P$7:P$26,SMALL(IF(ISNUMBER(P$7:P$26),ROW(INDIRECT(\"1:\"&ROWS(P$7:P$26)))),ROWS($7:26))),\"\")","v":""},{"$f":"IF(COUNT(Q$7:Q$26)>=ROWS($7:26),INDEX(Q$7:Q$26,SMALL(IF(ISNUMBER(Q$7:Q$26),ROW(INDIRECT(\"1:\"&ROWS(Q$7:Q$26)))),ROWS($7:26))),\"\")","v":""},{"$f":"IF(COUNT(R$7:R$26)>=ROWS($7:26),INDEX(R$7:R$26,SMALL(IF(ISNUMBER(R$7:R$26),ROW(INDIRECT(\"1:\"&ROWS(R$7:R$26)))),ROWS($7:26))),\"\")","v":""},{"$f":"IF(COUNT(S$7:S$26)>=ROWS($7:26),INDEX(S$7:S$26,SMALL(IF(ISNUMBER(S$7:S$26),ROW(INDIRECT(\"1:\"&ROWS(S$7:S$26)))),ROWS($7:26))),\"\")","v":""},{"$f":"IF(COUNT(T$7:T$26)>=ROWS($7:26),INDEX(T$7:T$26,SMALL(IF(ISNUMBER(T$7:T$26),ROW(INDIRECT(\"1:\"&ROWS(T$7:T$26)))),ROWS($7:26))),\"\")","v":""},{"$f":"IF(COUNT(U$7:U$26)>=ROWS($7:26),INDEX(U$7:U$26,SMALL(IF(ISNUMBER(U$7:U$26),ROW(INDIRECT(\"1:\"&ROWS(U$7:U$26)))),ROWS($7:26))),\"\")","v":""},{"$f":"IF(COUNT(V$7:V$26)>=ROWS($7:26),INDEX(V$7:V$26,SMALL(IF(ISNUMBER(V$7:V$26),ROW(INDIRECT(\"1:\"&ROWS(V$7:V$26)))),ROWS($7:26))),\"\")","v":""},{"$f":"IF(COUNT(W$7:W$26)>=ROWS($7:26),INDEX(W$7:W$26,SMALL(IF(ISNUMBER(W$7:W$26),ROW(INDIRECT(\"1:\"&ROWS(W$7:W$26)))),ROWS($7:26))),\"\")","v":""},{"$f":"IF(COUNT(X$7:X$26)>=ROWS($7:26),INDEX(X$7:X$26,SMALL(IF(ISNUMBER(X$7:X$26),ROW(INDIRECT(\"1:\"&ROWS(X$7:X$26)))),ROWS($7:26))),\"\")","v":""},{"$f":"IF(COUNT(Y$7:Y$26)>=ROWS($7:26),INDEX(Y$7:Y$26,SMALL(IF(ISNUMBER(Y$7:Y$26),ROW(INDIRECT(\"1:\"&ROWS(Y$7:Y$26)))),ROWS($7:26))),\"\")","v":""},{"$f":"IF(COUNT(Z$7:Z$26)>=ROWS($7:26),INDEX(Z$7:Z$26,SMALL(IF(ISNUMBER(Z$7:Z$26),ROW(INDIRECT(\"1:\"&ROWS(Z$7:Z$26)))),ROWS($7:26))),\"\")","v":""}]
["0Am"]
["0Af",null,null,null,null,1,2,3,4,5,6,7,8,9,10,11,12,13,14,15,16,17,18,19,20]
[null,null,null,null,{"$f":"IF(F29=\"\",\"\",\"6 Ah\")","v":""},{"$f":"OFFSET($AB7,COLUMN()-COLUMN($F29),)","v":""},{"$f":"OFFSET($AB7,COLUMN()-COLUMN($F29),)","v":""},"","","","","","","","","","","","","","","","","","",null,{"$f":"IF(E29=\"\",\"\",1)","v":""},{"$f":"E29&\" \"&F29&\" \"&G29&\" \"&H29&\" \"&I29&\" \"&J29&\" \"&K29&\" \"&L29&\" \"&M29&\" \"&N29&\" \"&O29&\" \"&P29&\" \"&Q29&\" \"&R29&\" \"&S29&\" \"&T29&\" \"&U29&\" \"&V29&\" \"&W29&\" \"&X29&\" \"&Y29","v":"                    "},null,null,null,null,null,{"$f":"IF(COUNT(AA$29:AA$49)>=ROWS($29:29),INDEX(AA$29:AA$49,SMALL(IF(ISNUMBER(AA$29:AA$49),ROW(INDIRECT(\"1:\"&ROWS(AA$29:AA$49)))),ROWS($29:29))),\"\")","v":""},{"$f":"IF(AH29=\"\",\"\",VLOOKUP(AH29,$AA$29:$AB$49,2,FALSE))","v":""}]
[null,null,null,6,{"$f":"IF(F30=\"\",\"\",\"6 Am\")","v":""},{"$f":"OFFSET($AC7,COLUMN()-COLUMN($F30),)","v":""},{"$f":"OFFSET($AC7,COLUMN()-COLUMN($F30),)","v":""},"","","","","","","","","","","","","","","","","","",null,{"$f":"IF(E30=\"\",\"\",2)","v":""},{"$f":"E30&\" \"&F30&\" \"&G30&\" \"&H30&\" \"&I30&\" \"&J30&\" \"&K30&\" \"&L30&\" \"&M30&\" \"&N30&\" \"&O30&\" \"&P30&\" \"&Q30&\" \"&R30&\" \"&S30&\" \"&T30&\" \"&U30&\" \"&V30&\" \"&W30&\" \"&X30&\" \"&Y30","v":"                    "},null,null,null,null,null,{"$f":"IF(COUNT(AA$29:AA$49)>=ROWS($29:30),INDEX(AA$29:AA$49,SMALL(IF(ISNUMBER(AA$29:AA$49),ROW(INDIRECT(\"1:\"&ROWS(AA$29:AA$49)))),ROWS($29:30))),\"\")","v":""},{"$f":"IF(AH30=\"\",\"\",VLOOKUP(AH30,$AA$29:$AB$49,2,FALSE))","v":""}]
[null,null,null,null,{"$f":"IF(F31=\"\",\"\",\"6 Af\")","v":""},{"$f":"OFFSET($AD7,COLUMN()-COLUMN($F31),)","v":""},{"$f":"OFFSET($AD7,COLUMN()-COLUMN($F31),)","v":""},"","","","","","","","","","","","","","","","","","",null,{"$f":"IF(E31=\"\",\"\",3)","v":""},{"$f":"E31&\" \"&F31&\" \"&G31&\" \"&H31&\" \"&I31&\" \"&J31&\" \"&K31&\" \"&L31&\" \"&M31&\" \"&N31&\" \"&O31&\" \"&P31&\" \"&Q31&\" \"&R31&\" \"&S31&\" \"&T31&\" \"&U31&\" \"&V31&\" \"&W31&\" \"&X31&\" \"&Y31","v":"                    "},null,null,null,null,null,{"$f":"IF(COUNT(AA$29:AA$49)>=ROWS($29:31),INDEX(AA$29:AA$49,SMALL(IF(ISNUMBER(AA$29:AA$49),ROW(INDIRECT(\"1:\"&ROWS(AA$29:AA$49)))),ROWS($29:31))),\"\")","v":""},""]
[null,null,null,null,{"$f":"IF(F32=\"\",\"\",\"5 Ah\")","v":""},{"$f":"OFFSET($AE7,COLUMN()-COLUMN($F32),)","v":""},{"$f":"OFFSET($AE7,COLUMN()-COLUMN($F32),)","v":""},"","","","","","","","","","","","","","","","","","",null,{"$f":"IF(E32=\"\",\"\",4)","v":""},"                    ",null,null,null,null,null,{"$f":"IF(COUNT(AA$29:AA$49)>=ROWS($29:32),INDEX(AA$29:AA$49,SMALL(IF(ISNUMBER(AA$29:AA$49),ROW(INDIRECT(\"1:\"&ROWS(AA$29:AA$49)))),ROWS($29:32))),\"\")","v":""},""]
[null,null,null,5,{"$f":"IF(F33=\"\",\"\",\"5 Am\")","v":""},{"$f":"OFFSET($AF7,COLUMN()-COLUMN($F33),)","v":""},{"$f":"OFFSET($AF7,COLUMN()-COLUMN($F33),)","v":""},"","","","","","","","","","","","","","","","","","",null,{"$f":"IF(E33=\"\",\"\",5)","v":""},"                    ",null,null,null,null,null,{"$f":"IF(COUNT(AA$29:AA$49)>=ROWS($29:33),INDEX(AA$29:AA$49,SMALL(IF(ISNUMBER(AA$29:AA$49),ROW(INDIRECT(\"1:\"&ROWS(AA$29:AA$49)))),ROWS($29:33))),\"\")","v":""},""]
[null,null,null,null,{"$f":"IF(F34=\"\",\"\",\"5 Af\")","v":""},{"$f":"OFFSET($AG7,COLUMN()-COLUMN($F34),)","v":""},{"$f":"OFFSET($AG7,COLUMN()-COLUMN($F34),)","v":""},"","","","","","","","","","","","","","","","","","",null,{"$f":"IF(E34=\"\",\"\",6)","v":""},"                    ",null,null,null,null,null,{"$f":"IF(COUNT(AA$29:AA$49)>=ROWS($29:34),INDEX(AA$29:AA$49,SMALL(IF(ISNUMBER(AA$29:AA$49),ROW(INDIRECT(\"1:\"&ROWS(AA$29:AA$49)))),ROWS($29:34))),\"\")","v":""},""]
[null,null,null,null,{"$f":"IF(F35=\"\",\"\",\"4 Ah\")","v":""},{"$f":"OFFSET($AH7,COLUMN()-COLUMN($F35),)","v":""},{"$f":"OFFSET($AH7,COLUMN()-COLUMN($F35),)","v":""},"","","","","","","","","","","","","","","","","","",null,{"$f":"IF(E35=\"\",\"\",7)","v":""},"                    ",null,null,null,null,null,{"$f":"IF(COUNT(AA$29:AA$49)>=ROWS($29:35),INDEX(AA$29:AA$49,SMALL(IF(ISNUMBER(AA$29:AA$49),ROW(INDIRECT(\"1:\"&ROWS(AA$29:AA$49)))),ROWS($29:35))),\"\")","v":""},""]
[null,null,null,4,{"$f":"IF(F36=\"\",\"\",\"4 Am\")","v":""},{"$f":"OFFSET($AI7,COLUMN()-COLUMN($F36),)","v":""},{"$f":"OFFSET($AI7,COLUMN()-COLUMN($F36),)","v":""},"","","","","","","","","","","","","","","","","","",null,{"$f":"IF(E36=\"\",\"\",8)","v":""},"                    ",null,null,null,null,null,{"$f":"IF(COUNT(AA$29:AA$49)>=ROWS($29:36),INDEX(AA$29:AA$49,SMALL(IF(ISNUMBER(AA$29:AA$49),ROW(INDIRECT(\"1:\"&ROWS(AA$29:AA$49)))),ROWS($29:36))),\"\")","v":""},""]
[null,null,null,null,{"$f":"IF(F37=\"\",\"\",\"4 Af\")","v":""},{"$f":"OFFSET($AJ7,COLUMN()-COLUMN($F37),)","v":""},{"$f":"OFFSET($AJ7,COLUMN()-COLUMN($F37),)","v":""},"","","","","","","","","","","","","","","","","","",null,{"$f":"IF(E37=\"\",\"\",9)","v":""},"                    ",null,null,null,null,null,{"$f":"IF(COUNT(AA$29:AA$49)>=ROWS($29:37),INDEX(AA$29:AA$49,SMALL(IF(ISNUMBER(AA$29:AA$49),ROW(INDIRECT(\"1:\"&ROWS(AA$29:AA$49)))),ROWS($29:37))),\"\")","v":""},""]
[null,null,null,null,{"$f":"IF(F38=\"\",\"\",\"3 Ah\")","v":""},{"$f":"OFFSET($AK7,COLUMN()-COLUMN($F38),)","v":""},{"$f":"OFFSET($AK7,COLUMN()-COLUMN($F38),)","v":""},"","","","","","","","","","","","","","","","","","",null,{"$f":"IF(E38=\"\",\"\",10)","v":""},"                    ",null,null,null,null,null,{"$f":"IF(COUNT(AA$29:AA$49)>=ROWS($29:38),INDEX(AA$29:AA$49,SMALL(IF(ISNUMBER(AA$29:AA$49),ROW(INDIRECT(\"1:\"&ROWS(AA$29:AA$49)))),ROWS($29:38))),\"\")","v":""},""]
[null,null,null,3,{"$f":"IF(F39=\"\",\"\",\"3 Am\")","v":""},{"$f":"OFFSET($AL7,COLUMN()-COLUMN($F39),)","v":""},{"$f":"OFFSET($AL7,COLUMN()-COLUMN($F39),)","v":""},"","","","","","","","","","","","","","","","","","",null,{"$f":"IF(E39=\"\",\"\",11)","v":""},"                    ",null,null,null,null,null,{"$f":"IF(COUNT(AA$29:AA$49)>=ROWS($29:39),INDEX(AA$29:AA$49,SMALL(IF(ISNUMBER(AA$29:AA$49),ROW(INDIRECT(\"1:\"&ROWS(AA$29:AA$49)))),ROWS($29:39))),\"\")","v":""},""]
[null,null,null,null,{"$f":"IF(F40=\"\",\"\",\"3 Af\")","v":""},{"$f":"OFFSET($AM7,COLUMN()-COLUMN($F40),)","v":""},{"$f":"OFFSET($AM7,COLUMN()-COLUMN($F40),)","v":""},"","","","","","","","","","","","","","","","","","",null,{"$f":"IF(E40=\"\",\"\",12)","v":""},"                    ",null,null,null,null,null,{"$f":"IF(COUNT(AA$29:AA$49)>=ROWS($29:40),INDEX(AA$29:AA$49,SMALL(IF(ISNUMBER(AA$29:AA$49),ROW(INDIRECT(\"1:\"&ROWS(AA$29:AA$49)))),ROWS($29:40))),\"\")","v":""},""]
[null,null,null,null,{"$f":"IF(F41=\"\",\"\",\"2 Ah\")","v":""},{"$f":"OFFSET($AN7,COLUMN()-COLUMN($F41),)","v":""},{"$f":"OFFSET($AN7,COLUMN()-COLUMN($F41),)","v":""},"","","","","","","","","","","","","","","","","","",null,{"$f":"IF(E41=\"\",\"\",13)","v":""},"                    ",null,null,null,null,null,{"$f":"IF(COUNT(AA$29:AA$49)>=ROWS($29:41),INDEX(AA$29:AA$49,SMALL(IF(ISNUMBER(AA$29:AA$49),ROW(INDIRECT(\"1:\"&ROWS(AA$29:AA$49)))),ROWS($29:41))),\"\")","v":""},""]
[null,null,null,2,{"$f":"IF(F42=\"\",\"\",\"2 Am\")","v":""},{"$f":"OFFSET($AO7,COLUMN()-COLUMN($F42),)","v":""},{"$f":"OFFSET($AO7,COLUMN()-COLUMN($F42),)","v":""},"","","","","","","","","","","","","","","","","","",null,{"$f":"IF(E42=\"\",\"\",14)","v":""},"                    ",null,null,null,null,null,{"$f":"IF(COUNT(AA$29:AA$49)>=ROWS($29:42),INDEX(AA$29:AA$49,SMALL(IF(ISNUMBER(AA$29:AA$49),ROW(INDIRECT(\"1:\"&ROWS(AA$29:AA$49)))),ROWS($29:42))),\"\")","v":""},""]
[null,null,null,null,{"$f":"IF(F43=\"\",\"\",\"2 Af\")","v":""},{"$f":"OFFSET($AP7,COLUMN()-COLUMN($F43),)","v":""},{"$f":"OFFSET($AP7,COLUMN()-COLUMN($F43),)","v":""},"","","","","","","","","","","","","","","","","","",null,{"$f":"IF(E43=\"\",\"\",15)","v":""},"                    ",null,null,null,null,null,{"$f":"IF(COUNT(AA$29:AA$49)>=ROWS($29:43),INDEX(AA$29:AA$49,SMALL(IF(ISNUMBER(AA$29:AA$49),ROW(INDIRECT(\"1:\"&ROWS(AA$29:AA$49)))),ROWS($29:43))),\"\")","v":""},""]
[null,null,null,null,{"$f":"IF(F44=\"\",\"\",\"1 Ah\")","v":""},{"$f":"OFFSET($AQ7,COLUMN()-COLUMN($F44),)","v":""},{"$f":"OFFSET($AQ7,COLUMN()-COLUMN($F44),)","v":""},"","","","","","","","","","","","","","","","","","",null,{"$f":"IF(E44=\"\",\"\",16)","v":""},"                    ",null,null,null,null,null,{"$f":"IF(COUNT(AA$29:AA$49)>=ROWS($29:44),INDEX(AA$29:AA$49,SMALL(IF(ISNUMBER(AA$29:AA$49),ROW(INDIRECT(\"1:\"&ROWS(AA$29:AA$49)))),ROWS($29:44))),\"\")","v":""},""]
[null,null,null,1,{"$f":"IF(F45=\"\",\"\",\"1 Am\")","v":""},{"$f":"OFFSET($AR7,COLUMN()-COLUMN($F45),)","v":""},{"$f":"OFFSET($AR7,COLUMN()-COLUMN($F45),)","v":""},"","","","","","","","","","","","","","","","","","",null,{"$f":"IF(E45=\"\",\"\",17)","v":""},"                    ",null,null,null,null,null,{"$f":"IF(COUNT(AA$29:AA$49)>=ROWS($29:45),INDEX(AA$29:AA$49,SMALL(IF(ISNUMBER(AA$29:AA$49),ROW(INDIRECT(\"1:\"&ROWS(AA$29:AA$49)))),ROWS($29:45))),\"\")","v":""},""]
[null,null,null,null,{"$f":"IF(F46=\"\",\"\",\"1 Af\")","v":""},{"$f":"OFFSET($AS7,COLUMN()-COLUMN($F46),)","v":""},{"$f":"OFFSET($AS7,COLUMN()-COLUMN($F46),)","v":""},"","","","","","","","","","","","","","","","","","",null,{"$f":"IF(E46=\"\",\"\",18)","v":""},"                    ",null,null,null,null,null,{"$f":"IF(COUNT(AA$29:AA$49)>=ROWS($29:46),INDEX(AA$29:AA$49,SMALL(IF(ISNUMBER(AA$29:AA$49),ROW(INDIRECT(\"1:\"&ROWS(AA$29:AA$49)))),ROWS($29:46))),\"\")","v":""},""]
[null,null,null,null,{"$f":"IF(F47=\"\",\"\",\"0 Ah\")","v":""},{"$f":"OFFSET($AT7,COLUMN()-COLUMN($F47),)","v":""},{"$f":"OFFSET($AT7,COLUMN()-COLUMN($F47),)","v":""},"","","","","","","","","","","","","","","","","","",null,{"$f":"IF(E47=\"\",\"\",19)","v":""},"                    ",null,null,null,null,null,{"$f":"IF(COUNT(AA$29:AA$49)>=ROWS($29:47),INDEX(AA$29:AA$49,SMALL(IF(ISNUMBER(AA$29:AA$49),ROW(INDIRECT(\"1:\"&ROWS(AA$29:AA$49)))),ROWS($29:47))),\"\")","v":""},""]
[null,null,null,0,{"$f":"IF(F48=\"\",\"\",\"0 Am\")","v":""},{"$f":"OFFSET($AU7,COLUMN()-COLUMN($F48),)","v":""},{"$f":"OFFSET($AU7,COLUMN()-COLUMN($F48),)","v":""},"","","","","","","","","","","","","","","","","","",null,{"$f":"IF(E48=\"\",\"\",20)","v":""},"                    ",null,null,null,null,null,{"$f":"IF(COUNT(AA$29:AA$49)>=ROWS($29:48),INDEX(AA$29:AA$49,SMALL(IF(ISNUMBER(AA$29:AA$49),ROW(INDIRECT(\"1:\"&ROWS(AA$29:AA$49)))),ROWS($29:48))),\"\")","v":""},""]
[null,null,null,null,{"$f":"IF(F49=\"\",\"\",\"0 Af\")","v":""},{"$f":"OFFSET($AV7,COLUMN()-COLUMN($F49),)","v":""},{"$f":"OFFSET($AV7,COLUMN()-COLUMN($F49),)","v":""},"","","","","","","","","","","","","","","","","","",null,{"$f":"IF(E49=\"\",\"\",21)","v":""},"                    ",null,null,null,null,null,{"$f":"IF(COUNT(AA$29:AA$49)>=ROWS($29:49),INDEX(AA$29:AA$49,SMALL(IF(ISNUMBER(AA$29:AA$49),ROW(INDIRECT(\"1:\"&ROWS(AA$29:AA$49)))),ROWS($29:49))),\"\")","v":""},""]
[]
[]
[null,null,null,null,{"$f":"AI29&AI30&AI31&AI32&AI33&AI34&AI35&AI36&AI37&AI38&AI39&AI40","v":""}]

{"sheet":" eliminer le tiers des partants","index":7,"n_rows":30,"n_cols":41,"rows_kept":30,"cut":false,"hidden":false,"merged":[[1,1,1,15],[3,6,3,7],[6,3,6,5],[6,7,6,8],[29,2,29,4],[29,5,29,6],[29,7,29,12]]}
[]
[null,"Méthode TIERCÉS DE TROT \"Éliminez à coup sûr le tiers des partants\" "]
[]
[null,null,null,null,null,null,"Allocation du jour",null,70000]
[null,null,null,null,null,null,null,null,{"$f":"I4/1000","v":70}]
[]
[null,null,null,"Cotes",null,null,"Places","Allocations"]
[null,"N°","Cheval","Probable","Probable","Dernière","Moyenne","Dernière","A.J Der.","Total","Class't","Éliminés","Rang","N°","N°",null,null,null,null,null,null,null,null,null,null,null,{"$f":"IF(B8=\"\",\"\",B8)","v":"N°"},null,null,null,null,null,{"$f":"IF(B8=\"\",\"\",B8)","v":"N°"},null,{"$f":"IF(AG8=\"\",\"\",AG8)","v":"N°"}]
[null,{"$f":"IF(Accueil!B15=\"\",\"\",Accueil!B15)","v":1},{"$f":"IF(Accueil!C15=\"\",\"\",Accueil!C15)","v":"Daika Vikland  "},3.7,{"$f":"IF(B9=\"\",\"\",IF(D9<5,0,D9/10))","v":0},{"$f":"IF(B9=\"\",\"\",IF(NCV!H6<5,0,NCV!H6/10))","v":15.4},{"$f":"IF(B9=\"\",\"\",AVERAGE(NCV!M6:O6))","v":10.333333333333334},{"$f":"IF(B9=\"\",\"\",ExtNum(NCV!W6)/1000)","v":100},{"$f":"IF(B9=\"\",\"\",($I$5-H9)/5)","v":-6},{"$f":"IF(B9=\"\",\"\",E9+F9+G9+I9)","v":19.733333333333334},{"$f":"IFERROR(IF(B9=\"\",\"\",RANK(J9,$J$9:$J$28,0)+COUNTIF($J$9:J9,J9)-1),\"\")","v":3},{"$f":"IF(B9=\"\",\"\",IF(AND(K9>=1,K9<=6),\"EL\",\" \"))","v":"EL"},{"$f":"IFERROR(IF(B9=\"\",\"\",RANK(AO9,$AO$9:$AO$27,1)+COUNTIF($AO$9:AO9,AO9)-1),\"\")","v":12},{"$f":"IF(B9=\"\",\"\",IF(AND(M9>=1,M9<=6),B9,\" \"))","v":" "},{"$f":"IFERROR(VALUE(N9),\"\")","v":""},null,null,null,null,null,null,null,null,null,null,null,{"$f":"IF(B9=\"\",\"\",B9)","v":1},{"$f":"IF(K9=\"\",\"\",K9)","v":3},{"$f":"IF(AB9<=6,AA9,\"\")","v":1},1,{"$f":"VLOOKUP(AD9,$AB$9:$AC$27,2,0)","v":4},null,{"$f":"IF(B9=\"\",\"\",B9)","v":1},{"$f":"IF(M9=\"\",\"\",M9)","v":12},{"$f":"IF(AG9=\"\",\"\",AG9)","v":1},1,{"$f":"VLOOKUP(AJ9,$AH$9:$AI$27,2,0)","v":10},{"$f":"IF(B9=\"\",\"\",IF(NCV!M6=\"Dai\",NCV!N6,NCV!M6))","v":14},{"$f":"IF(B9=\"\",\"\",IF(NCV!N6=\"Dai\",NCV!O6,NCV!N6))","v":10},null,{"$f":"IF(J9<0,\"\",J9)","v":19.733333333333334}]
[null,{"$f":"IF(Accueil!B16=\"\",\"\",Accueil!B16)","v":2},{"$f":"IF(Accueil!C16=\"\",\"\",Accueil!C16)","v":"Dalhium de Grez"},41,{"$f":"IF(B10=\"\",\"\",IF(D10<5,0,D10/10))","v":4.0999999999999996},{"$f":"IF(B10=\"\",\"\",IF(NCV!H7<5,0,NCV!H7/10))","v":10.6},{"$f":"IF(B10=\"\",\"\",AVERAGE(NCV!M7:O7))","v":5.666666666666667},{"$f":"IF(B10=\"\",\"\",ExtNum(NCV!W7)/1000)","v":90},{"$f":"IF(B10=\"\",\"\",($I$5-H10)/5)","v":-4},{"$f":"IF(B10=\"\",\"\",E10+F10+G10+I10)","v":16.366666666666667},{"$f":"IFERROR(IF(B10=\"\",\"\",RANK(J10,$J$9:$J$28,0)+COUNTIF($J$9:J10,J10)-1),\"\")","v":7},{"$f":"IF(B10=\"\",\"\",IF(AND(K10>=1,K10<=6),\"EL\",\" \"))","v":" "},{"$f":"IFERROR(IF(B10=\"\",\"\",RANK(AO10,$AO$9:$AO$27,1)+COUNTIF($AO$9:AO10,AO10)-1),\"\")","v":8},{"$f":"IF(B10=\"\",\"\",IF(AND(M10>=1,M10<=6),B10,\" \"))","v":" "},{"$f":"IFERROR(VALUE(N10),\"\")","v":""},null,null,null,null,null,null,null,null,null,null,null,2,{"$f":"IF(K10=\"\",\"\",K10)","v":7},{"$f":"IF(AB10<=6,AA10,\"\")","v":""},2,{"$f":"VLOOKUP(AD10,$AB$9:$AC$27,2,0)","v":14},null,2,{"$f":"IF(M10=\"\",\"\",M10)","v":8},2,2,{"$f":"VLOOKUP(AJ10,$AH$9:$AI$27,2,0)","v":7},{"$f":"IF(B10=\"\",\"\",IF(NCV!M7=\"Dai\",NCV!N7,NCV!M7))","v":11},{"$f":"IF(B10=\"\",\"\",IF(NCV!N7=\"Dai\",NCV!O7,NCV!N7))","v":2},null,{"$f":"IF(J10<0,\"\",J10)","v":16.366666666666667}]
[null,{"$f":"IF(Accueil!B17=\"\",\"\",Accueil!B17)","v":3},{"$f":"IF(Accueil!C17=\"\",\"\",Accueil!C17)","v":"Espion Volsin  "},7.3,0.73,{"$f":"IF(B11=\"\",\"\",IF(NCV!H8<5,0,NCV!H8/10))","v":2.5},{"$f":"IF(B11=\"\",\"\",AVERAGE(NCV!M8:O8))","v":12.333333333333334},{"$f":"IF(B11=\"\",\"\",ExtNum(NCV!W8)/1000)","v":80},-2,13.563333333333334,{"$f":"IFERROR(IF(B11=\"\",\"\",RANK(J11,$J$9:$J$28,0)+COUNTIF($J$9:J11,J11)-1),\"\")","v":10}," ",{"$f":"IFERROR(IF(B11=\"\",\"\",RANK(AO11,$AO$9:$AO$27,1)+COUNTIF($AO$9:AO11,AO11)-1),\"\")","v":5},3,3,null,null,null,null,null,null,null,null,null,null,null,3,10,"",3,1,null,3,5,3,3,6,{"$f":"IF(B11=\"\",\"\",IF(NCV!M8=\"Dai\",NCV!N8,NCV!M8))","v":8},{"$f":"IF(B11=\"\",\"\",IF(NCV!N8=\"Dai\",NCV!O8,NCV!N8))","v":14},null,13.563333333333334]
[null,{"$f":"IF(Accueil!B18=\"\",\"\",Accueil!B18)","v":4},{"$f":"IF(Accueil!C18=\"\",\"\",Accueil!C18)","v":"Duchesse Fouteau  "},12,1.2,{"$f":"IF(B12=\"\",\"\",IF(NCV!H9<5,0,NCV!H9/10))","v":13.1},{"$f":"IF(B12=\"\",\"\",AVERAGE(NCV!M9:O9))","v":8.6666666666666661},{"$f":"IF(B12=\"\",\"\",ExtNum(NCV!W9)/1000)","v":49},4.2,27.166666666666664,{"$f":"IFERROR(IF(B12=\"\",\"\",RANK(J12,$J$9:$J$28,0)+COUNTIF($J$9:J12,J12)-1),\"\")","v":1},"EL",{"$f":"IFERROR(IF(B12=\"\",\"\",RANK(AO12,$AO$9:$AO$27,1)+COUNTIF($AO$9:AO12,AO12)-1),\"\")","v":14}," ","",null,null,null,null,null,null,null,null,null,null,null,4,1,4,4,9,null,4,14,4,4,11,{"$f":"IF(B12=\"\",\"\",IF(NCV!M9=\"Dai\",NCV!N9,NCV!M9))","v":14},{"$f":"IF(B12=\"\",\"\",IF(NCV!N9=\"Dai\",NCV!O9,NCV!N9))","v":7},null,27.166666666666664]
[null,{"$f":"IF(Accueil!B19=\"\",\"\",Accueil!B19)","v":5},{"$f":"IF(Accueil!C19=\"\",\"\",Accueil!C19)","v":"Chef des Plaines"},87,8.6999999999999993,{"$f":"IF(B13=\"\",\"\",IF(NCV!H10<5,0,NCV!H10/10))","v":2.5},{"$f":"IF(B13=\"\",\"\",AVERAGE(NCV!M10:O10))","v":6.666666666666667},{"$f":"IF(B13=\"\",\"\",ExtNum(NCV!W10)/1000)","v":80},-2,15.866666666666667,{"$f":"IFERROR(IF(B13=\"\",\"\",RANK(J13,$J$9:$J$28,0)+COUNTIF($J$9:J13,J13)-1),\"\")","v":8}," ",{"$f":"IFERROR(IF(B13=\"\",\"\",RANK(AO13,$AO$9:$AO$27,1)+COUNTIF($AO$9:AO13,AO13)-1),\"\")","v":7}," ","",null,null,null,null,null,null,null,null,null,null,null,5,8,"",5,12,null,5,7,5,5,3,{"$f":"IF(B13=\"\",\"\",IF(NCV!M10=\"Dai\",NCV!N10,NCV!M10))","v":5},{"$f":"IF(B13=\"\",\"\",IF(NCV!N10=\"Dai\",NCV!O10,NCV!N10))","v":8},null,15.866666666666667]
[null,{"$f":"IF(Accueil!B20=\"\",\"\",Accueil!B20)","v":6},{"$f":"IF(Accueil!C20=\"\",\"\",Accueil!C20)","v":"Cool Gahn"},5.6,0.55999999999999994,{"$f":"IF(B14=\"\",\"\",IF(NCV!H11<5,0,NCV!H11/10))","v":3.1},{"$f":"IF(B14=\"\",\"\",AVERAGE(NCV!M11:O11))","v":6.666666666666667},{"$f":"IF(B14=\"\",\"\",ExtNum(NCV!W11)/1000)","v":80},-2,8.326666666666668,{"$f":"IFERROR(IF(B14=\"\",\"\",RANK(J14,$J$9:$J$28,0)+COUNTIF($J$9:J14,J14)-1),\"\")","v":12}," ",{"$f":"IFERROR(IF(B14=\"\",\"\",RANK(AO14,$AO$9:$AO$27,1)+COUNTIF($AO$9:AO14,AO14)-1),\"\")","v":3},6,6,null,null,null,null,null,null,null,null,null,null,null,6,12,"",6,13,null,6,3,6,6,8,{"$f":"IF(B14=\"\",\"\",IF(NCV!M11=\"Dai\",NCV!N11,NCV!M11))","v":9},{"$f":"IF(B14=\"\",\"\",IF(NCV!N11=\"Dai\",NCV!O11,NCV!N11))","v":4},null,8.326666666666668]
[null,{"$f":"IF(Accueil!B21=\"\",\"\",Accueil!B21)","v":7},{"$f":"IF(Accueil!C21=\"\",\"\",Accueil!C21)","v":"Elton Magic  "},3.8,0,{"$f":"IF(B15=\"\",\"\",IF(NCV!H12<5,0,NCV!H12/10))","v":0},{"$f":"IF(B15=\"\",\"\",AVERAGE(NCV!M12:O12))","v":4.666666666666667},{"$f":"IF(B15=\"\",\"\",ExtNum(NCV!W12)/1000)","v":53},3.4,8.0666666666666664,{"$f":"IFERROR(IF(B15=\"\",\"\",RANK(J15,$J$9:$J$28,0)+COUNTIF($J$9:J15,J15)-1),\"\")","v":13}," ",{"$f":"IFERROR(IF(B15=\"\",\"\",RANK(AO15,$AO$9:$AO$27,1)+COUNTIF($AO$9:AO15,AO15)-1),\"\")","v":2},7,7,null,null,null,null,null,null,null,null,null,null,null,7,13,"",null,null,null,7,2,7,null,null,{"$f":"IF(B15=\"\",\"\",IF(NCV!M12=\"Dai\",NCV!N12,NCV!M12))","v":1},{"$f":"IF(B15=\"\",\"\",IF(NCV!N12=\"Dai\",NCV!O12,NCV!N12))","v":3},null,8.0666666666666664]
[null,{"$f":"IF(Accueil!B22=\"\",\"\",Accueil!B22)","v":8},{"$f":"IF(Accueil!C22=\"\",\"\",Accueil!C22)","v":"Charly de Yor  "},45,4.5,{"$f":"IF(B16=\"\",\"\",IF(NCV!H13<5,0,NCV!H13/10))","v":5.6},{"$f":"IF(B16=\"\",\"\",AVERAGE(NCV!M13:O13))","v":6},{"$f":"IF(B16=\"\",\"\",ExtNum(NCV!W13)/1000)","v":80},-2,14.100000000000001,{"$f":"IFERROR(IF(B16=\"\",\"\",RANK(J16,$J$9:$J$28,0)+COUNTIF($J$9:J16,J16)-1),\"\")","v":9}," ",{"$f":"IFERROR(IF(B16=\"\",\"\",RANK(AO16,$AO$9:$AO$27,1)+COUNTIF($AO$9:AO16,AO16)-1),\"\")","v":6},8,8,null,null,null,null,null,null,null,null,null,null,null,8,9,"",null,null,null,8,6,8,null,null,{"$f":"IF(B16=\"\",\"\",IF(NCV!M13=\"Dai\",NCV!N13,NCV!M13))","v":7},{"$f":"IF(B16=\"\",\"\",IF(NCV!N13=\"Dai\",NCV!O13,NCV!N13))","v":2},null,14.100000000000001]
[null,{"$f":"IF(Accueil!B23=\"\",\"\",Accueil!B23)","v":9},{"$f":"IF(Accueil!C23=\"\",\"\",Accueil!C23)","v":"Chamar d'Ici   (E1)"},53,5.3,{"$f":"IF(B17=\"\",\"\",IF(NCV!H14<5,0,NCV!H14/10))","v":13.2},{"$f":"IF(B17=\"\",\"\",AVERAGE(NCV!M14:O14))","v":7},{"$f":"IF(B17=\"\",\"\",ExtNum(NCV!W14)/1000)","v":100},-6,19.5,{"$f":"IFERROR(IF(B17=\"\",\"\",RANK(J17,$J$9:$J$28,0)+COUNTIF($J$9:J17,J17)-1),\"\")","v":4},"EL",{"$f":"IFERROR(IF(B17=\"\",\"\",RANK(AO17,$AO$9:$AO$27,1)+COUNTIF($AO$9:AO17,AO17)-1),\"\")","v":11}," ","",null,null,null,null,null,null,null,null,null,null,null,9,4,9,null,null,null,9,11,9,null,null,{"$f":"IF(B17=\"\",\"\",IF(NCV!M14=\"Dai\",NCV!N14,NCV!M14))","v":7},{"$f":"IF(B17=\"\",\"\",IF(NCV!N14=\"Dai\",NCV!O14,NCV!N14))","v":6},null,19.5]
[null,{"$f":"IF(Accueil!B24=\"\",\"\",Accueil!B24)","v":10},{"$f":"IF(Accueil!C24=\"\",\"\",Accueil!C24)","v":"Conflit (E1)"},17,1.7,{"$f":"IF(B18=\"\",\"\",IF(NCV!H15<5,0,NCV!H15/10))","v":2},{"$f":"IF(B18=\"\",\"\",AVERAGE(NCV!M15:O15))","v":5.666666666666667},{"$f":"IF(B18=\"\",\"\",ExtNum(NCV!W15)/1000)","v":90},-4,5.3666666666666671,{"$f":"IFERROR(IF(B18=\"\",\"\",RANK(J18,$J$9:$J$28,0)+COUNTIF($J$9:J18,J18)-1),\"\")","v":14}," ",{"$f":"IFERROR(IF(B18=\"\",\"\",RANK(AO18,$AO$9:$AO$27,1)+COUNTIF($AO$9:AO18,AO18)-1),\"\")","v":1},10,10,null,null,null,null,null,null,null,null,null,null,null,10,14,"",null,null,null,10,1,10,null,null,{"$f":"IF(B18=\"\",\"\",IF(NCV!M15=\"Dai\",NCV!N15,NCV!M15))","v":6},{"$f":"IF(B18=\"\",\"\",IF(NCV!N15=\"Dai\",NCV!O15,NCV!N15))","v":6},null,5.3666666666666671]
[null,{"$f":"IF(Accueil!B25=\"\",\"\",Accueil!B25)","v":11},{"$f":"IF(Accueil!C25=\"\",\"\",Accueil!C25)","v":"Daryl Impey"},32,3.2,{"$f":"IF(B19=\"\",\"\",IF(NCV!H16<5,0,NCV!H16/10))","v":6.2},{"$f":"IF(B19=\"\",\"\",AVERAGE(NCV!M16:O16))","v":3.5},{"$f":"IF(B19=\"\",\"\",ExtNum(NCV!W16)/1000)","v":90},-4,8.9,{"$f":"IFERROR(IF(B19=\"\",\"\",RANK(J19,$J$9:$J$28,0)+COUNTIF($J$9:J19,J19)-1),\"\")","v":11}," ",{"$f":"IFERROR(IF(B19=\"\",\"\",RANK(AO19,$AO$9:$AO$27,1)+COUNTIF($AO$9:AO19,AO19)-1),\"\")","v":4},11,11,null,null,null,null,null,null,null,null,null,null,null,11,11,"",null,null,null,11,4,11,null,null,{"$f":"IF(B19=\"\",\"\",IF(NCV!M16=\"Dai\",NCV!N16,NCV!M16))","v":4},{"$f":"IF(B19=\"\",\"\",IF(NCV!N16=\"Dai\",NCV!O16,NCV!N16))","v":3},null,8.9]
[null,{"$f":"IF(Accueil!B26=\"\",\"\",Accueil!B26)","v":12},{"$f":"IF(Accueil!C26=\"\",\"\",Accueil!C26)","v":"Carla de Flosaille  "},13,1.3,{"$f":"IF(B20=\"\",\"\",IF(NCV!H17<5,0,NCV!H17/10))","v":0.90999999999999992},{"$f":"IF(B20=\"\",\"\",AVERAGE(NCV!M17:O17))","v":9},{"$f":"IF(B20=\"\",\"\",ExtNum(NCV!W17)/1000)","v":36},6.8,18.010000000000002,{"$f":"IFERROR(IF(B20=\"\",\"\",RANK(J20,$J$9:$J$28,0)+COUNTIF($J$9:J20,J20)-1),\"\")","v":5},"EL",{"$f":"IFERROR(IF(B20=\"\",\"\",RANK(AO20,$AO$9:$AO$27,1)+COUNTIF($AO$9:AO20,AO20)-1),\"\")","v":10}," ","",null,null,null,null,null,null,null,null,null,null,null,12,5,12,null,null,null,12,10,12,null,null,{"$f":"IF(B20=\"\",\"\",IF(NCV!M17=\"Dai\",NCV!N17,NCV!M17))","v":13},{"$f":"IF(B20=\"\",\"\",IF(NCV!N17=\"Dai\",NCV!O17,NCV!N17))","v":8},null,18.010000000000002]
[null,{"$f":"IF(Accueil!B27=\"\",\"\",Accueil!B27)","v":13},{"$f":"IF(Accueil!C27=\"\",\"\",Accueil!C27)","v":"Elverina Devavian"},55,5.5,{"$f":"IF(B21=\"\",\"\",IF(NCV!H18<5,0,NCV!H18/10))","v":1},{"$f":"IF(B21=\"\",\"\",AVERAGE(NCV!M18:O18))","v":6.666666666666667},{"$f":"IF(B21=\"\",\"\",ExtNum(NCV!W18)/1000)","v":53},3.4,16.566666666666666,{"$f":"IFERROR(IF(B21=\"\",\"\",RANK(J21,$J$9:$J$28,0)+COUNTIF($J$9:J21,J21)-1),\"\")","v":6},"EL",{"$f":"IFERROR(IF(B21=\"\",\"\",RANK(AO21,$AO$9:$AO$27,1)+COUNTIF($AO$9:AO21,AO21)-1),\"\")","v":9}," ","",null,null,null,null,null,null,null,null,null,null,null,13,6,13,null,null,null,13,9,13,null,null,{"$f":"IF(B21=\"\",\"\",IF(NCV!M18=\"Dai\",NCV!N18,NCV!M18))","v":3},{"$f":"IF(B21=\"\",\"\",IF(NCV!N18=\"Dai\",NCV!O18,NCV!N18))","v":12},null,16.566666666666666]
[null,{"$f":"IF(Accueil!B28=\"\",\"\",Accueil!B28)","v":14},{"$f":"IF(Accueil!C28=\"\",\"\",Accueil!C28)","v":"Cisa du Mouchel  "},null,0,{"$f":"IF(B22=\"\",\"\",IF(NCV!H19<5,0,NCV!H19/10))","v":9.8000000000000007},{"$f":"IF(B22=\"\",\"\",AVERAGE(NCV!M19:O19))","v":10.333333333333334},{"$f":"IF(B22=\"\",\"\",ExtNum(NCV!W19)/1000)","v":67},0.6,20.733333333333334,{"$f":"IFERROR(IF(B22=\"\",\"\",RANK(J22,$J$9:$J$28,0)+COUNTIF($J$9:J22,J22)-1),\"\")","v":2},"EL",{"$f":"IFERROR(IF(B22=\"\",\"\",RANK(AO22,$AO$9:$AO$27,1)+COUNTIF($AO$9:AO22,AO22)-1),\"\")","v":13}," ","",null,null,null,null,null,null,null,null,null,null,null,14,2,14,null,null,null,14,13,14,null,null,{"$f":"IF(B22=\"\",\"\",IF(NCV!M19=\"Dai\",NCV!N19,NCV!M19))","v":10},{"$f":"IF(B22=\"\",\"\",IF(NCV!N19=\"Dai\",NCV!O19,NCV!N19))","v":10},null,20.733333333333334]
[null,{"$f":"IF(Accueil!B29=\"\",\"\",Accueil!B29)","v":""},{"$f":"IF(Accueil!C29=\"\",\"\",Accueil!C29)","v":""},null,"",{"$f":"IF(B23=\"\",\"\",IF(NCV!H20<5,0,NCV!H20/10))","v":""},{"$f":"IF(B23=\"\",\"\",AVERAGE(NCV!M20:O20))","v":""},{"$f":"IF(B23=\"\",\"\",ExtNum(NCV!W20)/1000)","v":""},"","",{"$f":"IFERROR(IF(B23=\"\",\"\",RANK(J23,$J$9:$J$28,0)+COUNTIF($J$9:J23,J23)-1),\"\")","v":""},"",{"$f":"IFERROR(IF(B23=\"\",\"\",RANK(AO23,$AO$9:$AO$27,1)+COUNTIF($AO$9:AO23,AO23)-1),\"\")","v":""},"","",null,null,null,null,null,null,null,null,null,null,null,"","","",null,null,null,"","","",null,null,{"$f":"IF(B23=\"\",\"\",IF(NCV!M20=\"Dai\",NCV!N20,NCV!M20))","v":""},{"$f":"IF(B23=\"\",\"\",IF(NCV!N20=\"Dai\",NCV!O20,NCV!N20))","v":""},null,""]
[null,{"$f":"IF(Accueil!B30=\"\",\"\",Accueil!B30)","v":""},{"$f":"IF(Accueil!C30=\"\",\"\",Accueil!C30)","v":""},null,"",{"$f":"IF(B24=\"\",\"\",IF(NCV!H21<5,0,NCV!H21/10))","v":""},{"$f":"IF(B24=\"\",\"\",AVERAGE(NCV!M21:O21))","v":""},{"$f":"IF(B24=\"\",\"\",ExtNum(NCV!W21)/1000)","v":""},"","",{"$f":"IFERROR(IF(B24=\"\",\"\",RANK(J24,$J$9:$J$28,0)+COUNTIF($J$9:J24,J24)-1),\"\")","v":""},"",{"$f":"IFERROR(IF(B24=\"\",\"\",RANK(AO24,$AO$9:$AO$27,1)+COUNTIF($AO$9:AO24,AO24)-1),\"\")","v":""},"","",null,null,null,null,null,null,null,null,null,null,null,"","","",null,null,null,"","","",null,null,{"$f":"IF(B24=\"\",\"\",IF(NCV!M21=\"Dai\",NCV!N21,NCV!M21))","v":""},{"$f":"IF(B24=\"\",\"\",IF(NCV!N21=\"Dai\",NCV!O21,NCV!N21))","v":""},null,""]
[null,{"$f":"IF(Accueil!B31=\"\",\"\",Accueil!B31)","v":""},{"$f":"IF(Accueil!C31=\"\",\"\",Accueil!C31)","v":""},null,"",{"$f":"IF(B25=\"\",\"\",IF(NCV!H22<5,0,NCV!H22/10))","v":""},{"$f":"IF(B25=\"\",\"\",AVERAGE(NCV!M22:O22))","v":""},{"$f":"IF(B25=\"\",\"\",ExtNum(NCV!W22)/1000)","v":""},"","",{"$f":"IFERROR(IF(B25=\"\",\"\",RANK(J25,$J$9:$J$28,0)+COUNTIF($J$9:J25,J25)-1),\"\")","v":""},"",{"$f":"IFERROR(IF(B25=\"\",\"\",RANK(AO25,$AO$9:$AO$27,1)+COUNTIF($AO$9:AO25,AO25)-1),\"\")","v":""},"","",null,null,null,null,null,null,null,null,null,null,null,"","","",null,null,null,"","","",null,null,{"$f":"IF(B25=\"\",\"\",IF(NCV!M22=\"Dai\",NCV!N22,NCV!M22))","v":""},{"$f":"IF(B25=\"\",\"\",IF(NCV!N22=\"Dai\",NCV!O22,NCV!N22))","v":""},null,""]
[null,{"$f":"IF(Accueil!B32=\"\",\"\",Accueil!B32)","v":""},{"$f":"IF(Accueil!C32=\"\",\"\",Accueil!C32)","v":""},null,"",{"$f":"IF(B26=\"\",\"\",IF(NCV!H23<5,0,NCV!H23/10))","v":""},{"$f":"IF(B26=\"\",\"\",AVERAGE(NCV!M23:O23))","v":""},{"$f":"IF(B26=\"\",\"\",ExtNum(NCV!W23)/1000)","v":""},"","",{"$f":"IFERROR(IF(B26=\"\",\"\",RANK(J26,$J$9:$J$28,0)+COUNTIF($J$9:J26,J26)-1),\"\")","v":""},"",{"$f":"IFERROR(IF(B26=\"\",\"\",RANK(AO26,$AO$9:$AO$27,1)+COUNTIF($AO$9:AO26,AO26)-1),\"\")","v":""},"","",null,null,null,null,null,null,null,null,null,null,null,"","","",null,null,null,"","","",null,null,{"$f":"IF(B26=\"\",\"\",IF(NCV!M23=\"Dai\",NCV!N23,NCV!M23))","v":""},{"$f":"IF(B26=\"\",\"\",IF(NCV!N23=\"Dai\",NCV!O23,NCV!N23))","v":""},null,""]
[null,{"$f":"IF(Accueil!B33=\"\",\"\",Accueil!B33)","v":""},{"$f":"IF(Accueil!C33=\"\",\"\",Accueil!C33)","v":""},null,"",{"$f":"IF(B27=\"\",\"\",IF(NCV!H24<5,0,NCV!H24/10))","v":""},{"$f":"IF(B27=\"\",\"\",AVERAGE(NCV!M24:O24))","v":""},{"$f":"IF(B27=\"\",\"\",ExtNum(NCV!W24)/1000)","v":""},"","",{"$f":"IFERROR(IF(B27=\"\",\"\",RANK(J27,$J$9:$J$28,0)+COUNTIF($J$9:J27,J27)-1),\"\")","v":""},"",{"$f":"IFERROR(IF(B27=\"\",\"\",RANK(AO27,$AO$9:$AO$27,1)+COUNTIF($AO$9:AO27,AO27)-1),\"\")","v":""},"","",null,null,null,null,null,null,null,null,null,null,null,"","","",null,null,null,"","","",null,null,{"$f":"IF(B27=\"\",\"\",IF(NCV!M24=\"Dai\",NCV!N24,NCV!M24))","v":""},{"$f":"IF(B27=\"\",\"\",IF(NCV!N24=\"Dai\",NCV!O24,NCV!N24))","v":""},null,""]
[null,{"$f":"IF(Accueil!B34=\"\",\"\",Accueil!B34)","v":""},{"$f":"IF(Accueil!C34=\"\",\"\",Accueil!C34)","v":""},null,"",{"$f":"IF(B28=\"\",\"\",IF(NCV!H25<5,0,NCV!H25/10))","v":""},{"$f":"IF(B28=\"\",\"\",AVERAGE(NCV!M25:O25))","v":""},{"$f":"IF(B28=\"\",\"\",ExtNum(NCV!W25)/1000)","v":""},"","",{"$f":"IFERROR(IF(B28=\"\",\"\",RANK(J28,$J$9:$J$28,0)+COUNTIF($J$9:J28,J28)-1),\"\")","v":""},"",{"$f":"IFERROR(IF(B28=\"\",\"\",RANK(AO28,$AO$9:$AO$27,1)+COUNTIF($AO$9:AO28,AO28)-1),\"\")","v":""},"",""]
[]
["Éliminés",null,{"$f":"AE9&\"-\"&AE10&\"-\"&AE11&\"-\"&AE12&\"-\"&AE13&\"-\"&AE14","v":"4-14-1-9-12-13"},null,null,"Sélection",null,{"$f":"AK9&\"-\"&AK10&\"-\"&AK11&\"-\"&AK12&\"-\"&AK13&\"-\"&AK14","v":"10-7-6-11-3-8"}]