{"text_format":"1","workbook":"xlsx","n_sheets":3,"sheets":["bilan","donne","installer"],"not_rendered":{"charts":0,"images":3,"macros":1,"external_links":0,"defined_names":14,"comments":1,"pivot_tables":0},"unopened":[],"bounds":{"document_bytes":16777216,"sheet_cells":100000,"rows_first":2000,"rows_last":500,"rows_between":2000,"halvings":0,"cell_chars":16384,"cell_head_chars":4096},"cells_cut":0,"cells_raw":0,"read":"whole","date_system":"1900"}

{"sheet":"bilan","index":0,"n_rows":36,"n_cols":154,"rows_kept":36,"cut":false,"hidden":false,"merged":[[30,16,30,17],[31,16,31,17],[32,16,32,17],[15,16,15,18],[4,16,4,17],[5,16,5,17],[6,16,6,17],[7,16,7,17],[8,16,8,17],[9,16,9,17],[10,16,10,17],[11,16,11,17],[12,16,12,17],[13,16,13,17],[14,16,14,17],[16,16,16,17],[18,16,18,17],[20,16,20,17],[30,1,30,11],[32,1,32,11],[27,1,27,11],[28,1,28,11],[20,5,20,11],[24,1,24,11],[25,1,25,11],[26,1,26,11],[6,7,6,8],[8,5,8,6],[14,9,14,10],[16,6,16,7],[19,5,19,10],[17,9,17,10],[13,6,13,7],[18,9,18,10],[8,7,8,8],[7,5,7,6],[6,1,6,2],[10,1,10,12],[12,2,12,3],[12,9,12,10],[13,2,13,3],[19,2,19,3],[20,2,20,3],[21,2,21,3],[12,4,12,5],[12,6,12,7],[13,4,13,5],[14,4,14,5],[14,6,14,8],[15,4,15,5],[2,13,3,13],[7,2,7,4],[14,2,14,3],[15,2,15,3],[16,2,16,3],[17,2,17,3],[18,2,18,3],[6,3,6,4],[7,7,7,8],[4,5,4,6],[5,5,5,6],[5,7,5,8],[5,9,5,10],[6,5,6,6],[17,147,20,148],[1,151,1,152],[29,1,29,11],[2,7,2,10],[0,16,1,25],[3,16,3,18],[3,1,3,2],[5,2,5,4],[4,7,4,9],[22,16,22,17],[27,16,27,17],[28,16,28,17],[17,16,17,17],[19,16,19,17],[21,16,21,17],[26,16,26,18],[29,16,29,17],[15,6,15,8],[12,11,12,12],[13,11,13,12],[15,9,15,10],[11,1,11,3],[11,4,11,8],[2,11,2,12],[5,11,5,12],[11,9,11,12],[16,4,16,5],[18,4,18,5],[18,6,18,8],[13,9,13,10],[16,9,16,10],[14,11,14,12],[15,11,15,12],[16,11,16,12],[17,11,17,12],[41,1,41,11],[33,1,33,11],[34,1,34,11],[35,1,35,11],[36,1,36,11],[47,1,47,11],[48,1,48,11],[49,1,49,11],[50,1,50,11],[51,1,51,11],[42,1,42,11],[43,1,43,11],[44,1,44,11],[45,1,45,11],[46,1,46,11],[57,1,57,11],[58,1,58,11],[37,1,37,11],[38,1,38,11],[40,1,40,11],[59,1,59,11],[60,1,60,11],[61,1,61,11],[52,1,52,11],[53,1,53,11],[54,1,54,11],[55,1,55,11],[56,1,56,11],[67,1,67,11],[68,1,68,11],[69,1,69,11],[70,1,70,11],[71,1,71,11],[62,1,62,11],[63,1,63,11],[64,1,64,11],[65,1,65,11],[66,1,66,11],[77,1,77,11],[78,1,78,11],[79,1,79,11],[80,1,80,11],[81,1,81,11],[72,1,72,11],[73,1,73,11],[74,1,74,11],[75,1,75,11],[76,1,76,11],[87,1,87,11],[88,1,88,11],[89,1,89,11],[90,1,90,11],[91,1,91,11],[82,1,82,11],[83,1,83,11],[84,1,84,11],[85,1,85,11],[86,1,86,11],[97,1,97,11],[98,1,98,11],[99,1,99,11],[100,1,100,11],[101,1,101,11],[92,1,92,11],[93,1,93,11],[94,1,94,11],[95,1,95,11],[96,1,96,11],[107,1,107,11],[108,1,108,11],[109,1,109,11],[110,1,110,11],[111,1,111,11],[102,1,102,11],[103,1,103,11],[104,1,104,11],[105,1,105,11],[106,1,106,11],[117,1,117,11],[118,1,118,11],[119,1,119,11],[120,1,120,11],[121,1,121,11],[112,1,112,11],[113,1,113,11],[114,1,114,11],[115,1,115,11],[116,1,116,11],[127,1,127,11],[128,1,128,11],[129,1,129,11],[130,1,130,11],[131,1,131,11],[122,1,122,11],[123,1,123,11],[124,1,124,11],[125,1,125,11],[126,1,126,11],[137,1,137,11],[138,1,138,11],[139,1,139,11],[140,1,140,11],[141,1,141,11],[132,1,132,11],[133,1,133,11],[134,1,134,11],[135,1,135,11],[136,1,136,11],[147,1,147,11],[148,1,148,11],[149,1,149,11],[150,1,150,11],[151,1,151,11],[142,1,142,11],[143,1,143,11],[144,1,144,11],[145,1,145,11],[146,1,146,11],[157,1,157,11],[158,1,158,11],[159,1,159,11],[160,1,160,11],[161,1,161,11],[152,1,152,11],[153,1,153,11],[154,1,154,11],[155,1,155,11],[156,1,156,11],[167,1,167,11],[168,1,168,11],[169,1,169,11],[170,1,170,11],[171,1,171,11],[162,1,162,11],[163,1,163,11],[164,1,164,11],[165,1,165,11],[166,1,166,11],[177,1,177,11],[178,1,178,11],[179,1,179,11],[180,1,180,11],[181,1,181,11],[172,1,172,11],[173,1,173,11],[174,1,174,11],[175,1,175,11],[176,1,176,11],[187,1,187,11],[188,1,188,11],[189,1,189,11],[190,1,190,11],[191,1,191,11],[182,1,182,11],[183,1,183,11],[184,1,184,11],[185,1,185,11],[186,1,186,11],[197,1,197,11],[198,1,198,11],[199,1,199,11],[200,1,200,11],[201,1,201,11],[192,1,192,11],[193,1,193,11],[194,1,194,11],[195,1,195,11],[196,1,196,11],[207,1,207,11],[208,1,208,11],[209,1,209,11],[210,1,210,11],[211,1,211,11],[202,1,202,11],[203,1,203,11],[204,1,204,11],[205,1,205,11],[206,1,206,11],[217,1,217,11],[218,1,218,11],[219,1,219,11],[220,1,220,11],[221,1,221,11],[212,1,212,11],[213,1,213,11],[214,1,214,11],[215,1,215,11],[216,1,216,11],[227,1,227,11],[228,1,228,11],[229,1,229,11],[230,1,230,11],[231,1,231,11],[222,1,222,11],[223,1,223,11],[224,1,224,11],[225,1,225,11],[226,1,226,11],[237,1,237,11],[238,1,238,11],[239,1,239,11],[240,1,240,11],[241,1,241,11],[232,1,232,11],[233,1,233,11],[234,1,234,11],[235,1,235,11],[236,1,236,11],[247,1,247,11],[248,1,248,11],[249,1,249,11],[250,1,250,11],[251,1,251,11],[242,1,242,11],[243,1,243,11],[244,1,244,11],[245,1,245,11],[246,1,246,11],[257,1,257,11],[258,1,258,11],[259,1,259,11],[260,1,260,11],[261,1,261,11],[252,1,252,11],[253,1,253,11],[254,1,254,11],[255,1,255,11],[256,1,256,11],[267,1,267,11],[268,1,268,11],[269,1,269,11],[270,1,270,11],[271,1,271,11],[262,1,262,11],[263,1,263,11],[264,1,264,11],[265,1,265,11],[266,1,266,11],[277,1,277,11],[278,1,278,11],[279,1,279,11],[280,1,280,11],[281,1,281,11],[272,1,272,11],[273,1,273,11],[274,1,274,11],[275,1,275,11],[276,1,276,11],[287,1,287,11],[288,1,288,11],[289,1,289,11],[290,1,290,11],[291,1,291,11],[282,1,282,11],[283,1,283,11],[284,1,284,11],[285,1,285,11],[286,1,286,11],[297,1,297,11],[298,1,298,11],[299,1,299,11],[300,1,300,11],[301,1,301,11],[292,1,292,11],[293,1,293,11],[294,1,294,11],[295,1,295,11],[296,1,296,11],[307,1,307,11],[308,1,308,11],[309,1,309,11],[310,1,310,11],[311,1,311,11],[302,1,302,11],[303,1,303,11],[304,1,304,11],[305,1,305,11],[306,1,306,11],[317,1,317,11],[318,1,318,11],[319,1,319,11],[320,1,320,11],[321,1,321,11],[312,1,312,11],[313,1,313,11],[314,1,314,11],[315,1,315,11],[316,1,316,11],[327,1,327,11],[328,1,328,11],[329,1,329,11],[330,1,330,11],[331,1,331,11],[322,1,322,11],[323,1,323,11],[324,1,324,11],[325,1,325,11],[326,1,326,11],[337,1,337,11],[338,1,338,11],[339,1,339,11],[340,1,340,11],[341,1,341,11],[332,1,332,11],[333,1,333,11],[334,1,334,11],[335,1,335,11],[336,1,336,11],[347,1,347,11],[348,1,348,11],[349,1,349,11],[350,1,350,11],[351,1,351,11],[342,1,342,11],[343,1,343,11],[344,1,344,11],[345,1,345,11],[346,1,346,11],[357,1,357,11],[358,1,358,11],[359,1,359,11],[360,1,360,11],[361,1,361,11],[352,1,352,11],[353,1,353,11],[354,1,354,11],[355,1,355,11],[356,1,356,11],[367,1,367,11],[368,1,368,11],[369,1,369,11],[370,1,370,11],[371,1,371,11],[362,1,362,11],[363,1,363,11],[364,1,364,11],[365,1,365,11],[366,1,366,11],[377,1,377,11],[378,1,378,11],[379,1,379,11],[380,1,380,11],[381,1,381,11],[372,1,372,11],[373,1,373,11],[374,1,374,11],[375,1,375,11],[376,1,376,11],[387,1,387,11],[388,1,388,11],[389,1,389,11],[390,1,390,11],[391,1,391,11],[382,1,382,11],[383,1,383,11],[384,1,384,11],[385,1,385,11],[386,1,386,11],[397,1,397,11],[398,1,398,11],[399,1,399,11],[400,1,400,11],[401,1,401,11],[392,1,392,11],[393,1,393,11],[394,1,394,11],[395,1,395,11],[396,1,396,11],[407,1,407,11],[408,1,408,11],[409,1,409,11],[410,1,410,11],[411,1,411,11],[402,1,402,11],[403,1,403,11],[404,1,404,11],[405,1,405,11],[406,1,406,11],[417,1,417,11],[418,1,418,11],[419,1,419,11],[420,1,420,11],[421,1,421,11],[412,1,412,11],[413,1,413,11],[414,1,414,11],[415,1,415,11],[416,1,416,11],[427,1,427,11],[428,1,428,11],[429,1,429,11],[430,1,430,11],[431,1,431,11],[422,1,422,11],[423,1,423,11],[424,1,424,11],[425,1,425,11],[426,1,426,11],[437,1,437,11],[438,1,438,11],[439,1,439,11],[440,1,440,11],[441,1,441,11],[432,1,432,11],[433,1,433,11],[434,1,434,11],[435,1,435,11],[436,1,436,11],[447,1,447,11],[448,1,448,11],[449,1,449,11],[450,1,450,11],[451,1,451,11],[442,1,442,11],[443,1,443,11],[444,1,444,11],[445,1,445,11],[446,1,446,11],[457,1,457,11],[458,1,458,11],[459,1,459,11],[460,1,460,11],[461,1,461,11],[452,1,452,11],[453,1,453,11],[454,1,454,11],[455,1,455,11],[456,1,456,11],[467,1,467,11],[468,1,468,11],[469,1,469,11],[470,1,470,11],[471,1,471,11],[462,1,462,11],[463,1,463,11],[464,1,464,11],[465,1,465,11],[466,1,466,11],[477,1,477,11],[478,1,478,11],[479,1,479,11],[480,1,480,11],[481,1,481,11],[472,1,472,11],[473,1,473,11],[474,1,474,11],[475,1,475,11],[476,1,476,11],[487,1,487,11],[488,1,488,11],[489,1,489,11],[490,1,490,11],[491,1,491,11],[482,1,482,11],[483,1,483,11],[484,1,484,11],[485,1,485,11],[486,1,486,11],[497,1,497,11],[498,1,498,11],[499,1,499,11],[500,1,500,11],[501,1,501,11],[492,1,492,11],[493,1,493,11],[494,1,494,11],[495,1,495,11],[496,1,496,11],[507,1,507,11],[508,1,508,11],[509,1,509,11],[510,1,510,11],[511,1,511,11],[502,1,502,11],[503,1,503,11],[504,1,504,11],[505,1,505,11],[506,1,506,11],[517,1,517,11],[518,1,518,11],[519,1,519,11],[520,1,520,11],[521,1,521,11],[512,1,512,11],[513,1,513,11],[514,1,514,11],[515,1,515,11],[516,1,516,11],[527,1,527,11],[528,1,528,11],[529,1,529,11],[530,1,530,11],[531,1,531,11],[522,1,522,11],[523,1,523,11],[524,1,524,11],[525,1,525,11],[526,1,526,11],[537,1,537,11],[538,1,538,11],[539,1,539,11],[540,1,540,11],[541,1,541,11],[532,1,532,11],[533,1,533,11],[534,1,534,11],[535,1,535,11],[536,1,536,11],[547,1,547,11],[548,1,548,11],[549,1,549,11],[550,1,550,11],[551,1,551,11],[542,1,542,11],[543,1,543,11],[544,1,544,11],[545,1,545,11],[546,1,546,11],[557,1,557,11],[558,1,558,11],[559,1,559,11],[560,1,560,11],[561,1,561,11],[552,1,552,11],[553,1,553,11],[554,1,554,11],[555,1,555,11],[556,1,556,11],[567,1,567,11],[568,1,568,11],[569,1,569,11],[570,1,570,11],[571,1,571,11],[562,1,562,11],[563,1,563,11],[564,1,564,11],[565,1,565,11],[566,1,566,11],[577,1,577,11],[578,1,578,11],[579,1,579,11],[580,1,580,11],[581,1,581,11],[572,1,572,11],[573,1,573,11],[574,1,574,11],[575,1,575,11],[576,1,576,11],[587,1,587,11],[588,1,588,11],[589,1,589,11],[590,1,590,11],[591,1,591,11],[582,1,582,11],[583,1,583,11],[584,1,584,11],[585,1,585,11],[586,1,586,11],[597,1,597,11],[598,1,598,11],[599,1,599,11],[600,1,600,11],[601,1,601,11],[592,1,592,11],[593,1,593,11],[594,1,594,11],[595,1,595,11],[596,1,596,11],[607,1,607,11],[608,1,608,11],[609,1,609,11],[610,1,610,11],[611,1,611,11],[602,1,602,11],[603,1,603,11],[604,1,604,11],[605,1,605,11],[606,1,606,11],[617,1,617,11],[618,1,618,11],[619,1,619,11],[620,1,620,11],[621,1,621,11],[612,1,612,11],[613,1,613,11],[614,1,614,11],[615,1,615,11],[616,1,616,11],[627,1,627,11],[628,1,628,11],[629,1,629,11],[630,1,630,11],[631,1,631,11],[622,1,622,11],[623,1,623,11],[624,1,624,11],[625,1,625,11],[626,1,626,11],[637,1,637,11],[638,1,638,11],[639,1,639,11],[640,1,640,11],[641,1,641,11],[632,1,632,11],[633,1,633,11],[634,1,634,11],[635,1,635,11],[636,1,636,11],[647,1,647,11],[648,1,648,11],[649,1,649,11],[650,1,650,11],[651,1,651,11],[642,1,642,11],[643,1,643,11],[644,1,644,11],[645,1,645,11],[646,1,646,11],[657,1,657,11],[658,1,658,11],[659,1,659,11],[660,1,660,11],[661,1,661,11],[652,1,652,11],[653,1,653,11],[654,1,654,11],[655,1,655,11],[656,1,656,11],[667,1,667,11],[668,1,668,11],[669,1,669,11],[670,1,670,11],[671,1,671,11],[662,1,662,11],[663,1,663,11],[664,1,664,11],[665,1,665,11],[666,1,666,11],[677,1,677,11],[678,1,678,11],[679,1,679,11],[680,1,680,11],[681,1,681,11],[672,1,672,11],[673,1,673,11],[674,1,674,11],[675,1,675,11],[676,1,676,11],[687,1,687,11],[688,1,688,11],[689,1,689,11],[690,1,690,11],[691,1,691,11],[682,1,682,11],[683,1,683,11],[684,1,684,11],[685,1,685,11],[686,1,686,11],[697,1,697,11],[698,1,698,11],[699,1,699,11],[700,1,700,11],[701,1,701,11],[692,1,692,11],[693,1,693,11],[694,1,694,11],[695,1,695,11],[696,1,696,11],[707,1,707,11],[708,1,708,11],[709,1,709,11],[710,1,710,11],[711,1,711,11],[702,1,702,11],[703,1,703,11],[704,1,704,11],[705,1,705,11],[706,1,706,11],[717,1,717,11],[718,1,718,11],[719,1,719,11],[720,1,720,11],[721,1,721,11],[712,1,712,11],[713,1,713,11],[714,1,714,11],[715,1,715,11],[716,1,716,11],[727,1,727,11],[728,1,728,11],[729,1,729,11],[730,1,730,11],[731,1,731,11],[722,1,722,11],[723,1,723,11],[724,1,724,11],[725,1,725,11],[726,1,726,11],[737,1,737,11],[738,1,738,11],[739,1,739,11],[740,1,740,11],[741,1,741,11],[732,1,732,11],[733,1,733,11],[734,1,734,11],[735,1,735,11],[736,1,736,11],[747,1,747,11],[748,1,748,11],[749,1,749,11],[750,1,750,11],[751,1,751,11],[742,1,742,11],[743,1,743,11],[744,1,744,11],[745,1,745,11],[746,1,746,11],[757,1,757,11],[758,1,758,11],[759,1,759,11],[760,1,760,11],[761,1,761,11],[752,1,752,11],[753,1,753,11],[754,1,754,11],[755,1,755,11],[756,1,756,11],[767,1,767,11],[768,1,768,11],[769,1,769,11],[770,1,770,11],[771,1,771,11],[762,1,762,11],[763,1,763,11],[764,1,764,11],[765,1,765,11],[766,1,766,11],[777,1,777,11],[778,1,778,11],[779,1,779,11],[780,1,780,11],[781,1,781,11],[772,1,772,11],[773,1,773,11],[774,1,774,11],[775,1,775,11],[776,1,776,11],[787,1,787,11],[788,1,788,11],[789,1,789,11],[790,1,790,11],[791,1,791,11],[782,1,782,11],[783,1,783,11],[784,1,784,11],[785,1,785,11],[786,1,786,11],[797,1,797,11],[798,1,798,11],[799,1,799,11],[800,1,800,11],[801,1,801,11],[792,1,792,11],[793,1,793,11],[794,1,794,11],[795,1,795,11],[796,1,796,11],[807,1,807,11],[808,1,808,11],[809,1,809,11],[810,1,810,11],[811,1,811,11],[802,1,802,11],[803,1,803,11],[804,1,804,11],[805,1,805,11],[806,1,806,11],[817,1,817,11],[818,1,818,11],[819,1,819,11],[820,1,820,11],[821,1,821,11],[812,1,812,11],[813,1,813,11],[814,1,814,11],[815,1,815,11],[816,1,816,11],[827,1,827,11],[828,1,828,11],[829,1,829,11],[830,1,830,11],[831,1,831,11],[822,1,822,11],[823,1,823,11],[824,1,824,11],[825,1,825,11],[826,1,826,11],[837,1,837,11],[838,1,838,11],[839,1,839,11],[840,1,840,11],[841,1,841,11],[832,1,832,11],[833,1,833,11],[834,1,834,11],[835,1,835,11],[836,1,836,11],[847,1,847,11],[848,1,848,11],[849,1,849,11],[850,1,850,11],[851,1,851,11],[842,1,842,11],[843,1,843,11],[844,1,844,11],[845,1,845,11],[846,1,846,11],[852,1,852,11],[853,1,853,11],[854,1,854,11],[855,1,855,11],[856,1,856,11],[867,1,867,11],[868,1,868,11],[869,1,869,11],[870,1,870,11],[871,1,871,11],[862,1,862,11],[863,1,863,11],[864,1,864,11],[865,1,865,11],[866,1,866,11],[879,1,879,11],[880,1,880,11],[877,1,877,11],[878,1,878,11],[857,1,857,11],[858,1,858,11],[859,1,859,11],[860,1,860,11],[861,1,861,11],[872,1,872,11],[873,1,873,11],[874,1,874,11],[875,1,875,11],[876,1,876,11],[882,1,882,11],[883,1,883,11],[884,1,884,11],[885,1,885,11],[886,1,886,11],[953,1,953,11],[908,1,908,11],[912,1,912,11],[909,1,909,11],[910,1,910,11],[911,1,911,11],[907,1,907,11],[913,1,913,11],[914,1,914,11],[915,1,915,11],[916,1,916,11],[902,1,902,11],[903,1,903,11],[904,1,904,11],[905,1,905,11],[906,1,906,11],[921,1,921,11],[954,1,954,11],[955,1,955,11],[931,1,931,11],[927,1,927,11],[928,1,928,11],[929,1,929,11],[930,1,930,11],[922,1,922,11],[923,1,923,11],[924,1,924,11],[925,1,925,11],[926,1,926,11],[952,1,952,11],[887,1,887,11],[888,1,888,11],[889,1,889,11],[890,1,890,11],[891,1,891,11],[896,1,896,11],[881,1,881,11],[978,1,978,11],[979,1,979,11],[972,1,972,11],[973,1,973,11],[974,1,974,11],[975,1,975,11],[976,1,976,11],[967,1,967,11],[968,1,968,11],[969,1,969,11],[970,1,970,11],[971,1,971,11]],"merged_total":1050,"flags":["merged_cut"]}
[null,null,null,null,null,null,null,"bilan énergétique",null,null,null,null,null,null,null,null,"scéance"]
[null,null,null,null,null,null,null,null,null,null,null,null,null,null,null,null,null,null,null,null,null,null,null,null,null,null,null,null,null,null,null,null,null,null,null,null,null,null,null,null,null,null,null,null,null,null,null,null,null,null,null,null,null,null,null,null,null,null,null,null,null,null,null,null,null,null,null,null,null,null,null,null,null,null,null,null,null,null,null,null,null,null,null,null,null,null,null,null,null,null,null,null,null,null,null,null,null,null,null,null,null,null,null,null,null,null,null,null,null,null,null,null,null,null,null,null,null,null,null,null,null,null,null,null,null,null,null,null,null,null,null,null,null,null,null,null,null,null,null,null,null,null,null,null,null,null,null,null,null,null,null,"horloge CIRCADIENNE"]
[null,null,null,null,null,null,null,"naissance",null,null,null,"signe astro occidental",null,null,null,null,null,null,null,"toutes ses cases ont des valeurs variables et j aurais voulu eliminer les doublons et les copier dans une seule colone a la suite"]
[null,"heure  rendez vous",null,null,null,null,null,"jour","mois","année","heures","signe","ascendent",null,null,null,{"$f":"B12","v":"questionnaire sur le patient"},null,null,null,null,null,null,null,null,null,null,null,null,null,null,null,null,null,null,null,null,null,null,null,null,null,null,null,null,null,null,null,null,null,null,null,null,null,null,null,null,null,null,null,null,null,null,null,null,null,null,null,null,null,null,null,null,null,null,null,null,null,null,null,null,null,null,null,null,null,null,null,null,null,null,null,null,null,null,null,null,null,null,null,null,null,null,null,null,null,null,null,null,null,null,null,null,null,null,null,null,null,null,null,null,null,null,null,null,null,null,null,null,null,null,null,null,null,null,null,null,null,null,null,null,null,null,null,null,null,null,"oui"]
[null,"date",{"$f":"TODAY()","v":"2020-05-05"},"sexe",null,"date de naissance",null,null,null,null,null,{"$f":"IF(H5<>0,VLOOKUP(DATE(\"2020\",MONTH(H5),DAY(H5)),donne!F2:L14,2,1),\"\")","v":""},{"$f":"IF(C6<>0,IFERROR(INDEX(donne!J:J,MATCH(K5,donne!H:H,1)),\"\"),\"\")","v":""},null,null,null,"le patient",null,{"$f":"C13","v":0},"2RP",null,null,null,null,null,null,null,null,null,null,null,null,null,null,null,null,null,null,null,null,null,null,null,null,null,null,null,null,null,null,null,null,null,null,null,null,null,null,null,null,null,null,null,null,null,null,null,null,null,null,null,null,null,null,null,null,null,null,null,null,null,null,null,null,null,null,null,null,null,null,null,null,null,null,null,null,null,null,null,null,null,null,null,null,null,null,null,null,null,null,null,null,null,null,null,null,null,null,null,null,null,null,null,null,null,null,null,null,null,null,null,null,null,null,null,null,null,null,null,null,null,null,null,null,null,null,null,"non"]
[null,"mon prenon",null,null,null,"profession",null,null,null,"horloge circadienne",null,"signe astro chinois",null,null,null,null,"respiration",null,0,"7P","9P"]
[null,"numeraux télephone",null,null,null,"situation familiale",null,null,null,"influence",{"$f":"IF(K5<>0,VLOOKUP(K5,bilan!EV8:EX32,2),\"\")","v":""},"signe","ascendent",null,null,null,"appetie",null,0,"21E"]
[null,"email",null,null,null,"nombre d'enfant",null,null,null,"opposer",{"$f":"IF(K5<>0,VLOOKUP(K5,bilan!EV8:EX32,3),\"\")","v":""},{"$f":"IFERROR(INDEX(donne!C:C,MATCH(H5,donne!A:A,1)),\"\")","v":""},{"$f":"IFERROR(INDEX(donne!D:D,MATCH(H5,donne!A:A,1)),\"\")","v":""},null,null,null,"sommeil",null,0,null,null,null,null,null,null,null,null,null,null,null,null,null,null,null,null,null,null,null,null,null,null,null,null,null,null,null,null,null,null,null,null,null,null,null,null,null,null,null,null,null,null,null,null,null,null,null,null,null,null,null,null,null,null,null,null,null,null,null,null,null,null,null,null,null,null,null,null,null,null,null,null,null,null,null,null,null,null,null,null,null,null,null,null,null,null,null,null,null,null,null,null,null,null,null,null,null,null,null,null,null,null,null,null,null,null,null,null,null,null,null,null,null,null,null,null,null,null,null,null,null,null,null,null,null,null,null,null,null,null,null,null,"00:00:00","VB","C"]
{"$rows_left_out":29}
{"sheet":"donne","index":1,"n_rows":102,"n_cols":62,"rows_kept":102,"cut":false,"hidden":true,"merged":[[0,40,0,43],[0,44,0,47],[0,49,0,61],[0,7,0,8]]}
["Début","Fin","Signe chinois","ascebdant",null,"date","signe","heures naiss",null,"ascendent",null,null,null,null,null,null,null,null,null,null,null,null,null,null,null,null,null,null,null,null,null,null,null,null,null,null,null,null,null,null,"ASTROLOGIQUE",null,null,null,"ASCENDANT",null,null,null,null,"Heures sidérales"]
["1930-01-29","17-02-1931","Cheval","terre",null,"2020-01-01","capricorne","00:00:00","00:33:00","Cancer",null,null,null,null,null,null,null,null,null,null,null,null,null,null,null,null,null,null,null,null,null,null,null,null,null,null,null,null,null,null,"SIGNES","DEBUT","FIN","ELEMENT","SIGNES","DE","A","SIGNES",null,"Jour",1,2,3,4,5,6,7,8,9,10,11,12]
["1931-02-17","06-02-1932","Chèvre","terre",null,"2020-01-21","verseau","00:34:00","03:16:00","Lion",null,null,null,null,null,null,null,null,null,null,null,null,null,null,null,null,null,null,null,null,null,null,null,null,null,null,null,null,null,null,"Capricorne",{"$f":"DATE(YEAR(TODAY()),1,1)","v":"2020-01-01"},{"$f":"DATE(YEAR(TODAY()),1,20)","v":"2020-01-20"},"Terre","Cancer","00:00:00","00:33:00","Cancer",null,1,"06:36:00","08:37:00","10:32:00","12:35:00","14:32:00","16:35:00","18:34:00","20:36:00","22:38:00","00:36:00","02:38:00","04:37:00"]
["1932-02-06","26-01-1933","Singe","métal",null,"2020-02-19","poissons","03:17:00","06:00:00","Vierge",null,null,null,null,null,null,null,null,null,null,null,null,null,null,null,null,null,null,null,null,null,null,null,null,null,null,null,null,null,null,"Verseau",{"$f":"DATE(YEAR(TODAY()),1,21)","v":"2020-01-21"},{"$f":"DATE(YEAR(TODAY()),2,18)","v":"2020-02-18"},"Air","Lion","00:34:00","03:16:00","Lion",null,2,"06:39:00","08:41:00","10:36:00","12:39:00","14:36:00","16:42:00","18:37:00","20:40:00","22:42:00","00:40:00","02:42:00","04:41:00"]
["1933-01-26","14-02-1934","Coq","métal",null,"2020-03-21","bélier","06:01:00","08:43:00","Balance",null,null,null,null,null,null,null,null,null,null,null,null,null,null,null,null,null,null,null,null,null,null,null,null,null,null,null,null,null,null,"Poissons",{"$f":"DATE(YEAR(TODAY()),2,19)","v":"2020-02-19"},{"$f":"DATE(YEAR(TODAY()),3,20)","v":"2020-03-20"},"Eau","Vierge","03:17:00","06:00:00","Vierge",null,3,"06:43:00","08:45:00","10:39:00","12:43:00","14:40:00","16:46:00","18:41:00","20:44:00","22:46:00","00:44:00","02:46:00","04:45:00"]
["1934-02-14","04-02-1935","Chien","feu",null,"2020-04-21","taureaux","08:44:00","11:25:00","Scorpion",null,null,null,null,null,null,null,null,null,null,null,null,null,null,null,null,null,null,null,null,null,null,null,null,null,null,null,null,null,null,"Bélier",{"$f":"DATE(YEAR(TODAY()),3,21)","v":"2020-03-21"},{"$f":"DATE(YEAR(TODAY()),4,20)","v":"2020-04-20"},"Feu","Balance","06:01:00","08:43:00","Balance",null,4,"06:47:00","08:49:00","10:43:00","12:47:00","14:44:00","16:50:00","18:45:00","20:49:00","22:51:00","00:48:00","02:50:00","04:50:00"]
["1935-02-04","24-01-1936","Cochon","feu",null,"2020-05-22","gémeaux","11:26:00","13:53:00","Sagittaire",null,null,null,null,null,null,null,null,null,null,null,null,null,null,null,null,null,null,null,null,null,null,null,null,null,null,null,null,null,null,"Taureau",{"$f":"DATE(YEAR(TODAY()),4,21)","v":"2020-04-21"},{"$f":"DATE(YEAR(TODAY()),5,20)","v":"2020-05-20"},"Terre","Scorpion","08:44:00","11:25:00","Scorpion",null,5,"06:51:00","08:53:00","10:47:00","12:51:00","14:48:00","16:54:00","18:48:00","20:54:00","22:54:00","00:54:00","02:54:00","04:53:00"]
["1936-01-24","11-02-1937","Rat","eau",null,"2020-06-22","cancer","13:54:00","15:42:00","Capricorne",null,null,null,null,null,null,null,null,null,null,null,null,null,null,null,null,null,null,null,null,null,null,null,null,null,null,null,null,null,null,"Gémeaux",{"$f":"DATE(YEAR(TODAY()),5,21)","v":"2020-05-21"},{"$f":"DATE(YEAR(TODAY()),6,21)","v":"2020-06-21"},"Air","Sagittaire","11:26:00","13:53:00","Sagittaire",null,6,"06:55:00","08:57:00","10:51:00","12:54:00","14:52:00","16:58:00","18:53:00","20:56:00","22:58:00","00:56:00","02:58:00","04:56:00"]
{"$rows_left_out":95}
{"sheet":"installer","index":2,"n_rows":0,"n_cols":0,"rows_kept":0,"cut":false,"hidden":true,"merged":[]}