{"text_format":"1","workbook":"xlsx","n_sheets":2,"sheets":["Feuil1","Feuil2"],"not_rendered":{"charts":0,"images":0,"macros":1,"external_links":0,"defined_names":4,"comments":0,"pivot_tables":0},"unopened":[],"bounds":{"document_bytes":16777216,"sheet_cells":100000,"rows_first":2000,"rows_last":500,"rows_between":2000,"halvings":0,"cell_chars":16384,"cell_head_chars":4096},"cells_cut":0,"cells_raw":0,"read":"whole","date_system":"1900"}

{"sheet":"Feuil1","index":0,"n_rows":10,"n_cols":6,"rows_kept":10,"cut":false,"hidden":false,"merged":[]}
["VILLE","NOM PRENOM","LICENCE",null,"Les villes"]
["Rennes","Michel DUPONT","Licence 1",null,{"$f":"OR($A2=\"Paris\",$A2=\"Toulouse\",$A2=\"Nantes\")","v":false}]
["Nantes","Jean MOULIN","Licence 3A"]
["Paris","Anne LAURENT","Licence B2"]
["Rennes","Baptiste DUCHAMP","Licence 1"]
["Toulouse","Claire AMOROS","Pas de licence"]
["Nantes","Pierre MAURANT","Licence 4"]
["Rennes","Cécile FABIOS","Licence 5"]
[]
[null,null,null,null,null,"\n\n\n"]

{"sheet":"Feuil2","index":1,"n_rows":20,"n_cols":9,"rows_kept":20,"cut":false,"hidden":false,"merged":[]}
["NOM PRENOM","LICENCE",null,"Ville",null,"NOM PRENOM","LICENCE"]
["Michel DUPONT",{"$f":"IF(ISNA(VLOOKUP(A2,Feuil1!$B$1:$B$2,2,FALSE)),\"OFF\",Feuil1!#REF!)","v":{"$error":"#REF!"}},null,"Nantes",null,"Jean MOULIN","Licence 3A"]
["Anne LAURENT",{"$f":"IF(ISNA(VLOOKUP(A3,Feuil1!$B$1:$B$2,2,FALSE)),\"OFF\",Feuil1!C1)","v":"OFF"},null,null,null,"Claire AMOROS","Pas de licence"]
["Baptiste DUCHAMP",{"$f":"IF(ISNA(VLOOKUP(A4,Feuil1!$B$1:$B$2,2,FALSE)),\"OFF\",Feuil1!#REF!)","v":"OFF"},null,null,null,"Pierre MAURANT","Licence 4"]
["Cécile FABIOS",{"$f":"IF(ISNA(VLOOKUP(A5,Feuil1!$B$1:$B$2,2,FALSE)),\"OFF\",Feuil1!#REF!)","v":"OFF"}]
[]
[]
[]
[]
[]
[]
[]
[null,null,null,null,null,null,"VILLE","NOM PRENOM","LICENCE"]
[null,null,null,null,null,null,"Rennes","Michel DUPONT","Licence 1"]
[null,null,null,null,null,null,"Nantes","Jean MOULIN","Licence 3A"]
[null,null,null,null,null,null,"Paris","Anne LAURENT","Licence B2"]
[null,null,null,null,null,null,"Rennes","Baptiste DUCHAMP","Licence 1"]
[null,null,null,null,null,null,"Toulouse","Claire AMOROS","Pas de licence"]
[null,null,null,null,null,null,"Nantes","Pierre MAURANT","Licence 4"]
[null,null,null,null,null,null,"Rennes","Cécile FABIOS","Licence 5"]