{"text_format":"1","workbook":"xlsx","n_sheets":11,"sheets":["Récap Achats Réels","POSTE (1)","POSTE (2)","POSTE (3)","POSTE (4)","POSTE (5)","POSTE (6)","POSTE (7)","POSTE (8)","POSTE (9)","POSTE (10)"],"not_rendered":{"charts":0,"images":0,"macros":0,"external_links":0,"defined_names":0,"comments":0,"pivot_tables":0},"unopened":[],"bounds":{"document_bytes":16777216,"sheet_cells":100000,"rows_first":2000,"rows_last":500,"rows_between":2000,"halvings":0,"cell_chars":16384,"cell_head_chars":4096},"cells_cut":0,"cells_raw":0,"read":"whole","date_system":"1900"}

{"sheet":"Récap Achats Réels","index":0,"n_rows":65,"n_cols":8,"rows_kept":65,"cut":false,"hidden":false,"merged":[[0,0,0,7]]}
["FOURNITURES | Réel"]
["Fournisseur","Ref","DESIGNATION","Unité","Qté","P.U. HT","P.T. HT","Poste"]
[{"$f":"IFERROR(INDEX('POSTE (1)'!N:N,MATCH(ROW()-2,'POSTE (1)'!$W:$W,0)),IFERROR(INDEX('POSTE (2)'!N:N,MATCH(ROW()-2,'POSTE (2)'!$W:$W,0)),IFERROR(INDEX('POSTE (3)'!N:N,MATCH(ROW()-2,'POSTE (3)'!$W:$W,0)),IFERROR(INDEX('POSTE (4)'!N:N,MATCH(ROW()-2,'POSTE (4)'!$W:$W,0)),IFERROR(INDEX('POSTE (5)'!N:N,MATCH(ROW()-2,'POSTE (5)'!$W:$W,0)),IFERROR(INDEX('POSTE (6)'!N:N,MATCH(ROW()-2,'POSTE (6)'!$W:$W,0)),IFERROR(INDEX('POSTE (7)'!N:N,MATCH(ROW()-2,'POSTE (7)'!$W:$W,0)),IFERROR(INDEX('POSTE (8)'!N:N,MATCH(ROW()-2,'POSTE (8)'!$W:$W,0)),IFERROR(INDEX('POSTE (9)'!N:N,MATCH(ROW()-2,'POSTE (9)'!$W:$W,0)),\"\")))))))))","v":"(1)Fournisseur1"},{"$f":"IFERROR(INDEX('POSTE (1)'!O:O,MATCH(ROW()-2,'POSTE (1)'!$W:$W,0)),IFERROR(INDEX('POSTE (2)'!O:O,MATCH(ROW()-2,'POSTE (2)'!$W:$W,0)),IFERROR(INDEX('POSTE (3)'!O:O,MATCH(ROW()-2,'POSTE (3)'!$W:$W,0)),IFERROR(INDEX('POSTE (4)'!O:O,MATCH(ROW()-2,'POSTE (4)'!$W:$W,0)),IFERROR(INDEX('POSTE (5)'!O:O,MATCH(ROW()-2,'POSTE (5)'!$W:$W,0)),IFERROR(INDEX('POSTE (6)'!O:O,MATCH(ROW()-2,'POSTE (6)'!$W:$W,0)),IFERROR(INDEX('POSTE (7)'!O:O,MATCH(ROW()-2,'POSTE (7)'!$W:$W,0)),IFERROR(INDEX('POSTE (8)'!O:O,MATCH(ROW()-2,'POSTE (8)'!$W:$W,0)),IFERROR(INDEX('POSTE (9)'!O:O,MATCH(ROW()-2,'POSTE (9)'!$W:$W,0)),\"\")))))))))","v":"(1)Ref1"},{"$f":"IFERROR(INDEX('POSTE (1)'!P:P,MATCH(ROW()-2,'POSTE (1)'!$W:$W,0)),IFERROR(INDEX('POSTE (2)'!P:P,MATCH(ROW()-2,'POSTE (2)'!$W:$W,0)),IFERROR(INDEX('POSTE (3)'!P:P,MATCH(ROW()-2,'POSTE (3)'!$W:$W,0)),IFERROR(INDEX('POSTE (4)'!P:P,MATCH(ROW()-2,'POSTE (4)'!$W:$W,0)),IFERROR(INDEX('POSTE (5)'!P:P,MATCH(ROW()-2,'POSTE (5)'!$W:$W,0)),IFERROR(INDEX('POSTE (6)'!P:P,MATCH(ROW()-2,'POSTE (6)'!$W:$W,0)),IFERROR(INDEX('POSTE (7)'!P:P,MATCH(ROW()-2,'POSTE (7)'!$W:$W,0)),IFERROR(INDEX('POSTE (8)'!P:P,MATCH(ROW()-2,'POSTE (8)'!$W:$W,0)),IFERROR(INDEX('POSTE (9)'!P:P,MATCH(ROW()-2,'POSTE (9)'!$W:$W,0)),\"\")))))))))","v":"(1)DESIGNATION1"},{"$f":"IFERROR(INDEX('POSTE (1)'!Q:Q,MATCH(ROW()-2,'POSTE (1)'!$W:$W,0)),IFERROR(INDEX('POSTE (2)'!Q:Q,MATCH(ROW()-2,'POSTE (2)'!$W:$W,0)),IFERROR(INDEX('POSTE (3)'!Q:Q,MATCH(ROW()-2,'POSTE (3)'!$W:$W,0)),IFERROR(INDEX('POSTE (4)'!Q:Q,MATCH(ROW()-2,'POSTE (4)'!$W:$W,0)),IFERROR(INDEX('POSTE (5)'!Q:Q,MATCH(ROW()-2,'POSTE (5)'!$W:$W,0)),IFERROR(INDEX('POSTE (6)'!Q:Q,MATCH(ROW()-2,'POSTE (6)'!$W:$W,0)),IFERROR(INDEX('POSTE (7)'!Q:Q,MATCH(ROW()-2,'POSTE (7)'!$W:$W,0)),IFERROR(INDEX('POSTE (8)'!Q:Q,MATCH(ROW()-2,'POSTE (8)'!$W:$W,0)),IFERROR(INDEX('POSTE (9)'!Q:Q,MATCH(ROW()-2,'POSTE (9)'!$W:$W,0)),\"\")))))))))","v":"T"},{"$f":"IFERROR(INDEX('POSTE (1)'!R:R,MATCH(ROW()-2,'POSTE (1)'!$W:$W,0)),IFERROR(INDEX('POSTE (2)'!R:R,MATCH(ROW()-2,'POSTE (2)'!$W:$W,0)),IFERROR(INDEX('POSTE (3)'!R:R,MATCH(ROW()-2,'POSTE (3)'!$W:$W,0)),IFERROR(INDEX('POSTE (4)'!R:R,MATCH(ROW()-2,'POSTE (4)'!$W:$W,0)),IFERROR(INDEX('POSTE (5)'!R:R,MATCH(ROW()-2,'POSTE (5)'!$W:$W,0)),IFERROR(INDEX('POSTE (6)'!R:R,MATCH(ROW()-2,'POSTE (6)'!$W:$W,0)),IFERROR(INDEX('POSTE (7)'!R:R,MATCH(ROW()-2,'POSTE (7)'!$W:$W,0)),IFERROR(INDEX('POSTE (8)'!R:R,MATCH(ROW()-2,'POSTE (8)'!$W:$W,0)),IFERROR(INDEX('POSTE (9)'!R:R,MATCH(ROW()-2,'POSTE (9)'!$W:$W,0)),\"\")))))))))","v":1},{"$f":"IFERROR(INDEX('POSTE (1)'!S:S,MATCH(ROW()-2,'POSTE (1)'!$W:$W,0)),IFERROR(INDEX('POSTE (2)'!S:S,MATCH(ROW()-2,'POSTE (2)'!$W:$W,0)),IFERROR(INDEX('POSTE (3)'!S:S,MATCH(ROW()-2,'POSTE (3)'!$W:$W,0)),IFERROR(INDEX('POSTE (4)'!S:S,MATCH(ROW()-2,'POSTE (4)'!$W:$W,0)),IFERROR(INDEX('POSTE (5)'!S:S,MATCH(ROW()-2,'POSTE (5)'!$W:$W,0)),IFERROR(INDEX('POSTE (6)'!S:S,MATCH(ROW()-2,'POSTE (6)'!$W:$W,0)),IFERROR(INDEX('POSTE (7)'!S:S,MATCH(ROW()-2,'POSTE (7)'!$W:$W,0)),IFERROR(INDEX('POSTE (8)'!S:S,MATCH(ROW()-2,'POSTE (8)'!$W:$W,0)),IFERROR(INDEX('POSTE (9)'!S:S,MATCH(ROW()-2,'POSTE (9)'!$W:$W,0)),\"\")))))))))","v":1},{"$f":"IFERROR(INDEX('POSTE (1)'!T:T,MATCH(ROW()-2,'POSTE (1)'!$W:$W,0)),IFERROR(INDEX('POSTE (2)'!T:T,MATCH(ROW()-2,'POSTE (2)'!$W:$W,0)),IFERROR(INDEX('POSTE (3)'!T:T,MATCH(ROW()-2,'POSTE (3)'!$W:$W,0)),IFERROR(INDEX('POSTE (4)'!T:T,MATCH(ROW()-2,'POSTE (4)'!$W:$W,0)),IFERROR(INDEX('POSTE (5)'!T:T,MATCH(ROW()-2,'POSTE (5)'!$W:$W,0)),IFERROR(INDEX('POSTE (6)'!T:T,MATCH(ROW()-2,'POSTE (6)'!$W:$W,0)),IFERROR(INDEX('POSTE (7)'!T:T,MATCH(ROW()-2,'POSTE (7)'!$W:$W,0)),IFERROR(INDEX('POSTE (8)'!T:T,MATCH(ROW()-2,'POSTE (8)'!$W:$W,0)),IFERROR(INDEX('POSTE (9)'!T:T,MATCH(ROW()-2,'POSTE (9)'!$W:$W,0)),\"\")))))))))","v":1},{"$f":"IFERROR(INDEX('POSTE (1)'!U:U,MATCH(ROW()-2,'POSTE (1)'!$W:$W,0)),IFERROR(INDEX('POSTE (2)'!U:U,MATCH(ROW()-2,'POSTE (2)'!$W:$W,0)),IFERROR(INDEX('POSTE (3)'!U:U,MATCH(ROW()-2,'POSTE (3)'!$W:$W,0)),IFERROR(INDEX('POSTE (4)'!U:U,MATCH(ROW()-2,'POSTE (4)'!$W:$W,0)),IFERROR(INDEX('POSTE (5)'!U:U,MATCH(ROW()-2,'POSTE (5)'!$W:$W,0)),IFERROR(INDEX('POSTE (6)'!U:U,MATCH(ROW()-2,'POSTE (6)'!$W:$W,0)),IFERROR(INDEX('POSTE (7)'!U:U,MATCH(ROW()-2,'POSTE (7)'!$W:$W,0)),IFERROR(INDEX('POSTE (8)'!U:U,MATCH(ROW()-2,'POSTE (8)'!$W:$W,0)),IFERROR(INDEX('POSTE (9)'!U:U,MATCH(ROW()-2,'POSTE (9)'!$W:$W,0)),\"\")))))))))","v":"POSTE (1)"}]
[{"$f":"IFERROR(INDEX('POSTE (1)'!N:N,MATCH(ROW()-2,'POSTE (1)'!$W:$W,0)),IFERROR(INDEX('POSTE (2)'!N:N,MATCH(ROW()-2,'POSTE (2)'!$W:$W,0)),IFERROR(INDEX('POSTE (3)'!N:N,MATCH(ROW()-2,'POSTE (3)'!$W:$W,0)),IFERROR(INDEX('POSTE (4)'!N:N,MATCH(ROW()-2,'POSTE (4)'!$W:$W,0)),IFERROR(INDEX('POSTE (5)'!N:N,MATCH(ROW()-2,'POSTE (5)'!$W:$W,0)),IFERROR(INDEX('POSTE (6)'!N:N,MATCH(ROW()-2,'POSTE (6)'!$W:$W,0)),IFERROR(INDEX('POSTE (7)'!N:N,MATCH(ROW()-2,'POSTE (7)'!$W:$W,0)),IFERROR(INDEX('POSTE (8)'!N:N,MATCH(ROW()-2,'POSTE (8)'!$W:$W,0)),IFERROR(INDEX('POSTE (9)'!N:N,MATCH(ROW()-2,'POSTE (9)'!$W:$W,0)),\"\")))))))))","v":"(2)Fournisseur"},{"$f":"IFERROR(INDEX('POSTE (1)'!O:O,MATCH(ROW()-2,'POSTE (1)'!$W:$W,0)),IFERROR(INDEX('POSTE (2)'!O:O,MATCH(ROW()-2,'POSTE (2)'!$W:$W,0)),IFERROR(INDEX('POSTE (3)'!O:O,MATCH(ROW()-2,'POSTE (3)'!$W:$W,0)),IFERROR(INDEX('POSTE (4)'!O:O,MATCH(ROW()-2,'POSTE (4)'!$W:$W,0)),IFERROR(INDEX('POSTE (5)'!O:O,MATCH(ROW()-2,'POSTE (5)'!$W:$W,0)),IFERROR(INDEX('POSTE (6)'!O:O,MATCH(ROW()-2,'POSTE (6)'!$W:$W,0)),IFERROR(INDEX('POSTE (7)'!O:O,MATCH(ROW()-2,'POSTE (7)'!$W:$W,0)),IFERROR(INDEX('POSTE (8)'!O:O,MATCH(ROW()-2,'POSTE (8)'!$W:$W,0)),IFERROR(INDEX('POSTE (9)'!O:O,MATCH(ROW()-2,'POSTE (9)'!$W:$W,0)),\"\")))))))))","v":"(2)Ref"},{"$f":"IFERROR(INDEX('POSTE (1)'!P:P,MATCH(ROW()-2,'POSTE (1)'!$W:$W,0)),IFERROR(INDEX('POSTE (2)'!P:P,MATCH(ROW()-2,'POSTE (2)'!$W:$W,0)),IFERROR(INDEX('POSTE (3)'!P:P,MATCH(ROW()-2,'POSTE (3)'!$W:$W,0)),IFERROR(INDEX('POSTE (4)'!P:P,MATCH(ROW()-2,'POSTE (4)'!$W:$W,0)),IFERROR(INDEX('POSTE (5)'!P:P,MATCH(ROW()-2,'POSTE (5)'!$W:$W,0)),IFERROR(INDEX('POSTE (6)'!P:P,MATCH(ROW()-2,'POSTE (6)'!$W:$W,0)),IFERROR(INDEX('POSTE (7)'!P:P,MATCH(ROW()-2,'POSTE (7)'!$W:$W,0)),IFERROR(INDEX('POSTE (8)'!P:P,MATCH(ROW()-2,'POSTE (8)'!$W:$W,0)),IFERROR(INDEX('POSTE (9)'!P:P,MATCH(ROW()-2,'POSTE (9)'!$W:$W,0)),\"\")))))))))","v":"(2)DESIGNATION"},{"$f":"IFERROR(INDEX('POSTE (1)'!Q:Q,MATCH(ROW()-2,'POSTE (1)'!$W:$W,0)),IFERROR(INDEX('POSTE (2)'!Q:Q,MATCH(ROW()-2,'POSTE (2)'!$W:$W,0)),IFERROR(INDEX('POSTE (3)'!Q:Q,MATCH(ROW()-2,'POSTE (3)'!$W:$W,0)),IFERROR(INDEX('POSTE (4)'!Q:Q,MATCH(ROW()-2,'POSTE (4)'!$W:$W,0)),IFERROR(INDEX('POSTE (5)'!Q:Q,MATCH(ROW()-2,'POSTE (5)'!$W:$W,0)),IFERROR(INDEX('POSTE (6)'!Q:Q,MATCH(ROW()-2,'POSTE (6)'!$W:$W,0)),IFERROR(INDEX('POSTE (7)'!Q:Q,MATCH(ROW()-2,'POSTE (7)'!$W:$W,0)),IFERROR(INDEX('POSTE (8)'!Q:Q,MATCH(ROW()-2,'POSTE (8)'!$W:$W,0)),IFERROR(INDEX('POSTE (9)'!Q:Q,MATCH(ROW()-2,'POSTE (9)'!$W:$W,0)),\"\")))))))))","v":"Kg"},{"$f":"IFERROR(INDEX('POSTE (1)'!R:R,MATCH(ROW()-2,'POSTE (1)'!$W:$W,0)),IFERROR(INDEX('POSTE (2)'!R:R,MATCH(ROW()-2,'POSTE (2)'!$W:$W,0)),IFERROR(INDEX('POSTE (3)'!R:R,MATCH(ROW()-2,'POSTE (3)'!$W:$W,0)),IFERROR(INDEX('POSTE (4)'!R:R,MATCH(ROW()-2,'POSTE (4)'!$W:$W,0)),IFERROR(INDEX('POSTE (5)'!R:R,MATCH(ROW()-2,'POSTE (5)'!$W:$W,0)),IFERROR(INDEX('POSTE (6)'!R:R,MATCH(ROW()-2,'POSTE (6)'!$W:$W,0)),IFERROR(INDEX('POSTE (7)'!R:R,MATCH(ROW()-2,'POSTE (7)'!$W:$W,0)),IFERROR(INDEX('POSTE (8)'!R:R,MATCH(ROW()-2,'POSTE (8)'!$W:$W,0)),IFERROR(INDEX('POSTE (9)'!R:R,MATCH(ROW()-2,'POSTE (9)'!$W:$W,0)),\"\")))))))))","v":2},{"$f":"IFERROR(INDEX('POSTE (1)'!S:S,MATCH(ROW()-2,'POSTE (1)'!$W:$W,0)),IFERROR(INDEX('POSTE (2)'!S:S,MATCH(ROW()-2,'POSTE (2)'!$W:$W,0)),IFERROR(INDEX('POSTE (3)'!S:S,MATCH(ROW()-2,'POSTE (3)'!$W:$W,0)),IFERROR(INDEX('POSTE (4)'!S:S,MATCH(ROW()-2,'POSTE (4)'!$W:$W,0)),IFERROR(INDEX('POSTE (5)'!S:S,MATCH(ROW()-2,'POSTE (5)'!$W:$W,0)),IFERROR(INDEX('POSTE (6)'!S:S,MATCH(ROW()-2,'POSTE (6)'!$W:$W,0)),IFERROR(INDEX('POSTE (7)'!S:S,MATCH(ROW()-2,'POSTE (7)'!$W:$W,0)),IFERROR(INDEX('POSTE (8)'!S:S,MATCH(ROW()-2,'POSTE (8)'!$W:$W,0)),IFERROR(INDEX('POSTE (9)'!S:S,MATCH(ROW()-2,'POSTE (9)'!$W:$W,0)),\"\")))))))))","v":1},{"$f":"IFERROR(INDEX('POSTE (1)'!T:T,MATCH(ROW()-2,'POSTE (1)'!$W:$W,0)),IFERROR(INDEX('POSTE (2)'!T:T,MATCH(ROW()-2,'POSTE (2)'!$W:$W,0)),IFERROR(INDEX('POSTE (3)'!T:T,MATCH(ROW()-2,'POSTE (3)'!$W:$W,0)),IFERROR(INDEX('POSTE (4)'!T:T,MATCH(ROW()-2,'POSTE (4)'!$W:$W,0)),IFERROR(INDEX('POSTE (5)'!T:T,MATCH(ROW()-2,'POSTE (5)'!$W:$W,0)),IFERROR(INDEX('POSTE (6)'!T:T,MATCH(ROW()-2,'POSTE (6)'!$W:$W,0)),IFERROR(INDEX('POSTE (7)'!T:T,MATCH(ROW()-2,'POSTE (7)'!$W:$W,0)),IFERROR(INDEX('POSTE (8)'!T:T,MATCH(ROW()-2,'POSTE (8)'!$W:$W,0)),IFERROR(INDEX('POSTE (9)'!T:T,MATCH(ROW()-2,'POSTE (9)'!$W:$W,0)),\"\")))))))))","v":2},{"$f":"IFERROR(INDEX('POSTE (1)'!U:U,MATCH(ROW()-2,'POSTE (1)'!$W:$W,0)),IFERROR(INDEX('POSTE (2)'!U:U,MATCH(ROW()-2,'POSTE (2)'!$W:$W,0)),IFERROR(INDEX('POSTE (3)'!U:U,MATCH(ROW()-2,'POSTE (3)'!$W:$W,0)),IFERROR(INDEX('POSTE (4)'!U:U,MATCH(ROW()-2,'POSTE (4)'!$W:$W,0)),IFERROR(INDEX('POSTE (5)'!U:U,MATCH(ROW()-2,'POSTE (5)'!$W:$W,0)),IFERROR(INDEX('POSTE (6)'!U:U,MATCH(ROW()-2,'POSTE (6)'!$W:$W,0)),IFERROR(INDEX('POSTE (7)'!U:U,MATCH(ROW()-2,'POSTE (7)'!$W:$W,0)),IFERROR(INDEX('POSTE (8)'!U:U,MATCH(ROW()-2,'POSTE (8)'!$W:$W,0)),IFERROR(INDEX('POSTE (9)'!U:U,MATCH(ROW()-2,'POSTE (9)'!$W:$W,0)),\"\")))))))))","v":"POSTE (2)"}]
[{"$f":"IFERROR(INDEX('POSTE (1)'!N:N,MATCH(ROW()-2,'POSTE (1)'!$W:$W,0)),IFERROR(INDEX('POSTE (2)'!N:N,MATCH(ROW()-2,'POSTE (2)'!$W:$W,0)),IFERROR(INDEX('POSTE (3)'!N:N,MATCH(ROW()-2,'POSTE (3)'!$W:$W,0)),IFERROR(INDEX('POSTE (4)'!N:N,MATCH(ROW()-2,'POSTE (4)'!$W:$W,0)),IFERROR(INDEX('POSTE (5)'!N:N,MATCH(ROW()-2,'POSTE (5)'!$W:$W,0)),IFERROR(INDEX('POSTE (6)'!N:N,MATCH(ROW()-2,'POSTE (6)'!$W:$W,0)),IFERROR(INDEX('POSTE (7)'!N:N,MATCH(ROW()-2,'POSTE (7)'!$W:$W,0)),IFERROR(INDEX('POSTE (8)'!N:N,MATCH(ROW()-2,'POSTE (8)'!$W:$W,0)),IFERROR(INDEX('POSTE (9)'!N:N,MATCH(ROW()-2,'POSTE (9)'!$W:$W,0)),\"\")))))))))","v":"(2)Fournisseur2"},{"$f":"IFERROR(INDEX('POSTE (1)'!O:O,MATCH(ROW()-2,'POSTE (1)'!$W:$W,0)),IFERROR(INDEX('POSTE (2)'!O:O,MATCH(ROW()-2,'POSTE (2)'!$W:$W,0)),IFERROR(INDEX('POSTE (3)'!O:O,MATCH(ROW()-2,'POSTE (3)'!$W:$W,0)),IFERROR(INDEX('POSTE (4)'!O:O,MATCH(ROW()-2,'POSTE (4)'!$W:$W,0)),IFERROR(INDEX('POSTE (5)'!O:O,MATCH(ROW()-2,'POSTE (5)'!$W:$W,0)),IFERROR(INDEX('POSTE (6)'!O:O,MATCH(ROW()-2,'POSTE (6)'!$W:$W,0)),IFERROR(INDEX('POSTE (7)'!O:O,MATCH(ROW()-2,'POSTE (7)'!$W:$W,0)),IFERROR(INDEX('POSTE (8)'!O:O,MATCH(ROW()-2,'POSTE (8)'!$W:$W,0)),IFERROR(INDEX('POSTE (9)'!O:O,MATCH(ROW()-2,'POSTE (9)'!$W:$W,0)),\"\")))))))))","v":"(2)Ref2"},{"$f":"IFERROR(INDEX('POSTE (1)'!P:P,MATCH(ROW()-2,'POSTE (1)'!$W:$W,0)),IFERROR(INDEX('POSTE (2)'!P:P,MATCH(ROW()-2,'POSTE (2)'!$W:$W,0)),IFERROR(INDEX('POSTE (3)'!P:P,MATCH(ROW()-2,'POSTE (3)'!$W:$W,0)),IFERROR(INDEX('POSTE (4)'!P:P,MATCH(ROW()-2,'POSTE (4)'!$W:$W,0)),IFERROR(INDEX('POSTE (5)'!P:P,MATCH(ROW()-2,'POSTE (5)'!$W:$W,0)),IFERROR(INDEX('POSTE (6)'!P:P,MATCH(ROW()-2,'POSTE (6)'!$W:$W,0)),IFERROR(INDEX('POSTE (7)'!P:P,MATCH(ROW()-2,'POSTE (7)'!$W:$W,0)),IFERROR(INDEX('POSTE (8)'!P:P,MATCH(ROW()-2,'POSTE (8)'!$W:$W,0)),IFERROR(INDEX('POSTE (9)'!P:P,MATCH(ROW()-2,'POSTE (9)'!$W:$W,0)),\"\")))))))))","v":"(2)DESIGNATION2"},{"$f":"IFERROR(INDEX('POSTE (1)'!Q:Q,MATCH(ROW()-2,'POSTE (1)'!$W:$W,0)),IFERROR(INDEX('POSTE (2)'!Q:Q,MATCH(ROW()-2,'POSTE (2)'!$W:$W,0)),IFERROR(INDEX('POSTE (3)'!Q:Q,MATCH(ROW()-2,'POSTE (3)'!$W:$W,0)),IFERROR(INDEX('POSTE (4)'!Q:Q,MATCH(ROW()-2,'POSTE (4)'!$W:$W,0)),IFERROR(INDEX('POSTE (5)'!Q:Q,MATCH(ROW()-2,'POSTE (5)'!$W:$W,0)),IFERROR(INDEX('POSTE (6)'!Q:Q,MATCH(ROW()-2,'POSTE (6)'!$W:$W,0)),IFERROR(INDEX('POSTE (7)'!Q:Q,MATCH(ROW()-2,'POSTE (7)'!$W:$W,0)),IFERROR(INDEX('POSTE (8)'!Q:Q,MATCH(ROW()-2,'POSTE (8)'!$W:$W,0)),IFERROR(INDEX('POSTE (9)'!Q:Q,MATCH(ROW()-2,'POSTE (9)'!$W:$W,0)),\"\")))))))))","v":"Kg"},{"$f":"IFERROR(INDEX('POSTE (1)'!R:R,MATCH(ROW()-2,'POSTE (1)'!$W:$W,0)),IFERROR(INDEX('POSTE (2)'!R:R,MATCH(ROW()-2,'POSTE (2)'!$W:$W,0)),IFERROR(INDEX('POSTE (3)'!R:R,MATCH(ROW()-2,'POSTE (3)'!$W:$W,0)),IFERROR(INDEX('POSTE (4)'!R:R,MATCH(ROW()-2,'POSTE (4)'!$W:$W,0)),IFERROR(INDEX('POSTE (5)'!R:R,MATCH(ROW()-2,'POSTE (5)'!$W:$W,0)),IFERROR(INDEX('POSTE (6)'!R:R,MATCH(ROW()-2,'POSTE (6)'!$W:$W,0)),IFERROR(INDEX('POSTE (7)'!R:R,MATCH(ROW()-2,'POSTE (7)'!$W:$W,0)),IFERROR(INDEX('POSTE (8)'!R:R,MATCH(ROW()-2,'POSTE (8)'!$W:$W,0)),IFERROR(INDEX('POSTE (9)'!R:R,MATCH(ROW()-2,'POSTE (9)'!$W:$W,0)),\"\")))))))))","v":2},{"$f":"IFERROR(INDEX('POSTE (1)'!S:S,MATCH(ROW()-2,'POSTE (1)'!$W:$W,0)),IFERROR(INDEX('POSTE (2)'!S:S,MATCH(ROW()-2,'POSTE (2)'!$W:$W,0)),IFERROR(INDEX('POSTE (3)'!S:S,MATCH(ROW()-2,'POSTE (3)'!$W:$W,0)),IFERROR(INDEX('POSTE (4)'!S:S,MATCH(ROW()-2,'POSTE (4)'!$W:$W,0)),IFERROR(INDEX('POSTE (5)'!S:S,MATCH(ROW()-2,'POSTE (5)'!$W:$W,0)),IFERROR(INDEX('POSTE (6)'!S:S,MATCH(ROW()-2,'POSTE (6)'!$W:$W,0)),IFERROR(INDEX('POSTE (7)'!S:S,MATCH(ROW()-2,'POSTE (7)'!$W:$W,0)),IFERROR(INDEX('POSTE (8)'!S:S,MATCH(ROW()-2,'POSTE (8)'!$W:$W,0)),IFERROR(INDEX('POSTE (9)'!S:S,MATCH(ROW()-2,'POSTE (9)'!$W:$W,0)),\"\")))))))))","v":1},{"$f":"IFERROR(INDEX('POSTE (1)'!T:T,MATCH(ROW()-2,'POSTE (1)'!$W:$W,0)),IFERROR(INDEX('POSTE (2)'!T:T,MATCH(ROW()-2,'POSTE (2)'!$W:$W,0)),IFERROR(INDEX('POSTE (3)'!T:T,MATCH(ROW()-2,'POSTE (3)'!$W:$W,0)),IFERROR(INDEX('POSTE (4)'!T:T,MATCH(ROW()-2,'POSTE (4)'!$W:$W,0)),IFERROR(INDEX('POSTE (5)'!T:T,MATCH(ROW()-2,'POSTE (5)'!$W:$W,0)),IFERROR(INDEX('POSTE (6)'!T:T,MATCH(ROW()-2,'POSTE (6)'!$W:$W,0)),IFERROR(INDEX('POSTE (7)'!T:T,MATCH(ROW()-2,'POSTE (7)'!$W:$W,0)),IFERROR(INDEX('POSTE (8)'!T:T,MATCH(ROW()-2,'POSTE (8)'!$W:$W,0)),IFERROR(INDEX('POSTE (9)'!T:T,MATCH(ROW()-2,'POSTE (9)'!$W:$W,0)),\"\")))))))))","v":2},{"$f":"IFERROR(INDEX('POSTE (1)'!U:U,MATCH(ROW()-2,'POSTE (1)'!$W:$W,0)),IFERROR(INDEX('POSTE (2)'!U:U,MATCH(ROW()-2,'POSTE (2)'!$W:$W,0)),IFERROR(INDEX('POSTE (3)'!U:U,MATCH(ROW()-2,'POSTE (3)'!$W:$W,0)),IFERROR(INDEX('POSTE (4)'!U:U,MATCH(ROW()-2,'POSTE (4)'!$W:$W,0)),IFERROR(INDEX('POSTE (5)'!U:U,MATCH(ROW()-2,'POSTE (5)'!$W:$W,0)),IFERROR(INDEX('POSTE (6)'!U:U,MATCH(ROW()-2,'POSTE (6)'!$W:$W,0)),IFERROR(INDEX('POSTE (7)'!U:U,MATCH(ROW()-2,'POSTE (7)'!$W:$W,0)),IFERROR(INDEX('POSTE (8)'!U:U,MATCH(ROW()-2,'POSTE (8)'!$W:$W,0)),IFERROR(INDEX('POSTE (9)'!U:U,MATCH(ROW()-2,'POSTE (9)'!$W:$W,0)),\"\")))))))))","v":"POSTE (2)"}]
[{"$f":"IFERROR(INDEX('POSTE (1)'!N:N,MATCH(ROW()-2,'POSTE (1)'!$W:$W,0)),IFERROR(INDEX('POSTE (2)'!N:N,MATCH(ROW()-2,'POSTE (2)'!$W:$W,0)),IFERROR(INDEX('POSTE (3)'!N:N,MATCH(ROW()-2,'POSTE (3)'!$W:$W,0)),IFERROR(INDEX('POSTE (4)'!N:N,MATCH(ROW()-2,'POSTE (4)'!$W:$W,0)),IFERROR(INDEX('POSTE (5)'!N:N,MATCH(ROW()-2,'POSTE (5)'!$W:$W,0)),IFERROR(INDEX('POSTE (6)'!N:N,MATCH(ROW()-2,'POSTE (6)'!$W:$W,0)),IFERROR(INDEX('POSTE (7)'!N:N,MATCH(ROW()-2,'POSTE (7)'!$W:$W,0)),IFERROR(INDEX('POSTE (8)'!N:N,MATCH(ROW()-2,'POSTE (8)'!$W:$W,0)),IFERROR(INDEX('POSTE (9)'!N:N,MATCH(ROW()-2,'POSTE (9)'!$W:$W,0)),\"\")))))))))","v":"(3)Fournisseur"},{"$f":"IFERROR(INDEX('POSTE (1)'!O:O,MATCH(ROW()-2,'POSTE (1)'!$W:$W,0)),IFERROR(INDEX('POSTE (2)'!O:O,MATCH(ROW()-2,'POSTE (2)'!$W:$W,0)),IFERROR(INDEX('POSTE (3)'!O:O,MATCH(ROW()-2,'POSTE (3)'!$W:$W,0)),IFERROR(INDEX('POSTE (4)'!O:O,MATCH(ROW()-2,'POSTE (4)'!$W:$W,0)),IFERROR(INDEX('POSTE (5)'!O:O,MATCH(ROW()-2,'POSTE (5)'!$W:$W,0)),IFERROR(INDEX('POSTE (6)'!O:O,MATCH(ROW()-2,'POSTE (6)'!$W:$W,0)),IFERROR(INDEX('POSTE (7)'!O:O,MATCH(ROW()-2,'POSTE (7)'!$W:$W,0)),IFERROR(INDEX('POSTE (8)'!O:O,MATCH(ROW()-2,'POSTE (8)'!$W:$W,0)),IFERROR(INDEX('POSTE (9)'!O:O,MATCH(ROW()-2,'POSTE (9)'!$W:$W,0)),\"\")))))))))","v":"(3)Ref"},{"$f":"IFERROR(INDEX('POSTE (1)'!P:P,MATCH(ROW()-2,'POSTE (1)'!$W:$W,0)),IFERROR(INDEX('POSTE (2)'!P:P,MATCH(ROW()-2,'POSTE (2)'!$W:$W,0)),IFERROR(INDEX('POSTE (3)'!P:P,MATCH(ROW()-2,'POSTE (3)'!$W:$W,0)),IFERROR(INDEX('POSTE (4)'!P:P,MATCH(ROW()-2,'POSTE (4)'!$W:$W,0)),IFERROR(INDEX('POSTE (5)'!P:P,MATCH(ROW()-2,'POSTE (5)'!$W:$W,0)),IFERROR(INDEX('POSTE (6)'!P:P,MATCH(ROW()-2,'POSTE (6)'!$W:$W,0)),IFERROR(INDEX('POSTE (7)'!P:P,MATCH(ROW()-2,'POSTE (7)'!$W:$W,0)),IFERROR(INDEX('POSTE (8)'!P:P,MATCH(ROW()-2,'POSTE (8)'!$W:$W,0)),IFERROR(INDEX('POSTE (9)'!P:P,MATCH(ROW()-2,'POSTE (9)'!$W:$W,0)),\"\")))))))))","v":"(3)DESIGNATION"},{"$f":"IFERROR(INDEX('POSTE (1)'!Q:Q,MATCH(ROW()-2,'POSTE (1)'!$W:$W,0)),IFERROR(INDEX('POSTE (2)'!Q:Q,MATCH(ROW()-2,'POSTE (2)'!$W:$W,0)),IFERROR(INDEX('POSTE (3)'!Q:Q,MATCH(ROW()-2,'POSTE (3)'!$W:$W,0)),IFERROR(INDEX('POSTE (4)'!Q:Q,MATCH(ROW()-2,'POSTE (4)'!$W:$W,0)),IFERROR(INDEX('POSTE (5)'!Q:Q,MATCH(ROW()-2,'POSTE (5)'!$W:$W,0)),IFERROR(INDEX('POSTE (6)'!Q:Q,MATCH(ROW()-2,'POSTE (6)'!$W:$W,0)),IFERROR(INDEX('POSTE (7)'!Q:Q,MATCH(ROW()-2,'POSTE (7)'!$W:$W,0)),IFERROR(INDEX('POSTE (8)'!Q:Q,MATCH(ROW()-2,'POSTE (8)'!$W:$W,0)),IFERROR(INDEX('POSTE (9)'!Q:Q,MATCH(ROW()-2,'POSTE (9)'!$W:$W,0)),\"\")))))))))","v":"L"},{"$f":"IFERROR(INDEX('POSTE (1)'!R:R,MATCH(ROW()-2,'POSTE (1)'!$W:$W,0)),IFERROR(INDEX('POSTE (2)'!R:R,MATCH(ROW()-2,'POSTE (2)'!$W:$W,0)),IFERROR(INDEX('POSTE (3)'!R:R,MATCH(ROW()-2,'POSTE (3)'!$W:$W,0)),IFERROR(INDEX('POSTE (4)'!R:R,MATCH(ROW()-2,'POSTE (4)'!$W:$W,0)),IFERROR(INDEX('POSTE (5)'!R:R,MATCH(ROW()-2,'POSTE (5)'!$W:$W,0)),IFERROR(INDEX('POSTE (6)'!R:R,MATCH(ROW()-2,'POSTE (6)'!$W:$W,0)),IFERROR(INDEX('POSTE (7)'!R:R,MATCH(ROW()-2,'POSTE (7)'!$W:$W,0)),IFERROR(INDEX('POSTE (8)'!R:R,MATCH(ROW()-2,'POSTE (8)'!$W:$W,0)),IFERROR(INDEX('POSTE (9)'!R:R,MATCH(ROW()-2,'POSTE (9)'!$W:$W,0)),\"\")))))))))","v":3},{"$f":"IFERROR(INDEX('POSTE (1)'!S:S,MATCH(ROW()-2,'POSTE (1)'!$W:$W,0)),IFERROR(INDEX('POSTE (2)'!S:S,MATCH(ROW()-2,'POSTE (2)'!$W:$W,0)),IFERROR(INDEX('POSTE (3)'!S:S,MATCH(ROW()-2,'POSTE (3)'!$W:$W,0)),IFERROR(INDEX('POSTE (4)'!S:S,MATCH(ROW()-2,'POSTE (4)'!$W:$W,0)),IFERROR(INDEX('POSTE (5)'!S:S,MATCH(ROW()-2,'POSTE (5)'!$W:$W,0)),IFERROR(INDEX('POSTE (6)'!S:S,MATCH(ROW()-2,'POSTE (6)'!$W:$W,0)),IFERROR(INDEX('POSTE (7)'!S:S,MATCH(ROW()-2,'POSTE (7)'!$W:$W,0)),IFERROR(INDEX('POSTE (8)'!S:S,MATCH(ROW()-2,'POSTE (8)'!$W:$W,0)),IFERROR(INDEX('POSTE (9)'!S:S,MATCH(ROW()-2,'POSTE (9)'!$W:$W,0)),\"\")))))))))","v":1},{"$f":"IFERROR(INDEX('POSTE (1)'!T:T,MATCH(ROW()-2,'POSTE (1)'!$W:$W,0)),IFERROR(INDEX('POSTE (2)'!T:T,MATCH(ROW()-2,'POSTE (2)'!$W:$W,0)),IFERROR(INDEX('POSTE (3)'!T:T,MATCH(ROW()-2,'POSTE (3)'!$W:$W,0)),IFERROR(INDEX('POSTE (4)'!T:T,MATCH(ROW()-2,'POSTE (4)'!$W:$W,0)),IFERROR(INDEX('POSTE (5)'!T:T,MATCH(ROW()-2,'POSTE (5)'!$W:$W,0)),IFERROR(INDEX('POSTE (6)'!T:T,MATCH(ROW()-2,'POSTE (6)'!$W:$W,0)),IFERROR(INDEX('POSTE (7)'!T:T,MATCH(ROW()-2,'POSTE (7)'!$W:$W,0)),IFERROR(INDEX('POSTE (8)'!T:T,MATCH(ROW()-2,'POSTE (8)'!$W:$W,0)),IFERROR(INDEX('POSTE (9)'!T:T,MATCH(ROW()-2,'POSTE (9)'!$W:$W,0)),\"\")))))))))","v":3},{"$f":"IFERROR(INDEX('POSTE (1)'!U:U,MATCH(ROW()-2,'POSTE (1)'!$W:$W,0)),IFERROR(INDEX('POSTE (2)'!U:U,MATCH(ROW()-2,'POSTE (2)'!$W:$W,0)),IFERROR(INDEX('POSTE (3)'!U:U,MATCH(ROW()-2,'POSTE (3)'!$W:$W,0)),IFERROR(INDEX('POSTE (4)'!U:U,MATCH(ROW()-2,'POSTE (4)'!$W:$W,0)),IFERROR(INDEX('POSTE (5)'!U:U,MATCH(ROW()-2,'POSTE (5)'!$W:$W,0)),IFERROR(INDEX('POSTE (6)'!U:U,MATCH(ROW()-2,'POSTE (6)'!$W:$W,0)),IFERROR(INDEX('POSTE (7)'!U:U,MATCH(ROW()-2,'POSTE (7)'!$W:$W,0)),IFERROR(INDEX('POSTE (8)'!U:U,MATCH(ROW()-2,'POSTE (8)'!$W:$W,0)),IFERROR(INDEX('POSTE (9)'!U:U,MATCH(ROW()-2,'POSTE (9)'!$W:$W,0)),\"\")))))))))","v":"POSTE (3)"}]
[{"$f":"IFERROR(INDEX('POSTE (1)'!N:N,MATCH(ROW()-2,'POSTE (1)'!$W:$W,0)),IFERROR(INDEX('POSTE (2)'!N:N,MATCH(ROW()-2,'POSTE (2)'!$W:$W,0)),IFERROR(INDEX('POSTE (3)'!N:N,MATCH(ROW()-2,'POSTE (3)'!$W:$W,0)),IFERROR(INDEX('POSTE (4)'!N:N,MATCH(ROW()-2,'POSTE (4)'!$W:$W,0)),IFERROR(INDEX('POSTE (5)'!N:N,MATCH(ROW()-2,'POSTE (5)'!$W:$W,0)),IFERROR(INDEX('POSTE (6)'!N:N,MATCH(ROW()-2,'POSTE (6)'!$W:$W,0)),IFERROR(INDEX('POSTE (7)'!N:N,MATCH(ROW()-2,'POSTE (7)'!$W:$W,0)),IFERROR(INDEX('POSTE (8)'!N:N,MATCH(ROW()-2,'POSTE (8)'!$W:$W,0)),IFERROR(INDEX('POSTE (9)'!N:N,MATCH(ROW()-2,'POSTE (9)'!$W:$W,0)),\"\")))))))))","v":"(3)Fournisseur2"},{"$f":"IFERROR(INDEX('POSTE (1)'!O:O,MATCH(ROW()-2,'POSTE (1)'!$W:$W,0)),IFERROR(INDEX('POSTE (2)'!O:O,MATCH(ROW()-2,'POSTE (2)'!$W:$W,0)),IFERROR(INDEX('POSTE (3)'!O:O,MATCH(ROW()-2,'POSTE (3)'!$W:$W,0)),IFERROR(INDEX('POSTE (4)'!O:O,MATCH(ROW()-2,'POSTE (4)'!$W:$W,0)),IFERROR(INDEX('POSTE (5)'!O:O,MATCH(ROW()-2,'POSTE (5)'!$W:$W,0)),IFERROR(INDEX('POSTE (6)'!O:O,MATCH(ROW()-2,'POSTE (6)'!$W:$W,0)),IFERROR(INDEX('POSTE (7)'!O:O,MATCH(ROW()-2,'POSTE (7)'!$W:$W,0)),IFERROR(INDEX('POSTE (8)'!O:O,MATCH(ROW()-2,'POSTE (8)'!$W:$W,0)),IFERROR(INDEX('POSTE (9)'!O:O,MATCH(ROW()-2,'POSTE (9)'!$W:$W,0)),\"\")))))))))","v":"(3)Ref2"},{"$f":"IFERROR(INDEX('POSTE (1)'!P:P,MATCH(ROW()-2,'POSTE (1)'!$W:$W,0)),IFERROR(INDEX('POSTE (2)'!P:P,MATCH(ROW()-2,'POSTE (2)'!$W:$W,0)),IFERROR(INDEX('POSTE (3)'!P:P,MATCH(ROW()-2,'POSTE (3)'!$W:$W,0)),IFERROR(INDEX('POSTE (4)'!P:P,MATCH(ROW()-2,'POSTE (4)'!$W:$W,0)),IFERROR(INDEX('POSTE (5)'!P:P,MATCH(ROW()-2,'POSTE (5)'!$W:$W,0)),IFERROR(INDEX('POSTE (6)'!P:P,MATCH(ROW()-2,'POSTE (6)'!$W:$W,0)),IFERROR(INDEX('POSTE (7)'!P:P,MATCH(ROW()-2,'POSTE (7)'!$W:$W,0)),IFERROR(INDEX('POSTE (8)'!P:P,MATCH(ROW()-2,'POSTE (8)'!$W:$W,0)),IFERROR(INDEX('POSTE (9)'!P:P,MATCH(ROW()-2,'POSTE (9)'!$W:$W,0)),\"\")))))))))","v":"(3)DESIGNATION2"},{"$f":"IFERROR(INDEX('POSTE (1)'!Q:Q,MATCH(ROW()-2,'POSTE (1)'!$W:$W,0)),IFERROR(INDEX('POSTE (2)'!Q:Q,MATCH(ROW()-2,'POSTE (2)'!$W:$W,0)),IFERROR(INDEX('POSTE (3)'!Q:Q,MATCH(ROW()-2,'POSTE (3)'!$W:$W,0)),IFERROR(INDEX('POSTE (4)'!Q:Q,MATCH(ROW()-2,'POSTE (4)'!$W:$W,0)),IFERROR(INDEX('POSTE (5)'!Q:Q,MATCH(ROW()-2,'POSTE (5)'!$W:$W,0)),IFERROR(INDEX('POSTE (6)'!Q:Q,MATCH(ROW()-2,'POSTE (6)'!$W:$W,0)),IFERROR(INDEX('POSTE (7)'!Q:Q,MATCH(ROW()-2,'POSTE (7)'!$W:$W,0)),IFERROR(INDEX('POSTE (8)'!Q:Q,MATCH(ROW()-2,'POSTE (8)'!$W:$W,0)),IFERROR(INDEX('POSTE (9)'!Q:Q,MATCH(ROW()-2,'POSTE (9)'!$W:$W,0)),\"\")))))))))","v":"L"},{"$f":"IFERROR(INDEX('POSTE (1)'!R:R,MATCH(ROW()-2,'POSTE (1)'!$W:$W,0)),IFERROR(INDEX('POSTE (2)'!R:R,MATCH(ROW()-2,'POSTE (2)'!$W:$W,0)),IFERROR(INDEX('POSTE (3)'!R:R,MATCH(ROW()-2,'POSTE (3)'!$W:$W,0)),IFERROR(INDEX('POSTE (4)'!R:R,MATCH(ROW()-2,'POSTE (4)'!$W:$W,0)),IFERROR(INDEX('POSTE (5)'!R:R,MATCH(ROW()-2,'POSTE (5)'!$W:$W,0)),IFERROR(INDEX('POSTE (6)'!R:R,MATCH(ROW()-2,'POSTE (6)'!$W:$W,0)),IFERROR(INDEX('POSTE (7)'!R:R,MATCH(ROW()-2,'POSTE (7)'!$W:$W,0)),IFERROR(INDEX('POSTE (8)'!R:R,MATCH(ROW()-2,'POSTE (8)'!$W:$W,0)),IFERROR(INDEX('POSTE (9)'!R:R,MATCH(ROW()-2,'POSTE (9)'!$W:$W,0)),\"\")))))))))","v":3},{"$f":"IFERROR(INDEX('POSTE (1)'!S:S,MATCH(ROW()-2,'POSTE (1)'!$W:$W,0)),IFERROR(INDEX('POSTE (2)'!S:S,MATCH(ROW()-2,'POSTE (2)'!$W:$W,0)),IFERROR(INDEX('POSTE (3)'!S:S,MATCH(ROW()-2,'POSTE (3)'!$W:$W,0)),IFERROR(INDEX('POSTE (4)'!S:S,MATCH(ROW()-2,'POSTE (4)'!$W:$W,0)),IFERROR(INDEX('POSTE (5)'!S:S,MATCH(ROW()-2,'POSTE (5)'!$W:$W,0)),IFERROR(INDEX('POSTE (6)'!S:S,MATCH(ROW()-2,'POSTE (6)'!$W:$W,0)),IFERROR(INDEX('POSTE (7)'!S:S,MATCH(ROW()-2,'POSTE (7)'!$W:$W,0)),IFERROR(INDEX('POSTE (8)'!S:S,MATCH(ROW()-2,'POSTE (8)'!$W:$W,0)),IFERROR(INDEX('POSTE (9)'!S:S,MATCH(ROW()-2,'POSTE (9)'!$W:$W,0)),\"\")))))))))","v":1},{"$f":"IFERROR(INDEX('POSTE (1)'!T:T,MATCH(ROW()-2,'POSTE (1)'!$W:$W,0)),IFERROR(INDEX('POSTE (2)'!T:T,MATCH(ROW()-2,'POSTE (2)'!$W:$W,0)),IFERROR(INDEX('POSTE (3)'!T:T,MATCH(ROW()-2,'POSTE (3)'!$W:$W,0)),IFERROR(INDEX('POSTE (4)'!T:T,MATCH(ROW()-2,'POSTE (4)'!$W:$W,0)),IFERROR(INDEX('POSTE (5)'!T:T,MATCH(ROW()-2,'POSTE (5)'!$W:$W,0)),IFERROR(INDEX('POSTE (6)'!T:T,MATCH(ROW()-2,'POSTE (6)'!$W:$W,0)),IFERROR(INDEX('POSTE (7)'!T:T,MATCH(ROW()-2,'POSTE (7)'!$W:$W,0)),IFERROR(INDEX('POSTE (8)'!T:T,MATCH(ROW()-2,'POSTE (8)'!$W:$W,0)),IFERROR(INDEX('POSTE (9)'!T:T,MATCH(ROW()-2,'POSTE (9)'!$W:$W,0)),\"\")))))))))","v":3},{"$f":"IFERROR(INDEX('POSTE (1)'!U:U,MATCH(ROW()-2,'POSTE (1)'!$W:$W,0)),IFERROR(INDEX('POSTE (2)'!U:U,MATCH(ROW()-2,'POSTE (2)'!$W:$W,0)),IFERROR(INDEX('POSTE (3)'!U:U,MATCH(ROW()-2,'POSTE (3)'!$W:$W,0)),IFERROR(INDEX('POSTE (4)'!U:U,MATCH(ROW()-2,'POSTE (4)'!$W:$W,0)),IFERROR(INDEX('POSTE (5)'!U:U,MATCH(ROW()-2,'POSTE (5)'!$W:$W,0)),IFERROR(INDEX('POSTE (6)'!U:U,MATCH(ROW()-2,'POSTE (6)'!$W:$W,0)),IFERROR(INDEX('POSTE (7)'!U:U,MATCH(ROW()-2,'POSTE (7)'!$W:$W,0)),IFERROR(INDEX('POSTE (8)'!U:U,MATCH(ROW()-2,'POSTE (8)'!$W:$W,0)),IFERROR(INDEX('POSTE (9)'!U:U,MATCH(ROW()-2,'POSTE (9)'!$W:$W,0)),\"\")))))))))","v":"POSTE (3)"}]
[{"$f":"IFERROR(INDEX('POSTE (1)'!N:N,MATCH(ROW()-2,'POSTE (1)'!$W:$W,0)),IFERROR(INDEX('POSTE (2)'!N:N,MATCH(ROW()-2,'POSTE (2)'!$W:$W,0)),IFERROR(INDEX('POSTE (3)'!N:N,MATCH(ROW()-2,'POSTE (3)'!$W:$W,0)),IFERROR(INDEX('POSTE (4)'!N:N,MATCH(ROW()-2,'POSTE (4)'!$W:$W,0)),IFERROR(INDEX('POSTE (5)'!N:N,MATCH(ROW()-2,'POSTE (5)'!$W:$W,0)),IFERROR(INDEX('POSTE (6)'!N:N,MATCH(ROW()-2,'POSTE (6)'!$W:$W,0)),IFERROR(INDEX('POSTE (7)'!N:N,MATCH(ROW()-2,'POSTE (7)'!$W:$W,0)),IFERROR(INDEX('POSTE (8)'!N:N,MATCH(ROW()-2,'POSTE (8)'!$W:$W,0)),IFERROR(INDEX('POSTE (9)'!N:N,MATCH(ROW()-2,'POSTE (9)'!$W:$W,0)),\"\")))))))))","v":"(3)Fournisseur3"},{"$f":"IFERROR(INDEX('POSTE (1)'!O:O,MATCH(ROW()-2,'POSTE (1)'!$W:$W,0)),IFERROR(INDEX('POSTE (2)'!O:O,MATCH(ROW()-2,'POSTE (2)'!$W:$W,0)),IFERROR(INDEX('POSTE (3)'!O:O,MATCH(ROW()-2,'POSTE (3)'!$W:$W,0)),IFERROR(INDEX('POSTE (4)'!O:O,MATCH(ROW()-2,'POSTE (4)'!$W:$W,0)),IFERROR(INDEX('POSTE (5)'!O:O,MATCH(ROW()-2,'POSTE (5)'!$W:$W,0)),IFERROR(INDEX('POSTE (6)'!O:O,MATCH(ROW()-2,'POSTE (6)'!$W:$W,0)),IFERROR(INDEX('POSTE (7)'!O:O,MATCH(ROW()-2,'POSTE (7)'!$W:$W,0)),IFERROR(INDEX('POSTE (8)'!O:O,MATCH(ROW()-2,'POSTE (8)'!$W:$W,0)),IFERROR(INDEX('POSTE (9)'!O:O,MATCH(ROW()-2,'POSTE (9)'!$W:$W,0)),\"\")))))))))","v":"(3)Ref3"},{"$f":"IFERROR(INDEX('POSTE (1)'!P:P,MATCH(ROW()-2,'POSTE (1)'!$W:$W,0)),IFERROR(INDEX('POSTE (2)'!P:P,MATCH(ROW()-2,'POSTE (2)'!$W:$W,0)),IFERROR(INDEX('POSTE (3)'!P:P,MATCH(ROW()-2,'POSTE (3)'!$W:$W,0)),IFERROR(INDEX('POSTE (4)'!P:P,MATCH(ROW()-2,'POSTE (4)'!$W:$W,0)),IFERROR(INDEX('POSTE (5)'!P:P,MATCH(ROW()-2,'POSTE (5)'!$W:$W,0)),IFERROR(INDEX('POSTE (6)'!P:P,MATCH(ROW()-2,'POSTE (6)'!$W:$W,0)),IFERROR(INDEX('POSTE (7)'!P:P,MATCH(ROW()-2,'POSTE (7)'!$W:$W,0)),IFERROR(INDEX('POSTE (8)'!P:P,MATCH(ROW()-2,'POSTE (8)'!$W:$W,0)),IFERROR(INDEX('POSTE (9)'!P:P,MATCH(ROW()-2,'POSTE (9)'!$W:$W,0)),\"\")))))))))","v":"(3)DESIGNATION3"},{"$f":"IFERROR(INDEX('POSTE (1)'!Q:Q,MATCH(ROW()-2,'POSTE (1)'!$W:$W,0)),IFERROR(INDEX('POSTE (2)'!Q:Q,MATCH(ROW()-2,'POSTE (2)'!$W:$W,0)),IFERROR(INDEX('POSTE (3)'!Q:Q,MATCH(ROW()-2,'POSTE (3)'!$W:$W,0)),IFERROR(INDEX('POSTE (4)'!Q:Q,MATCH(ROW()-2,'POSTE (4)'!$W:$W,0)),IFERROR(INDEX('POSTE (5)'!Q:Q,MATCH(ROW()-2,'POSTE (5)'!$W:$W,0)),IFERROR(INDEX('POSTE (6)'!Q:Q,MATCH(ROW()-2,'POSTE (6)'!$W:$W,0)),IFERROR(INDEX('POSTE (7)'!Q:Q,MATCH(ROW()-2,'POSTE (7)'!$W:$W,0)),IFERROR(INDEX('POSTE (8)'!Q:Q,MATCH(ROW()-2,'POSTE (8)'!$W:$W,0)),IFERROR(INDEX('POSTE (9)'!Q:Q,MATCH(ROW()-2,'POSTE (9)'!$W:$W,0)),\"\")))))))))","v":"L"},{"$f":"IFERROR(INDEX('POSTE (1)'!R:R,MATCH(ROW()-2,'POSTE (1)'!$W:$W,0)),IFERROR(INDEX('POSTE (2)'!R:R,MATCH(ROW()-2,'POSTE (2)'!$W:$W,0)),IFERROR(INDEX('POSTE (3)'!R:R,MATCH(ROW()-2,'POSTE (3)'!$W:$W,0)),IFERROR(INDEX('POSTE (4)'!R:R,MATCH(ROW()-2,'POSTE (4)'!$W:$W,0)),IFERROR(INDEX('POSTE (5)'!R:R,MATCH(ROW()-2,'POSTE (5)'!$W:$W,0)),IFERROR(INDEX('POSTE (6)'!R:R,MATCH(ROW()-2,'POSTE (6)'!$W:$W,0)),IFERROR(INDEX('POSTE (7)'!R:R,MATCH(ROW()-2,'POSTE (7)'!$W:$W,0)),IFERROR(INDEX('POSTE (8)'!R:R,MATCH(ROW()-2,'POSTE (8)'!$W:$W,0)),IFERROR(INDEX('POSTE (9)'!R:R,MATCH(ROW()-2,'POSTE (9)'!$W:$W,0)),\"\")))))))))","v":3},{"$f":"IFERROR(INDEX('POSTE (1)'!S:S,MATCH(ROW()-2,'POSTE (1)'!$W:$W,0)),IFERROR(INDEX('POSTE (2)'!S:S,MATCH(ROW()-2,'POSTE (2)'!$W:$W,0)),IFERROR(INDEX('POSTE (3)'!S:S,MATCH(ROW()-2,'POSTE (3)'!$W:$W,0)),IFERROR(INDEX('POSTE (4)'!S:S,MATCH(ROW()-2,'POSTE (4)'!$W:$W,0)),IFERROR(INDEX('POSTE (5)'!S:S,MATCH(ROW()-2,'POSTE (5)'!$W:$W,0)),IFERROR(INDEX('POSTE (6)'!S:S,MATCH(ROW()-2,'POSTE (6)'!$W:$W,0)),IFERROR(INDEX('POSTE (7)'!S:S,MATCH(ROW()-2,'POSTE (7)'!$W:$W,0)),IFERROR(INDEX('POSTE (8)'!S:S,MATCH(ROW()-2,'POSTE (8)'!$W:$W,0)),IFERROR(INDEX('POSTE (9)'!S:S,MATCH(ROW()-2,'POSTE (9)'!$W:$W,0)),\"\")))))))))","v":1},{"$f":"IFERROR(INDEX('POSTE (1)'!T:T,MATCH(ROW()-2,'POSTE (1)'!$W:$W,0)),IFERROR(INDEX('POSTE (2)'!T:T,MATCH(ROW()-2,'POSTE (2)'!$W:$W,0)),IFERROR(INDEX('POSTE (3)'!T:T,MATCH(ROW()-2,'POSTE (3)'!$W:$W,0)),IFERROR(INDEX('POSTE (4)'!T:T,MATCH(ROW()-2,'POSTE (4)'!$W:$W,0)),IFERROR(INDEX('POSTE (5)'!T:T,MATCH(ROW()-2,'POSTE (5)'!$W:$W,0)),IFERROR(INDEX('POSTE (6)'!T:T,MATCH(ROW()-2,'POSTE (6)'!$W:$W,0)),IFERROR(INDEX('POSTE (7)'!T:T,MATCH(ROW()-2,'POSTE (7)'!$W:$W,0)),IFERROR(INDEX('POSTE (8)'!T:T,MATCH(ROW()-2,'POSTE (8)'!$W:$W,0)),IFERROR(INDEX('POSTE (9)'!T:T,MATCH(ROW()-2,'POSTE (9)'!$W:$W,0)),\"\")))))))))","v":3},{"$f":"IFERROR(INDEX('POSTE (1)'!U:U,MATCH(ROW()-2,'POSTE (1)'!$W:$W,0)),IFERROR(INDEX('POSTE (2)'!U:U,MATCH(ROW()-2,'POSTE (2)'!$W:$W,0)),IFERROR(INDEX('POSTE (3)'!U:U,MATCH(ROW()-2,'POSTE (3)'!$W:$W,0)),IFERROR(INDEX('POSTE (4)'!U:U,MATCH(ROW()-2,'POSTE (4)'!$W:$W,0)),IFERROR(INDEX('POSTE (5)'!U:U,MATCH(ROW()-2,'POSTE (5)'!$W:$W,0)),IFERROR(INDEX('POSTE (6)'!U:U,MATCH(ROW()-2,'POSTE (6)'!$W:$W,0)),IFERROR(INDEX('POSTE (7)'!U:U,MATCH(ROW()-2,'POSTE (7)'!$W:$W,0)),IFERROR(INDEX('POSTE (8)'!U:U,MATCH(ROW()-2,'POSTE (8)'!$W:$W,0)),IFERROR(INDEX('POSTE (9)'!U:U,MATCH(ROW()-2,'POSTE (9)'!$W:$W,0)),\"\")))))))))","v":"POSTE (3)"}]
[{"$f":"IFERROR(INDEX('POSTE (1)'!N:N,MATCH(ROW()-2,'POSTE (1)'!$W:$W,0)),IFERROR(INDEX('POSTE (2)'!N:N,MATCH(ROW()-2,'POSTE (2)'!$W:$W,0)),IFERROR(INDEX('POSTE (3)'!N:N,MATCH(ROW()-2,'POSTE (3)'!$W:$W,0)),IFERROR(INDEX('POSTE (4)'!N:N,MATCH(ROW()-2,'POSTE (4)'!$W:$W,0)),IFERROR(INDEX('POSTE (5)'!N:N,MATCH(ROW()-2,'POSTE (5)'!$W:$W,0)),IFERROR(INDEX('POSTE (6)'!N:N,MATCH(ROW()-2,'POSTE (6)'!$W:$W,0)),IFERROR(INDEX('POSTE (7)'!N:N,MATCH(ROW()-2,'POSTE (7)'!$W:$W,0)),IFERROR(INDEX('POSTE (8)'!N:N,MATCH(ROW()-2,'POSTE (8)'!$W:$W,0)),IFERROR(INDEX('POSTE (9)'!N:N,MATCH(ROW()-2,'POSTE (9)'!$W:$W,0)),\"\")))))))))","v":"(4)Fournisseur"},{"$f":"IFERROR(INDEX('POSTE (1)'!O:O,MATCH(ROW()-2,'POSTE (1)'!$W:$W,0)),IFERROR(INDEX('POSTE (2)'!O:O,MATCH(ROW()-2,'POSTE (2)'!$W:$W,0)),IFERROR(INDEX('POSTE (3)'!O:O,MATCH(ROW()-2,'POSTE (3)'!$W:$W,0)),IFERROR(INDEX('POSTE (4)'!O:O,MATCH(ROW()-2,'POSTE (4)'!$W:$W,0)),IFERROR(INDEX('POSTE (5)'!O:O,MATCH(ROW()-2,'POSTE (5)'!$W:$W,0)),IFERROR(INDEX('POSTE (6)'!O:O,MATCH(ROW()-2,'POSTE (6)'!$W:$W,0)),IFERROR(INDEX('POSTE (7)'!O:O,MATCH(ROW()-2,'POSTE (7)'!$W:$W,0)),IFERROR(INDEX('POSTE (8)'!O:O,MATCH(ROW()-2,'POSTE (8)'!$W:$W,0)),IFERROR(INDEX('POSTE (9)'!O:O,MATCH(ROW()-2,'POSTE (9)'!$W:$W,0)),\"\")))))))))","v":"(4)Ref"},{"$f":"IFERROR(INDEX('POSTE (1)'!P:P,MATCH(ROW()-2,'POSTE (1)'!$W:$W,0)),IFERROR(INDEX('POSTE (2)'!P:P,MATCH(ROW()-2,'POSTE (2)'!$W:$W,0)),IFERROR(INDEX('POSTE (3)'!P:P,MATCH(ROW()-2,'POSTE (3)'!$W:$W,0)),IFERROR(INDEX('POSTE (4)'!P:P,MATCH(ROW()-2,'POSTE (4)'!$W:$W,0)),IFERROR(INDEX('POSTE (5)'!P:P,MATCH(ROW()-2,'POSTE (5)'!$W:$W,0)),IFERROR(INDEX('POSTE (6)'!P:P,MATCH(ROW()-2,'POSTE (6)'!$W:$W,0)),IFERROR(INDEX('POSTE (7)'!P:P,MATCH(ROW()-2,'POSTE (7)'!$W:$W,0)),IFERROR(INDEX('POSTE (8)'!P:P,MATCH(ROW()-2,'POSTE (8)'!$W:$W,0)),IFERROR(INDEX('POSTE (9)'!P:P,MATCH(ROW()-2,'POSTE (9)'!$W:$W,0)),\"\")))))))))","v":"(4)DESIGNATION"},{"$f":"IFERROR(INDEX('POSTE (1)'!Q:Q,MATCH(ROW()-2,'POSTE (1)'!$W:$W,0)),IFERROR(INDEX('POSTE (2)'!Q:Q,MATCH(ROW()-2,'POSTE (2)'!$W:$W,0)),IFERROR(INDEX('POSTE (3)'!Q:Q,MATCH(ROW()-2,'POSTE (3)'!$W:$W,0)),IFERROR(INDEX('POSTE (4)'!Q:Q,MATCH(ROW()-2,'POSTE (4)'!$W:$W,0)),IFERROR(INDEX('POSTE (5)'!Q:Q,MATCH(ROW()-2,'POSTE (5)'!$W:$W,0)),IFERROR(INDEX('POSTE (6)'!Q:Q,MATCH(ROW()-2,'POSTE (6)'!$W:$W,0)),IFERROR(INDEX('POSTE (7)'!Q:Q,MATCH(ROW()-2,'POSTE (7)'!$W:$W,0)),IFERROR(INDEX('POSTE (8)'!Q:Q,MATCH(ROW()-2,'POSTE (8)'!$W:$W,0)),IFERROR(INDEX('POSTE (9)'!Q:Q,MATCH(ROW()-2,'POSTE (9)'!$W:$W,0)),\"\")))))))))","v":"g"},{"$f":"IFERROR(INDEX('POSTE (1)'!R:R,MATCH(ROW()-2,'POSTE (1)'!$W:$W,0)),IFERROR(INDEX('POSTE (2)'!R:R,MATCH(ROW()-2,'POSTE (2)'!$W:$W,0)),IFERROR(INDEX('POSTE (3)'!R:R,MATCH(ROW()-2,'POSTE (3)'!$W:$W,0)),IFERROR(INDEX('POSTE (4)'!R:R,MATCH(ROW()-2,'POSTE (4)'!$W:$W,0)),IFERROR(INDEX('POSTE (5)'!R:R,MATCH(ROW()-2,'POSTE (5)'!$W:$W,0)),IFERROR(INDEX('POSTE (6)'!R:R,MATCH(ROW()-2,'POSTE (6)'!$W:$W,0)),IFERROR(INDEX('POSTE (7)'!R:R,MATCH(ROW()-2,'POSTE (7)'!$W:$W,0)),IFERROR(INDEX('POSTE (8)'!R:R,MATCH(ROW()-2,'POSTE (8)'!$W:$W,0)),IFERROR(INDEX('POSTE (9)'!R:R,MATCH(ROW()-2,'POSTE (9)'!$W:$W,0)),\"\")))))))))","v":4},{"$f":"IFERROR(INDEX('POSTE (1)'!S:S,MATCH(ROW()-2,'POSTE (1)'!$W:$W,0)),IFERROR(INDEX('POSTE (2)'!S:S,MATCH(ROW()-2,'POSTE (2)'!$W:$W,0)),IFERROR(INDEX('POSTE (3)'!S:S,MATCH(ROW()-2,'POSTE (3)'!$W:$W,0)),IFERROR(INDEX('POSTE (4)'!S:S,MATCH(ROW()-2,'POSTE (4)'!$W:$W,0)),IFERROR(INDEX('POSTE (5)'!S:S,MATCH(ROW()-2,'POSTE (5)'!$W:$W,0)),IFERROR(INDEX('POSTE (6)'!S:S,MATCH(ROW()-2,'POSTE (6)'!$W:$W,0)),IFERROR(INDEX('POSTE (7)'!S:S,MATCH(ROW()-2,'POSTE (7)'!$W:$W,0)),IFERROR(INDEX('POSTE (8)'!S:S,MATCH(ROW()-2,'POSTE (8)'!$W:$W,0)),IFERROR(INDEX('POSTE (9)'!S:S,MATCH(ROW()-2,'POSTE (9)'!$W:$W,0)),\"\")))))))))","v":1},{"$f":"IFERROR(INDEX('POSTE (1)'!T:T,MATCH(ROW()-2,'POSTE (1)'!$W:$W,0)),IFERROR(INDEX('POSTE (2)'!T:T,MATCH(ROW()-2,'POSTE (2)'!$W:$W,0)),IFERROR(INDEX('POSTE (3)'!T:T,MATCH(ROW()-2,'POSTE (3)'!$W:$W,0)),IFERROR(INDEX('POSTE (4)'!T:T,MATCH(ROW()-2,'POSTE (4)'!$W:$W,0)),IFERROR(INDEX('POSTE (5)'!T:T,MATCH(ROW()-2,'POSTE (5)'!$W:$W,0)),IFERROR(INDEX('POSTE (6)'!T:T,MATCH(ROW()-2,'POSTE (6)'!$W:$W,0)),IFERROR(INDEX('POSTE (7)'!T:T,MATCH(ROW()-2,'POSTE (7)'!$W:$W,0)),IFERROR(INDEX('POSTE (8)'!T:T,MATCH(ROW()-2,'POSTE (8)'!$W:$W,0)),IFERROR(INDEX('POSTE (9)'!T:T,MATCH(ROW()-2,'POSTE (9)'!$W:$W,0)),\"\")))))))))","v":4},{"$f":"IFERROR(INDEX('POSTE (1)'!U:U,MATCH(ROW()-2,'POSTE (1)'!$W:$W,0)),IFERROR(INDEX('POSTE (2)'!U:U,MATCH(ROW()-2,'POSTE (2)'!$W:$W,0)),IFERROR(INDEX('POSTE (3)'!U:U,MATCH(ROW()-2,'POSTE (3)'!$W:$W,0)),IFERROR(INDEX('POSTE (4)'!U:U,MATCH(ROW()-2,'POSTE (4)'!$W:$W,0)),IFERROR(INDEX('POSTE (5)'!U:U,MATCH(ROW()-2,'POSTE (5)'!$W:$W,0)),IFERROR(INDEX('POSTE (6)'!U:U,MATCH(ROW()-2,'POSTE (6)'!$W:$W,0)),IFERROR(INDEX('POSTE (7)'!U:U,MATCH(ROW()-2,'POSTE (7)'!$W:$W,0)),IFERROR(INDEX('POSTE (8)'!U:U,MATCH(ROW()-2,'POSTE (8)'!$W:$W,0)),IFERROR(INDEX('POSTE (9)'!U:U,MATCH(ROW()-2,'POSTE (9)'!$W:$W,0)),\"\")))))))))","v":"POSTE (4)"}]
[{"$f":"IFERROR(INDEX('POSTE (1)'!N:N,MATCH(ROW()-2,'POSTE (1)'!$W:$W,0)),IFERROR(INDEX('POSTE (2)'!N:N,MATCH(ROW()-2,'POSTE (2)'!$W:$W,0)),IFERROR(INDEX('POSTE (3)'!N:N,MATCH(ROW()-2,'POSTE (3)'!$W:$W,0)),IFERROR(INDEX('POSTE (4)'!N:N,MATCH(ROW()-2,'POSTE (4)'!$W:$W,0)),IFERROR(INDEX('POSTE (5)'!N:N,MATCH(ROW()-2,'POSTE (5)'!$W:$W,0)),IFERROR(INDEX('POSTE (6)'!N:N,MATCH(ROW()-2,'POSTE (6)'!$W:$W,0)),IFERROR(INDEX('POSTE (7)'!N:N,MATCH(ROW()-2,'POSTE (7)'!$W:$W,0)),IFERROR(INDEX('POSTE (8)'!N:N,MATCH(ROW()-2,'POSTE (8)'!$W:$W,0)),IFERROR(INDEX('POSTE (9)'!N:N,MATCH(ROW()-2,'POSTE (9)'!$W:$W,0)),\"\")))))))))","v":"(4)Fournisseur2"},{"$f":"IFERROR(INDEX('POSTE (1)'!O:O,MATCH(ROW()-2,'POSTE (1)'!$W:$W,0)),IFERROR(INDEX('POSTE (2)'!O:O,MATCH(ROW()-2,'POSTE (2)'!$W:$W,0)),IFERROR(INDEX('POSTE (3)'!O:O,MATCH(ROW()-2,'POSTE (3)'!$W:$W,0)),IFERROR(INDEX('POSTE (4)'!O:O,MATCH(ROW()-2,'POSTE (4)'!$W:$W,0)),IFERROR(INDEX('POSTE (5)'!O:O,MATCH(ROW()-2,'POSTE (5)'!$W:$W,0)),IFERROR(INDEX('POSTE (6)'!O:O,MATCH(ROW()-2,'POSTE (6)'!$W:$W,0)),IFERROR(INDEX('POSTE (7)'!O:O,MATCH(ROW()-2,'POSTE (7)'!$W:$W,0)),IFERROR(INDEX('POSTE (8)'!O:O,MATCH(ROW()-2,'POSTE (8)'!$W:$W,0)),IFERROR(INDEX('POSTE (9)'!O:O,MATCH(ROW()-2,'POSTE (9)'!$W:$W,0)),\"\")))))))))","v":"(4)Ref2"},{"$f":"IFERROR(INDEX('POSTE (1)'!P:P,MATCH(ROW()-2,'POSTE (1)'!$W:$W,0)),IFERROR(INDEX('POSTE (2)'!P:P,MATCH(ROW()-2,'POSTE (2)'!$W:$W,0)),IFERROR(INDEX('POSTE (3)'!P:P,MATCH(ROW()-2,'POSTE (3)'!$W:$W,0)),IFERROR(INDEX('POSTE (4)'!P:P,MATCH(ROW()-2,'POSTE (4)'!$W:$W,0)),IFERROR(INDEX('POSTE (5)'!P:P,MATCH(ROW()-2,'POSTE (5)'!$W:$W,0)),IFERROR(INDEX('POSTE (6)'!P:P,MATCH(ROW()-2,'POSTE (6)'!$W:$W,0)),IFERROR(INDEX('POSTE (7)'!P:P,MATCH(ROW()-2,'POSTE (7)'!$W:$W,0)),IFERROR(INDEX('POSTE (8)'!P:P,MATCH(ROW()-2,'POSTE (8)'!$W:$W,0)),IFERROR(INDEX('POSTE (9)'!P:P,MATCH(ROW()-2,'POSTE (9)'!$W:$W,0)),\"\")))))))))","v":"(4)DESIGNATION2"},{"$f":"IFERROR(INDEX('POSTE (1)'!Q:Q,MATCH(ROW()-2,'POSTE (1)'!$W:$W,0)),IFERROR(INDEX('POSTE (2)'!Q:Q,MATCH(ROW()-2,'POSTE (2)'!$W:$W,0)),IFERROR(INDEX('POSTE (3)'!Q:Q,MATCH(ROW()-2,'POSTE (3)'!$W:$W,0)),IFERROR(INDEX('POSTE (4)'!Q:Q,MATCH(ROW()-2,'POSTE (4)'!$W:$W,0)),IFERROR(INDEX('POSTE (5)'!Q:Q,MATCH(ROW()-2,'POSTE (5)'!$W:$W,0)),IFERROR(INDEX('POSTE (6)'!Q:Q,MATCH(ROW()-2,'POSTE (6)'!$W:$W,0)),IFERROR(INDEX('POSTE (7)'!Q:Q,MATCH(ROW()-2,'POSTE (7)'!$W:$W,0)),IFERROR(INDEX('POSTE (8)'!Q:Q,MATCH(ROW()-2,'POSTE (8)'!$W:$W,0)),IFERROR(INDEX('POSTE (9)'!Q:Q,MATCH(ROW()-2,'POSTE (9)'!$W:$W,0)),\"\")))))))))","v":"g"},{"$f":"IFERROR(INDEX('POSTE (1)'!R:R,MATCH(ROW()-2,'POSTE (1)'!$W:$W,0)),IFERROR(INDEX('POSTE (2)'!R:R,MATCH(ROW()-2,'POSTE (2)'!$W:$W,0)),IFERROR(INDEX('POSTE (3)'!R:R,MATCH(ROW()-2,'POSTE (3)'!$W:$W,0)),IFERROR(INDEX('POSTE (4)'!R:R,MATCH(ROW()-2,'POSTE (4)'!$W:$W,0)),IFERROR(INDEX('POSTE (5)'!R:R,MATCH(ROW()-2,'POSTE (5)'!$W:$W,0)),IFERROR(INDEX('POSTE (6)'!R:R,MATCH(ROW()-2,'POSTE (6)'!$W:$W,0)),IFERROR(INDEX('POSTE (7)'!R:R,MATCH(ROW()-2,'POSTE (7)'!$W:$W,0)),IFERROR(INDEX('POSTE (8)'!R:R,MATCH(ROW()-2,'POSTE (8)'!$W:$W,0)),IFERROR(INDEX('POSTE (9)'!R:R,MATCH(ROW()-2,'POSTE (9)'!$W:$W,0)),\"\")))))))))","v":4},{"$f":"IFERROR(INDEX('POSTE (1)'!S:S,MATCH(ROW()-2,'POSTE (1)'!$W:$W,0)),IFERROR(INDEX('POSTE (2)'!S:S,MATCH(ROW()-2,'POSTE (2)'!$W:$W,0)),IFERROR(INDEX('POSTE (3)'!S:S,MATCH(ROW()-2,'POSTE (3)'!$W:$W,0)),IFERROR(INDEX('POSTE (4)'!S:S,MATCH(ROW()-2,'POSTE (4)'!$W:$W,0)),IFERROR(INDEX('POSTE (5)'!S:S,MATCH(ROW()-2,'POSTE (5)'!$W:$W,0)),IFERROR(INDEX('POSTE (6)'!S:S,MATCH(ROW()-2,'POSTE (6)'!$W:$W,0)),IFERROR(INDEX('POSTE (7)'!S:S,MATCH(ROW()-2,'POSTE (7)'!$W:$W,0)),IFERROR(INDEX('POSTE (8)'!S:S,MATCH(ROW()-2,'POSTE (8)'!$W:$W,0)),IFERROR(INDEX('POSTE (9)'!S:S,MATCH(ROW()-2,'POSTE (9)'!$W:$W,0)),\"\")))))))))","v":1},{"$f":"IFERROR(INDEX('POSTE (1)'!T:T,MATCH(ROW()-2,'POSTE (1)'!$W:$W,0)),IFERROR(INDEX('POSTE (2)'!T:T,MATCH(ROW()-2,'POSTE (2)'!$W:$W,0)),IFERROR(INDEX('POSTE (3)'!T:T,MATCH(ROW()-2,'POSTE (3)'!$W:$W,0)),IFERROR(INDEX('POSTE (4)'!T:T,MATCH(ROW()-2,'POSTE (4)'!$W:$W,0)),IFERROR(INDEX('POSTE (5)'!T:T,MATCH(ROW()-2,'POSTE (5)'!$W:$W,0)),IFERROR(INDEX('POSTE (6)'!T:T,MATCH(ROW()-2,'POSTE (6)'!$W:$W,0)),IFERROR(INDEX('POSTE (7)'!T:T,MATCH(ROW()-2,'POSTE (7)'!$W:$W,0)),IFERROR(INDEX('POSTE (8)'!T:T,MATCH(ROW()-2,'POSTE (8)'!$W:$W,0)),IFERROR(INDEX('POSTE (9)'!T:T,MATCH(ROW()-2,'POSTE (9)'!$W:$W,0)),\"\")))))))))","v":4},{"$f":"IFERROR(INDEX('POSTE (1)'!U:U,MATCH(ROW()-2,'POSTE (1)'!$W:$W,0)),IFERROR(INDEX('POSTE (2)'!U:U,MATCH(ROW()-2,'POSTE (2)'!$W:$W,0)),IFERROR(INDEX('POSTE (3)'!U:U,MATCH(ROW()-2,'POSTE (3)'!$W:$W,0)),IFERROR(INDEX('POSTE (4)'!U:U,MATCH(ROW()-2,'POSTE (4)'!$W:$W,0)),IFERROR(INDEX('POSTE (5)'!U:U,MATCH(ROW()-2,'POSTE (5)'!$W:$W,0)),IFERROR(INDEX('POSTE (6)'!U:U,MATCH(ROW()-2,'POSTE (6)'!$W:$W,0)),IFERROR(INDEX('POSTE (7)'!U:U,MATCH(ROW()-2,'POSTE (7)'!$W:$W,0)),IFERROR(INDEX('POSTE (8)'!U:U,MATCH(ROW()-2,'POSTE (8)'!$W:$W,0)),IFERROR(INDEX('POSTE (9)'!U:U,MATCH(ROW()-2,'POSTE (9)'!$W:$W,0)),\"\")))))))))","v":"POSTE (4)"}]
[{"$f":"IFERROR(INDEX('POSTE (1)'!N:N,MATCH(ROW()-2,'POSTE (1)'!$W:$W,0)),IFERROR(INDEX('POSTE (2)'!N:N,MATCH(ROW()-2,'POSTE (2)'!$W:$W,0)),IFERROR(INDEX('POSTE (3)'!N:N,MATCH(ROW()-2,'POSTE (3)'!$W:$W,0)),IFERROR(INDEX('POSTE (4)'!N:N,MATCH(ROW()-2,'POSTE (4)'!$W:$W,0)),IFERROR(INDEX('POSTE (5)'!N:N,MATCH(ROW()-2,'POSTE (5)'!$W:$W,0)),IFERROR(INDEX('POSTE (6)'!N:N,MATCH(ROW()-2,'POSTE (6)'!$W:$W,0)),IFERROR(INDEX('POSTE (7)'!N:N,MATCH(ROW()-2,'POSTE (7)'!$W:$W,0)),IFERROR(INDEX('POSTE (8)'!N:N,MATCH(ROW()-2,'POSTE (8)'!$W:$W,0)),IFERROR(INDEX('POSTE (9)'!N:N,MATCH(ROW()-2,'POSTE (9)'!$W:$W,0)),\"\")))))))))","v":"(4)Fournisseur3"},{"$f":"IFERROR(INDEX('POSTE (1)'!O:O,MATCH(ROW()-2,'POSTE (1)'!$W:$W,0)),IFERROR(INDEX('POSTE (2)'!O:O,MATCH(ROW()-2,'POSTE (2)'!$W:$W,0)),IFERROR(INDEX('POSTE (3)'!O:O,MATCH(ROW()-2,'POSTE (3)'!$W:$W,0)),IFERROR(INDEX('POSTE (4)'!O:O,MATCH(ROW()-2,'POSTE (4)'!$W:$W,0)),IFERROR(INDEX('POSTE (5)'!O:O,MATCH(ROW()-2,'POSTE (5)'!$W:$W,0)),IFERROR(INDEX('POSTE (6)'!O:O,MATCH(ROW()-2,'POSTE (6)'!$W:$W,0)),IFERROR(INDEX('POSTE (7)'!O:O,MATCH(ROW()-2,'POSTE (7)'!$W:$W,0)),IFERROR(INDEX('POSTE (8)'!O:O,MATCH(ROW()-2,'POSTE (8)'!$W:$W,0)),IFERROR(INDEX('POSTE (9)'!O:O,MATCH(ROW()-2,'POSTE (9)'!$W:$W,0)),\"\")))))))))","v":"(4)Ref3"},{"$f":"IFERROR(INDEX('POSTE (1)'!P:P,MATCH(ROW()-2,'POSTE (1)'!$W:$W,0)),IFERROR(INDEX('POSTE (2)'!P:P,MATCH(ROW()-2,'POSTE (2)'!$W:$W,0)),IFERROR(INDEX('POSTE (3)'!P:P,MATCH(ROW()-2,'POSTE (3)'!$W:$W,0)),IFERROR(INDEX('POSTE (4)'!P:P,MATCH(ROW()-2,'POSTE (4)'!$W:$W,0)),IFERROR(INDEX('POSTE (5)'!P:P,MATCH(ROW()-2,'POSTE (5)'!$W:$W,0)),IFERROR(INDEX('POSTE (6)'!P:P,MATCH(ROW()-2,'POSTE (6)'!$W:$W,0)),IFERROR(INDEX('POSTE (7)'!P:P,MATCH(ROW()-2,'POSTE (7)'!$W:$W,0)),IFERROR(INDEX('POSTE (8)'!P:P,MATCH(ROW()-2,'POSTE (8)'!$W:$W,0)),IFERROR(INDEX('POSTE (9)'!P:P,MATCH(ROW()-2,'POSTE (9)'!$W:$W,0)),\"\")))))))))","v":"(4)DESIGNATION3"},{"$f":"IFERROR(INDEX('POSTE (1)'!Q:Q,MATCH(ROW()-2,'POSTE (1)'!$W:$W,0)),IFERROR(INDEX('POSTE (2)'!Q:Q,MATCH(ROW()-2,'POSTE (2)'!$W:$W,0)),IFERROR(INDEX('POSTE (3)'!Q:Q,MATCH(ROW()-2,'POSTE (3)'!$W:$W,0)),IFERROR(INDEX('POSTE (4)'!Q:Q,MATCH(ROW()-2,'POSTE (4)'!$W:$W,0)),IFERROR(INDEX('POSTE (5)'!Q:Q,MATCH(ROW()-2,'POSTE (5)'!$W:$W,0)),IFERROR(INDEX('POSTE (6)'!Q:Q,MATCH(ROW()-2,'POSTE (6)'!$W:$W,0)),IFERROR(INDEX('POSTE (7)'!Q:Q,MATCH(ROW()-2,'POSTE (7)'!$W:$W,0)),IFERROR(INDEX('POSTE (8)'!Q:Q,MATCH(ROW()-2,'POSTE (8)'!$W:$W,0)),IFERROR(INDEX('POSTE (9)'!Q:Q,MATCH(ROW()-2,'POSTE (9)'!$W:$W,0)),\"\")))))))))","v":"g"},{"$f":"IFERROR(INDEX('POSTE (1)'!R:R,MATCH(ROW()-2,'POSTE (1)'!$W:$W,0)),IFERROR(INDEX('POSTE (2)'!R:R,MATCH(ROW()-2,'POSTE (2)'!$W:$W,0)),IFERROR(INDEX('POSTE (3)'!R:R,MATCH(ROW()-2,'POSTE (3)'!$W:$W,0)),IFERROR(INDEX('POSTE (4)'!R:R,MATCH(ROW()-2,'POSTE (4)'!$W:$W,0)),IFERROR(INDEX('POSTE (5)'!R:R,MATCH(ROW()-2,'POSTE (5)'!$W:$W,0)),IFERROR(INDEX('POSTE (6)'!R:R,MATCH(ROW()-2,'POSTE (6)'!$W:$W,0)),IFERROR(INDEX('POSTE (7)'!R:R,MATCH(ROW()-2,'POSTE (7)'!$W:$W,0)),IFERROR(INDEX('POSTE (8)'!R:R,MATCH(ROW()-2,'POSTE (8)'!$W:$W,0)),IFERROR(INDEX('POSTE (9)'!R:R,MATCH(ROW()-2,'POSTE (9)'!$W:$W,0)),\"\")))))))))","v":4},{"$f":"IFERROR(INDEX('POSTE (1)'!S:S,MATCH(ROW()-2,'POSTE (1)'!$W:$W,0)),IFERROR(INDEX('POSTE (2)'!S:S,MATCH(ROW()-2,'POSTE (2)'!$W:$W,0)),IFERROR(INDEX('POSTE (3)'!S:S,MATCH(ROW()-2,'POSTE (3)'!$W:$W,0)),IFERROR(INDEX('POSTE (4)'!S:S,MATCH(ROW()-2,'POSTE (4)'!$W:$W,0)),IFERROR(INDEX('POSTE (5)'!S:S,MATCH(ROW()-2,'POSTE (5)'!$W:$W,0)),IFERROR(INDEX('POSTE (6)'!S:S,MATCH(ROW()-2,'POSTE (6)'!$W:$W,0)),IFERROR(INDEX('POSTE (7)'!S:S,MATCH(ROW()-2,'POSTE (7)'!$W:$W,0)),IFERROR(INDEX('POSTE (8)'!S:S,MATCH(ROW()-2,'POSTE (8)'!$W:$W,0)),IFERROR(INDEX('POSTE (9)'!S:S,MATCH(ROW()-2,'POSTE (9)'!$W:$W,0)),\"\")))))))))","v":1},{"$f":"IFERROR(INDEX('POSTE (1)'!T:T,MATCH(ROW()-2,'POSTE (1)'!$W:$W,0)),IFERROR(INDEX('POSTE (2)'!T:T,MATCH(ROW()-2,'POSTE (2)'!$W:$W,0)),IFERROR(INDEX('POSTE (3)'!T:T,MATCH(ROW()-2,'POSTE (3)'!$W:$W,0)),IFERROR(INDEX('POSTE (4)'!T:T,MATCH(ROW()-2,'POSTE (4)'!$W:$W,0)),IFERROR(INDEX('POSTE (5)'!T:T,MATCH(ROW()-2,'POSTE (5)'!$W:$W,0)),IFERROR(INDEX('POSTE (6)'!T:T,MATCH(ROW()-2,'POSTE (6)'!$W:$W,0)),IFERROR(INDEX('POSTE (7)'!T:T,MATCH(ROW()-2,'POSTE (7)'!$W:$W,0)),IFERROR(INDEX('POSTE (8)'!T:T,MATCH(ROW()-2,'POSTE (8)'!$W:$W,0)),IFERROR(INDEX('POSTE (9)'!T:T,MATCH(ROW()-2,'POSTE (9)'!$W:$W,0)),\"\")))))))))","v":4},{"$f":"IFERROR(INDEX('POSTE (1)'!U:U,MATCH(ROW()-2,'POSTE (1)'!$W:$W,0)),IFERROR(INDEX('POSTE (2)'!U:U,MATCH(ROW()-2,'POSTE (2)'!$W:$W,0)),IFERROR(INDEX('POSTE (3)'!U:U,MATCH(ROW()-2,'POSTE (3)'!$W:$W,0)),IFERROR(INDEX('POSTE (4)'!U:U,MATCH(ROW()-2,'POSTE (4)'!$W:$W,0)),IFERROR(INDEX('POSTE (5)'!U:U,MATCH(ROW()-2,'POSTE (5)'!$W:$W,0)),IFERROR(INDEX('POSTE (6)'!U:U,MATCH(ROW()-2,'POSTE (6)'!$W:$W,0)),IFERROR(INDEX('POSTE (7)'!U:U,MATCH(ROW()-2,'POSTE (7)'!$W:$W,0)),IFERROR(INDEX('POSTE (8)'!U:U,MATCH(ROW()-2,'POSTE (8)'!$W:$W,0)),IFERROR(INDEX('POSTE (9)'!U:U,MATCH(ROW()-2,'POSTE (9)'!$W:$W,0)),\"\")))))))))","v":"POSTE (4)"}]
[{"$f":"IFERROR(INDEX('POSTE (1)'!N:N,MATCH(ROW()-2,'POSTE (1)'!$W:$W,0)),IFERROR(INDEX('POSTE (2)'!N:N,MATCH(ROW()-2,'POSTE (2)'!$W:$W,0)),IFERROR(INDEX('POSTE (3)'!N:N,MATCH(ROW()-2,'POSTE (3)'!$W:$W,0)),IFERROR(INDEX('POSTE (4)'!N:N,MATCH(ROW()-2,'POSTE (4)'!$W:$W,0)),IFERROR(INDEX('POSTE (5)'!N:N,MATCH(ROW()-2,'POSTE (5)'!$W:$W,0)),IFERROR(INDEX('POSTE (6)'!N:N,MATCH(ROW()-2,'POSTE (6)'!$W:$W,0)),IFERROR(INDEX('POSTE (7)'!N:N,MATCH(ROW()-2,'POSTE (7)'!$W:$W,0)),IFERROR(INDEX('POSTE (8)'!N:N,MATCH(ROW()-2,'POSTE (8)'!$W:$W,0)),IFERROR(INDEX('POSTE (9)'!N:N,MATCH(ROW()-2,'POSTE (9)'!$W:$W,0)),\"\")))))))))","v":"(4)Fournisseur4"},{"$f":"IFERROR(INDEX('POSTE (1)'!O:O,MATCH(ROW()-2,'POSTE (1)'!$W:$W,0)),IFERROR(INDEX('POSTE (2)'!O:O,MATCH(ROW()-2,'POSTE (2)'!$W:$W,0)),IFERROR(INDEX('POSTE (3)'!O:O,MATCH(ROW()-2,'POSTE (3)'!$W:$W,0)),IFERROR(INDEX('POSTE (4)'!O:O,MATCH(ROW()-2,'POSTE (4)'!$W:$W,0)),IFERROR(INDEX('POSTE (5)'!O:O,MATCH(ROW()-2,'POSTE (5)'!$W:$W,0)),IFERROR(INDEX('POSTE (6)'!O:O,MATCH(ROW()-2,'POSTE (6)'!$W:$W,0)),IFERROR(INDEX('POSTE (7)'!O:O,MATCH(ROW()-2,'POSTE (7)'!$W:$W,0)),IFERROR(INDEX('POSTE (8)'!O:O,MATCH(ROW()-2,'POSTE (8)'!$W:$W,0)),IFERROR(INDEX('POSTE (9)'!O:O,MATCH(ROW()-2,'POSTE (9)'!$W:$W,0)),\"\")))))))))","v":"(4)Ref4"},{"$f":"IFERROR(INDEX('POSTE (1)'!P:P,MATCH(ROW()-2,'POSTE (1)'!$W:$W,0)),IFERROR(INDEX('POSTE (2)'!P:P,MATCH(ROW()-2,'POSTE (2)'!$W:$W,0)),IFERROR(INDEX('POSTE (3)'!P:P,MATCH(ROW()-2,'POSTE (3)'!$W:$W,0)),IFERROR(INDEX('POSTE (4)'!P:P,MATCH(ROW()-2,'POSTE (4)'!$W:$W,0)),IFERROR(INDEX('POSTE (5)'!P:P,MATCH(ROW()-2,'POSTE (5)'!$W:$W,0)),IFERROR(INDEX('POSTE (6)'!P:P,MATCH(ROW()-2,'POSTE (6)'!$W:$W,0)),IFERROR(INDEX('POSTE (7)'!P:P,MATCH(ROW()-2,'POSTE (7)'!$W:$W,0)),IFERROR(INDEX('POSTE (8)'!P:P,MATCH(ROW()-2,'POSTE (8)'!$W:$W,0)),IFERROR(INDEX('POSTE (9)'!P:P,MATCH(ROW()-2,'POSTE (9)'!$W:$W,0)),\"\")))))))))","v":"(4)DESIGNATION4"},{"$f":"IFERROR(INDEX('POSTE (1)'!Q:Q,MATCH(ROW()-2,'POSTE (1)'!$W:$W,0)),IFERROR(INDEX('POSTE (2)'!Q:Q,MATCH(ROW()-2,'POSTE (2)'!$W:$W,0)),IFERROR(INDEX('POSTE (3)'!Q:Q,MATCH(ROW()-2,'POSTE (3)'!$W:$W,0)),IFERROR(INDEX('POSTE (4)'!Q:Q,MATCH(ROW()-2,'POSTE (4)'!$W:$W,0)),IFERROR(INDEX('POSTE (5)'!Q:Q,MATCH(ROW()-2,'POSTE (5)'!$W:$W,0)),IFERROR(INDEX('POSTE (6)'!Q:Q,MATCH(ROW()-2,'POSTE (6)'!$W:$W,0)),IFERROR(INDEX('POSTE (7)'!Q:Q,MATCH(ROW()-2,'POSTE (7)'!$W:$W,0)),IFERROR(INDEX('POSTE (8)'!Q:Q,MATCH(ROW()-2,'POSTE (8)'!$W:$W,0)),IFERROR(INDEX('POSTE (9)'!Q:Q,MATCH(ROW()-2,'POSTE (9)'!$W:$W,0)),\"\")))))))))","v":"g"},{"$f":"IFERROR(INDEX('POSTE (1)'!R:R,MATCH(ROW()-2,'POSTE (1)'!$W:$W,0)),IFERROR(INDEX('POSTE (2)'!R:R,MATCH(ROW()-2,'POSTE (2)'!$W:$W,0)),IFERROR(INDEX('POSTE (3)'!R:R,MATCH(ROW()-2,'POSTE (3)'!$W:$W,0)),IFERROR(INDEX('POSTE (4)'!R:R,MATCH(ROW()-2,'POSTE (4)'!$W:$W,0)),IFERROR(INDEX('POSTE (5)'!R:R,MATCH(ROW()-2,'POSTE (5)'!$W:$W,0)),IFERROR(INDEX('POSTE (6)'!R:R,MATCH(ROW()-2,'POSTE (6)'!$W:$W,0)),IFERROR(INDEX('POSTE (7)'!R:R,MATCH(ROW()-2,'POSTE (7)'!$W:$W,0)),IFERROR(INDEX('POSTE (8)'!R:R,MATCH(ROW()-2,'POSTE (8)'!$W:$W,0)),IFERROR(INDEX('POSTE (9)'!R:R,MATCH(ROW()-2,'POSTE (9)'!$W:$W,0)),\"\")))))))))","v":4},{"$f":"IFERROR(INDEX('POSTE (1)'!S:S,MATCH(ROW()-2,'POSTE (1)'!$W:$W,0)),IFERROR(INDEX('POSTE (2)'!S:S,MATCH(ROW()-2,'POSTE (2)'!$W:$W,0)),IFERROR(INDEX('POSTE (3)'!S:S,MATCH(ROW()-2,'POSTE (3)'!$W:$W,0)),IFERROR(INDEX('POSTE (4)'!S:S,MATCH(ROW()-2,'POSTE (4)'!$W:$W,0)),IFERROR(INDEX('POSTE (5)'!S:S,MATCH(ROW()-2,'POSTE (5)'!$W:$W,0)),IFERROR(INDEX('POSTE (6)'!S:S,MATCH(ROW()-2,'POSTE (6)'!$W:$W,0)),IFERROR(INDEX('POSTE (7)'!S:S,MATCH(ROW()-2,'POSTE (7)'!$W:$W,0)),IFERROR(INDEX('POSTE (8)'!S:S,MATCH(ROW()-2,'POSTE (8)'!$W:$W,0)),IFERROR(INDEX('POSTE (9)'!S:S,MATCH(ROW()-2,'POSTE (9)'!$W:$W,0)),\"\")))))))))","v":1},{"$f":"IFERROR(INDEX('POSTE (1)'!T:T,MATCH(ROW()-2,'POSTE (1)'!$W:$W,0)),IFERROR(INDEX('POSTE (2)'!T:T,MATCH(ROW()-2,'POSTE (2)'!$W:$W,0)),IFERROR(INDEX('POSTE (3)'!T:T,MATCH(ROW()-2,'POSTE (3)'!$W:$W,0)),IFERROR(INDEX('POSTE (4)'!T:T,MATCH(ROW()-2,'POSTE (4)'!$W:$W,0)),IFERROR(INDEX('POSTE (5)'!T:T,MATCH(ROW()-2,'POSTE (5)'!$W:$W,0)),IFERROR(INDEX('POSTE (6)'!T:T,MATCH(ROW()-2,'POSTE (6)'!$W:$W,0)),IFERROR(INDEX('POSTE (7)'!T:T,MATCH(ROW()-2,'POSTE (7)'!$W:$W,0)),IFERROR(INDEX('POSTE (8)'!T:T,MATCH(ROW()-2,'POSTE (8)'!$W:$W,0)),IFERROR(INDEX('POSTE (9)'!T:T,MATCH(ROW()-2,'POSTE (9)'!$W:$W,0)),\"\")))))))))","v":4},{"$f":"IFERROR(INDEX('POSTE (1)'!U:U,MATCH(ROW()-2,'POSTE (1)'!$W:$W,0)),IFERROR(INDEX('POSTE (2)'!U:U,MATCH(ROW()-2,'POSTE (2)'!$W:$W,0)),IFERROR(INDEX('POSTE (3)'!U:U,MATCH(ROW()-2,'POSTE (3)'!$W:$W,0)),IFERROR(INDEX('POSTE (4)'!U:U,MATCH(ROW()-2,'POSTE (4)'!$W:$W,0)),IFERROR(INDEX('POSTE (5)'!U:U,MATCH(ROW()-2,'POSTE (5)'!$W:$W,0)),IFERROR(INDEX('POSTE (6)'!U:U,MATCH(ROW()-2,'POSTE (6)'!$W:$W,0)),IFERROR(INDEX('POSTE (7)'!U:U,MATCH(ROW()-2,'POSTE (7)'!$W:$W,0)),IFERROR(INDEX('POSTE (8)'!U:U,MATCH(ROW()-2,'POSTE (8)'!$W:$W,0)),IFERROR(INDEX('POSTE (9)'!U:U,MATCH(ROW()-2,'POSTE (9)'!$W:$W,0)),\"\")))))))))","v":"POSTE (4)"}]
[{"$f":"IFERROR(INDEX('POSTE (1)'!N:N,MATCH(ROW()-2,'POSTE (1)'!$W:$W,0)),IFERROR(INDEX('POSTE (2)'!N:N,MATCH(ROW()-2,'POSTE (2)'!$W:$W,0)),IFERROR(INDEX('POSTE (3)'!N:N,MATCH(ROW()-2,'POSTE (3)'!$W:$W,0)),IFERROR(INDEX('POSTE (4)'!N:N,MATCH(ROW()-2,'POSTE (4)'!$W:$W,0)),IFERROR(INDEX('POSTE (5)'!N:N,MATCH(ROW()-2,'POSTE (5)'!$W:$W,0)),IFERROR(INDEX('POSTE (6)'!N:N,MATCH(ROW()-2,'POSTE (6)'!$W:$W,0)),IFERROR(INDEX('POSTE (7)'!N:N,MATCH(ROW()-2,'POSTE (7)'!$W:$W,0)),IFERROR(INDEX('POSTE (8)'!N:N,MATCH(ROW()-2,'POSTE (8)'!$W:$W,0)),IFERROR(INDEX('POSTE (9)'!N:N,MATCH(ROW()-2,'POSTE (9)'!$W:$W,0)),\"\")))))))))","v":"(5)Fournisseur"},{"$f":"IFERROR(INDEX('POSTE (1)'!O:O,MATCH(ROW()-2,'POSTE (1)'!$W:$W,0)),IFERROR(INDEX('POSTE (2)'!O:O,MATCH(ROW()-2,'POSTE (2)'!$W:$W,0)),IFERROR(INDEX('POSTE (3)'!O:O,MATCH(ROW()-2,'POSTE (3)'!$W:$W,0)),IFERROR(INDEX('POSTE (4)'!O:O,MATCH(ROW()-2,'POSTE (4)'!$W:$W,0)),IFERROR(INDEX('POSTE (5)'!O:O,MATCH(ROW()-2,'POSTE (5)'!$W:$W,0)),IFERROR(INDEX('POSTE (6)'!O:O,MATCH(ROW()-2,'POSTE (6)'!$W:$W,0)),IFERROR(INDEX('POSTE (7)'!O:O,MATCH(ROW()-2,'POSTE (7)'!$W:$W,0)),IFERROR(INDEX('POSTE (8)'!O:O,MATCH(ROW()-2,'POSTE (8)'!$W:$W,0)),IFERROR(INDEX('POSTE (9)'!O:O,MATCH(ROW()-2,'POSTE (9)'!$W:$W,0)),\"\")))))))))","v":"(5)Ref"},{"$f":"IFERROR(INDEX('POSTE (1)'!P:P,MATCH(ROW()-2,'POSTE (1)'!$W:$W,0)),IFERROR(INDEX('POSTE (2)'!P:P,MATCH(ROW()-2,'POSTE (2)'!$W:$W,0)),IFERROR(INDEX('POSTE (3)'!P:P,MATCH(ROW()-2,'POSTE (3)'!$W:$W,0)),IFERROR(INDEX('POSTE (4)'!P:P,MATCH(ROW()-2,'POSTE (4)'!$W:$W,0)),IFERROR(INDEX('POSTE (5)'!P:P,MATCH(ROW()-2,'POSTE (5)'!$W:$W,0)),IFERROR(INDEX('POSTE (6)'!P:P,MATCH(ROW()-2,'POSTE (6)'!$W:$W,0)),IFERROR(INDEX('POSTE (7)'!P:P,MATCH(ROW()-2,'POSTE (7)'!$W:$W,0)),IFERROR(INDEX('POSTE (8)'!P:P,MATCH(ROW()-2,'POSTE (8)'!$W:$W,0)),IFERROR(INDEX('POSTE (9)'!P:P,MATCH(ROW()-2,'POSTE (9)'!$W:$W,0)),\"\")))))))))","v":"(5)DESIGNATION"},{"$f":"IFERROR(INDEX('POSTE (1)'!Q:Q,MATCH(ROW()-2,'POSTE (1)'!$W:$W,0)),IFERROR(INDEX('POSTE (2)'!Q:Q,MATCH(ROW()-2,'POSTE (2)'!$W:$W,0)),IFERROR(INDEX('POSTE (3)'!Q:Q,MATCH(ROW()-2,'POSTE (3)'!$W:$W,0)),IFERROR(INDEX('POSTE (4)'!Q:Q,MATCH(ROW()-2,'POSTE (4)'!$W:$W,0)),IFERROR(INDEX('POSTE (5)'!Q:Q,MATCH(ROW()-2,'POSTE (5)'!$W:$W,0)),IFERROR(INDEX('POSTE (6)'!Q:Q,MATCH(ROW()-2,'POSTE (6)'!$W:$W,0)),IFERROR(INDEX('POSTE (7)'!Q:Q,MATCH(ROW()-2,'POSTE (7)'!$W:$W,0)),IFERROR(INDEX('POSTE (8)'!Q:Q,MATCH(ROW()-2,'POSTE (8)'!$W:$W,0)),IFERROR(INDEX('POSTE (9)'!Q:Q,MATCH(ROW()-2,'POSTE (9)'!$W:$W,0)),\"\")))))))))","v":"m"},{"$f":"IFERROR(INDEX('POSTE (1)'!R:R,MATCH(ROW()-2,'POSTE (1)'!$W:$W,0)),IFERROR(INDEX('POSTE (2)'!R:R,MATCH(ROW()-2,'POSTE (2)'!$W:$W,0)),IFERROR(INDEX('POSTE (3)'!R:R,MATCH(ROW()-2,'POSTE (3)'!$W:$W,0)),IFERROR(INDEX('POSTE (4)'!R:R,MATCH(ROW()-2,'POSTE (4)'!$W:$W,0)),IFERROR(INDEX('POSTE (5)'!R:R,MATCH(ROW()-2,'POSTE (5)'!$W:$W,0)),IFERROR(INDEX('POSTE (6)'!R:R,MATCH(ROW()-2,'POSTE (6)'!$W:$W,0)),IFERROR(INDEX('POSTE (7)'!R:R,MATCH(ROW()-2,'POSTE (7)'!$W:$W,0)),IFERROR(INDEX('POSTE (8)'!R:R,MATCH(ROW()-2,'POSTE (8)'!$W:$W,0)),IFERROR(INDEX('POSTE (9)'!R:R,MATCH(ROW()-2,'POSTE (9)'!$W:$W,0)),\"\")))))))))","v":5},{"$f":"IFERROR(INDEX('POSTE (1)'!S:S,MATCH(ROW()-2,'POSTE (1)'!$W:$W,0)),IFERROR(INDEX('POSTE (2)'!S:S,MATCH(ROW()-2,'POSTE (2)'!$W:$W,0)),IFERROR(INDEX('POSTE (3)'!S:S,MATCH(ROW()-2,'POSTE (3)'!$W:$W,0)),IFERROR(INDEX('POSTE (4)'!S:S,MATCH(ROW()-2,'POSTE (4)'!$W:$W,0)),IFERROR(INDEX('POSTE (5)'!S:S,MATCH(ROW()-2,'POSTE (5)'!$W:$W,0)),IFERROR(INDEX('POSTE (6)'!S:S,MATCH(ROW()-2,'POSTE (6)'!$W:$W,0)),IFERROR(INDEX('POSTE (7)'!S:S,MATCH(ROW()-2,'POSTE (7)'!$W:$W,0)),IFERROR(INDEX('POSTE (8)'!S:S,MATCH(ROW()-2,'POSTE (8)'!$W:$W,0)),IFERROR(INDEX('POSTE (9)'!S:S,MATCH(ROW()-2,'POSTE (9)'!$W:$W,0)),\"\")))))))))","v":1},{"$f":"IFERROR(INDEX('POSTE (1)'!T:T,MATCH(ROW()-2,'POSTE (1)'!$W:$W,0)),IFERROR(INDEX('POSTE (2)'!T:T,MATCH(ROW()-2,'POSTE (2)'!$W:$W,0)),IFERROR(INDEX('POSTE (3)'!T:T,MATCH(ROW()-2,'POSTE (3)'!$W:$W,0)),IFERROR(INDEX('POSTE (4)'!T:T,MATCH(ROW()-2,'POSTE (4)'!$W:$W,0)),IFERROR(INDEX('POSTE (5)'!T:T,MATCH(ROW()-2,'POSTE (5)'!$W:$W,0)),IFERROR(INDEX('POSTE (6)'!T:T,MATCH(ROW()-2,'POSTE (6)'!$W:$W,0)),IFERROR(INDEX('POSTE (7)'!T:T,MATCH(ROW()-2,'POSTE (7)'!$W:$W,0)),IFERROR(INDEX('POSTE (8)'!T:T,MATCH(ROW()-2,'POSTE (8)'!$W:$W,0)),IFERROR(INDEX('POSTE (9)'!T:T,MATCH(ROW()-2,'POSTE (9)'!$W:$W,0)),\"\")))))))))","v":5},{"$f":"IFERROR(INDEX('POSTE (1)'!U:U,MATCH(ROW()-2,'POSTE (1)'!$W:$W,0)),IFERROR(INDEX('POSTE (2)'!U:U,MATCH(ROW()-2,'POSTE (2)'!$W:$W,0)),IFERROR(INDEX('POSTE (3)'!U:U,MATCH(ROW()-2,'POSTE (3)'!$W:$W,0)),IFERROR(INDEX('POSTE (4)'!U:U,MATCH(ROW()-2,'POSTE (4)'!$W:$W,0)),IFERROR(INDEX('POSTE (5)'!U:U,MATCH(ROW()-2,'POSTE (5)'!$W:$W,0)),IFERROR(INDEX('POSTE (6)'!U:U,MATCH(ROW()-2,'POSTE (6)'!$W:$W,0)),IFERROR(INDEX('POSTE (7)'!U:U,MATCH(ROW()-2,'POSTE (7)'!$W:$W,0)),IFERROR(INDEX('POSTE (8)'!U:U,MATCH(ROW()-2,'POSTE (8)'!$W:$W,0)),IFERROR(INDEX('POSTE (9)'!U:U,MATCH(ROW()-2,'POSTE (9)'!$W:$W,0)),\"\")))))))))","v":"POSTE (5)"}]
[{"$f":"IFERROR(INDEX('POSTE (1)'!N:N,MATCH(ROW()-2,'POSTE (1)'!$W:$W,0)),IFERROR(INDEX('POSTE (2)'!N:N,MATCH(ROW()-2,'POSTE (2)'!$W:$W,0)),IFERROR(INDEX('POSTE (3)'!N:N,MATCH(ROW()-2,'POSTE (3)'!$W:$W,0)),IFERROR(INDEX('POSTE (4)'!N:N,MATCH(ROW()-2,'POSTE (4)'!$W:$W,0)),IFERROR(INDEX('POSTE (5)'!N:N,MATCH(ROW()-2,'POSTE (5)'!$W:$W,0)),IFERROR(INDEX('POSTE (6)'!N:N,MATCH(ROW()-2,'POSTE (6)'!$W:$W,0)),IFERROR(INDEX('POSTE (7)'!N:N,MATCH(ROW()-2,'POSTE (7)'!$W:$W,0)),IFERROR(INDEX('POSTE (8)'!N:N,MATCH(ROW()-2,'POSTE (8)'!$W:$W,0)),IFERROR(INDEX('POSTE (9)'!N:N,MATCH(ROW()-2,'POSTE (9)'!$W:$W,0)),\"\")))))))))","v":"(5)Fournisseur2"},{"$f":"IFERROR(INDEX('POSTE (1)'!O:O,MATCH(ROW()-2,'POSTE (1)'!$W:$W,0)),IFERROR(INDEX('POSTE (2)'!O:O,MATCH(ROW()-2,'POSTE (2)'!$W:$W,0)),IFERROR(INDEX('POSTE (3)'!O:O,MATCH(ROW()-2,'POSTE (3)'!$W:$W,0)),IFERROR(INDEX('POSTE (4)'!O:O,MATCH(ROW()-2,'POSTE (4)'!$W:$W,0)),IFERROR(INDEX('POSTE (5)'!O:O,MATCH(ROW()-2,'POSTE (5)'!$W:$W,0)),IFERROR(INDEX('POSTE (6)'!O:O,MATCH(ROW()-2,'POSTE (6)'!$W:$W,0)),IFERROR(INDEX('POSTE (7)'!O:O,MATCH(ROW()-2,'POSTE (7)'!$W:$W,0)),IFERROR(INDEX('POSTE (8)'!O:O,MATCH(ROW()-2,'POSTE (8)'!$W:$W,0)),IFERROR(INDEX('POSTE (9)'!O:O,MATCH(ROW()-2,'POSTE (9)'!$W:$W,0)),\"\")))))))))","v":"(5)Ref2"},{"$f":"IFERROR(INDEX('POSTE (1)'!P:P,MATCH(ROW()-2,'POSTE (1)'!$W:$W,0)),IFERROR(INDEX('POSTE (2)'!P:P,MATCH(ROW()-2,'POSTE (2)'!$W:$W,0)),IFERROR(INDEX('POSTE (3)'!P:P,MATCH(ROW()-2,'POSTE (3)'!$W:$W,0)),IFERROR(INDEX('POSTE (4)'!P:P,MATCH(ROW()-2,'POSTE (4)'!$W:$W,0)),IFERROR(INDEX('POSTE (5)'!P:P,MATCH(ROW()-2,'POSTE (5)'!$W:$W,0)),IFERROR(INDEX('POSTE (6)'!P:P,MATCH(ROW()-2,'POSTE (6)'!$W:$W,0)),IFERROR(INDEX('POSTE (7)'!P:P,MATCH(ROW()-2,'POSTE (7)'!$W:$W,0)),IFERROR(INDEX('POSTE (8)'!P:P,MATCH(ROW()-2,'POSTE (8)'!$W:$W,0)),IFERROR(INDEX('POSTE (9)'!P:P,MATCH(ROW()-2,'POSTE (9)'!$W:$W,0)),\"\")))))))))","v":"(5)DESIGNATION2"},{"$f":"IFERROR(INDEX('POSTE (1)'!Q:Q,MATCH(ROW()-2,'POSTE (1)'!$W:$W,0)),IFERROR(INDEX('POSTE (2)'!Q:Q,MATCH(ROW()-2,'POSTE (2)'!$W:$W,0)),IFERROR(INDEX('POSTE (3)'!Q:Q,MATCH(ROW()-2,'POSTE (3)'!$W:$W,0)),IFERROR(INDEX('POSTE (4)'!Q:Q,MATCH(ROW()-2,'POSTE (4)'!$W:$W,0)),IFERROR(INDEX('POSTE (5)'!Q:Q,MATCH(ROW()-2,'POSTE (5)'!$W:$W,0)),IFERROR(INDEX('POSTE (6)'!Q:Q,MATCH(ROW()-2,'POSTE (6)'!$W:$W,0)),IFERROR(INDEX('POSTE (7)'!Q:Q,MATCH(ROW()-2,'POSTE (7)'!$W:$W,0)),IFERROR(INDEX('POSTE (8)'!Q:Q,MATCH(ROW()-2,'POSTE (8)'!$W:$W,0)),IFERROR(INDEX('POSTE (9)'!Q:Q,MATCH(ROW()-2,'POSTE (9)'!$W:$W,0)),\"\")))))))))","v":"m"},{"$f":"IFERROR(INDEX('POSTE (1)'!R:R,MATCH(ROW()-2,'POSTE (1)'!$W:$W,0)),IFERROR(INDEX('POSTE (2)'!R:R,MATCH(ROW()-2,'POSTE (2)'!$W:$W,0)),IFERROR(INDEX('POSTE (3)'!R:R,MATCH(ROW()-2,'POSTE (3)'!$W:$W,0)),IFERROR(INDEX('POSTE (4)'!R:R,MATCH(ROW()-2,'POSTE (4)'!$W:$W,0)),IFERROR(INDEX('POSTE (5)'!R:R,MATCH(ROW()-2,'POSTE (5)'!$W:$W,0)),IFERROR(INDEX('POSTE (6)'!R:R,MATCH(ROW()-2,'POSTE (6)'!$W:$W,0)),IFERROR(INDEX('POSTE (7)'!R:R,MATCH(ROW()-2,'POSTE (7)'!$W:$W,0)),IFERROR(INDEX('POSTE (8)'!R:R,MATCH(ROW()-2,'POSTE (8)'!$W:$W,0)),IFERROR(INDEX('POSTE (9)'!R:R,MATCH(ROW()-2,'POSTE (9)'!$W:$W,0)),\"\")))))))))","v":5},{"$f":"IFERROR(INDEX('POSTE (1)'!S:S,MATCH(ROW()-2,'POSTE (1)'!$W:$W,0)),IFERROR(INDEX('POSTE (2)'!S:S,MATCH(ROW()-2,'POSTE (2)'!$W:$W,0)),IFERROR(INDEX('POSTE (3)'!S:S,MATCH(ROW()-2,'POSTE (3)'!$W:$W,0)),IFERROR(INDEX('POSTE (4)'!S:S,MATCH(ROW()-2,'POSTE (4)'!$W:$W,0)),IFERROR(INDEX('POSTE (5)'!S:S,MATCH(ROW()-2,'POSTE (5)'!$W:$W,0)),IFERROR(INDEX('POSTE (6)'!S:S,MATCH(ROW()-2,'POSTE (6)'!$W:$W,0)),IFERROR(INDEX('POSTE (7)'!S:S,MATCH(ROW()-2,'POSTE (7)'!$W:$W,0)),IFERROR(INDEX('POSTE (8)'!S:S,MATCH(ROW()-2,'POSTE (8)'!$W:$W,0)),IFERROR(INDEX('POSTE (9)'!S:S,MATCH(ROW()-2,'POSTE (9)'!$W:$W,0)),\"\")))))))))","v":1},{"$f":"IFERROR(INDEX('POSTE (1)'!T:T,MATCH(ROW()-2,'POSTE (1)'!$W:$W,0)),IFERROR(INDEX('POSTE (2)'!T:T,MATCH(ROW()-2,'POSTE (2)'!$W:$W,0)),IFERROR(INDEX('POSTE (3)'!T:T,MATCH(ROW()-2,'POSTE (3)'!$W:$W,0)),IFERROR(INDEX('POSTE (4)'!T:T,MATCH(ROW()-2,'POSTE (4)'!$W:$W,0)),IFERROR(INDEX('POSTE (5)'!T:T,MATCH(ROW()-2,'POSTE (5)'!$W:$W,0)),IFERROR(INDEX('POSTE (6)'!T:T,MATCH(ROW()-2,'POSTE (6)'!$W:$W,0)),IFERROR(INDEX('POSTE (7)'!T:T,MATCH(ROW()-2,'POSTE (7)'!$W:$W,0)),IFERROR(INDEX('POSTE (8)'!T:T,MATCH(ROW()-2,'POSTE (8)'!$W:$W,0)),IFERROR(INDEX('POSTE (9)'!T:T,MATCH(ROW()-2,'POSTE (9)'!$W:$W,0)),\"\")))))))))","v":5},{"$f":"IFERROR(INDEX('POSTE (1)'!U:U,MATCH(ROW()-2,'POSTE (1)'!$W:$W,0)),IFERROR(INDEX('POSTE (2)'!U:U,MATCH(ROW()-2,'POSTE (2)'!$W:$W,0)),IFERROR(INDEX('POSTE (3)'!U:U,MATCH(ROW()-2,'POSTE (3)'!$W:$W,0)),IFERROR(INDEX('POSTE (4)'!U:U,MATCH(ROW()-2,'POSTE (4)'!$W:$W,0)),IFERROR(INDEX('POSTE (5)'!U:U,MATCH(ROW()-2,'POSTE (5)'!$W:$W,0)),IFERROR(INDEX('POSTE (6)'!U:U,MATCH(ROW()-2,'POSTE (6)'!$W:$W,0)),IFERROR(INDEX('POSTE (7)'!U:U,MATCH(ROW()-2,'POSTE (7)'!$W:$W,0)),IFERROR(INDEX('POSTE (8)'!U:U,MATCH(ROW()-2,'POSTE (8)'!$W:$W,0)),IFERROR(INDEX('POSTE (9)'!U:U,MATCH(ROW()-2,'POSTE (9)'!$W:$W,0)),\"\")))))))))","v":"POSTE (5)"}]
[{"$f":"IFERROR(INDEX('POSTE (1)'!N:N,MATCH(ROW()-2,'POSTE (1)'!$W:$W,0)),IFERROR(INDEX('POSTE (2)'!N:N,MATCH(ROW()-2,'POSTE (2)'!$W:$W,0)),IFERROR(INDEX('POSTE (3)'!N:N,MATCH(ROW()-2,'POSTE (3)'!$W:$W,0)),IFERROR(INDEX('POSTE (4)'!N:N,MATCH(ROW()-2,'POSTE (4)'!$W:$W,0)),IFERROR(INDEX('POSTE (5)'!N:N,MATCH(ROW()-2,'POSTE (5)'!$W:$W,0)),IFERROR(INDEX('POSTE (6)'!N:N,MATCH(ROW()-2,'POSTE (6)'!$W:$W,0)),IFERROR(INDEX('POSTE (7)'!N:N,MATCH(ROW()-2,'POSTE (7)'!$W:$W,0)),IFERROR(INDEX('POSTE (8)'!N:N,MATCH(ROW()-2,'POSTE (8)'!$W:$W,0)),IFERROR(INDEX('POSTE (9)'!N:N,MATCH(ROW()-2,'POSTE (9)'!$W:$W,0)),\"\")))))))))","v":"(5)Fournisseur3"},{"$f":"IFERROR(INDEX('POSTE (1)'!O:O,MATCH(ROW()-2,'POSTE (1)'!$W:$W,0)),IFERROR(INDEX('POSTE (2)'!O:O,MATCH(ROW()-2,'POSTE (2)'!$W:$W,0)),IFERROR(INDEX('POSTE (3)'!O:O,MATCH(ROW()-2,'POSTE (3)'!$W:$W,0)),IFERROR(INDEX('POSTE (4)'!O:O,MATCH(ROW()-2,'POSTE (4)'!$W:$W,0)),IFERROR(INDEX('POSTE (5)'!O:O,MATCH(ROW()-2,'POSTE (5)'!$W:$W,0)),IFERROR(INDEX('POSTE (6)'!O:O,MATCH(ROW()-2,'POSTE (6)'!$W:$W,0)),IFERROR(INDEX('POSTE (7)'!O:O,MATCH(ROW()-2,'POSTE (7)'!$W:$W,0)),IFERROR(INDEX('POSTE (8)'!O:O,MATCH(ROW()-2,'POSTE (8)'!$W:$W,0)),IFERROR(INDEX('POSTE (9)'!O:O,MATCH(ROW()-2,'POSTE (9)'!$W:$W,0)),\"\")))))))))","v":"(5)Ref3"},{"$f":"IFERROR(INDEX('POSTE (1)'!P:P,MATCH(ROW()-2,'POSTE (1)'!$W:$W,0)),IFERROR(INDEX('POSTE (2)'!P:P,MATCH(ROW()-2,'POSTE (2)'!$W:$W,0)),IFERROR(INDEX('POSTE (3)'!P:P,MATCH(ROW()-2,'POSTE (3)'!$W:$W,0)),IFERROR(INDEX('POSTE (4)'!P:P,MATCH(ROW()-2,'POSTE (4)'!$W:$W,0)),IFERROR(INDEX('POSTE (5)'!P:P,MATCH(ROW()-2,'POSTE (5)'!$W:$W,0)),IFERROR(INDEX('POSTE (6)'!P:P,MATCH(ROW()-2,'POSTE (6)'!$W:$W,0)),IFERROR(INDEX('POSTE (7)'!P:P,MATCH(ROW()-2,'POSTE (7)'!$W:$W,0)),IFERROR(INDEX('POSTE (8)'!P:P,MATCH(ROW()-2,'POSTE (8)'!$W:$W,0)),IFERROR(INDEX('POSTE (9)'!P:P,MATCH(ROW()-2,'POSTE (9)'!$W:$W,0)),\"\")))))))))","v":"(5)DESIGNATION3"},{"$f":"IFERROR(INDEX('POSTE (1)'!Q:Q,MATCH(ROW()-2,'POSTE (1)'!$W:$W,0)),IFERROR(INDEX('POSTE (2)'!Q:Q,MATCH(ROW()-2,'POSTE (2)'!$W:$W,0)),IFERROR(INDEX('POSTE (3)'!Q:Q,MATCH(ROW()-2,'POSTE (3)'!$W:$W,0)),IFERROR(INDEX('POSTE (4)'!Q:Q,MATCH(ROW()-2,'POSTE (4)'!$W:$W,0)),IFERROR(INDEX('POSTE (5)'!Q:Q,MATCH(ROW()-2,'POSTE (5)'!$W:$W,0)),IFERROR(INDEX('POSTE (6)'!Q:Q,MATCH(ROW()-2,'POSTE (6)'!$W:$W,0)),IFERROR(INDEX('POSTE (7)'!Q:Q,MATCH(ROW()-2,'POSTE (7)'!$W:$W,0)),IFERROR(INDEX('POSTE (8)'!Q:Q,MATCH(ROW()-2,'POSTE (8)'!$W:$W,0)),IFERROR(INDEX('POSTE (9)'!Q:Q,MATCH(ROW()-2,'POSTE (9)'!$W:$W,0)),\"\")))))))))","v":"m"},{"$f":"IFERROR(INDEX('POSTE (1)'!R:R,MATCH(ROW()-2,'POSTE (1)'!$W:$W,0)),IFERROR(INDEX('POSTE (2)'!R:R,MATCH(ROW()-2,'POSTE (2)'!$W:$W,0)),IFERROR(INDEX('POSTE (3)'!R:R,MATCH(ROW()-2,'POSTE (3)'!$W:$W,0)),IFERROR(INDEX('POSTE (4)'!R:R,MATCH(ROW()-2,'POSTE (4)'!$W:$W,0)),IFERROR(INDEX('POSTE (5)'!R:R,MATCH(ROW()-2,'POSTE (5)'!$W:$W,0)),IFERROR(INDEX('POSTE (6)'!R:R,MATCH(ROW()-2,'POSTE (6)'!$W:$W,0)),IFERROR(INDEX('POSTE (7)'!R:R,MATCH(ROW()-2,'POSTE (7)'!$W:$W,0)),IFERROR(INDEX('POSTE (8)'!R:R,MATCH(ROW()-2,'POSTE (8)'!$W:$W,0)),IFERROR(INDEX('POSTE (9)'!R:R,MATCH(ROW()-2,'POSTE (9)'!$W:$W,0)),\"\")))))))))","v":5},{"$f":"IFERROR(INDEX('POSTE (1)'!S:S,MATCH(ROW()-2,'POSTE (1)'!$W:$W,0)),IFERROR(INDEX('POSTE (2)'!S:S,MATCH(ROW()-2,'POSTE (2)'!$W:$W,0)),IFERROR(INDEX('POSTE (3)'!S:S,MATCH(ROW()-2,'POSTE (3)'!$W:$W,0)),IFERROR(INDEX('POSTE (4)'!S:S,MATCH(ROW()-2,'POSTE (4)'!$W:$W,0)),IFERROR(INDEX('POSTE (5)'!S:S,MATCH(ROW()-2,'POSTE (5)'!$W:$W,0)),IFERROR(INDEX('POSTE (6)'!S:S,MATCH(ROW()-2,'POSTE (6)'!$W:$W,0)),IFERROR(INDEX('POSTE (7)'!S:S,MATCH(ROW()-2,'POSTE (7)'!$W:$W,0)),IFERROR(INDEX('POSTE (8)'!S:S,MATCH(ROW()-2,'POSTE (8)'!$W:$W,0)),IFERROR(INDEX('POSTE (9)'!S:S,MATCH(ROW()-2,'POSTE (9)'!$W:$W,0)),\"\")))))))))","v":1},{"$f":"IFERROR(INDEX('POSTE (1)'!T:T,MATCH(ROW()-2,'POSTE (1)'!$W:$W,0)),IFERROR(INDEX('POSTE (2)'!T:T,MATCH(ROW()-2,'POSTE (2)'!$W:$W,0)),IFERROR(INDEX('POSTE (3)'!T:T,MATCH(ROW()-2,'POSTE (3)'!$W:$W,0)),IFERROR(INDEX('POSTE (4)'!T:T,MATCH(ROW()-2,'POSTE (4)'!$W:$W,0)),IFERROR(INDEX('POSTE (5)'!T:T,MATCH(ROW()-2,'POSTE (5)'!$W:$W,0)),IFERROR(INDEX('POSTE (6)'!T:T,MATCH(ROW()-2,'POSTE (6)'!$W:$W,0)),IFERROR(INDEX('POSTE (7)'!T:T,MATCH(ROW()-2,'POSTE (7)'!$W:$W,0)),IFERROR(INDEX('POSTE (8)'!T:T,MATCH(ROW()-2,'POSTE (8)'!$W:$W,0)),IFERROR(INDEX('POSTE (9)'!T:T,MATCH(ROW()-2,'POSTE (9)'!$W:$W,0)),\"\")))))))))","v":5},{"$f":"IFERROR(INDEX('POSTE (1)'!U:U,MATCH(ROW()-2,'POSTE (1)'!$W:$W,0)),IFERROR(INDEX('POSTE (2)'!U:U,MATCH(ROW()-2,'POSTE (2)'!$W:$W,0)),IFERROR(INDEX('POSTE (3)'!U:U,MATCH(ROW()-2,'POSTE (3)'!$W:$W,0)),IFERROR(INDEX('POSTE (4)'!U:U,MATCH(ROW()-2,'POSTE (4)'!$W:$W,0)),IFERROR(INDEX('POSTE (5)'!U:U,MATCH(ROW()-2,'POSTE (5)'!$W:$W,0)),IFERROR(INDEX('POSTE (6)'!U:U,MATCH(ROW()-2,'POSTE (6)'!$W:$W,0)),IFERROR(INDEX('POSTE (7)'!U:U,MATCH(ROW()-2,'POSTE (7)'!$W:$W,0)),IFERROR(INDEX('POSTE (8)'!U:U,MATCH(ROW()-2,'POSTE (8)'!$W:$W,0)),IFERROR(INDEX('POSTE (9)'!U:U,MATCH(ROW()-2,'POSTE (9)'!$W:$W,0)),\"\")))))))))","v":"POSTE (5)"}]
[{"$f":"IFERROR(INDEX('POSTE (1)'!N:N,MATCH(ROW()-2,'POSTE (1)'!$W:$W,0)),IFERROR(INDEX('POSTE (2)'!N:N,MATCH(ROW()-2,'POSTE (2)'!$W:$W,0)),IFERROR(INDEX('POSTE (3)'!N:N,MATCH(ROW()-2,'POSTE (3)'!$W:$W,0)),IFERROR(INDEX('POSTE (4)'!N:N,MATCH(ROW()-2,'POSTE (4)'!$W:$W,0)),IFERROR(INDEX('POSTE (5)'!N:N,MATCH(ROW()-2,'POSTE (5)'!$W:$W,0)),IFERROR(INDEX('POSTE (6)'!N:N,MATCH(ROW()-2,'POSTE (6)'!$W:$W,0)),IFERROR(INDEX('POSTE (7)'!N:N,MATCH(ROW()-2,'POSTE (7)'!$W:$W,0)),IFERROR(INDEX('POSTE (8)'!N:N,MATCH(ROW()-2,'POSTE (8)'!$W:$W,0)),IFERROR(INDEX('POSTE (9)'!N:N,MATCH(ROW()-2,'POSTE (9)'!$W:$W,0)),\"\")))))))))","v":"(5)Fournisseur4"},{"$f":"IFERROR(INDEX('POSTE (1)'!O:O,MATCH(ROW()-2,'POSTE (1)'!$W:$W,0)),IFERROR(INDEX('POSTE (2)'!O:O,MATCH(ROW()-2,'POSTE (2)'!$W:$W,0)),IFERROR(INDEX('POSTE (3)'!O:O,MATCH(ROW()-2,'POSTE (3)'!$W:$W,0)),IFERROR(INDEX('POSTE (4)'!O:O,MATCH(ROW()-2,'POSTE (4)'!$W:$W,0)),IFERROR(INDEX('POSTE (5)'!O:O,MATCH(ROW()-2,'POSTE (5)'!$W:$W,0)),IFERROR(INDEX('POSTE (6)'!O:O,MATCH(ROW()-2,'POSTE (6)'!$W:$W,0)),IFERROR(INDEX('POSTE (7)'!O:O,MATCH(ROW()-2,'POSTE (7)'!$W:$W,0)),IFERROR(INDEX('POSTE (8)'!O:O,MATCH(ROW()-2,'POSTE (8)'!$W:$W,0)),IFERROR(INDEX('POSTE (9)'!O:O,MATCH(ROW()-2,'POSTE (9)'!$W:$W,0)),\"\")))))))))","v":"(5)Ref4"},{"$f":"IFERROR(INDEX('POSTE (1)'!P:P,MATCH(ROW()-2,'POSTE (1)'!$W:$W,0)),IFERROR(INDEX('POSTE (2)'!P:P,MATCH(ROW()-2,'POSTE (2)'!$W:$W,0)),IFERROR(INDEX('POSTE (3)'!P:P,MATCH(ROW()-2,'POSTE (3)'!$W:$W,0)),IFERROR(INDEX('POSTE (4)'!P:P,MATCH(ROW()-2,'POSTE (4)'!$W:$W,0)),IFERROR(INDEX('POSTE (5)'!P:P,MATCH(ROW()-2,'POSTE (5)'!$W:$W,0)),IFERROR(INDEX('POSTE (6)'!P:P,MATCH(ROW()-2,'POSTE (6)'!$W:$W,0)),IFERROR(INDEX('POSTE (7)'!P:P,MATCH(ROW()-2,'POSTE (7)'!$W:$W,0)),IFERROR(INDEX('POSTE (8)'!P:P,MATCH(ROW()-2,'POSTE (8)'!$W:$W,0)),IFERROR(INDEX('POSTE (9)'!P:P,MATCH(ROW()-2,'POSTE (9)'!$W:$W,0)),\"\")))))))))","v":"(5)DESIGNATION4"},{"$f":"IFERROR(INDEX('POSTE (1)'!Q:Q,MATCH(ROW()-2,'POSTE (1)'!$W:$W,0)),IFERROR(INDEX('POSTE (2)'!Q:Q,MATCH(ROW()-2,'POSTE (2)'!$W:$W,0)),IFERROR(INDEX('POSTE (3)'!Q:Q,MATCH(ROW()-2,'POSTE (3)'!$W:$W,0)),IFERROR(INDEX('POSTE (4)'!Q:Q,MATCH(ROW()-2,'POSTE (4)'!$W:$W,0)),IFERROR(INDEX('POSTE (5)'!Q:Q,MATCH(ROW()-2,'POSTE (5)'!$W:$W,0)),IFERROR(INDEX('POSTE (6)'!Q:Q,MATCH(ROW()-2,'POSTE (6)'!$W:$W,0)),IFERROR(INDEX('POSTE (7)'!Q:Q,MATCH(ROW()-2,'POSTE (7)'!$W:$W,0)),IFERROR(INDEX('POSTE (8)'!Q:Q,MATCH(ROW()-2,'POSTE (8)'!$W:$W,0)),IFERROR(INDEX('POSTE (9)'!Q:Q,MATCH(ROW()-2,'POSTE (9)'!$W:$W,0)),\"\")))))))))","v":"m"},{"$f":"IFERROR(INDEX('POSTE (1)'!R:R,MATCH(ROW()-2,'POSTE (1)'!$W:$W,0)),IFERROR(INDEX('POSTE (2)'!R:R,MATCH(ROW()-2,'POSTE (2)'!$W:$W,0)),IFERROR(INDEX('POSTE (3)'!R:R,MATCH(ROW()-2,'POSTE (3)'!$W:$W,0)),IFERROR(INDEX('POSTE (4)'!R:R,MATCH(ROW()-2,'POSTE (4)'!$W:$W,0)),IFERROR(INDEX('POSTE (5)'!R:R,MATCH(ROW()-2,'POSTE (5)'!$W:$W,0)),IFERROR(INDEX('POSTE (6)'!R:R,MATCH(ROW()-2,'POSTE (6)'!$W:$W,0)),IFERROR(INDEX('POSTE (7)'!R:R,MATCH(ROW()-2,'POSTE (7)'!$W:$W,0)),IFERROR(INDEX('POSTE (8)'!R:R,MATCH(ROW()-2,'POSTE (8)'!$W:$W,0)),IFERROR(INDEX('POSTE (9)'!R:R,MATCH(ROW()-2,'POSTE (9)'!$W:$W,0)),\"\")))))))))","v":5},{"$f":"IFERROR(INDEX('POSTE (1)'!S:S,MATCH(ROW()-2,'POSTE (1)'!$W:$W,0)),IFERROR(INDEX('POSTE (2)'!S:S,MATCH(ROW()-2,'POSTE (2)'!$W:$W,0)),IFERROR(INDEX('POSTE (3)'!S:S,MATCH(ROW()-2,'POSTE (3)'!$W:$W,0)),IFERROR(INDEX('POSTE (4)'!S:S,MATCH(ROW()-2,'POSTE (4)'!$W:$W,0)),IFERROR(INDEX('POSTE (5)'!S:S,MATCH(ROW()-2,'POSTE (5)'!$W:$W,0)),IFERROR(INDEX('POSTE (6)'!S:S,MATCH(ROW()-2,'POSTE (6)'!$W:$W,0)),IFERROR(INDEX('POSTE (7)'!S:S,MATCH(ROW()-2,'POSTE (7)'!$W:$W,0)),IFERROR(INDEX('POSTE (8)'!S:S,MATCH(ROW()-2,'POSTE (8)'!$W:$W,0)),IFERROR(INDEX('POSTE (9)'!S:S,MATCH(ROW()-2,'POSTE (9)'!$W:$W,0)),\"\")))))))))","v":1},{"$f":"IFERROR(INDEX('POSTE (1)'!T:T,MATCH(ROW()-2,'POSTE (1)'!$W:$W,0)),IFERROR(INDEX('POSTE (2)'!T:T,MATCH(ROW()-2,'POSTE (2)'!$W:$W,0)),IFERROR(INDEX('POSTE (3)'!T:T,MATCH(ROW()-2,'POSTE (3)'!$W:$W,0)),IFERROR(INDEX('POSTE (4)'!T:T,MATCH(ROW()-2,'POSTE (4)'!$W:$W,0)),IFERROR(INDEX('POSTE (5)'!T:T,MATCH(ROW()-2,'POSTE (5)'!$W:$W,0)),IFERROR(INDEX('POSTE (6)'!T:T,MATCH(ROW()-2,'POSTE (6)'!$W:$W,0)),IFERROR(INDEX('POSTE (7)'!T:T,MATCH(ROW()-2,'POSTE (7)'!$W:$W,0)),IFERROR(INDEX('POSTE (8)'!T:T,MATCH(ROW()-2,'POSTE (8)'!$W:$W,0)),IFERROR(INDEX('POSTE (9)'!T:T,MATCH(ROW()-2,'POSTE (9)'!$W:$W,0)),\"\")))))))))","v":5},{"$f":"IFERROR(INDEX('POSTE (1)'!U:U,MATCH(ROW()-2,'POSTE (1)'!$W:$W,0)),IFERROR(INDEX('POSTE (2)'!U:U,MATCH(ROW()-2,'POSTE (2)'!$W:$W,0)),IFERROR(INDEX('POSTE (3)'!U:U,MATCH(ROW()-2,'POSTE (3)'!$W:$W,0)),IFERROR(INDEX('POSTE (4)'!U:U,MATCH(ROW()-2,'POSTE (4)'!$W:$W,0)),IFERROR(INDEX('POSTE (5)'!U:U,MATCH(ROW()-2,'POSTE (5)'!$W:$W,0)),IFERROR(INDEX('POSTE (6)'!U:U,MATCH(ROW()-2,'POSTE (6)'!$W:$W,0)),IFERROR(INDEX('POSTE (7)'!U:U,MATCH(ROW()-2,'POSTE (7)'!$W:$W,0)),IFERROR(INDEX('POSTE (8)'!U:U,MATCH(ROW()-2,'POSTE (8)'!$W:$W,0)),IFERROR(INDEX('POSTE (9)'!U:U,MATCH(ROW()-2,'POSTE (9)'!$W:$W,0)),\"\")))))))))","v":"POSTE (5)"}]
[{"$f":"IFERROR(INDEX('POSTE (1)'!N:N,MATCH(ROW()-2,'POSTE (1)'!$W:$W,0)),IFERROR(INDEX('POSTE (2)'!N:N,MATCH(ROW()-2,'POSTE (2)'!$W:$W,0)),IFERROR(INDEX('POSTE (3)'!N:N,MATCH(ROW()-2,'POSTE (3)'!$W:$W,0)),IFERROR(INDEX('POSTE (4)'!N:N,MATCH(ROW()-2,'POSTE (4)'!$W:$W,0)),IFERROR(INDEX('POSTE (5)'!N:N,MATCH(ROW()-2,'POSTE (5)'!$W:$W,0)),IFERROR(INDEX('POSTE (6)'!N:N,MATCH(ROW()-2,'POSTE (6)'!$W:$W,0)),IFERROR(INDEX('POSTE (7)'!N:N,MATCH(ROW()-2,'POSTE (7)'!$W:$W,0)),IFERROR(INDEX('POSTE (8)'!N:N,MATCH(ROW()-2,'POSTE (8)'!$W:$W,0)),IFERROR(INDEX('POSTE (9)'!N:N,MATCH(ROW()-2,'POSTE (9)'!$W:$W,0)),\"\")))))))))","v":"(5)Fournisseur5"},{"$f":"IFERROR(INDEX('POSTE (1)'!O:O,MATCH(ROW()-2,'POSTE (1)'!$W:$W,0)),IFERROR(INDEX('POSTE (2)'!O:O,MATCH(ROW()-2,'POSTE (2)'!$W:$W,0)),IFERROR(INDEX('POSTE (3)'!O:O,MATCH(ROW()-2,'POSTE (3)'!$W:$W,0)),IFERROR(INDEX('POSTE (4)'!O:O,MATCH(ROW()-2,'POSTE (4)'!$W:$W,0)),IFERROR(INDEX('POSTE (5)'!O:O,MATCH(ROW()-2,'POSTE (5)'!$W:$W,0)),IFERROR(INDEX('POSTE (6)'!O:O,MATCH(ROW()-2,'POSTE (6)'!$W:$W,0)),IFERROR(INDEX('POSTE (7)'!O:O,MATCH(ROW()-2,'POSTE (7)'!$W:$W,0)),IFERROR(INDEX('POSTE (8)'!O:O,MATCH(ROW()-2,'POSTE (8)'!$W:$W,0)),IFERROR(INDEX('POSTE (9)'!O:O,MATCH(ROW()-2,'POSTE (9)'!$W:$W,0)),\"\")))))))))","v":"(5)Ref5"},{"$f":"IFERROR(INDEX('POSTE (1)'!P:P,MATCH(ROW()-2,'POSTE (1)'!$W:$W,0)),IFERROR(INDEX('POSTE (2)'!P:P,MATCH(ROW()-2,'POSTE (2)'!$W:$W,0)),IFERROR(INDEX('POSTE (3)'!P:P,MATCH(ROW()-2,'POSTE (3)'!$W:$W,0)),IFERROR(INDEX('POSTE (4)'!P:P,MATCH(ROW()-2,'POSTE (4)'!$W:$W,0)),IFERROR(INDEX('POSTE (5)'!P:P,MATCH(ROW()-2,'POSTE (5)'!$W:$W,0)),IFERROR(INDEX('POSTE (6)'!P:P,MATCH(ROW()-2,'POSTE (6)'!$W:$W,0)),IFERROR(INDEX('POSTE (7)'!P:P,MATCH(ROW()-2,'POSTE (7)'!$W:$W,0)),IFERROR(INDEX('POSTE (8)'!P:P,MATCH(ROW()-2,'POSTE (8)'!$W:$W,0)),IFERROR(INDEX('POSTE (9)'!P:P,MATCH(ROW()-2,'POSTE (9)'!$W:$W,0)),\"\")))))))))","v":"(5)DESIGNATION5"},{"$f":"IFERROR(INDEX('POSTE (1)'!Q:Q,MATCH(ROW()-2,'POSTE (1)'!$W:$W,0)),IFERROR(INDEX('POSTE (2)'!Q:Q,MATCH(ROW()-2,'POSTE (2)'!$W:$W,0)),IFERROR(INDEX('POSTE (3)'!Q:Q,MATCH(ROW()-2,'POSTE (3)'!$W:$W,0)),IFERROR(INDEX('POSTE (4)'!Q:Q,MATCH(ROW()-2,'POSTE (4)'!$W:$W,0)),IFERROR(INDEX('POSTE (5)'!Q:Q,MATCH(ROW()-2,'POSTE (5)'!$W:$W,0)),IFERROR(INDEX('POSTE (6)'!Q:Q,MATCH(ROW()-2,'POSTE (6)'!$W:$W,0)),IFERROR(INDEX('POSTE (7)'!Q:Q,MATCH(ROW()-2,'POSTE (7)'!$W:$W,0)),IFERROR(INDEX('POSTE (8)'!Q:Q,MATCH(ROW()-2,'POSTE (8)'!$W:$W,0)),IFERROR(INDEX('POSTE (9)'!Q:Q,MATCH(ROW()-2,'POSTE (9)'!$W:$W,0)),\"\")))))))))","v":"m"},{"$f":"IFERROR(INDEX('POSTE (1)'!R:R,MATCH(ROW()-2,'POSTE (1)'!$W:$W,0)),IFERROR(INDEX('POSTE (2)'!R:R,MATCH(ROW()-2,'POSTE (2)'!$W:$W,0)),IFERROR(INDEX('POSTE (3)'!R:R,MATCH(ROW()-2,'POSTE (3)'!$W:$W,0)),IFERROR(INDEX('POSTE (4)'!R:R,MATCH(ROW()-2,'POSTE (4)'!$W:$W,0)),IFERROR(INDEX('POSTE (5)'!R:R,MATCH(ROW()-2,'POSTE (5)'!$W:$W,0)),IFERROR(INDEX('POSTE (6)'!R:R,MATCH(ROW()-2,'POSTE (6)'!$W:$W,0)),IFERROR(INDEX('POSTE (7)'!R:R,MATCH(ROW()-2,'POSTE (7)'!$W:$W,0)),IFERROR(INDEX('POSTE (8)'!R:R,MATCH(ROW()-2,'POSTE (8)'!$W:$W,0)),IFERROR(INDEX('POSTE (9)'!R:R,MATCH(ROW()-2,'POSTE (9)'!$W:$W,0)),\"\")))))))))","v":5},{"$f":"IFERROR(INDEX('POSTE (1)'!S:S,MATCH(ROW()-2,'POSTE (1)'!$W:$W,0)),IFERROR(INDEX('POSTE (2)'!S:S,MATCH(ROW()-2,'POSTE (2)'!$W:$W,0)),IFERROR(INDEX('POSTE (3)'!S:S,MATCH(ROW()-2,'POSTE (3)'!$W:$W,0)),IFERROR(INDEX('POSTE (4)'!S:S,MATCH(ROW()-2,'POSTE (4)'!$W:$W,0)),IFERROR(INDEX('POSTE (5)'!S:S,MATCH(ROW()-2,'POSTE (5)'!$W:$W,0)),IFERROR(INDEX('POSTE (6)'!S:S,MATCH(ROW()-2,'POSTE (6)'!$W:$W,0)),IFERROR(INDEX('POSTE (7)'!S:S,MATCH(ROW()-2,'POSTE (7)'!$W:$W,0)),IFERROR(INDEX('POSTE (8)'!S:S,MATCH(ROW()-2,'POSTE (8)'!$W:$W,0)),IFERROR(INDEX('POSTE (9)'!S:S,MATCH(ROW()-2,'POSTE (9)'!$W:$W,0)),\"\")))))))))","v":1},{"$f":"IFERROR(INDEX('POSTE (1)'!T:T,MATCH(ROW()-2,'POSTE (1)'!$W:$W,0)),IFERROR(INDEX('POSTE (2)'!T:T,MATCH(ROW()-2,'POSTE (2)'!$W:$W,0)),IFERROR(INDEX('POSTE (3)'!T:T,MATCH(ROW()-2,'POSTE (3)'!$W:$W,0)),IFERROR(INDEX('POSTE (4)'!T:T,MATCH(ROW()-2,'POSTE (4)'!$W:$W,0)),IFERROR(INDEX('POSTE (5)'!T:T,MATCH(ROW()-2,'POSTE (5)'!$W:$W,0)),IFERROR(INDEX('POSTE (6)'!T:T,MATCH(ROW()-2,'POSTE (6)'!$W:$W,0)),IFERROR(INDEX('POSTE (7)'!T:T,MATCH(ROW()-2,'POSTE (7)'!$W:$W,0)),IFERROR(INDEX('POSTE (8)'!T:T,MATCH(ROW()-2,'POSTE (8)'!$W:$W,0)),IFERROR(INDEX('POSTE (9)'!T:T,MATCH(ROW()-2,'POSTE (9)'!$W:$W,0)),\"\")))))))))","v":5},{"$f":"IFERROR(INDEX('POSTE (1)'!U:U,MATCH(ROW()-2,'POSTE (1)'!$W:$W,0)),IFERROR(INDEX('POSTE (2)'!U:U,MATCH(ROW()-2,'POSTE (2)'!$W:$W,0)),IFERROR(INDEX('POSTE (3)'!U:U,MATCH(ROW()-2,'POSTE (3)'!$W:$W,0)),IFERROR(INDEX('POSTE (4)'!U:U,MATCH(ROW()-2,'POSTE (4)'!$W:$W,0)),IFERROR(INDEX('POSTE (5)'!U:U,MATCH(ROW()-2,'POSTE (5)'!$W:$W,0)),IFERROR(INDEX('POSTE (6)'!U:U,MATCH(ROW()-2,'POSTE (6)'!$W:$W,0)),IFERROR(INDEX('POSTE (7)'!U:U,MATCH(ROW()-2,'POSTE (7)'!$W:$W,0)),IFERROR(INDEX('POSTE (8)'!U:U,MATCH(ROW()-2,'POSTE (8)'!$W:$W,0)),IFERROR(INDEX('POSTE (9)'!U:U,MATCH(ROW()-2,'POSTE (9)'!$W:$W,0)),\"\")))))))))","v":"POSTE (5)"}]
[{"$f":"IFERROR(INDEX('POSTE (1)'!N:N,MATCH(ROW()-2,'POSTE (1)'!$W:$W,0)),IFERROR(INDEX('POSTE (2)'!N:N,MATCH(ROW()-2,'POSTE (2)'!$W:$W,0)),IFERROR(INDEX('POSTE (3)'!N:N,MATCH(ROW()-2,'POSTE (3)'!$W:$W,0)),IFERROR(INDEX('POSTE (4)'!N:N,MATCH(ROW()-2,'POSTE (4)'!$W:$W,0)),IFERROR(INDEX('POSTE (5)'!N:N,MATCH(ROW()-2,'POSTE (5)'!$W:$W,0)),IFERROR(INDEX('POSTE (6)'!N:N,MATCH(ROW()-2,'POSTE (6)'!$W:$W,0)),IFERROR(INDEX('POSTE (7)'!N:N,MATCH(ROW()-2,'POSTE (7)'!$W:$W,0)),IFERROR(INDEX('POSTE (8)'!N:N,MATCH(ROW()-2,'POSTE (8)'!$W:$W,0)),IFERROR(INDEX('POSTE (9)'!N:N,MATCH(ROW()-2,'POSTE (9)'!$W:$W,0)),\"\")))))))))","v":"(6)Fournisseur"},{"$f":"IFERROR(INDEX('POSTE (1)'!O:O,MATCH(ROW()-2,'POSTE (1)'!$W:$W,0)),IFERROR(INDEX('POSTE (2)'!O:O,MATCH(ROW()-2,'POSTE (2)'!$W:$W,0)),IFERROR(INDEX('POSTE (3)'!O:O,MATCH(ROW()-2,'POSTE (3)'!$W:$W,0)),IFERROR(INDEX('POSTE (4)'!O:O,MATCH(ROW()-2,'POSTE (4)'!$W:$W,0)),IFERROR(INDEX('POSTE (5)'!O:O,MATCH(ROW()-2,'POSTE (5)'!$W:$W,0)),IFERROR(INDEX('POSTE (6)'!O:O,MATCH(ROW()-2,'POSTE (6)'!$W:$W,0)),IFERROR(INDEX('POSTE (7)'!O:O,MATCH(ROW()-2,'POSTE (7)'!$W:$W,0)),IFERROR(INDEX('POSTE (8)'!O:O,MATCH(ROW()-2,'POSTE (8)'!$W:$W,0)),IFERROR(INDEX('POSTE (9)'!O:O,MATCH(ROW()-2,'POSTE (9)'!$W:$W,0)),\"\")))))))))","v":"(6)Ref"},{"$f":"IFERROR(INDEX('POSTE (1)'!P:P,MATCH(ROW()-2,'POSTE (1)'!$W:$W,0)),IFERROR(INDEX('POSTE (2)'!P:P,MATCH(ROW()-2,'POSTE (2)'!$W:$W,0)),IFERROR(INDEX('POSTE (3)'!P:P,MATCH(ROW()-2,'POSTE (3)'!$W:$W,0)),IFERROR(INDEX('POSTE (4)'!P:P,MATCH(ROW()-2,'POSTE (4)'!$W:$W,0)),IFERROR(INDEX('POSTE (5)'!P:P,MATCH(ROW()-2,'POSTE (5)'!$W:$W,0)),IFERROR(INDEX('POSTE (6)'!P:P,MATCH(ROW()-2,'POSTE (6)'!$W:$W,0)),IFERROR(INDEX('POSTE (7)'!P:P,MATCH(ROW()-2,'POSTE (7)'!$W:$W,0)),IFERROR(INDEX('POSTE (8)'!P:P,MATCH(ROW()-2,'POSTE (8)'!$W:$W,0)),IFERROR(INDEX('POSTE (9)'!P:P,MATCH(ROW()-2,'POSTE (9)'!$W:$W,0)),\"\")))))))))","v":"(6)DESIGNATION"},{"$f":"IFERROR(INDEX('POSTE (1)'!Q:Q,MATCH(ROW()-2,'POSTE (1)'!$W:$W,0)),IFERROR(INDEX('POSTE (2)'!Q:Q,MATCH(ROW()-2,'POSTE (2)'!$W:$W,0)),IFERROR(INDEX('POSTE (3)'!Q:Q,MATCH(ROW()-2,'POSTE (3)'!$W:$W,0)),IFERROR(INDEX('POSTE (4)'!Q:Q,MATCH(ROW()-2,'POSTE (4)'!$W:$W,0)),IFERROR(INDEX('POSTE (5)'!Q:Q,MATCH(ROW()-2,'POSTE (5)'!$W:$W,0)),IFERROR(INDEX('POSTE (6)'!Q:Q,MATCH(ROW()-2,'POSTE (6)'!$W:$W,0)),IFERROR(INDEX('POSTE (7)'!Q:Q,MATCH(ROW()-2,'POSTE (7)'!$W:$W,0)),IFERROR(INDEX('POSTE (8)'!Q:Q,MATCH(ROW()-2,'POSTE (8)'!$W:$W,0)),IFERROR(INDEX('POSTE (9)'!Q:Q,MATCH(ROW()-2,'POSTE (9)'!$W:$W,0)),\"\")))))))))","v":"cm"},{"$f":"IFERROR(INDEX('POSTE (1)'!R:R,MATCH(ROW()-2,'POSTE (1)'!$W:$W,0)),IFERROR(INDEX('POSTE (2)'!R:R,MATCH(ROW()-2,'POSTE (2)'!$W:$W,0)),IFERROR(INDEX('POSTE (3)'!R:R,MATCH(ROW()-2,'POSTE (3)'!$W:$W,0)),IFERROR(INDEX('POSTE (4)'!R:R,MATCH(ROW()-2,'POSTE (4)'!$W:$W,0)),IFERROR(INDEX('POSTE (5)'!R:R,MATCH(ROW()-2,'POSTE (5)'!$W:$W,0)),IFERROR(INDEX('POSTE (6)'!R:R,MATCH(ROW()-2,'POSTE (6)'!$W:$W,0)),IFERROR(INDEX('POSTE (7)'!R:R,MATCH(ROW()-2,'POSTE (7)'!$W:$W,0)),IFERROR(INDEX('POSTE (8)'!R:R,MATCH(ROW()-2,'POSTE (8)'!$W:$W,0)),IFERROR(INDEX('POSTE (9)'!R:R,MATCH(ROW()-2,'POSTE (9)'!$W:$W,0)),\"\")))))))))","v":6},{"$f":"IFERROR(INDEX('POSTE (1)'!S:S,MATCH(ROW()-2,'POSTE (1)'!$W:$W,0)),IFERROR(INDEX('POSTE (2)'!S:S,MATCH(ROW()-2,'POSTE (2)'!$W:$W,0)),IFERROR(INDEX('POSTE (3)'!S:S,MATCH(ROW()-2,'POSTE (3)'!$W:$W,0)),IFERROR(INDEX('POSTE (4)'!S:S,MATCH(ROW()-2,'POSTE (4)'!$W:$W,0)),IFERROR(INDEX('POSTE (5)'!S:S,MATCH(ROW()-2,'POSTE (5)'!$W:$W,0)),IFERROR(INDEX('POSTE (6)'!S:S,MATCH(ROW()-2,'POSTE (6)'!$W:$W,0)),IFERROR(INDEX('POSTE (7)'!S:S,MATCH(ROW()-2,'POSTE (7)'!$W:$W,0)),IFERROR(INDEX('POSTE (8)'!S:S,MATCH(ROW()-2,'POSTE (8)'!$W:$W,0)),IFERROR(INDEX('POSTE (9)'!S:S,MATCH(ROW()-2,'POSTE (9)'!$W:$W,0)),\"\")))))))))","v":1},{"$f":"IFERROR(INDEX('POSTE (1)'!T:T,MATCH(ROW()-2,'POSTE (1)'!$W:$W,0)),IFERROR(INDEX('POSTE (2)'!T:T,MATCH(ROW()-2,'POSTE (2)'!$W:$W,0)),IFERROR(INDEX('POSTE (3)'!T:T,MATCH(ROW()-2,'POSTE (3)'!$W:$W,0)),IFERROR(INDEX('POSTE (4)'!T:T,MATCH(ROW()-2,'POSTE (4)'!$W:$W,0)),IFERROR(INDEX('POSTE (5)'!T:T,MATCH(ROW()-2,'POSTE (5)'!$W:$W,0)),IFERROR(INDEX('POSTE (6)'!T:T,MATCH(ROW()-2,'POSTE (6)'!$W:$W,0)),IFERROR(INDEX('POSTE (7)'!T:T,MATCH(ROW()-2,'POSTE (7)'!$W:$W,0)),IFERROR(INDEX('POSTE (8)'!T:T,MATCH(ROW()-2,'POSTE (8)'!$W:$W,0)),IFERROR(INDEX('POSTE (9)'!T:T,MATCH(ROW()-2,'POSTE (9)'!$W:$W,0)),\"\")))))))))","v":6},{"$f":"IFERROR(INDEX('POSTE (1)'!U:U,MATCH(ROW()-2,'POSTE (1)'!$W:$W,0)),IFERROR(INDEX('POSTE (2)'!U:U,MATCH(ROW()-2,'POSTE (2)'!$W:$W,0)),IFERROR(INDEX('POSTE (3)'!U:U,MATCH(ROW()-2,'POSTE (3)'!$W:$W,0)),IFERROR(INDEX('POSTE (4)'!U:U,MATCH(ROW()-2,'POSTE (4)'!$W:$W,0)),IFERROR(INDEX('POSTE (5)'!U:U,MATCH(ROW()-2,'POSTE (5)'!$W:$W,0)),IFERROR(INDEX('POSTE (6)'!U:U,MATCH(ROW()-2,'POSTE (6)'!$W:$W,0)),IFERROR(INDEX('POSTE (7)'!U:U,MATCH(ROW()-2,'POSTE (7)'!$W:$W,0)),IFERROR(INDEX('POSTE (8)'!U:U,MATCH(ROW()-2,'POSTE (8)'!$W:$W,0)),IFERROR(INDEX('POSTE (9)'!U:U,MATCH(ROW()-2,'POSTE (9)'!$W:$W,0)),\"\")))))))))","v":"POSTE (6)"}]
[{"$f":"IFERROR(INDEX('POSTE (1)'!N:N,MATCH(ROW()-2,'POSTE (1)'!$W:$W,0)),IFERROR(INDEX('POSTE (2)'!N:N,MATCH(ROW()-2,'POSTE (2)'!$W:$W,0)),IFERROR(INDEX('POSTE (3)'!N:N,MATCH(ROW()-2,'POSTE (3)'!$W:$W,0)),IFERROR(INDEX('POSTE (4)'!N:N,MATCH(ROW()-2,'POSTE (4)'!$W:$W,0)),IFERROR(INDEX('POSTE (5)'!N:N,MATCH(ROW()-2,'POSTE (5)'!$W:$W,0)),IFERROR(INDEX('POSTE (6)'!N:N,MATCH(ROW()-2,'POSTE (6)'!$W:$W,0)),IFERROR(INDEX('POSTE (7)'!N:N,MATCH(ROW()-2,'POSTE (7)'!$W:$W,0)),IFERROR(INDEX('POSTE (8)'!N:N,MATCH(ROW()-2,'POSTE (8)'!$W:$W,0)),IFERROR(INDEX('POSTE (9)'!N:N,MATCH(ROW()-2,'POSTE (9)'!$W:$W,0)),\"\")))))))))","v":"(6)Fournisseur2"},{"$f":"IFERROR(INDEX('POSTE (1)'!O:O,MATCH(ROW()-2,'POSTE (1)'!$W:$W,0)),IFERROR(INDEX('POSTE (2)'!O:O,MATCH(ROW()-2,'POSTE (2)'!$W:$W,0)),IFERROR(INDEX('POSTE (3)'!O:O,MATCH(ROW()-2,'POSTE (3)'!$W:$W,0)),IFERROR(INDEX('POSTE (4)'!O:O,MATCH(ROW()-2,'POSTE (4)'!$W:$W,0)),IFERROR(INDEX('POSTE (5)'!O:O,MATCH(ROW()-2,'POSTE (5)'!$W:$W,0)),IFERROR(INDEX('POSTE (6)'!O:O,MATCH(ROW()-2,'POSTE (6)'!$W:$W,0)),IFERROR(INDEX('POSTE (7)'!O:O,MATCH(ROW()-2,'POSTE (7)'!$W:$W,0)),IFERROR(INDEX('POSTE (8)'!O:O,MATCH(ROW()-2,'POSTE (8)'!$W:$W,0)),IFERROR(INDEX('POSTE (9)'!O:O,MATCH(ROW()-2,'POSTE (9)'!$W:$W,0)),\"\")))))))))","v":"(6)Ref2"},{"$f":"IFERROR(INDEX('POSTE (1)'!P:P,MATCH(ROW()-2,'POSTE (1)'!$W:$W,0)),IFERROR(INDEX('POSTE (2)'!P:P,MATCH(ROW()-2,'POSTE (2)'!$W:$W,0)),IFERROR(INDEX('POSTE (3)'!P:P,MATCH(ROW()-2,'POSTE (3)'!$W:$W,0)),IFERROR(INDEX('POSTE (4)'!P:P,MATCH(ROW()-2,'POSTE (4)'!$W:$W,0)),IFERROR(INDEX('POSTE (5)'!P:P,MATCH(ROW()-2,'POSTE (5)'!$W:$W,0)),IFERROR(INDEX('POSTE (6)'!P:P,MATCH(ROW()-2,'POSTE (6)'!$W:$W,0)),IFERROR(INDEX('POSTE (7)'!P:P,MATCH(ROW()-2,'POSTE (7)'!$W:$W,0)),IFERROR(INDEX('POSTE (8)'!P:P,MATCH(ROW()-2,'POSTE (8)'!$W:$W,0)),IFERROR(INDEX('POSTE (9)'!P:P,MATCH(ROW()-2,'POSTE (9)'!$W:$W,0)),\"\")))))))))","v":"(6)DESIGNATION2"},{"$f":"IFERROR(INDEX('POSTE (1)'!Q:Q,MATCH(ROW()-2,'POSTE (1)'!$W:$W,0)),IFERROR(INDEX('POSTE (2)'!Q:Q,MATCH(ROW()-2,'POSTE (2)'!$W:$W,0)),IFERROR(INDEX('POSTE (3)'!Q:Q,MATCH(ROW()-2,'POSTE (3)'!$W:$W,0)),IFERROR(INDEX('POSTE (4)'!Q:Q,MATCH(ROW()-2,'POSTE (4)'!$W:$W,0)),IFERROR(INDEX('POSTE (5)'!Q:Q,MATCH(ROW()-2,'POSTE (5)'!$W:$W,0)),IFERROR(INDEX('POSTE (6)'!Q:Q,MATCH(ROW()-2,'POSTE (6)'!$W:$W,0)),IFERROR(INDEX('POSTE (7)'!Q:Q,MATCH(ROW()-2,'POSTE (7)'!$W:$W,0)),IFERROR(INDEX('POSTE (8)'!Q:Q,MATCH(ROW()-2,'POSTE (8)'!$W:$W,0)),IFERROR(INDEX('POSTE (9)'!Q:Q,MATCH(ROW()-2,'POSTE (9)'!$W:$W,0)),\"\")))))))))","v":"cm"},{"$f":"IFERROR(INDEX('POSTE (1)'!R:R,MATCH(ROW()-2,'POSTE (1)'!$W:$W,0)),IFERROR(INDEX('POSTE (2)'!R:R,MATCH(ROW()-2,'POSTE (2)'!$W:$W,0)),IFERROR(INDEX('POSTE (3)'!R:R,MATCH(ROW()-2,'POSTE (3)'!$W:$W,0)),IFERROR(INDEX('POSTE (4)'!R:R,MATCH(ROW()-2,'POSTE (4)'!$W:$W,0)),IFERROR(INDEX('POSTE (5)'!R:R,MATCH(ROW()-2,'POSTE (5)'!$W:$W,0)),IFERROR(INDEX('POSTE (6)'!R:R,MATCH(ROW()-2,'POSTE (6)'!$W:$W,0)),IFERROR(INDEX('POSTE (7)'!R:R,MATCH(ROW()-2,'POSTE (7)'!$W:$W,0)),IFERROR(INDEX('POSTE (8)'!R:R,MATCH(ROW()-2,'POSTE (8)'!$W:$W,0)),IFERROR(INDEX('POSTE (9)'!R:R,MATCH(ROW()-2,'POSTE (9)'!$W:$W,0)),\"\")))))))))","v":6},{"$f":"IFERROR(INDEX('POSTE (1)'!S:S,MATCH(ROW()-2,'POSTE (1)'!$W:$W,0)),IFERROR(INDEX('POSTE (2)'!S:S,MATCH(ROW()-2,'POSTE (2)'!$W:$W,0)),IFERROR(INDEX('POSTE (3)'!S:S,MATCH(ROW()-2,'POSTE (3)'!$W:$W,0)),IFERROR(INDEX('POSTE (4)'!S:S,MATCH(ROW()-2,'POSTE (4)'!$W:$W,0)),IFERROR(INDEX('POSTE (5)'!S:S,MATCH(ROW()-2,'POSTE (5)'!$W:$W,0)),IFERROR(INDEX('POSTE (6)'!S:S,MATCH(ROW()-2,'POSTE (6)'!$W:$W,0)),IFERROR(INDEX('POSTE (7)'!S:S,MATCH(ROW()-2,'POSTE (7)'!$W:$W,0)),IFERROR(INDEX('POSTE (8)'!S:S,MATCH(ROW()-2,'POSTE (8)'!$W:$W,0)),IFERROR(INDEX('POSTE (9)'!S:S,MATCH(ROW()-2,'POSTE (9)'!$W:$W,0)),\"\")))))))))","v":1},{"$f":"IFERROR(INDEX('POSTE (1)'!T:T,MATCH(ROW()-2,'POSTE (1)'!$W:$W,0)),IFERROR(INDEX('POSTE (2)'!T:T,MATCH(ROW()-2,'POSTE (2)'!$W:$W,0)),IFERROR(INDEX('POSTE (3)'!T:T,MATCH(ROW()-2,'POSTE (3)'!$W:$W,0)),IFERROR(INDEX('POSTE (4)'!T:T,MATCH(ROW()-2,'POSTE (4)'!$W:$W,0)),IFERROR(INDEX('POSTE (5)'!T:T,MATCH(ROW()-2,'POSTE (5)'!$W:$W,0)),IFERROR(INDEX('POSTE (6)'!T:T,MATCH(ROW()-2,'POSTE (6)'!$W:$W,0)),IFERROR(INDEX('POSTE (7)'!T:T,MATCH(ROW()-2,'POSTE (7)'!$W:$W,0)),IFERROR(INDEX('POSTE (8)'!T:T,MATCH(ROW()-2,'POSTE (8)'!$W:$W,0)),IFERROR(INDEX('POSTE (9)'!T:T,MATCH(ROW()-2,'POSTE (9)'!$W:$W,0)),\"\")))))))))","v":6},{"$f":"IFERROR(INDEX('POSTE (1)'!U:U,MATCH(ROW()-2,'POSTE (1)'!$W:$W,0)),IFERROR(INDEX('POSTE (2)'!U:U,MATCH(ROW()-2,'POSTE (2)'!$W:$W,0)),IFERROR(INDEX('POSTE (3)'!U:U,MATCH(ROW()-2,'POSTE (3)'!$W:$W,0)),IFERROR(INDEX('POSTE (4)'!U:U,MATCH(ROW()-2,'POSTE (4)'!$W:$W,0)),IFERROR(INDEX('POSTE (5)'!U:U,MATCH(ROW()-2,'POSTE (5)'!$W:$W,0)),IFERROR(INDEX('POSTE (6)'!U:U,MATCH(ROW()-2,'POSTE (6)'!$W:$W,0)),IFERROR(INDEX('POSTE (7)'!U:U,MATCH(ROW()-2,'POSTE (7)'!$W:$W,0)),IFERROR(INDEX('POSTE (8)'!U:U,MATCH(ROW()-2,'POSTE (8)'!$W:$W,0)),IFERROR(INDEX('POSTE (9)'!U:U,MATCH(ROW()-2,'POSTE (9)'!$W:$W,0)),\"\")))))))))","v":"POSTE (6)"}]
[{"$f":"IFERROR(INDEX('POSTE (1)'!N:N,MATCH(ROW()-2,'POSTE (1)'!$W:$W,0)),IFERROR(INDEX('POSTE (2)'!N:N,MATCH(ROW()-2,'POSTE (2)'!$W:$W,0)),IFERROR(INDEX('POSTE (3)'!N:N,MATCH(ROW()-2,'POSTE (3)'!$W:$W,0)),IFERROR(INDEX('POSTE (4)'!N:N,MATCH(ROW()-2,'POSTE (4)'!$W:$W,0)),IFERROR(INDEX('POSTE (5)'!N:N,MATCH(ROW()-2,'POSTE (5)'!$W:$W,0)),IFERROR(INDEX('POSTE (6)'!N:N,MATCH(ROW()-2,'POSTE (6)'!$W:$W,0)),IFERROR(INDEX('POSTE (7)'!N:N,MATCH(ROW()-2,'POSTE (7)'!$W:$W,0)),IFERROR(INDEX('POSTE (8)'!N:N,MATCH(ROW()-2,'POSTE (8)'!$W:$W,0)),IFERROR(INDEX('POSTE (9)'!N:N,MATCH(ROW()-2,'POSTE (9)'!$W:$W,0)),\"\")))))))))","v":"(6)Fournisseur3"},{"$f":"IFERROR(INDEX('POSTE (1)'!O:O,MATCH(ROW()-2,'POSTE (1)'!$W:$W,0)),IFERROR(INDEX('POSTE (2)'!O:O,MATCH(ROW()-2,'POSTE (2)'!$W:$W,0)),IFERROR(INDEX('POSTE (3)'!O:O,MATCH(ROW()-2,'POSTE (3)'!$W:$W,0)),IFERROR(INDEX('POSTE (4)'!O:O,MATCH(ROW()-2,'POSTE (4)'!$W:$W,0)),IFERROR(INDEX('POSTE (5)'!O:O,MATCH(ROW()-2,'POSTE (5)'!$W:$W,0)),IFERROR(INDEX('POSTE (6)'!O:O,MATCH(ROW()-2,'POSTE (6)'!$W:$W,0)),IFERROR(INDEX('POSTE (7)'!O:O,MATCH(ROW()-2,'POSTE (7)'!$W:$W,0)),IFERROR(INDEX('POSTE (8)'!O:O,MATCH(ROW()-2,'POSTE (8)'!$W:$W,0)),IFERROR(INDEX('POSTE (9)'!O:O,MATCH(ROW()-2,'POSTE (9)'!$W:$W,0)),\"\")))))))))","v":"(6)Ref3"},{"$f":"IFERROR(INDEX('POSTE (1)'!P:P,MATCH(ROW()-2,'POSTE (1)'!$W:$W,0)),IFERROR(INDEX('POSTE (2)'!P:P,MATCH(ROW()-2,'POSTE (2)'!$W:$W,0)),IFERROR(INDEX('POSTE (3)'!P:P,MATCH(ROW()-2,'POSTE (3)'!$W:$W,0)),IFERROR(INDEX('POSTE (4)'!P:P,MATCH(ROW()-2,'POSTE (4)'!$W:$W,0)),IFERROR(INDEX('POSTE (5)'!P:P,MATCH(ROW()-2,'POSTE (5)'!$W:$W,0)),IFERROR(INDEX('POSTE (6)'!P:P,MATCH(ROW()-2,'POSTE (6)'!$W:$W,0)),IFERROR(INDEX('POSTE (7)'!P:P,MATCH(ROW()-2,'POSTE (7)'!$W:$W,0)),IFERROR(INDEX('POSTE (8)'!P:P,MATCH(ROW()-2,'POSTE (8)'!$W:$W,0)),IFERROR(INDEX('POSTE (9)'!P:P,MATCH(ROW()-2,'POSTE (9)'!$W:$W,0)),\"\")))))))))","v":"(6)DESIGNATION3"},{"$f":"IFERROR(INDEX('POSTE (1)'!Q:Q,MATCH(ROW()-2,'POSTE (1)'!$W:$W,0)),IFERROR(INDEX('POSTE (2)'!Q:Q,MATCH(ROW()-2,'POSTE (2)'!$W:$W,0)),IFERROR(INDEX('POSTE (3)'!Q:Q,MATCH(ROW()-2,'POSTE (3)'!$W:$W,0)),IFERROR(INDEX('POSTE (4)'!Q:Q,MATCH(ROW()-2,'POSTE (4)'!$W:$W,0)),IFERROR(INDEX('POSTE (5)'!Q:Q,MATCH(ROW()-2,'POSTE (5)'!$W:$W,0)),IFERROR(INDEX('POSTE (6)'!Q:Q,MATCH(ROW()-2,'POSTE (6)'!$W:$W,0)),IFERROR(INDEX('POSTE (7)'!Q:Q,MATCH(ROW()-2,'POSTE (7)'!$W:$W,0)),IFERROR(INDEX('POSTE (8)'!Q:Q,MATCH(ROW()-2,'POSTE (8)'!$W:$W,0)),IFERROR(INDEX('POSTE (9)'!Q:Q,MATCH(ROW()-2,'POSTE (9)'!$W:$W,0)),\"\")))))))))","v":"cm"},{"$f":"IFERROR(INDEX('POSTE (1)'!R:R,MATCH(ROW()-2,'POSTE (1)'!$W:$W,0)),IFERROR(INDEX('POSTE (2)'!R:R,MATCH(ROW()-2,'POSTE (2)'!$W:$W,0)),IFERROR(INDEX('POSTE (3)'!R:R,MATCH(ROW()-2,'POSTE (3)'!$W:$W,0)),IFERROR(INDEX('POSTE (4)'!R:R,MATCH(ROW()-2,'POSTE (4)'!$W:$W,0)),IFERROR(INDEX('POSTE (5)'!R:R,MATCH(ROW()-2,'POSTE (5)'!$W:$W,0)),IFERROR(INDEX('POSTE (6)'!R:R,MATCH(ROW()-2,'POSTE (6)'!$W:$W,0)),IFERROR(INDEX('POSTE (7)'!R:R,MATCH(ROW()-2,'POSTE (7)'!$W:$W,0)),IFERROR(INDEX('POSTE (8)'!R:R,MATCH(ROW()-2,'POSTE (8)'!$W:$W,0)),IFERROR(INDEX('POSTE (9)'!R:R,MATCH(ROW()-2,'POSTE (9)'!$W:$W,0)),\"\")))))))))","v":6},{"$f":"IFERROR(INDEX('POSTE (1)'!S:S,MATCH(ROW()-2,'POSTE (1)'!$W:$W,0)),IFERROR(INDEX('POSTE (2)'!S:S,MATCH(ROW()-2,'POSTE (2)'!$W:$W,0)),IFERROR(INDEX('POSTE (3)'!S:S,MATCH(ROW()-2,'POSTE (3)'!$W:$W,0)),IFERROR(INDEX('POSTE (4)'!S:S,MATCH(ROW()-2,'POSTE (4)'!$W:$W,0)),IFERROR(INDEX('POSTE (5)'!S:S,MATCH(ROW()-2,'POSTE (5)'!$W:$W,0)),IFERROR(INDEX('POSTE (6)'!S:S,MATCH(ROW()-2,'POSTE (6)'!$W:$W,0)),IFERROR(INDEX('POSTE (7)'!S:S,MATCH(ROW()-2,'POSTE (7)'!$W:$W,0)),IFERROR(INDEX('POSTE (8)'!S:S,MATCH(ROW()-2,'POSTE (8)'!$W:$W,0)),IFERROR(INDEX('POSTE (9)'!S:S,MATCH(ROW()-2,'POSTE (9)'!$W:$W,0)),\"\")))))))))","v":1},{"$f":"IFERROR(INDEX('POSTE (1)'!T:T,MATCH(ROW()-2,'POSTE (1)'!$W:$W,0)),IFERROR(INDEX('POSTE (2)'!T:T,MATCH(ROW()-2,'POSTE (2)'!$W:$W,0)),IFERROR(INDEX('POSTE (3)'!T:T,MATCH(ROW()-2,'POSTE (3)'!$W:$W,0)),IFERROR(INDEX('POSTE (4)'!T:T,MATCH(ROW()-2,'POSTE (4)'!$W:$W,0)),IFERROR(INDEX('POSTE (5)'!T:T,MATCH(ROW()-2,'POSTE (5)'!$W:$W,0)),IFERROR(INDEX('POSTE (6)'!T:T,MATCH(ROW()-2,'POSTE (6)'!$W:$W,0)),IFERROR(INDEX('POSTE (7)'!T:T,MATCH(ROW()-2,'POSTE (7)'!$W:$W,0)),IFERROR(INDEX('POSTE (8)'!T:T,MATCH(ROW()-2,'POSTE (8)'!$W:$W,0)),IFERROR(INDEX('POSTE (9)'!T:T,MATCH(ROW()-2,'POSTE (9)'!$W:$W,0)),\"\")))))))))","v":6},{"$f":"IFERROR(INDEX('POSTE (1)'!U:U,MATCH(ROW()-2,'POSTE (1)'!$W:$W,0)),IFERROR(INDEX('POSTE (2)'!U:U,MATCH(ROW()-2,'POSTE (2)'!$W:$W,0)),IFERROR(INDEX('POSTE (3)'!U:U,MATCH(ROW()-2,'POSTE (3)'!$W:$W,0)),IFERROR(INDEX('POSTE (4)'!U:U,MATCH(ROW()-2,'POSTE (4)'!$W:$W,0)),IFERROR(INDEX('POSTE (5)'!U:U,MATCH(ROW()-2,'POSTE (5)'!$W:$W,0)),IFERROR(INDEX('POSTE (6)'!U:U,MATCH(ROW()-2,'POSTE (6)'!$W:$W,0)),IFERROR(INDEX('POSTE (7)'!U:U,MATCH(ROW()-2,'POSTE (7)'!$W:$W,0)),IFERROR(INDEX('POSTE (8)'!U:U,MATCH(ROW()-2,'POSTE (8)'!$W:$W,0)),IFERROR(INDEX('POSTE (9)'!U:U,MATCH(ROW()-2,'POSTE (9)'!$W:$W,0)),\"\")))))))))","v":"POSTE (6)"}]
[{"$f":"IFERROR(INDEX('POSTE (1)'!N:N,MATCH(ROW()-2,'POSTE (1)'!$W:$W,0)),IFERROR(INDEX('POSTE (2)'!N:N,MATCH(ROW()-2,'POSTE (2)'!$W:$W,0)),IFERROR(INDEX('POSTE (3)'!N:N,MATCH(ROW()-2,'POSTE (3)'!$W:$W,0)),IFERROR(INDEX('POSTE (4)'!N:N,MATCH(ROW()-2,'POSTE (4)'!$W:$W,0)),IFERROR(INDEX('POSTE (5)'!N:N,MATCH(ROW()-2,'POSTE (5)'!$W:$W,0)),IFERROR(INDEX('POSTE (6)'!N:N,MATCH(ROW()-2,'POSTE (6)'!$W:$W,0)),IFERROR(INDEX('POSTE (7)'!N:N,MATCH(ROW()-2,'POSTE (7)'!$W:$W,0)),IFERROR(INDEX('POSTE (8)'!N:N,MATCH(ROW()-2,'POSTE (8)'!$W:$W,0)),IFERROR(INDEX('POSTE (9)'!N:N,MATCH(ROW()-2,'POSTE (9)'!$W:$W,0)),\"\")))))))))","v":"(6)Fournisseur4"},{"$f":"IFERROR(INDEX('POSTE (1)'!O:O,MATCH(ROW()-2,'POSTE (1)'!$W:$W,0)),IFERROR(INDEX('POSTE (2)'!O:O,MATCH(ROW()-2,'POSTE (2)'!$W:$W,0)),IFERROR(INDEX('POSTE (3)'!O:O,MATCH(ROW()-2,'POSTE (3)'!$W:$W,0)),IFERROR(INDEX('POSTE (4)'!O:O,MATCH(ROW()-2,'POSTE (4)'!$W:$W,0)),IFERROR(INDEX('POSTE (5)'!O:O,MATCH(ROW()-2,'POSTE (5)'!$W:$W,0)),IFERROR(INDEX('POSTE (6)'!O:O,MATCH(ROW()-2,'POSTE (6)'!$W:$W,0)),IFERROR(INDEX('POSTE (7)'!O:O,MATCH(ROW()-2,'POSTE (7)'!$W:$W,0)),IFERROR(INDEX('POSTE (8)'!O:O,MATCH(ROW()-2,'POSTE (8)'!$W:$W,0)),IFERROR(INDEX('POSTE (9)'!O:O,MATCH(ROW()-2,'POSTE (9)'!$W:$W,0)),\"\")))))))))","v":"(6)Ref4"},{"$f":"IFERROR(INDEX('POSTE (1)'!P:P,MATCH(ROW()-2,'POSTE (1)'!$W:$W,0)),IFERROR(INDEX('POSTE (2)'!P:P,MATCH(ROW()-2,'POSTE (2)'!$W:$W,0)),IFERROR(INDEX('POSTE (3)'!P:P,MATCH(ROW()-2,'POSTE (3)'!$W:$W,0)),IFERROR(INDEX('POSTE (4)'!P:P,MATCH(ROW()-2,'POSTE (4)'!$W:$W,0)),IFERROR(INDEX('POSTE (5)'!P:P,MATCH(ROW()-2,'POSTE (5)'!$W:$W,0)),IFERROR(INDEX('POSTE (6)'!P:P,MATCH(ROW()-2,'POSTE (6)'!$W:$W,0)),IFERROR(INDEX('POSTE (7)'!P:P,MATCH(ROW()-2,'POSTE (7)'!$W:$W,0)),IFERROR(INDEX('POSTE (8)'!P:P,MATCH(ROW()-2,'POSTE (8)'!$W:$W,0)),IFERROR(INDEX('POSTE (9)'!P:P,MATCH(ROW()-2,'POSTE (9)'!$W:$W,0)),\"\")))))))))","v":"(6)DESIGNATION4"},{"$f":"IFERROR(INDEX('POSTE (1)'!Q:Q,MATCH(ROW()-2,'POSTE (1)'!$W:$W,0)),IFERROR(INDEX('POSTE (2)'!Q:Q,MATCH(ROW()-2,'POSTE (2)'!$W:$W,0)),IFERROR(INDEX('POSTE (3)'!Q:Q,MATCH(ROW()-2,'POSTE (3)'!$W:$W,0)),IFERROR(INDEX('POSTE (4)'!Q:Q,MATCH(ROW()-2,'POSTE (4)'!$W:$W,0)),IFERROR(INDEX('POSTE (5)'!Q:Q,MATCH(ROW()-2,'POSTE (5)'!$W:$W,0)),IFERROR(INDEX('POSTE (6)'!Q:Q,MATCH(ROW()-2,'POSTE (6)'!$W:$W,0)),IFERROR(INDEX('POSTE (7)'!Q:Q,MATCH(ROW()-2,'POSTE (7)'!$W:$W,0)),IFERROR(INDEX('POSTE (8)'!Q:Q,MATCH(ROW()-2,'POSTE (8)'!$W:$W,0)),IFERROR(INDEX('POSTE (9)'!Q:Q,MATCH(ROW()-2,'POSTE (9)'!$W:$W,0)),\"\")))))))))","v":"cm"},{"$f":"IFERROR(INDEX('POSTE (1)'!R:R,MATCH(ROW()-2,'POSTE (1)'!$W:$W,0)),IFERROR(INDEX('POSTE (2)'!R:R,MATCH(ROW()-2,'POSTE (2)'!$W:$W,0)),IFERROR(INDEX('POSTE (3)'!R:R,MATCH(ROW()-2,'POSTE (3)'!$W:$W,0)),IFERROR(INDEX('POSTE (4)'!R:R,MATCH(ROW()-2,'POSTE (4)'!$W:$W,0)),IFERROR(INDEX('POSTE (5)'!R:R,MATCH(ROW()-2,'POSTE (5)'!$W:$W,0)),IFERROR(INDEX('POSTE (6)'!R:R,MATCH(ROW()-2,'POSTE (6)'!$W:$W,0)),IFERROR(INDEX('POSTE (7)'!R:R,MATCH(ROW()-2,'POSTE (7)'!$W:$W,0)),IFERROR(INDEX('POSTE (8)'!R:R,MATCH(ROW()-2,'POSTE (8)'!$W:$W,0)),IFERROR(INDEX('POSTE (9)'!R:R,MATCH(ROW()-2,'POSTE (9)'!$W:$W,0)),\"\")))))))))","v":6},{"$f":"IFERROR(INDEX('POSTE (1)'!S:S,MATCH(ROW()-2,'POSTE (1)'!$W:$W,0)),IFERROR(INDEX('POSTE (2)'!S:S,MATCH(ROW()-2,'POSTE (2)'!$W:$W,0)),IFERROR(INDEX('POSTE (3)'!S:S,MATCH(ROW()-2,'POSTE (3)'!$W:$W,0)),IFERROR(INDEX('POSTE (4)'!S:S,MATCH(ROW()-2,'POSTE (4)'!$W:$W,0)),IFERROR(INDEX('POSTE (5)'!S:S,MATCH(ROW()-2,'POSTE (5)'!$W:$W,0)),IFERROR(INDEX('POSTE (6)'!S:S,MATCH(ROW()-2,'POSTE (6)'!$W:$W,0)),IFERROR(INDEX('POSTE (7)'!S:S,MATCH(ROW()-2,'POSTE (7)'!$W:$W,0)),IFERROR(INDEX('POSTE (8)'!S:S,MATCH(ROW()-2,'POSTE (8)'!$W:$W,0)),IFERROR(INDEX('POSTE (9)'!S:S,MATCH(ROW()-2,'POSTE (9)'!$W:$W,0)),\"\")))))))))","v":1},{"$f":"IFERROR(INDEX('POSTE (1)'!T:T,MATCH(ROW()-2,'POSTE (1)'!$W:$W,0)),IFERROR(INDEX('POSTE (2)'!T:T,MATCH(ROW()-2,'POSTE (2)'!$W:$W,0)),IFERROR(INDEX('POSTE (3)'!T:T,MATCH(ROW()-2,'POSTE (3)'!$W:$W,0)),IFERROR(INDEX('POSTE (4)'!T:T,MATCH(ROW()-2,'POSTE (4)'!$W:$W,0)),IFERROR(INDEX('POSTE (5)'!T:T,MATCH(ROW()-2,'POSTE (5)'!$W:$W,0)),IFERROR(INDEX('POSTE (6)'!T:T,MATCH(ROW()-2,'POSTE (6)'!$W:$W,0)),IFERROR(INDEX('POSTE (7)'!T:T,MATCH(ROW()-2,'POSTE (7)'!$W:$W,0)),IFERROR(INDEX('POSTE (8)'!T:T,MATCH(ROW()-2,'POSTE (8)'!$W:$W,0)),IFERROR(INDEX('POSTE (9)'!T:T,MATCH(ROW()-2,'POSTE (9)'!$W:$W,0)),\"\")))))))))","v":6},{"$f":"IFERROR(INDEX('POSTE (1)'!U:U,MATCH(ROW()-2,'POSTE (1)'!$W:$W,0)),IFERROR(INDEX('POSTE (2)'!U:U,MATCH(ROW()-2,'POSTE (2)'!$W:$W,0)),IFERROR(INDEX('POSTE (3)'!U:U,MATCH(ROW()-2,'POSTE (3)'!$W:$W,0)),IFERROR(INDEX('POSTE (4)'!U:U,MATCH(ROW()-2,'POSTE (4)'!$W:$W,0)),IFERROR(INDEX('POSTE (5)'!U:U,MATCH(ROW()-2,'POSTE (5)'!$W:$W,0)),IFERROR(INDEX('POSTE (6)'!U:U,MATCH(ROW()-2,'POSTE (6)'!$W:$W,0)),IFERROR(INDEX('POSTE (7)'!U:U,MATCH(ROW()-2,'POSTE (7)'!$W:$W,0)),IFERROR(INDEX('POSTE (8)'!U:U,MATCH(ROW()-2,'POSTE (8)'!$W:$W,0)),IFERROR(INDEX('POSTE (9)'!U:U,MATCH(ROW()-2,'POSTE (9)'!$W:$W,0)),\"\")))))))))","v":"POSTE (6)"}]
[{"$f":"IFERROR(INDEX('POSTE (1)'!N:N,MATCH(ROW()-2,'POSTE (1)'!$W:$W,0)),IFERROR(INDEX('POSTE (2)'!N:N,MATCH(ROW()-2,'POSTE (2)'!$W:$W,0)),IFERROR(INDEX('POSTE (3)'!N:N,MATCH(ROW()-2,'POSTE (3)'!$W:$W,0)),IFERROR(INDEX('POSTE (4)'!N:N,MATCH(ROW()-2,'POSTE (4)'!$W:$W,0)),IFERROR(INDEX('POSTE (5)'!N:N,MATCH(ROW()-2,'POSTE (5)'!$W:$W,0)),IFERROR(INDEX('POSTE (6)'!N:N,MATCH(ROW()-2,'POSTE (6)'!$W:$W,0)),IFERROR(INDEX('POSTE (7)'!N:N,MATCH(ROW()-2,'POSTE (7)'!$W:$W,0)),IFERROR(INDEX('POSTE (8)'!N:N,MATCH(ROW()-2,'POSTE (8)'!$W:$W,0)),IFERROR(INDEX('POSTE (9)'!N:N,MATCH(ROW()-2,'POSTE (9)'!$W:$W,0)),\"\")))))))))","v":"(6)Fournisseur5"},{"$f":"IFERROR(INDEX('POSTE (1)'!O:O,MATCH(ROW()-2,'POSTE (1)'!$W:$W,0)),IFERROR(INDEX('POSTE (2)'!O:O,MATCH(ROW()-2,'POSTE (2)'!$W:$W,0)),IFERROR(INDEX('POSTE (3)'!O:O,MATCH(ROW()-2,'POSTE (3)'!$W:$W,0)),IFERROR(INDEX('POSTE (4)'!O:O,MATCH(ROW()-2,'POSTE (4)'!$W:$W,0)),IFERROR(INDEX('POSTE (5)'!O:O,MATCH(ROW()-2,'POSTE (5)'!$W:$W,0)),IFERROR(INDEX('POSTE (6)'!O:O,MATCH(ROW()-2,'POSTE (6)'!$W:$W,0)),IFERROR(INDEX('POSTE (7)'!O:O,MATCH(ROW()-2,'POSTE (7)'!$W:$W,0)),IFERROR(INDEX('POSTE (8)'!O:O,MATCH(ROW()-2,'POSTE (8)'!$W:$W,0)),IFERROR(INDEX('POSTE (9)'!O:O,MATCH(ROW()-2,'POSTE (9)'!$W:$W,0)),\"\")))))))))","v":"(6)Ref5"},{"$f":"IFERROR(INDEX('POSTE (1)'!P:P,MATCH(ROW()-2,'POSTE (1)'!$W:$W,0)),IFERROR(INDEX('POSTE (2)'!P:P,MATCH(ROW()-2,'POSTE (2)'!$W:$W,0)),IFERROR(INDEX('POSTE (3)'!P:P,MATCH(ROW()-2,'POSTE (3)'!$W:$W,0)),IFERROR(INDEX('POSTE (4)'!P:P,MATCH(ROW()-2,'POSTE (4)'!$W:$W,0)),IFERROR(INDEX('POSTE (5)'!P:P,MATCH(ROW()-2,'POSTE (5)'!$W:$W,0)),IFERROR(INDEX('POSTE (6)'!P:P,MATCH(ROW()-2,'POSTE (6)'!$W:$W,0)),IFERROR(INDEX('POSTE (7)'!P:P,MATCH(ROW()-2,'POSTE (7)'!$W:$W,0)),IFERROR(INDEX('POSTE (8)'!P:P,MATCH(ROW()-2,'POSTE (8)'!$W:$W,0)),IFERROR(INDEX('POSTE (9)'!P:P,MATCH(ROW()-2,'POSTE (9)'!$W:$W,0)),\"\")))))))))","v":"(6)DESIGNATION5"},{"$f":"IFERROR(INDEX('POSTE (1)'!Q:Q,MATCH(ROW()-2,'POSTE (1)'!$W:$W,0)),IFERROR(INDEX('POSTE (2)'!Q:Q,MATCH(ROW()-2,'POSTE (2)'!$W:$W,0)),IFERROR(INDEX('POSTE (3)'!Q:Q,MATCH(ROW()-2,'POSTE (3)'!$W:$W,0)),IFERROR(INDEX('POSTE (4)'!Q:Q,MATCH(ROW()-2,'POSTE (4)'!$W:$W,0)),IFERROR(INDEX('POSTE (5)'!Q:Q,MATCH(ROW()-2,'POSTE (5)'!$W:$W,0)),IFERROR(INDEX('POSTE (6)'!Q:Q,MATCH(ROW()-2,'POSTE (6)'!$W:$W,0)),IFERROR(INDEX('POSTE (7)'!Q:Q,MATCH(ROW()-2,'POSTE (7)'!$W:$W,0)),IFERROR(INDEX('POSTE (8)'!Q:Q,MATCH(ROW()-2,'POSTE (8)'!$W:$W,0)),IFERROR(INDEX('POSTE (9)'!Q:Q,MATCH(ROW()-2,'POSTE (9)'!$W:$W,0)),\"\")))))))))","v":"cm"},{"$f":"IFERROR(INDEX('POSTE (1)'!R:R,MATCH(ROW()-2,'POSTE (1)'!$W:$W,0)),IFERROR(INDEX('POSTE (2)'!R:R,MATCH(ROW()-2,'POSTE (2)'!$W:$W,0)),IFERROR(INDEX('POSTE (3)'!R:R,MATCH(ROW()-2,'POSTE (3)'!$W:$W,0)),IFERROR(INDEX('POSTE (4)'!R:R,MATCH(ROW()-2,'POSTE (4)'!$W:$W,0)),IFERROR(INDEX('POSTE (5)'!R:R,MATCH(ROW()-2,'POSTE (5)'!$W:$W,0)),IFERROR(INDEX('POSTE (6)'!R:R,MATCH(ROW()-2,'POSTE (6)'!$W:$W,0)),IFERROR(INDEX('POSTE (7)'!R:R,MATCH(ROW()-2,'POSTE (7)'!$W:$W,0)),IFERROR(INDEX('POSTE (8)'!R:R,MATCH(ROW()-2,'POSTE (8)'!$W:$W,0)),IFERROR(INDEX('POSTE (9)'!R:R,MATCH(ROW()-2,'POSTE (9)'!$W:$W,0)),\"\")))))))))","v":6},{"$f":"IFERROR(INDEX('POSTE (1)'!S:S,MATCH(ROW()-2,'POSTE (1)'!$W:$W,0)),IFERROR(INDEX('POSTE (2)'!S:S,MATCH(ROW()-2,'POSTE (2)'!$W:$W,0)),IFERROR(INDEX('POSTE (3)'!S:S,MATCH(ROW()-2,'POSTE (3)'!$W:$W,0)),IFERROR(INDEX('POSTE (4)'!S:S,MATCH(ROW()-2,'POSTE (4)'!$W:$W,0)),IFERROR(INDEX('POSTE (5)'!S:S,MATCH(ROW()-2,'POSTE (5)'!$W:$W,0)),IFERROR(INDEX('POSTE (6)'!S:S,MATCH(ROW()-2,'POSTE (6)'!$W:$W,0)),IFERROR(INDEX('POSTE (7)'!S:S,MATCH(ROW()-2,'POSTE (7)'!$W:$W,0)),IFERROR(INDEX('POSTE (8)'!S:S,MATCH(ROW()-2,'POSTE (8)'!$W:$W,0)),IFERROR(INDEX('POSTE (9)'!S:S,MATCH(ROW()-2,'POSTE (9)'!$W:$W,0)),\"\")))))))))","v":1},{"$f":"IFERROR(INDEX('POSTE (1)'!T:T,MATCH(ROW()-2,'POSTE (1)'!$W:$W,0)),IFERROR(INDEX('POSTE (2)'!T:T,MATCH(ROW()-2,'POSTE (2)'!$W:$W,0)),IFERROR(INDEX('POSTE (3)'!T:T,MATCH(ROW()-2,'POSTE (3)'!$W:$W,0)),IFERROR(INDEX('POSTE (4)'!T:T,MATCH(ROW()-2,'POSTE (4)'!$W:$W,0)),IFERROR(INDEX('POSTE (5)'!T:T,MATCH(ROW()-2,'POSTE (5)'!$W:$W,0)),IFERROR(INDEX('POSTE (6)'!T:T,MATCH(ROW()-2,'POSTE (6)'!$W:$W,0)),IFERROR(INDEX('POSTE (7)'!T:T,MATCH(ROW()-2,'POSTE (7)'!$W:$W,0)),IFERROR(INDEX('POSTE (8)'!T:T,MATCH(ROW()-2,'POSTE (8)'!$W:$W,0)),IFERROR(INDEX('POSTE (9)'!T:T,MATCH(ROW()-2,'POSTE (9)'!$W:$W,0)),\"\")))))))))","v":6},{"$f":"IFERROR(INDEX('POSTE (1)'!U:U,MATCH(ROW()-2,'POSTE (1)'!$W:$W,0)),IFERROR(INDEX('POSTE (2)'!U:U,MATCH(ROW()-2,'POSTE (2)'!$W:$W,0)),IFERROR(INDEX('POSTE (3)'!U:U,MATCH(ROW()-2,'POSTE (3)'!$W:$W,0)),IFERROR(INDEX('POSTE (4)'!U:U,MATCH(ROW()-2,'POSTE (4)'!$W:$W,0)),IFERROR(INDEX('POSTE (5)'!U:U,MATCH(ROW()-2,'POSTE (5)'!$W:$W,0)),IFERROR(INDEX('POSTE (6)'!U:U,MATCH(ROW()-2,'POSTE (6)'!$W:$W,0)),IFERROR(INDEX('POSTE (7)'!U:U,MATCH(ROW()-2,'POSTE (7)'!$W:$W,0)),IFERROR(INDEX('POSTE (8)'!U:U,MATCH(ROW()-2,'POSTE (8)'!$W:$W,0)),IFERROR(INDEX('POSTE (9)'!U:U,MATCH(ROW()-2,'POSTE (9)'!$W:$W,0)),\"\")))))))))","v":"POSTE (6)"}]
[{"$f":"IFERROR(INDEX('POSTE (1)'!N:N,MATCH(ROW()-2,'POSTE (1)'!$W:$W,0)),IFERROR(INDEX('POSTE (2)'!N:N,MATCH(ROW()-2,'POSTE (2)'!$W:$W,0)),IFERROR(INDEX('POSTE (3)'!N:N,MATCH(ROW()-2,'POSTE (3)'!$W:$W,0)),IFERROR(INDEX('POSTE (4)'!N:N,MATCH(ROW()-2,'POSTE (4)'!$W:$W,0)),IFERROR(INDEX('POSTE (5)'!N:N,MATCH(ROW()-2,'POSTE (5)'!$W:$W,0)),IFERROR(INDEX('POSTE (6)'!N:N,MATCH(ROW()-2,'POSTE (6)'!$W:$W,0)),IFERROR(INDEX('POSTE (7)'!N:N,MATCH(ROW()-2,'POSTE (7)'!$W:$W,0)),IFERROR(INDEX('POSTE (8)'!N:N,MATCH(ROW()-2,'POSTE (8)'!$W:$W,0)),IFERROR(INDEX('POSTE (9)'!N:N,MATCH(ROW()-2,'POSTE (9)'!$W:$W,0)),\"\")))))))))","v":"(6)Fournisseur6"},{"$f":"IFERROR(INDEX('POSTE (1)'!O:O,MATCH(ROW()-2,'POSTE (1)'!$W:$W,0)),IFERROR(INDEX('POSTE (2)'!O:O,MATCH(ROW()-2,'POSTE (2)'!$W:$W,0)),IFERROR(INDEX('POSTE (3)'!O:O,MATCH(ROW()-2,'POSTE (3)'!$W:$W,0)),IFERROR(INDEX('POSTE (4)'!O:O,MATCH(ROW()-2,'POSTE (4)'!$W:$W,0)),IFERROR(INDEX('POSTE (5)'!O:O,MATCH(ROW()-2,'POSTE (5)'!$W:$W,0)),IFERROR(INDEX('POSTE (6)'!O:O,MATCH(ROW()-2,'POSTE (6)'!$W:$W,0)),IFERROR(INDEX('POSTE (7)'!O:O,MATCH(ROW()-2,'POSTE (7)'!$W:$W,0)),IFERROR(INDEX('POSTE (8)'!O:O,MATCH(ROW()-2,'POSTE (8)'!$W:$W,0)),IFERROR(INDEX('POSTE (9)'!O:O,MATCH(ROW()-2,'POSTE (9)'!$W:$W,0)),\"\")))))))))","v":"(6)Ref6"},{"$f":"IFERROR(INDEX('POSTE (1)'!P:P,MATCH(ROW()-2,'POSTE (1)'!$W:$W,0)),IFERROR(INDEX('POSTE (2)'!P:P,MATCH(ROW()-2,'POSTE (2)'!$W:$W,0)),IFERROR(INDEX('POSTE (3)'!P:P,MATCH(ROW()-2,'POSTE (3)'!$W:$W,0)),IFERROR(INDEX('POSTE (4)'!P:P,MATCH(ROW()-2,'POSTE (4)'!$W:$W,0)),IFERROR(INDEX('POSTE (5)'!P:P,MATCH(ROW()-2,'POSTE (5)'!$W:$W,0)),IFERROR(INDEX('POSTE (6)'!P:P,MATCH(ROW()-2,'POSTE (6)'!$W:$W,0)),IFERROR(INDEX('POSTE (7)'!P:P,MATCH(ROW()-2,'POSTE (7)'!$W:$W,0)),IFERROR(INDEX('POSTE (8)'!P:P,MATCH(ROW()-2,'POSTE (8)'!$W:$W,0)),IFERROR(INDEX('POSTE (9)'!P:P,MATCH(ROW()-2,'POSTE (9)'!$W:$W,0)),\"\")))))))))","v":"(6)DESIGNATION6"},{"$f":"IFERROR(INDEX('POSTE (1)'!Q:Q,MATCH(ROW()-2,'POSTE (1)'!$W:$W,0)),IFERROR(INDEX('POSTE (2)'!Q:Q,MATCH(ROW()-2,'POSTE (2)'!$W:$W,0)),IFERROR(INDEX('POSTE (3)'!Q:Q,MATCH(ROW()-2,'POSTE (3)'!$W:$W,0)),IFERROR(INDEX('POSTE (4)'!Q:Q,MATCH(ROW()-2,'POSTE (4)'!$W:$W,0)),IFERROR(INDEX('POSTE (5)'!Q:Q,MATCH(ROW()-2,'POSTE (5)'!$W:$W,0)),IFERROR(INDEX('POSTE (6)'!Q:Q,MATCH(ROW()-2,'POSTE (6)'!$W:$W,0)),IFERROR(INDEX('POSTE (7)'!Q:Q,MATCH(ROW()-2,'POSTE (7)'!$W:$W,0)),IFERROR(INDEX('POSTE (8)'!Q:Q,MATCH(ROW()-2,'POSTE (8)'!$W:$W,0)),IFERROR(INDEX('POSTE (9)'!Q:Q,MATCH(ROW()-2,'POSTE (9)'!$W:$W,0)),\"\")))))))))","v":"cm"},{"$f":"IFERROR(INDEX('POSTE (1)'!R:R,MATCH(ROW()-2,'POSTE (1)'!$W:$W,0)),IFERROR(INDEX('POSTE (2)'!R:R,MATCH(ROW()-2,'POSTE (2)'!$W:$W,0)),IFERROR(INDEX('POSTE (3)'!R:R,MATCH(ROW()-2,'POSTE (3)'!$W:$W,0)),IFERROR(INDEX('POSTE (4)'!R:R,MATCH(ROW()-2,'POSTE (4)'!$W:$W,0)),IFERROR(INDEX('POSTE (5)'!R:R,MATCH(ROW()-2,'POSTE (5)'!$W:$W,0)),IFERROR(INDEX('POSTE (6)'!R:R,MATCH(ROW()-2,'POSTE (6)'!$W:$W,0)),IFERROR(INDEX('POSTE (7)'!R:R,MATCH(ROW()-2,'POSTE (7)'!$W:$W,0)),IFERROR(INDEX('POSTE (8)'!R:R,MATCH(ROW()-2,'POSTE (8)'!$W:$W,0)),IFERROR(INDEX('POSTE (9)'!R:R,MATCH(ROW()-2,'POSTE (9)'!$W:$W,0)),\"\")))))))))","v":6},{"$f":"IFERROR(INDEX('POSTE (1)'!S:S,MATCH(ROW()-2,'POSTE (1)'!$W:$W,0)),IFERROR(INDEX('POSTE (2)'!S:S,MATCH(ROW()-2,'POSTE (2)'!$W:$W,0)),IFERROR(INDEX('POSTE (3)'!S:S,MATCH(ROW()-2,'POSTE (3)'!$W:$W,0)),IFERROR(INDEX('POSTE (4)'!S:S,MATCH(ROW()-2,'POSTE (4)'!$W:$W,0)),IFERROR(INDEX('POSTE (5)'!S:S,MATCH(ROW()-2,'POSTE (5)'!$W:$W,0)),IFERROR(INDEX('POSTE (6)'!S:S,MATCH(ROW()-2,'POSTE (6)'!$W:$W,0)),IFERROR(INDEX('POSTE (7)'!S:S,MATCH(ROW()-2,'POSTE (7)'!$W:$W,0)),IFERROR(INDEX('POSTE (8)'!S:S,MATCH(ROW()-2,'POSTE (8)'!$W:$W,0)),IFERROR(INDEX('POSTE (9)'!S:S,MATCH(ROW()-2,'POSTE (9)'!$W:$W,0)),\"\")))))))))","v":1},{"$f":"IFERROR(INDEX('POSTE (1)'!T:T,MATCH(ROW()-2,'POSTE (1)'!$W:$W,0)),IFERROR(INDEX('POSTE (2)'!T:T,MATCH(ROW()-2,'POSTE (2)'!$W:$W,0)),IFERROR(INDEX('POSTE (3)'!T:T,MATCH(ROW()-2,'POSTE (3)'!$W:$W,0)),IFERROR(INDEX('POSTE (4)'!T:T,MATCH(ROW()-2,'POSTE (4)'!$W:$W,0)),IFERROR(INDEX('POSTE (5)'!T:T,MATCH(ROW()-2,'POSTE (5)'!$W:$W,0)),IFERROR(INDEX('POSTE (6)'!T:T,MATCH(ROW()-2,'POSTE (6)'!$W:$W,0)),IFERROR(INDEX('POSTE (7)'!T:T,MATCH(ROW()-2,'POSTE (7)'!$W:$W,0)),IFERROR(INDEX('POSTE (8)'!T:T,MATCH(ROW()-2,'POSTE (8)'!$W:$W,0)),IFERROR(INDEX('POSTE (9)'!T:T,MATCH(ROW()-2,'POSTE (9)'!$W:$W,0)),\"\")))))))))","v":6},{"$f":"IFERROR(INDEX('POSTE (1)'!U:U,MATCH(ROW()-2,'POSTE (1)'!$W:$W,0)),IFERROR(INDEX('POSTE (2)'!U:U,MATCH(ROW()-2,'POSTE (2)'!$W:$W,0)),IFERROR(INDEX('POSTE (3)'!U:U,MATCH(ROW()-2,'POSTE (3)'!$W:$W,0)),IFERROR(INDEX('POSTE (4)'!U:U,MATCH(ROW()-2,'POSTE (4)'!$W:$W,0)),IFERROR(INDEX('POSTE (5)'!U:U,MATCH(ROW()-2,'POSTE (5)'!$W:$W,0)),IFERROR(INDEX('POSTE (6)'!U:U,MATCH(ROW()-2,'POSTE (6)'!$W:$W,0)),IFERROR(INDEX('POSTE (7)'!U:U,MATCH(ROW()-2,'POSTE (7)'!$W:$W,0)),IFERROR(INDEX('POSTE (8)'!U:U,MATCH(ROW()-2,'POSTE (8)'!$W:$W,0)),IFERROR(INDEX('POSTE (9)'!U:U,MATCH(ROW()-2,'POSTE (9)'!$W:$W,0)),\"\")))))))))","v":"POSTE (6)"}]
[{"$f":"IFERROR(INDEX('POSTE (1)'!N:N,MATCH(ROW()-2,'POSTE (1)'!$W:$W,0)),IFERROR(INDEX('POSTE (2)'!N:N,MATCH(ROW()-2,'POSTE (2)'!$W:$W,0)),IFERROR(INDEX('POSTE (3)'!N:N,MATCH(ROW()-2,'POSTE (3)'!$W:$W,0)),IFERROR(INDEX('POSTE (4)'!N:N,MATCH(ROW()-2,'POSTE (4)'!$W:$W,0)),IFERROR(INDEX('POSTE (5)'!N:N,MATCH(ROW()-2,'POSTE (5)'!$W:$W,0)),IFERROR(INDEX('POSTE (6)'!N:N,MATCH(ROW()-2,'POSTE (6)'!$W:$W,0)),IFERROR(INDEX('POSTE (7)'!N:N,MATCH(ROW()-2,'POSTE (7)'!$W:$W,0)),IFERROR(INDEX('POSTE (8)'!N:N,MATCH(ROW()-2,'POSTE (8)'!$W:$W,0)),IFERROR(INDEX('POSTE (9)'!N:N,MATCH(ROW()-2,'POSTE (9)'!$W:$W,0)),\"\")))))))))","v":"(7)Fournisseur"},{"$f":"IFERROR(INDEX('POSTE (1)'!O:O,MATCH(ROW()-2,'POSTE (1)'!$W:$W,0)),IFERROR(INDEX('POSTE (2)'!O:O,MATCH(ROW()-2,'POSTE (2)'!$W:$W,0)),IFERROR(INDEX('POSTE (3)'!O:O,MATCH(ROW()-2,'POSTE (3)'!$W:$W,0)),IFERROR(INDEX('POSTE (4)'!O:O,MATCH(ROW()-2,'POSTE (4)'!$W:$W,0)),IFERROR(INDEX('POSTE (5)'!O:O,MATCH(ROW()-2,'POSTE (5)'!$W:$W,0)),IFERROR(INDEX('POSTE (6)'!O:O,MATCH(ROW()-2,'POSTE (6)'!$W:$W,0)),IFERROR(INDEX('POSTE (7)'!O:O,MATCH(ROW()-2,'POSTE (7)'!$W:$W,0)),IFERROR(INDEX('POSTE (8)'!O:O,MATCH(ROW()-2,'POSTE (8)'!$W:$W,0)),IFERROR(INDEX('POSTE (9)'!O:O,MATCH(ROW()-2,'POSTE (9)'!$W:$W,0)),\"\")))))))))","v":"(7)Ref"},{"$f":"IFERROR(INDEX('POSTE (1)'!P:P,MATCH(ROW()-2,'POSTE (1)'!$W:$W,0)),IFERROR(INDEX('POSTE (2)'!P:P,MATCH(ROW()-2,'POSTE (2)'!$W:$W,0)),IFERROR(INDEX('POSTE (3)'!P:P,MATCH(ROW()-2,'POSTE (3)'!$W:$W,0)),IFERROR(INDEX('POSTE (4)'!P:P,MATCH(ROW()-2,'POSTE (4)'!$W:$W,0)),IFERROR(INDEX('POSTE (5)'!P:P,MATCH(ROW()-2,'POSTE (5)'!$W:$W,0)),IFERROR(INDEX('POSTE (6)'!P:P,MATCH(ROW()-2,'POSTE (6)'!$W:$W,0)),IFERROR(INDEX('POSTE (7)'!P:P,MATCH(ROW()-2,'POSTE (7)'!$W:$W,0)),IFERROR(INDEX('POSTE (8)'!P:P,MATCH(ROW()-2,'POSTE (8)'!$W:$W,0)),IFERROR(INDEX('POSTE (9)'!P:P,MATCH(ROW()-2,'POSTE (9)'!$W:$W,0)),\"\")))))))))","v":"(7)DESIGNATION"},{"$f":"IFERROR(INDEX('POSTE (1)'!Q:Q,MATCH(ROW()-2,'POSTE (1)'!$W:$W,0)),IFERROR(INDEX('POSTE (2)'!Q:Q,MATCH(ROW()-2,'POSTE (2)'!$W:$W,0)),IFERROR(INDEX('POSTE (3)'!Q:Q,MATCH(ROW()-2,'POSTE (3)'!$W:$W,0)),IFERROR(INDEX('POSTE (4)'!Q:Q,MATCH(ROW()-2,'POSTE (4)'!$W:$W,0)),IFERROR(INDEX('POSTE (5)'!Q:Q,MATCH(ROW()-2,'POSTE (5)'!$W:$W,0)),IFERROR(INDEX('POSTE (6)'!Q:Q,MATCH(ROW()-2,'POSTE (6)'!$W:$W,0)),IFERROR(INDEX('POSTE (7)'!Q:Q,MATCH(ROW()-2,'POSTE (7)'!$W:$W,0)),IFERROR(INDEX('POSTE (8)'!Q:Q,MATCH(ROW()-2,'POSTE (8)'!$W:$W,0)),IFERROR(INDEX('POSTE (9)'!Q:Q,MATCH(ROW()-2,'POSTE (9)'!$W:$W,0)),\"\")))))))))","v":"km"},{"$f":"IFERROR(INDEX('POSTE (1)'!R:R,MATCH(ROW()-2,'POSTE (1)'!$W:$W,0)),IFERROR(INDEX('POSTE (2)'!R:R,MATCH(ROW()-2,'POSTE (2)'!$W:$W,0)),IFERROR(INDEX('POSTE (3)'!R:R,MATCH(ROW()-2,'POSTE (3)'!$W:$W,0)),IFERROR(INDEX('POSTE (4)'!R:R,MATCH(ROW()-2,'POSTE (4)'!$W:$W,0)),IFERROR(INDEX('POSTE (5)'!R:R,MATCH(ROW()-2,'POSTE (5)'!$W:$W,0)),IFERROR(INDEX('POSTE (6)'!R:R,MATCH(ROW()-2,'POSTE (6)'!$W:$W,0)),IFERROR(INDEX('POSTE (7)'!R:R,MATCH(ROW()-2,'POSTE (7)'!$W:$W,0)),IFERROR(INDEX('POSTE (8)'!R:R,MATCH(ROW()-2,'POSTE (8)'!$W:$W,0)),IFERROR(INDEX('POSTE (9)'!R:R,MATCH(ROW()-2,'POSTE (9)'!$W:$W,0)),\"\")))))))))","v":7},{"$f":"IFERROR(INDEX('POSTE (1)'!S:S,MATCH(ROW()-2,'POSTE (1)'!$W:$W,0)),IFERROR(INDEX('POSTE (2)'!S:S,MATCH(ROW()-2,'POSTE (2)'!$W:$W,0)),IFERROR(INDEX('POSTE (3)'!S:S,MATCH(ROW()-2,'POSTE (3)'!$W:$W,0)),IFERROR(INDEX('POSTE (4)'!S:S,MATCH(ROW()-2,'POSTE (4)'!$W:$W,0)),IFERROR(INDEX('POSTE (5)'!S:S,MATCH(ROW()-2,'POSTE (5)'!$W:$W,0)),IFERROR(INDEX('POSTE (6)'!S:S,MATCH(ROW()-2,'POSTE (6)'!$W:$W,0)),IFERROR(INDEX('POSTE (7)'!S:S,MATCH(ROW()-2,'POSTE (7)'!$W:$W,0)),IFERROR(INDEX('POSTE (8)'!S:S,MATCH(ROW()-2,'POSTE (8)'!$W:$W,0)),IFERROR(INDEX('POSTE (9)'!S:S,MATCH(ROW()-2,'POSTE (9)'!$W:$W,0)),\"\")))))))))","v":1},{"$f":"IFERROR(INDEX('POSTE (1)'!T:T,MATCH(ROW()-2,'POSTE (1)'!$W:$W,0)),IFERROR(INDEX('POSTE (2)'!T:T,MATCH(ROW()-2,'POSTE (2)'!$W:$W,0)),IFERROR(INDEX('POSTE (3)'!T:T,MATCH(ROW()-2,'POSTE (3)'!$W:$W,0)),IFERROR(INDEX('POSTE (4)'!T:T,MATCH(ROW()-2,'POSTE (4)'!$W:$W,0)),IFERROR(INDEX('POSTE (5)'!T:T,MATCH(ROW()-2,'POSTE (5)'!$W:$W,0)),IFERROR(INDEX('POSTE (6)'!T:T,MATCH(ROW()-2,'POSTE (6)'!$W:$W,0)),IFERROR(INDEX('POSTE (7)'!T:T,MATCH(ROW()-2,'POSTE (7)'!$W:$W,0)),IFERROR(INDEX('POSTE (8)'!T:T,MATCH(ROW()-2,'POSTE (8)'!$W:$W,0)),IFERROR(INDEX('POSTE (9)'!T:T,MATCH(ROW()-2,'POSTE (9)'!$W:$W,0)),\"\")))))))))","v":7},{"$f":"IFERROR(INDEX('POSTE (1)'!U:U,MATCH(ROW()-2,'POSTE (1)'!$W:$W,0)),IFERROR(INDEX('POSTE (2)'!U:U,MATCH(ROW()-2,'POSTE (2)'!$W:$W,0)),IFERROR(INDEX('POSTE (3)'!U:U,MATCH(ROW()-2,'POSTE (3)'!$W:$W,0)),IFERROR(INDEX('POSTE (4)'!U:U,MATCH(ROW()-2,'POSTE (4)'!$W:$W,0)),IFERROR(INDEX('POSTE (5)'!U:U,MATCH(ROW()-2,'POSTE (5)'!$W:$W,0)),IFERROR(INDEX('POSTE (6)'!U:U,MATCH(ROW()-2,'POSTE (6)'!$W:$W,0)),IFERROR(INDEX('POSTE (7)'!U:U,MATCH(ROW()-2,'POSTE (7)'!$W:$W,0)),IFERROR(INDEX('POSTE (8)'!U:U,MATCH(ROW()-2,'POSTE (8)'!$W:$W,0)),IFERROR(INDEX('POSTE (9)'!U:U,MATCH(ROW()-2,'POSTE (9)'!$W:$W,0)),\"\")))))))))","v":"POSTE (7)"}]
[{"$f":"IFERROR(INDEX('POSTE (1)'!N:N,MATCH(ROW()-2,'POSTE (1)'!$W:$W,0)),IFERROR(INDEX('POSTE (2)'!N:N,MATCH(ROW()-2,'POSTE (2)'!$W:$W,0)),IFERROR(INDEX('POSTE (3)'!N:N,MATCH(ROW()-2,'POSTE (3)'!$W:$W,0)),IFERROR(INDEX('POSTE (4)'!N:N,MATCH(ROW()-2,'POSTE (4)'!$W:$W,0)),IFERROR(INDEX('POSTE (5)'!N:N,MATCH(ROW()-2,'POSTE (5)'!$W:$W,0)),IFERROR(INDEX('POSTE (6)'!N:N,MATCH(ROW()-2,'POSTE (6)'!$W:$W,0)),IFERROR(INDEX('POSTE (7)'!N:N,MATCH(ROW()-2,'POSTE (7)'!$W:$W,0)),IFERROR(INDEX('POSTE (8)'!N:N,MATCH(ROW()-2,'POSTE (8)'!$W:$W,0)),IFERROR(INDEX('POSTE (9)'!N:N,MATCH(ROW()-2,'POSTE (9)'!$W:$W,0)),\"\")))))))))","v":"(7)Fournisseur2"},{"$f":"IFERROR(INDEX('POSTE (1)'!O:O,MATCH(ROW()-2,'POSTE (1)'!$W:$W,0)),IFERROR(INDEX('POSTE (2)'!O:O,MATCH(ROW()-2,'POSTE (2)'!$W:$W,0)),IFERROR(INDEX('POSTE (3)'!O:O,MATCH(ROW()-2,'POSTE (3)'!$W:$W,0)),IFERROR(INDEX('POSTE (4)'!O:O,MATCH(ROW()-2,'POSTE (4)'!$W:$W,0)),IFERROR(INDEX('POSTE (5)'!O:O,MATCH(ROW()-2,'POSTE (5)'!$W:$W,0)),IFERROR(INDEX('POSTE (6)'!O:O,MATCH(ROW()-2,'POSTE (6)'!$W:$W,0)),IFERROR(INDEX('POSTE (7)'!O:O,MATCH(ROW()-2,'POSTE (7)'!$W:$W,0)),IFERROR(INDEX('POSTE (8)'!O:O,MATCH(ROW()-2,'POSTE (8)'!$W:$W,0)),IFERROR(INDEX('POSTE (9)'!O:O,MATCH(ROW()-2,'POSTE (9)'!$W:$W,0)),\"\")))))))))","v":"(7)Ref2"},{"$f":"IFERROR(INDEX('POSTE (1)'!P:P,MATCH(ROW()-2,'POSTE (1)'!$W:$W,0)),IFERROR(INDEX('POSTE (2)'!P:P,MATCH(ROW()-2,'POSTE (2)'!$W:$W,0)),IFERROR(INDEX('POSTE (3)'!P:P,MATCH(ROW()-2,'POSTE (3)'!$W:$W,0)),IFERROR(INDEX('POSTE (4)'!P:P,MATCH(ROW()-2,'POSTE (4)'!$W:$W,0)),IFERROR(INDEX('POSTE (5)'!P:P,MATCH(ROW()-2,'POSTE (5)'!$W:$W,0)),IFERROR(INDEX('POSTE (6)'!P:P,MATCH(ROW()-2,'POSTE (6)'!$W:$W,0)),IFERROR(INDEX('POSTE (7)'!P:P,MATCH(ROW()-2,'POSTE (7)'!$W:$W,0)),IFERROR(INDEX('POSTE (8)'!P:P,MATCH(ROW()-2,'POSTE (8)'!$W:$W,0)),IFERROR(INDEX('POSTE (9)'!P:P,MATCH(ROW()-2,'POSTE (9)'!$W:$W,0)),\"\")))))))))","v":"(7)DESIGNATION2"},{"$f":"IFERROR(INDEX('POSTE (1)'!Q:Q,MATCH(ROW()-2,'POSTE (1)'!$W:$W,0)),IFERROR(INDEX('POSTE (2)'!Q:Q,MATCH(ROW()-2,'POSTE (2)'!$W:$W,0)),IFERROR(INDEX('POSTE (3)'!Q:Q,MATCH(ROW()-2,'POSTE (3)'!$W:$W,0)),IFERROR(INDEX('POSTE (4)'!Q:Q,MATCH(ROW()-2,'POSTE (4)'!$W:$W,0)),IFERROR(INDEX('POSTE (5)'!Q:Q,MATCH(ROW()-2,'POSTE (5)'!$W:$W,0)),IFERROR(INDEX('POSTE (6)'!Q:Q,MATCH(ROW()-2,'POSTE (6)'!$W:$W,0)),IFERROR(INDEX('POSTE (7)'!Q:Q,MATCH(ROW()-2,'POSTE (7)'!$W:$W,0)),IFERROR(INDEX('POSTE (8)'!Q:Q,MATCH(ROW()-2,'POSTE (8)'!$W:$W,0)),IFERROR(INDEX('POSTE (9)'!Q:Q,MATCH(ROW()-2,'POSTE (9)'!$W:$W,0)),\"\")))))))))","v":"km"},{"$f":"IFERROR(INDEX('POSTE (1)'!R:R,MATCH(ROW()-2,'POSTE (1)'!$W:$W,0)),IFERROR(INDEX('POSTE (2)'!R:R,MATCH(ROW()-2,'POSTE (2)'!$W:$W,0)),IFERROR(INDEX('POSTE (3)'!R:R,MATCH(ROW()-2,'POSTE (3)'!$W:$W,0)),IFERROR(INDEX('POSTE (4)'!R:R,MATCH(ROW()-2,'POSTE (4)'!$W:$W,0)),IFERROR(INDEX('POSTE (5)'!R:R,MATCH(ROW()-2,'POSTE (5)'!$W:$W,0)),IFERROR(INDEX('POSTE (6)'!R:R,MATCH(ROW()-2,'POSTE (6)'!$W:$W,0)),IFERROR(INDEX('POSTE (7)'!R:R,MATCH(ROW()-2,'POSTE (7)'!$W:$W,0)),IFERROR(INDEX('POSTE (8)'!R:R,MATCH(ROW()-2,'POSTE (8)'!$W:$W,0)),IFERROR(INDEX('POSTE (9)'!R:R,MATCH(ROW()-2,'POSTE (9)'!$W:$W,0)),\"\")))))))))","v":7},{"$f":"IFERROR(INDEX('POSTE (1)'!S:S,MATCH(ROW()-2,'POSTE (1)'!$W:$W,0)),IFERROR(INDEX('POSTE (2)'!S:S,MATCH(ROW()-2,'POSTE (2)'!$W:$W,0)),IFERROR(INDEX('POSTE (3)'!S:S,MATCH(ROW()-2,'POSTE (3)'!$W:$W,0)),IFERROR(INDEX('POSTE (4)'!S:S,MATCH(ROW()-2,'POSTE (4)'!$W:$W,0)),IFERROR(INDEX('POSTE (5)'!S:S,MATCH(ROW()-2,'POSTE (5)'!$W:$W,0)),IFERROR(INDEX('POSTE (6)'!S:S,MATCH(ROW()-2,'POSTE (6)'!$W:$W,0)),IFERROR(INDEX('POSTE (7)'!S:S,MATCH(ROW()-2,'POSTE (7)'!$W:$W,0)),IFERROR(INDEX('POSTE (8)'!S:S,MATCH(ROW()-2,'POSTE (8)'!$W:$W,0)),IFERROR(INDEX('POSTE (9)'!S:S,MATCH(ROW()-2,'POSTE (9)'!$W:$W,0)),\"\")))))))))","v":1},{"$f":"IFERROR(INDEX('POSTE (1)'!T:T,MATCH(ROW()-2,'POSTE (1)'!$W:$W,0)),IFERROR(INDEX('POSTE (2)'!T:T,MATCH(ROW()-2,'POSTE (2)'!$W:$W,0)),IFERROR(INDEX('POSTE (3)'!T:T,MATCH(ROW()-2,'POSTE (3)'!$W:$W,0)),IFERROR(INDEX('POSTE (4)'!T:T,MATCH(ROW()-2,'POSTE (4)'!$W:$W,0)),IFERROR(INDEX('POSTE (5)'!T:T,MATCH(ROW()-2,'POSTE (5)'!$W:$W,0)),IFERROR(INDEX('POSTE (6)'!T:T,MATCH(ROW()-2,'POSTE (6)'!$W:$W,0)),IFERROR(INDEX('POSTE (7)'!T:T,MATCH(ROW()-2,'POSTE (7)'!$W:$W,0)),IFERROR(INDEX('POSTE (8)'!T:T,MATCH(ROW()-2,'POSTE (8)'!$W:$W,0)),IFERROR(INDEX('POSTE (9)'!T:T,MATCH(ROW()-2,'POSTE (9)'!$W:$W,0)),\"\")))))))))","v":7},{"$f":"IFERROR(INDEX('POSTE (1)'!U:U,MATCH(ROW()-2,'POSTE (1)'!$W:$W,0)),IFERROR(INDEX('POSTE (2)'!U:U,MATCH(ROW()-2,'POSTE (2)'!$W:$W,0)),IFERROR(INDEX('POSTE (3)'!U:U,MATCH(ROW()-2,'POSTE (3)'!$W:$W,0)),IFERROR(INDEX('POSTE (4)'!U:U,MATCH(ROW()-2,'POSTE (4)'!$W:$W,0)),IFERROR(INDEX('POSTE (5)'!U:U,MATCH(ROW()-2,'POSTE (5)'!$W:$W,0)),IFERROR(INDEX('POSTE (6)'!U:U,MATCH(ROW()-2,'POSTE (6)'!$W:$W,0)),IFERROR(INDEX('POSTE (7)'!U:U,MATCH(ROW()-2,'POSTE (7)'!$W:$W,0)),IFERROR(INDEX('POSTE (8)'!U:U,MATCH(ROW()-2,'POSTE (8)'!$W:$W,0)),IFERROR(INDEX('POSTE (9)'!U:U,MATCH(ROW()-2,'POSTE (9)'!$W:$W,0)),\"\")))))))))","v":"POSTE (7)"}]
[{"$f":"IFERROR(INDEX('POSTE (1)'!N:N,MATCH(ROW()-2,'POSTE (1)'!$W:$W,0)),IFERROR(INDEX('POSTE (2)'!N:N,MATCH(ROW()-2,'POSTE (2)'!$W:$W,0)),IFERROR(INDEX('POSTE (3)'!N:N,MATCH(ROW()-2,'POSTE (3)'!$W:$W,0)),IFERROR(INDEX('POSTE (4)'!N:N,MATCH(ROW()-2,'POSTE (4)'!$W:$W,0)),IFERROR(INDEX('POSTE (5)'!N:N,MATCH(ROW()-2,'POSTE (5)'!$W:$W,0)),IFERROR(INDEX('POSTE (6)'!N:N,MATCH(ROW()-2,'POSTE (6)'!$W:$W,0)),IFERROR(INDEX('POSTE (7)'!N:N,MATCH(ROW()-2,'POSTE (7)'!$W:$W,0)),IFERROR(INDEX('POSTE (8)'!N:N,MATCH(ROW()-2,'POSTE (8)'!$W:$W,0)),IFERROR(INDEX('POSTE (9)'!N:N,MATCH(ROW()-2,'POSTE (9)'!$W:$W,0)),\"\")))))))))","v":"(7)Fournisseur3"},{"$f":"IFERROR(INDEX('POSTE (1)'!O:O,MATCH(ROW()-2,'POSTE (1)'!$W:$W,0)),IFERROR(INDEX('POSTE (2)'!O:O,MATCH(ROW()-2,'POSTE (2)'!$W:$W,0)),IFERROR(INDEX('POSTE (3)'!O:O,MATCH(ROW()-2,'POSTE (3)'!$W:$W,0)),IFERROR(INDEX('POSTE (4)'!O:O,MATCH(ROW()-2,'POSTE (4)'!$W:$W,0)),IFERROR(INDEX('POSTE (5)'!O:O,MATCH(ROW()-2,'POSTE (5)'!$W:$W,0)),IFERROR(INDEX('POSTE (6)'!O:O,MATCH(ROW()-2,'POSTE (6)'!$W:$W,0)),IFERROR(INDEX('POSTE (7)'!O:O,MATCH(ROW()-2,'POSTE (7)'!$W:$W,0)),IFERROR(INDEX('POSTE (8)'!O:O,MATCH(ROW()-2,'POSTE (8)'!$W:$W,0)),IFERROR(INDEX('POSTE (9)'!O:O,MATCH(ROW()-2,'POSTE (9)'!$W:$W,0)),\"\")))))))))","v":"(7)Ref3"},{"$f":"IFERROR(INDEX('POSTE (1)'!P:P,MATCH(ROW()-2,'POSTE (1)'!$W:$W,0)),IFERROR(INDEX('POSTE (2)'!P:P,MATCH(ROW()-2,'POSTE (2)'!$W:$W,0)),IFERROR(INDEX('POSTE (3)'!P:P,MATCH(ROW()-2,'POSTE (3)'!$W:$W,0)),IFERROR(INDEX('POSTE (4)'!P:P,MATCH(ROW()-2,'POSTE (4)'!$W:$W,0)),IFERROR(INDEX('POSTE (5)'!P:P,MATCH(ROW()-2,'POSTE (5)'!$W:$W,0)),IFERROR(INDEX('POSTE (6)'!P:P,MATCH(ROW()-2,'POSTE (6)'!$W:$W,0)),IFERROR(INDEX('POSTE (7)'!P:P,MATCH(ROW()-2,'POSTE (7)'!$W:$W,0)),IFERROR(INDEX('POSTE (8)'!P:P,MATCH(ROW()-2,'POSTE (8)'!$W:$W,0)),IFERROR(INDEX('POSTE (9)'!P:P,MATCH(ROW()-2,'POSTE (9)'!$W:$W,0)),\"\")))))))))","v":"(7)DESIGNATION3"},{"$f":"IFERROR(INDEX('POSTE (1)'!Q:Q,MATCH(ROW()-2,'POSTE (1)'!$W:$W,0)),IFERROR(INDEX('POSTE (2)'!Q:Q,MATCH(ROW()-2,'POSTE (2)'!$W:$W,0)),IFERROR(INDEX('POSTE (3)'!Q:Q,MATCH(ROW()-2,'POSTE (3)'!$W:$W,0)),IFERROR(INDEX('POSTE (4)'!Q:Q,MATCH(ROW()-2,'POSTE (4)'!$W:$W,0)),IFERROR(INDEX('POSTE (5)'!Q:Q,MATCH(ROW()-2,'POSTE (5)'!$W:$W,0)),IFERROR(INDEX('POSTE (6)'!Q:Q,MATCH(ROW()-2,'POSTE (6)'!$W:$W,0)),IFERROR(INDEX('POSTE (7)'!Q:Q,MATCH(ROW()-2,'POSTE (7)'!$W:$W,0)),IFERROR(INDEX('POSTE (8)'!Q:Q,MATCH(ROW()-2,'POSTE (8)'!$W:$W,0)),IFERROR(INDEX('POSTE (9)'!Q:Q,MATCH(ROW()-2,'POSTE (9)'!$W:$W,0)),\"\")))))))))","v":"km"},{"$f":"IFERROR(INDEX('POSTE (1)'!R:R,MATCH(ROW()-2,'POSTE (1)'!$W:$W,0)),IFERROR(INDEX('POSTE (2)'!R:R,MATCH(ROW()-2,'POSTE (2)'!$W:$W,0)),IFERROR(INDEX('POSTE (3)'!R:R,MATCH(ROW()-2,'POSTE (3)'!$W:$W,0)),IFERROR(INDEX('POSTE (4)'!R:R,MATCH(ROW()-2,'POSTE (4)'!$W:$W,0)),IFERROR(INDEX('POSTE (5)'!R:R,MATCH(ROW()-2,'POSTE (5)'!$W:$W,0)),IFERROR(INDEX('POSTE (6)'!R:R,MATCH(ROW()-2,'POSTE (6)'!$W:$W,0)),IFERROR(INDEX('POSTE (7)'!R:R,MATCH(ROW()-2,'POSTE (7)'!$W:$W,0)),IFERROR(INDEX('POSTE (8)'!R:R,MATCH(ROW()-2,'POSTE (8)'!$W:$W,0)),IFERROR(INDEX('POSTE (9)'!R:R,MATCH(ROW()-2,'POSTE (9)'!$W:$W,0)),\"\")))))))))","v":7},{"$f":"IFERROR(INDEX('POSTE (1)'!S:S,MATCH(ROW()-2,'POSTE (1)'!$W:$W,0)),IFERROR(INDEX('POSTE (2)'!S:S,MATCH(ROW()-2,'POSTE (2)'!$W:$W,0)),IFERROR(INDEX('POSTE (3)'!S:S,MATCH(ROW()-2,'POSTE (3)'!$W:$W,0)),IFERROR(INDEX('POSTE (4)'!S:S,MATCH(ROW()-2,'POSTE (4)'!$W:$W,0)),IFERROR(INDEX('POSTE (5)'!S:S,MATCH(ROW()-2,'POSTE (5)'!$W:$W,0)),IFERROR(INDEX('POSTE (6)'!S:S,MATCH(ROW()-2,'POSTE (6)'!$W:$W,0)),IFERROR(INDEX('POSTE (7)'!S:S,MATCH(ROW()-2,'POSTE (7)'!$W:$W,0)),IFERROR(INDEX('POSTE (8)'!S:S,MATCH(ROW()-2,'POSTE (8)'!$W:$W,0)),IFERROR(INDEX('POSTE (9)'!S:S,MATCH(ROW()-2,'POSTE (9)'!$W:$W,0)),\"\")))))))))","v":1},{"$f":"IFERROR(INDEX('POSTE (1)'!T:T,MATCH(ROW()-2,'POSTE (1)'!$W:$W,0)),IFERROR(INDEX('POSTE (2)'!T:T,MATCH(ROW()-2,'POSTE (2)'!$W:$W,0)),IFERROR(INDEX('POSTE (3)'!T:T,MATCH(ROW()-2,'POSTE (3)'!$W:$W,0)),IFERROR(INDEX('POSTE (4)'!T:T,MATCH(ROW()-2,'POSTE (4)'!$W:$W,0)),IFERROR(INDEX('POSTE (5)'!T:T,MATCH(ROW()-2,'POSTE (5)'!$W:$W,0)),IFERROR(INDEX('POSTE (6)'!T:T,MATCH(ROW()-2,'POSTE (6)'!$W:$W,0)),IFERROR(INDEX('POSTE (7)'!T:T,MATCH(ROW()-2,'POSTE (7)'!$W:$W,0)),IFERROR(INDEX('POSTE (8)'!T:T,MATCH(ROW()-2,'POSTE (8)'!$W:$W,0)),IFERROR(INDEX('POSTE (9)'!T:T,MATCH(ROW()-2,'POSTE (9)'!$W:$W,0)),\"\")))))))))","v":7},{"$f":"IFERROR(INDEX('POSTE (1)'!U:U,MATCH(ROW()-2,'POSTE (1)'!$W:$W,0)),IFERROR(INDEX('POSTE (2)'!U:U,MATCH(ROW()-2,'POSTE (2)'!$W:$W,0)),IFERROR(INDEX('POSTE (3)'!U:U,MATCH(ROW()-2,'POSTE (3)'!$W:$W,0)),IFERROR(INDEX('POSTE (4)'!U:U,MATCH(ROW()-2,'POSTE (4)'!$W:$W,0)),IFERROR(INDEX('POSTE (5)'!U:U,MATCH(ROW()-2,'POSTE (5)'!$W:$W,0)),IFERROR(INDEX('POSTE (6)'!U:U,MATCH(ROW()-2,'POSTE (6)'!$W:$W,0)),IFERROR(INDEX('POSTE (7)'!U:U,MATCH(ROW()-2,'POSTE (7)'!$W:$W,0)),IFERROR(INDEX('POSTE (8)'!U:U,MATCH(ROW()-2,'POSTE (8)'!$W:$W,0)),IFERROR(INDEX('POSTE (9)'!U:U,MATCH(ROW()-2,'POSTE (9)'!$W:$W,0)),\"\")))))))))","v":"POSTE (7)"}]
[{"$f":"IFERROR(INDEX('POSTE (1)'!N:N,MATCH(ROW()-2,'POSTE (1)'!$W:$W,0)),IFERROR(INDEX('POSTE (2)'!N:N,MATCH(ROW()-2,'POSTE (2)'!$W:$W,0)),IFERROR(INDEX('POSTE (3)'!N:N,MATCH(ROW()-2,'POSTE (3)'!$W:$W,0)),IFERROR(INDEX('POSTE (4)'!N:N,MATCH(ROW()-2,'POSTE (4)'!$W:$W,0)),IFERROR(INDEX('POSTE (5)'!N:N,MATCH(ROW()-2,'POSTE (5)'!$W:$W,0)),IFERROR(INDEX('POSTE (6)'!N:N,MATCH(ROW()-2,'POSTE (6)'!$W:$W,0)),IFERROR(INDEX('POSTE (7)'!N:N,MATCH(ROW()-2,'POSTE (7)'!$W:$W,0)),IFERROR(INDEX('POSTE (8)'!N:N,MATCH(ROW()-2,'POSTE (8)'!$W:$W,0)),IFERROR(INDEX('POSTE (9)'!N:N,MATCH(ROW()-2,'POSTE (9)'!$W:$W,0)),\"\")))))))))","v":"(7)Fournisseur4"},{"$f":"IFERROR(INDEX('POSTE (1)'!O:O,MATCH(ROW()-2,'POSTE (1)'!$W:$W,0)),IFERROR(INDEX('POSTE (2)'!O:O,MATCH(ROW()-2,'POSTE (2)'!$W:$W,0)),IFERROR(INDEX('POSTE (3)'!O:O,MATCH(ROW()-2,'POSTE (3)'!$W:$W,0)),IFERROR(INDEX('POSTE (4)'!O:O,MATCH(ROW()-2,'POSTE (4)'!$W:$W,0)),IFERROR(INDEX('POSTE (5)'!O:O,MATCH(ROW()-2,'POSTE (5)'!$W:$W,0)),IFERROR(INDEX('POSTE (6)'!O:O,MATCH(ROW()-2,'POSTE (6)'!$W:$W,0)),IFERROR(INDEX('POSTE (7)'!O:O,MATCH(ROW()-2,'POSTE (7)'!$W:$W,0)),IFERROR(INDEX('POSTE (8)'!O:O,MATCH(ROW()-2,'POSTE (8)'!$W:$W,0)),IFERROR(INDEX('POSTE (9)'!O:O,MATCH(ROW()-2,'POSTE (9)'!$W:$W,0)),\"\")))))))))","v":"(7)Ref4"},{"$f":"IFERROR(INDEX('POSTE (1)'!P:P,MATCH(ROW()-2,'POSTE (1)'!$W:$W,0)),IFERROR(INDEX('POSTE (2)'!P:P,MATCH(ROW()-2,'POSTE (2)'!$W:$W,0)),IFERROR(INDEX('POSTE (3)'!P:P,MATCH(ROW()-2,'POSTE (3)'!$W:$W,0)),IFERROR(INDEX('POSTE (4)'!P:P,MATCH(ROW()-2,'POSTE (4)'!$W:$W,0)),IFERROR(INDEX('POSTE (5)'!P:P,MATCH(ROW()-2,'POSTE (5)'!$W:$W,0)),IFERROR(INDEX('POSTE (6)'!P:P,MATCH(ROW()-2,'POSTE (6)'!$W:$W,0)),IFERROR(INDEX('POSTE (7)'!P:P,MATCH(ROW()-2,'POSTE (7)'!$W:$W,0)),IFERROR(INDEX('POSTE (8)'!P:P,MATCH(ROW()-2,'POSTE (8)'!$W:$W,0)),IFERROR(INDEX('POSTE (9)'!P:P,MATCH(ROW()-2,'POSTE (9)'!$W:$W,0)),\"\")))))))))","v":"(7)DESIGNATION4"},{"$f":"IFERROR(INDEX('POSTE (1)'!Q:Q,MATCH(ROW()-2,'POSTE (1)'!$W:$W,0)),IFERROR(INDEX('POSTE (2)'!Q:Q,MATCH(ROW()-2,'POSTE (2)'!$W:$W,0)),IFERROR(INDEX('POSTE (3)'!Q:Q,MATCH(ROW()-2,'POSTE (3)'!$W:$W,0)),IFERROR(INDEX('POSTE (4)'!Q:Q,MATCH(ROW()-2,'POSTE (4)'!$W:$W,0)),IFERROR(INDEX('POSTE (5)'!Q:Q,MATCH(ROW()-2,'POSTE (5)'!$W:$W,0)),IFERROR(INDEX('POSTE (6)'!Q:Q,MATCH(ROW()-2,'POSTE (6)'!$W:$W,0)),IFERROR(INDEX('POSTE (7)'!Q:Q,MATCH(ROW()-2,'POSTE (7)'!$W:$W,0)),IFERROR(INDEX('POSTE (8)'!Q:Q,MATCH(ROW()-2,'POSTE (8)'!$W:$W,0)),IFERROR(INDEX('POSTE (9)'!Q:Q,MATCH(ROW()-2,'POSTE (9)'!$W:$W,0)),\"\")))))))))","v":"km"},{"$f":"IFERROR(INDEX('POSTE (1)'!R:R,MATCH(ROW()-2,'POSTE (1)'!$W:$W,0)),IFERROR(INDEX('POSTE (2)'!R:R,MATCH(ROW()-2,'POSTE (2)'!$W:$W,0)),IFERROR(INDEX('POSTE (3)'!R:R,MATCH(ROW()-2,'POSTE (3)'!$W:$W,0)),IFERROR(INDEX('POSTE (4)'!R:R,MATCH(ROW()-2,'POSTE (4)'!$W:$W,0)),IFERROR(INDEX('POSTE (5)'!R:R,MATCH(ROW()-2,'POSTE (5)'!$W:$W,0)),IFERROR(INDEX('POSTE (6)'!R:R,MATCH(ROW()-2,'POSTE (6)'!$W:$W,0)),IFERROR(INDEX('POSTE (7)'!R:R,MATCH(ROW()-2,'POSTE (7)'!$W:$W,0)),IFERROR(INDEX('POSTE (8)'!R:R,MATCH(ROW()-2,'POSTE (8)'!$W:$W,0)),IFERROR(INDEX('POSTE (9)'!R:R,MATCH(ROW()-2,'POSTE (9)'!$W:$W,0)),\"\")))))))))","v":7},{"$f":"IFERROR(INDEX('POSTE (1)'!S:S,MATCH(ROW()-2,'POSTE (1)'!$W:$W,0)),IFERROR(INDEX('POSTE (2)'!S:S,MATCH(ROW()-2,'POSTE (2)'!$W:$W,0)),IFERROR(INDEX('POSTE (3)'!S:S,MATCH(ROW()-2,'POSTE (3)'!$W:$W,0)),IFERROR(INDEX('POSTE (4)'!S:S,MATCH(ROW()-2,'POSTE (4)'!$W:$W,0)),IFERROR(INDEX('POSTE (5)'!S:S,MATCH(ROW()-2,'POSTE (5)'!$W:$W,0)),IFERROR(INDEX('POSTE (6)'!S:S,MATCH(ROW()-2,'POSTE (6)'!$W:$W,0)),IFERROR(INDEX('POSTE (7)'!S:S,MATCH(ROW()-2,'POSTE (7)'!$W:$W,0)),IFERROR(INDEX('POSTE (8)'!S:S,MATCH(ROW()-2,'POSTE (8)'!$W:$W,0)),IFERROR(INDEX('POSTE (9)'!S:S,MATCH(ROW()-2,'POSTE (9)'!$W:$W,0)),\"\")))))))))","v":1},{"$f":"IFERROR(INDEX('POSTE (1)'!T:T,MATCH(ROW()-2,'POSTE (1)'!$W:$W,0)),IFERROR(INDEX('POSTE (2)'!T:T,MATCH(ROW()-2,'POSTE (2)'!$W:$W,0)),IFERROR(INDEX('POSTE (3)'!T:T,MATCH(ROW()-2,'POSTE (3)'!$W:$W,0)),IFERROR(INDEX('POSTE (4)'!T:T,MATCH(ROW()-2,'POSTE (4)'!$W:$W,0)),IFERROR(INDEX('POSTE (5)'!T:T,MATCH(ROW()-2,'POSTE (5)'!$W:$W,0)),IFERROR(INDEX('POSTE (6)'!T:T,MATCH(ROW()-2,'POSTE (6)'!$W:$W,0)),IFERROR(INDEX('POSTE (7)'!T:T,MATCH(ROW()-2,'POSTE (7)'!$W:$W,0)),IFERROR(INDEX('POSTE (8)'!T:T,MATCH(ROW()-2,'POSTE (8)'!$W:$W,0)),IFERROR(INDEX('POSTE (9)'!T:T,MATCH(ROW()-2,'POSTE (9)'!$W:$W,0)),\"\")))))))))","v":7},{"$f":"IFERROR(INDEX('POSTE (1)'!U:U,MATCH(ROW()-2,'POSTE (1)'!$W:$W,0)),IFERROR(INDEX('POSTE (2)'!U:U,MATCH(ROW()-2,'POSTE (2)'!$W:$W,0)),IFERROR(INDEX('POSTE (3)'!U:U,MATCH(ROW()-2,'POSTE (3)'!$W:$W,0)),IFERROR(INDEX('POSTE (4)'!U:U,MATCH(ROW()-2,'POSTE (4)'!$W:$W,0)),IFERROR(INDEX('POSTE (5)'!U:U,MATCH(ROW()-2,'POSTE (5)'!$W:$W,0)),IFERROR(INDEX('POSTE (6)'!U:U,MATCH(ROW()-2,'POSTE (6)'!$W:$W,0)),IFERROR(INDEX('POSTE (7)'!U:U,MATCH(ROW()-2,'POSTE (7)'!$W:$W,0)),IFERROR(INDEX('POSTE (8)'!U:U,MATCH(ROW()-2,'POSTE (8)'!$W:$W,0)),IFERROR(INDEX('POSTE (9)'!U:U,MATCH(ROW()-2,'POSTE (9)'!$W:$W,0)),\"\")))))))))","v":"POSTE (7)"}]
[{"$f":"IFERROR(INDEX('POSTE (1)'!N:N,MATCH(ROW()-2,'POSTE (1)'!$W:$W,0)),IFERROR(INDEX('POSTE (2)'!N:N,MATCH(ROW()-2,'POSTE (2)'!$W:$W,0)),IFERROR(INDEX('POSTE (3)'!N:N,MATCH(ROW()-2,'POSTE (3)'!$W:$W,0)),IFERROR(INDEX('POSTE (4)'!N:N,MATCH(ROW()-2,'POSTE (4)'!$W:$W,0)),IFERROR(INDEX('POSTE (5)'!N:N,MATCH(ROW()-2,'POSTE (5)'!$W:$W,0)),IFERROR(INDEX('POSTE (6)'!N:N,MATCH(ROW()-2,'POSTE (6)'!$W:$W,0)),IFERROR(INDEX('POSTE (7)'!N:N,MATCH(ROW()-2,'POSTE (7)'!$W:$W,0)),IFERROR(INDEX('POSTE (8)'!N:N,MATCH(ROW()-2,'POSTE (8)'!$W:$W,0)),IFERROR(INDEX('POSTE (9)'!N:N,MATCH(ROW()-2,'POSTE (9)'!$W:$W,0)),\"\")))))))))","v":"(7)Fournisseur5"},{"$f":"IFERROR(INDEX('POSTE (1)'!O:O,MATCH(ROW()-2,'POSTE (1)'!$W:$W,0)),IFERROR(INDEX('POSTE (2)'!O:O,MATCH(ROW()-2,'POSTE (2)'!$W:$W,0)),IFERROR(INDEX('POSTE (3)'!O:O,MATCH(ROW()-2,'POSTE (3)'!$W:$W,0)),IFERROR(INDEX('POSTE (4)'!O:O,MATCH(ROW()-2,'POSTE (4)'!$W:$W,0)),IFERROR(INDEX('POSTE (5)'!O:O,MATCH(ROW()-2,'POSTE (5)'!$W:$W,0)),IFERROR(INDEX('POSTE (6)'!O:O,MATCH(ROW()-2,'POSTE (6)'!$W:$W,0)),IFERROR(INDEX('POSTE (7)'!O:O,MATCH(ROW()-2,'POSTE (7)'!$W:$W,0)),IFERROR(INDEX('POSTE (8)'!O:O,MATCH(ROW()-2,'POSTE (8)'!$W:$W,0)),IFERROR(INDEX('POSTE (9)'!O:O,MATCH(ROW()-2,'POSTE (9)'!$W:$W,0)),\"\")))))))))","v":"(7)Ref5"},{"$f":"IFERROR(INDEX('POSTE (1)'!P:P,MATCH(ROW()-2,'POSTE (1)'!$W:$W,0)),IFERROR(INDEX('POSTE (2)'!P:P,MATCH(ROW()-2,'POSTE (2)'!$W:$W,0)),IFERROR(INDEX('POSTE (3)'!P:P,MATCH(ROW()-2,'POSTE (3)'!$W:$W,0)),IFERROR(INDEX('POSTE (4)'!P:P,MATCH(ROW()-2,'POSTE (4)'!$W:$W,0)),IFERROR(INDEX('POSTE (5)'!P:P,MATCH(ROW()-2,'POSTE (5)'!$W:$W,0)),IFERROR(INDEX('POSTE (6)'!P:P,MATCH(ROW()-2,'POSTE (6)'!$W:$W,0)),IFERROR(INDEX('POSTE (7)'!P:P,MATCH(ROW()-2,'POSTE (7)'!$W:$W,0)),IFERROR(INDEX('POSTE (8)'!P:P,MATCH(ROW()-2,'POSTE (8)'!$W:$W,0)),IFERROR(INDEX('POSTE (9)'!P:P,MATCH(ROW()-2,'POSTE (9)'!$W:$W,0)),\"\")))))))))","v":"(7)DESIGNATION5"},{"$f":"IFERROR(INDEX('POSTE (1)'!Q:Q,MATCH(ROW()-2,'POSTE (1)'!$W:$W,0)),IFERROR(INDEX('POSTE (2)'!Q:Q,MATCH(ROW()-2,'POSTE (2)'!$W:$W,0)),IFERROR(INDEX('POSTE (3)'!Q:Q,MATCH(ROW()-2,'POSTE (3)'!$W:$W,0)),IFERROR(INDEX('POSTE (4)'!Q:Q,MATCH(ROW()-2,'POSTE (4)'!$W:$W,0)),IFERROR(INDEX('POSTE (5)'!Q:Q,MATCH(ROW()-2,'POSTE (5)'!$W:$W,0)),IFERROR(INDEX('POSTE (6)'!Q:Q,MATCH(ROW()-2,'POSTE (6)'!$W:$W,0)),IFERROR(INDEX('POSTE (7)'!Q:Q,MATCH(ROW()-2,'POSTE (7)'!$W:$W,0)),IFERROR(INDEX('POSTE (8)'!Q:Q,MATCH(ROW()-2,'POSTE (8)'!$W:$W,0)),IFERROR(INDEX('POSTE (9)'!Q:Q,MATCH(ROW()-2,'POSTE (9)'!$W:$W,0)),\"\")))))))))","v":"km"},{"$f":"IFERROR(INDEX('POSTE (1)'!R:R,MATCH(ROW()-2,'POSTE (1)'!$W:$W,0)),IFERROR(INDEX('POSTE (2)'!R:R,MATCH(ROW()-2,'POSTE (2)'!$W:$W,0)),IFERROR(INDEX('POSTE (3)'!R:R,MATCH(ROW()-2,'POSTE (3)'!$W:$W,0)),IFERROR(INDEX('POSTE (4)'!R:R,MATCH(ROW()-2,'POSTE (4)'!$W:$W,0)),IFERROR(INDEX('POSTE (5)'!R:R,MATCH(ROW()-2,'POSTE (5)'!$W:$W,0)),IFERROR(INDEX('POSTE (6)'!R:R,MATCH(ROW()-2,'POSTE (6)'!$W:$W,0)),IFERROR(INDEX('POSTE (7)'!R:R,MATCH(ROW()-2,'POSTE (7)'!$W:$W,0)),IFERROR(INDEX('POSTE (8)'!R:R,MATCH(ROW()-2,'POSTE (8)'!$W:$W,0)),IFERROR(INDEX('POSTE (9)'!R:R,MATCH(ROW()-2,'POSTE (9)'!$W:$W,0)),\"\")))))))))","v":7},{"$f":"IFERROR(INDEX('POSTE (1)'!S:S,MATCH(ROW()-2,'POSTE (1)'!$W:$W,0)),IFERROR(INDEX('POSTE (2)'!S:S,MATCH(ROW()-2,'POSTE (2)'!$W:$W,0)),IFERROR(INDEX('POSTE (3)'!S:S,MATCH(ROW()-2,'POSTE (3)'!$W:$W,0)),IFERROR(INDEX('POSTE (4)'!S:S,MATCH(ROW()-2,'POSTE (4)'!$W:$W,0)),IFERROR(INDEX('POSTE (5)'!S:S,MATCH(ROW()-2,'POSTE (5)'!$W:$W,0)),IFERROR(INDEX('POSTE (6)'!S:S,MATCH(ROW()-2,'POSTE (6)'!$W:$W,0)),IFERROR(INDEX('POSTE (7)'!S:S,MATCH(ROW()-2,'POSTE (7)'!$W:$W,0)),IFERROR(INDEX('POSTE (8)'!S:S,MATCH(ROW()-2,'POSTE (8)'!$W:$W,0)),IFERROR(INDEX('POSTE (9)'!S:S,MATCH(ROW()-2,'POSTE (9)'!$W:$W,0)),\"\")))))))))","v":1},{"$f":"IFERROR(INDEX('POSTE (1)'!T:T,MATCH(ROW()-2,'POSTE (1)'!$W:$W,0)),IFERROR(INDEX('POSTE (2)'!T:T,MATCH(ROW()-2,'POSTE (2)'!$W:$W,0)),IFERROR(INDEX('POSTE (3)'!T:T,MATCH(ROW()-2,'POSTE (3)'!$W:$W,0)),IFERROR(INDEX('POSTE (4)'!T:T,MATCH(ROW()-2,'POSTE (4)'!$W:$W,0)),IFERROR(INDEX('POSTE (5)'!T:T,MATCH(ROW()-2,'POSTE (5)'!$W:$W,0)),IFERROR(INDEX('POSTE (6)'!T:T,MATCH(ROW()-2,'POSTE (6)'!$W:$W,0)),IFERROR(INDEX('POSTE (7)'!T:T,MATCH(ROW()-2,'POSTE (7)'!$W:$W,0)),IFERROR(INDEX('POSTE (8)'!T:T,MATCH(ROW()-2,'POSTE (8)'!$W:$W,0)),IFERROR(INDEX('POSTE (9)'!T:T,MATCH(ROW()-2,'POSTE (9)'!$W:$W,0)),\"\")))))))))","v":7},{"$f":"IFERROR(INDEX('POSTE (1)'!U:U,MATCH(ROW()-2,'POSTE (1)'!$W:$W,0)),IFERROR(INDEX('POSTE (2)'!U:U,MATCH(ROW()-2,'POSTE (2)'!$W:$W,0)),IFERROR(INDEX('POSTE (3)'!U:U,MATCH(ROW()-2,'POSTE (3)'!$W:$W,0)),IFERROR(INDEX('POSTE (4)'!U:U,MATCH(ROW()-2,'POSTE (4)'!$W:$W,0)),IFERROR(INDEX('POSTE (5)'!U:U,MATCH(ROW()-2,'POSTE (5)'!$W:$W,0)),IFERROR(INDEX('POSTE (6)'!U:U,MATCH(ROW()-2,'POSTE (6)'!$W:$W,0)),IFERROR(INDEX('POSTE (7)'!U:U,MATCH(ROW()-2,'POSTE (7)'!$W:$W,0)),IFERROR(INDEX('POSTE (8)'!U:U,MATCH(ROW()-2,'POSTE (8)'!$W:$W,0)),IFERROR(INDEX('POSTE (9)'!U:U,MATCH(ROW()-2,'POSTE (9)'!$W:$W,0)),\"\")))))))))","v":"POSTE (7)"}]
[{"$f":"IFERROR(INDEX('POSTE (1)'!N:N,MATCH(ROW()-2,'POSTE (1)'!$W:$W,0)),IFERROR(INDEX('POSTE (2)'!N:N,MATCH(ROW()-2,'POSTE (2)'!$W:$W,0)),IFERROR(INDEX('POSTE (3)'!N:N,MATCH(ROW()-2,'POSTE (3)'!$W:$W,0)),IFERROR(INDEX('POSTE (4)'!N:N,MATCH(ROW()-2,'POSTE (4)'!$W:$W,0)),IFERROR(INDEX('POSTE (5)'!N:N,MATCH(ROW()-2,'POSTE (5)'!$W:$W,0)),IFERROR(INDEX('POSTE (6)'!N:N,MATCH(ROW()-2,'POSTE (6)'!$W:$W,0)),IFERROR(INDEX('POSTE (7)'!N:N,MATCH(ROW()-2,'POSTE (7)'!$W:$W,0)),IFERROR(INDEX('POSTE (8)'!N:N,MATCH(ROW()-2,'POSTE (8)'!$W:$W,0)),IFERROR(INDEX('POSTE (9)'!N:N,MATCH(ROW()-2,'POSTE (9)'!$W:$W,0)),\"\")))))))))","v":"(7)Fournisseur6"},{"$f":"IFERROR(INDEX('POSTE (1)'!O:O,MATCH(ROW()-2,'POSTE (1)'!$W:$W,0)),IFERROR(INDEX('POSTE (2)'!O:O,MATCH(ROW()-2,'POSTE (2)'!$W:$W,0)),IFERROR(INDEX('POSTE (3)'!O:O,MATCH(ROW()-2,'POSTE (3)'!$W:$W,0)),IFERROR(INDEX('POSTE (4)'!O:O,MATCH(ROW()-2,'POSTE (4)'!$W:$W,0)),IFERROR(INDEX('POSTE (5)'!O:O,MATCH(ROW()-2,'POSTE (5)'!$W:$W,0)),IFERROR(INDEX('POSTE (6)'!O:O,MATCH(ROW()-2,'POSTE (6)'!$W:$W,0)),IFERROR(INDEX('POSTE (7)'!O:O,MATCH(ROW()-2,'POSTE (7)'!$W:$W,0)),IFERROR(INDEX('POSTE (8)'!O:O,MATCH(ROW()-2,'POSTE (8)'!$W:$W,0)),IFERROR(INDEX('POSTE (9)'!O:O,MATCH(ROW()-2,'POSTE (9)'!$W:$W,0)),\"\")))))))))","v":"(7)Ref6"},{"$f":"IFERROR(INDEX('POSTE (1)'!P:P,MATCH(ROW()-2,'POSTE (1)'!$W:$W,0)),IFERROR(INDEX('POSTE (2)'!P:P,MATCH(ROW()-2,'POSTE (2)'!$W:$W,0)),IFERROR(INDEX('POSTE (3)'!P:P,MATCH(ROW()-2,'POSTE (3)'!$W:$W,0)),IFERROR(INDEX('POSTE (4)'!P:P,MATCH(ROW()-2,'POSTE (4)'!$W:$W,0)),IFERROR(INDEX('POSTE (5)'!P:P,MATCH(ROW()-2,'POSTE (5)'!$W:$W,0)),IFERROR(INDEX('POSTE (6)'!P:P,MATCH(ROW()-2,'POSTE (6)'!$W:$W,0)),IFERROR(INDEX('POSTE (7)'!P:P,MATCH(ROW()-2,'POSTE (7)'!$W:$W,0)),IFERROR(INDEX('POSTE (8)'!P:P,MATCH(ROW()-2,'POSTE (8)'!$W:$W,0)),IFERROR(INDEX('POSTE (9)'!P:P,MATCH(ROW()-2,'POSTE (9)'!$W:$W,0)),\"\")))))))))","v":"(7)DESIGNATION6"},{"$f":"IFERROR(INDEX('POSTE (1)'!Q:Q,MATCH(ROW()-2,'POSTE (1)'!$W:$W,0)),IFERROR(INDEX('POSTE (2)'!Q:Q,MATCH(ROW()-2,'POSTE (2)'!$W:$W,0)),IFERROR(INDEX('POSTE (3)'!Q:Q,MATCH(ROW()-2,'POSTE (3)'!$W:$W,0)),IFERROR(INDEX('POSTE (4)'!Q:Q,MATCH(ROW()-2,'POSTE (4)'!$W:$W,0)),IFERROR(INDEX('POSTE (5)'!Q:Q,MATCH(ROW()-2,'POSTE (5)'!$W:$W,0)),IFERROR(INDEX('POSTE (6)'!Q:Q,MATCH(ROW()-2,'POSTE (6)'!$W:$W,0)),IFERROR(INDEX('POSTE (7)'!Q:Q,MATCH(ROW()-2,'POSTE (7)'!$W:$W,0)),IFERROR(INDEX('POSTE (8)'!Q:Q,MATCH(ROW()-2,'POSTE (8)'!$W:$W,0)),IFERROR(INDEX('POSTE (9)'!Q:Q,MATCH(ROW()-2,'POSTE (9)'!$W:$W,0)),\"\")))))))))","v":"km"},{"$f":"IFERROR(INDEX('POSTE (1)'!R:R,MATCH(ROW()-2,'POSTE (1)'!$W:$W,0)),IFERROR(INDEX('POSTE (2)'!R:R,MATCH(ROW()-2,'POSTE (2)'!$W:$W,0)),IFERROR(INDEX('POSTE (3)'!R:R,MATCH(ROW()-2,'POSTE (3)'!$W:$W,0)),IFERROR(INDEX('POSTE (4)'!R:R,MATCH(ROW()-2,'POSTE (4)'!$W:$W,0)),IFERROR(INDEX('POSTE (5)'!R:R,MATCH(ROW()-2,'POSTE (5)'!$W:$W,0)),IFERROR(INDEX('POSTE (6)'!R:R,MATCH(ROW()-2,'POSTE (6)'!$W:$W,0)),IFERROR(INDEX('POSTE (7)'!R:R,MATCH(ROW()-2,'POSTE (7)'!$W:$W,0)),IFERROR(INDEX('POSTE (8)'!R:R,MATCH(ROW()-2,'POSTE (8)'!$W:$W,0)),IFERROR(INDEX('POSTE (9)'!R:R,MATCH(ROW()-2,'POSTE (9)'!$W:$W,0)),\"\")))))))))","v":7},{"$f":"IFERROR(INDEX('POSTE (1)'!S:S,MATCH(ROW()-2,'POSTE (1)'!$W:$W,0)),IFERROR(INDEX('POSTE (2)'!S:S,MATCH(ROW()-2,'POSTE (2)'!$W:$W,0)),IFERROR(INDEX('POSTE (3)'!S:S,MATCH(ROW()-2,'POSTE (3)'!$W:$W,0)),IFERROR(INDEX('POSTE (4)'!S:S,MATCH(ROW()-2,'POSTE (4)'!$W:$W,0)),IFERROR(INDEX('POSTE (5)'!S:S,MATCH(ROW()-2,'POSTE (5)'!$W:$W,0)),IFERROR(INDEX('POSTE (6)'!S:S,MATCH(ROW()-2,'POSTE (6)'!$W:$W,0)),IFERROR(INDEX('POSTE (7)'!S:S,MATCH(ROW()-2,'POSTE (7)'!$W:$W,0)),IFERROR(INDEX('POSTE (8)'!S:S,MATCH(ROW()-2,'POSTE (8)'!$W:$W,0)),IFERROR(INDEX('POSTE (9)'!S:S,MATCH(ROW()-2,'POSTE (9)'!$W:$W,0)),\"\")))))))))","v":1},{"$f":"IFERROR(INDEX('POSTE (1)'!T:T,MATCH(ROW()-2,'POSTE (1)'!$W:$W,0)),IFERROR(INDEX('POSTE (2)'!T:T,MATCH(ROW()-2,'POSTE (2)'!$W:$W,0)),IFERROR(INDEX('POSTE (3)'!T:T,MATCH(ROW()-2,'POSTE (3)'!$W:$W,0)),IFERROR(INDEX('POSTE (4)'!T:T,MATCH(ROW()-2,'POSTE (4)'!$W:$W,0)),IFERROR(INDEX('POSTE (5)'!T:T,MATCH(ROW()-2,'POSTE (5)'!$W:$W,0)),IFERROR(INDEX('POSTE (6)'!T:T,MATCH(ROW()-2,'POSTE (6)'!$W:$W,0)),IFERROR(INDEX('POSTE (7)'!T:T,MATCH(ROW()-2,'POSTE (7)'!$W:$W,0)),IFERROR(INDEX('POSTE (8)'!T:T,MATCH(ROW()-2,'POSTE (8)'!$W:$W,0)),IFERROR(INDEX('POSTE (9)'!T:T,MATCH(ROW()-2,'POSTE (9)'!$W:$W,0)),\"\")))))))))","v":7},{"$f":"IFERROR(INDEX('POSTE (1)'!U:U,MATCH(ROW()-2,'POSTE (1)'!$W:$W,0)),IFERROR(INDEX('POSTE (2)'!U:U,MATCH(ROW()-2,'POSTE (2)'!$W:$W,0)),IFERROR(INDEX('POSTE (3)'!U:U,MATCH(ROW()-2,'POSTE (3)'!$W:$W,0)),IFERROR(INDEX('POSTE (4)'!U:U,MATCH(ROW()-2,'POSTE (4)'!$W:$W,0)),IFERROR(INDEX('POSTE (5)'!U:U,MATCH(ROW()-2,'POSTE (5)'!$W:$W,0)),IFERROR(INDEX('POSTE (6)'!U:U,MATCH(ROW()-2,'POSTE (6)'!$W:$W,0)),IFERROR(INDEX('POSTE (7)'!U:U,MATCH(ROW()-2,'POSTE (7)'!$W:$W,0)),IFERROR(INDEX('POSTE (8)'!U:U,MATCH(ROW()-2,'POSTE (8)'!$W:$W,0)),IFERROR(INDEX('POSTE (9)'!U:U,MATCH(ROW()-2,'POSTE (9)'!$W:$W,0)),\"\")))))))))","v":"POSTE (7)"}]
[{"$f":"IFERROR(INDEX('POSTE (1)'!N:N,MATCH(ROW()-2,'POSTE (1)'!$W:$W,0)),IFERROR(INDEX('POSTE (2)'!N:N,MATCH(ROW()-2,'POSTE (2)'!$W:$W,0)),IFERROR(INDEX('POSTE (3)'!N:N,MATCH(ROW()-2,'POSTE (3)'!$W:$W,0)),IFERROR(INDEX('POSTE (4)'!N:N,MATCH(ROW()-2,'POSTE (4)'!$W:$W,0)),IFERROR(INDEX('POSTE (5)'!N:N,MATCH(ROW()-2,'POSTE (5)'!$W:$W,0)),IFERROR(INDEX('POSTE (6)'!N:N,MATCH(ROW()-2,'POSTE (6)'!$W:$W,0)),IFERROR(INDEX('POSTE (7)'!N:N,MATCH(ROW()-2,'POSTE (7)'!$W:$W,0)),IFERROR(INDEX('POSTE (8)'!N:N,MATCH(ROW()-2,'POSTE (8)'!$W:$W,0)),IFERROR(INDEX('POSTE (9)'!N:N,MATCH(ROW()-2,'POSTE (9)'!$W:$W,0)),\"\")))))))))","v":"(7)Fournisseur7"},{"$f":"IFERROR(INDEX('POSTE (1)'!O:O,MATCH(ROW()-2,'POSTE (1)'!$W:$W,0)),IFERROR(INDEX('POSTE (2)'!O:O,MATCH(ROW()-2,'POSTE (2)'!$W:$W,0)),IFERROR(INDEX('POSTE (3)'!O:O,MATCH(ROW()-2,'POSTE (3)'!$W:$W,0)),IFERROR(INDEX('POSTE (4)'!O:O,MATCH(ROW()-2,'POSTE (4)'!$W:$W,0)),IFERROR(INDEX('POSTE (5)'!O:O,MATCH(ROW()-2,'POSTE (5)'!$W:$W,0)),IFERROR(INDEX('POSTE (6)'!O:O,MATCH(ROW()-2,'POSTE (6)'!$W:$W,0)),IFERROR(INDEX('POSTE (7)'!O:O,MATCH(ROW()-2,'POSTE (7)'!$W:$W,0)),IFERROR(INDEX('POSTE (8)'!O:O,MATCH(ROW()-2,'POSTE (8)'!$W:$W,0)),IFERROR(INDEX('POSTE (9)'!O:O,MATCH(ROW()-2,'POSTE (9)'!$W:$W,0)),\"\")))))))))","v":"(7)Ref7"},{"$f":"IFERROR(INDEX('POSTE (1)'!P:P,MATCH(ROW()-2,'POSTE (1)'!$W:$W,0)),IFERROR(INDEX('POSTE (2)'!P:P,MATCH(ROW()-2,'POSTE (2)'!$W:$W,0)),IFERROR(INDEX('POSTE (3)'!P:P,MATCH(ROW()-2,'POSTE (3)'!$W:$W,0)),IFERROR(INDEX('POSTE (4)'!P:P,MATCH(ROW()-2,'POSTE (4)'!$W:$W,0)),IFERROR(INDEX('POSTE (5)'!P:P,MATCH(ROW()-2,'POSTE (5)'!$W:$W,0)),IFERROR(INDEX('POSTE (6)'!P:P,MATCH(ROW()-2,'POSTE (6)'!$W:$W,0)),IFERROR(INDEX('POSTE (7)'!P:P,MATCH(ROW()-2,'POSTE (7)'!$W:$W,0)),IFERROR(INDEX('POSTE (8)'!P:P,MATCH(ROW()-2,'POSTE (8)'!$W:$W,0)),IFERROR(INDEX('POSTE (9)'!P:P,MATCH(ROW()-2,'POSTE (9)'!$W:$W,0)),\"\")))))))))","v":"(7)DESIGNATION7"},{"$f":"IFERROR(INDEX('POSTE (1)'!Q:Q,MATCH(ROW()-2,'POSTE (1)'!$W:$W,0)),IFERROR(INDEX('POSTE (2)'!Q:Q,MATCH(ROW()-2,'POSTE (2)'!$W:$W,0)),IFERROR(INDEX('POSTE (3)'!Q:Q,MATCH(ROW()-2,'POSTE (3)'!$W:$W,0)),IFERROR(INDEX('POSTE (4)'!Q:Q,MATCH(ROW()-2,'POSTE (4)'!$W:$W,0)),IFERROR(INDEX('POSTE (5)'!Q:Q,MATCH(ROW()-2,'POSTE (5)'!$W:$W,0)),IFERROR(INDEX('POSTE (6)'!Q:Q,MATCH(ROW()-2,'POSTE (6)'!$W:$W,0)),IFERROR(INDEX('POSTE (7)'!Q:Q,MATCH(ROW()-2,'POSTE (7)'!$W:$W,0)),IFERROR(INDEX('POSTE (8)'!Q:Q,MATCH(ROW()-2,'POSTE (8)'!$W:$W,0)),IFERROR(INDEX('POSTE (9)'!Q:Q,MATCH(ROW()-2,'POSTE (9)'!$W:$W,0)),\"\")))))))))","v":"km"},{"$f":"IFERROR(INDEX('POSTE (1)'!R:R,MATCH(ROW()-2,'POSTE (1)'!$W:$W,0)),IFERROR(INDEX('POSTE (2)'!R:R,MATCH(ROW()-2,'POSTE (2)'!$W:$W,0)),IFERROR(INDEX('POSTE (3)'!R:R,MATCH(ROW()-2,'POSTE (3)'!$W:$W,0)),IFERROR(INDEX('POSTE (4)'!R:R,MATCH(ROW()-2,'POSTE (4)'!$W:$W,0)),IFERROR(INDEX('POSTE (5)'!R:R,MATCH(ROW()-2,'POSTE (5)'!$W:$W,0)),IFERROR(INDEX('POSTE (6)'!R:R,MATCH(ROW()-2,'POSTE (6)'!$W:$W,0)),IFERROR(INDEX('POSTE (7)'!R:R,MATCH(ROW()-2,'POSTE (7)'!$W:$W,0)),IFERROR(INDEX('POSTE (8)'!R:R,MATCH(ROW()-2,'POSTE (8)'!$W:$W,0)),IFERROR(INDEX('POSTE (9)'!R:R,MATCH(ROW()-2,'POSTE (9)'!$W:$W,0)),\"\")))))))))","v":7},{"$f":"IFERROR(INDEX('POSTE (1)'!S:S,MATCH(ROW()-2,'POSTE (1)'!$W:$W,0)),IFERROR(INDEX('POSTE (2)'!S:S,MATCH(ROW()-2,'POSTE (2)'!$W:$W,0)),IFERROR(INDEX('POSTE (3)'!S:S,MATCH(ROW()-2,'POSTE (3)'!$W:$W,0)),IFERROR(INDEX('POSTE (4)'!S:S,MATCH(ROW()-2,'POSTE (4)'!$W:$W,0)),IFERROR(INDEX('POSTE (5)'!S:S,MATCH(ROW()-2,'POSTE (5)'!$W:$W,0)),IFERROR(INDEX('POSTE (6)'!S:S,MATCH(ROW()-2,'POSTE (6)'!$W:$W,0)),IFERROR(INDEX('POSTE (7)'!S:S,MATCH(ROW()-2,'POSTE (7)'!$W:$W,0)),IFERROR(INDEX('POSTE (8)'!S:S,MATCH(ROW()-2,'POSTE (8)'!$W:$W,0)),IFERROR(INDEX('POSTE (9)'!S:S,MATCH(ROW()-2,'POSTE (9)'!$W:$W,0)),\"\")))))))))","v":1},{"$f":"IFERROR(INDEX('POSTE (1)'!T:T,MATCH(ROW()-2,'POSTE (1)'!$W:$W,0)),IFERROR(INDEX('POSTE (2)'!T:T,MATCH(ROW()-2,'POSTE (2)'!$W:$W,0)),IFERROR(INDEX('POSTE (3)'!T:T,MATCH(ROW()-2,'POSTE (3)'!$W:$W,0)),IFERROR(INDEX('POSTE (4)'!T:T,MATCH(ROW()-2,'POSTE (4)'!$W:$W,0)),IFERROR(INDEX('POSTE (5)'!T:T,MATCH(ROW()-2,'POSTE (5)'!$W:$W,0)),IFERROR(INDEX('POSTE (6)'!T:T,MATCH(ROW()-2,'POSTE (6)'!$W:$W,0)),IFERROR(INDEX('POSTE (7)'!T:T,MATCH(ROW()-2,'POSTE (7)'!$W:$W,0)),IFERROR(INDEX('POSTE (8)'!T:T,MATCH(ROW()-2,'POSTE (8)'!$W:$W,0)),IFERROR(INDEX('POSTE (9)'!T:T,MATCH(ROW()-2,'POSTE (9)'!$W:$W,0)),\"\")))))))))","v":7},{"$f":"IFERROR(INDEX('POSTE (1)'!U:U,MATCH(ROW()-2,'POSTE (1)'!$W:$W,0)),IFERROR(INDEX('POSTE (2)'!U:U,MATCH(ROW()-2,'POSTE (2)'!$W:$W,0)),IFERROR(INDEX('POSTE (3)'!U:U,MATCH(ROW()-2,'POSTE (3)'!$W:$W,0)),IFERROR(INDEX('POSTE (4)'!U:U,MATCH(ROW()-2,'POSTE (4)'!$W:$W,0)),IFERROR(INDEX('POSTE (5)'!U:U,MATCH(ROW()-2,'POSTE (5)'!$W:$W,0)),IFERROR(INDEX('POSTE (6)'!U:U,MATCH(ROW()-2,'POSTE (6)'!$W:$W,0)),IFERROR(INDEX('POSTE (7)'!U:U,MATCH(ROW()-2,'POSTE (7)'!$W:$W,0)),IFERROR(INDEX('POSTE (8)'!U:U,MATCH(ROW()-2,'POSTE (8)'!$W:$W,0)),IFERROR(INDEX('POSTE (9)'!U:U,MATCH(ROW()-2,'POSTE (9)'!$W:$W,0)),\"\")))))))))","v":"POSTE (7)"}]
[{"$f":"IFERROR(INDEX('POSTE (1)'!N:N,MATCH(ROW()-2,'POSTE (1)'!$W:$W,0)),IFERROR(INDEX('POSTE (2)'!N:N,MATCH(ROW()-2,'POSTE (2)'!$W:$W,0)),IFERROR(INDEX('POSTE (3)'!N:N,MATCH(ROW()-2,'POSTE (3)'!$W:$W,0)),IFERROR(INDEX('POSTE (4)'!N:N,MATCH(ROW()-2,'POSTE (4)'!$W:$W,0)),IFERROR(INDEX('POSTE (5)'!N:N,MATCH(ROW()-2,'POSTE (5)'!$W:$W,0)),IFERROR(INDEX('POSTE (6)'!N:N,MATCH(ROW()-2,'POSTE (6)'!$W:$W,0)),IFERROR(INDEX('POSTE (7)'!N:N,MATCH(ROW()-2,'POSTE (7)'!$W:$W,0)),IFERROR(INDEX('POSTE (8)'!N:N,MATCH(ROW()-2,'POSTE (8)'!$W:$W,0)),IFERROR(INDEX('POSTE (9)'!N:N,MATCH(ROW()-2,'POSTE (9)'!$W:$W,0)),\"\")))))))))","v":"(8)Fournisseur"},{"$f":"IFERROR(INDEX('POSTE (1)'!O:O,MATCH(ROW()-2,'POSTE (1)'!$W:$W,0)),IFERROR(INDEX('POSTE (2)'!O:O,MATCH(ROW()-2,'POSTE (2)'!$W:$W,0)),IFERROR(INDEX('POSTE (3)'!O:O,MATCH(ROW()-2,'POSTE (3)'!$W:$W,0)),IFERROR(INDEX('POSTE (4)'!O:O,MATCH(ROW()-2,'POSTE (4)'!$W:$W,0)),IFERROR(INDEX('POSTE (5)'!O:O,MATCH(ROW()-2,'POSTE (5)'!$W:$W,0)),IFERROR(INDEX('POSTE (6)'!O:O,MATCH(ROW()-2,'POSTE (6)'!$W:$W,0)),IFERROR(INDEX('POSTE (7)'!O:O,MATCH(ROW()-2,'POSTE (7)'!$W:$W,0)),IFERROR(INDEX('POSTE (8)'!O:O,MATCH(ROW()-2,'POSTE (8)'!$W:$W,0)),IFERROR(INDEX('POSTE (9)'!O:O,MATCH(ROW()-2,'POSTE (9)'!$W:$W,0)),\"\")))))))))","v":"(8)Ref"},{"$f":"IFERROR(INDEX('POSTE (1)'!P:P,MATCH(ROW()-2,'POSTE (1)'!$W:$W,0)),IFERROR(INDEX('POSTE (2)'!P:P,MATCH(ROW()-2,'POSTE (2)'!$W:$W,0)),IFERROR(INDEX('POSTE (3)'!P:P,MATCH(ROW()-2,'POSTE (3)'!$W:$W,0)),IFERROR(INDEX('POSTE (4)'!P:P,MATCH(ROW()-2,'POSTE (4)'!$W:$W,0)),IFERROR(INDEX('POSTE (5)'!P:P,MATCH(ROW()-2,'POSTE (5)'!$W:$W,0)),IFERROR(INDEX('POSTE (6)'!P:P,MATCH(ROW()-2,'POSTE (6)'!$W:$W,0)),IFERROR(INDEX('POSTE (7)'!P:P,MATCH(ROW()-2,'POSTE (7)'!$W:$W,0)),IFERROR(INDEX('POSTE (8)'!P:P,MATCH(ROW()-2,'POSTE (8)'!$W:$W,0)),IFERROR(INDEX('POSTE (9)'!P:P,MATCH(ROW()-2,'POSTE (9)'!$W:$W,0)),\"\")))))))))","v":"(8)DESIGNATION"},{"$f":"IFERROR(INDEX('POSTE (1)'!Q:Q,MATCH(ROW()-2,'POSTE (1)'!$W:$W,0)),IFERROR(INDEX('POSTE (2)'!Q:Q,MATCH(ROW()-2,'POSTE (2)'!$W:$W,0)),IFERROR(INDEX('POSTE (3)'!Q:Q,MATCH(ROW()-2,'POSTE (3)'!$W:$W,0)),IFERROR(INDEX('POSTE (4)'!Q:Q,MATCH(ROW()-2,'POSTE (4)'!$W:$W,0)),IFERROR(INDEX('POSTE (5)'!Q:Q,MATCH(ROW()-2,'POSTE (5)'!$W:$W,0)),IFERROR(INDEX('POSTE (6)'!Q:Q,MATCH(ROW()-2,'POSTE (6)'!$W:$W,0)),IFERROR(INDEX('POSTE (7)'!Q:Q,MATCH(ROW()-2,'POSTE (7)'!$W:$W,0)),IFERROR(INDEX('POSTE (8)'!Q:Q,MATCH(ROW()-2,'POSTE (8)'!$W:$W,0)),IFERROR(INDEX('POSTE (9)'!Q:Q,MATCH(ROW()-2,'POSTE (9)'!$W:$W,0)),\"\")))))))))","v":"U(8)"},{"$f":"IFERROR(INDEX('POSTE (1)'!R:R,MATCH(ROW()-2,'POSTE (1)'!$W:$W,0)),IFERROR(INDEX('POSTE (2)'!R:R,MATCH(ROW()-2,'POSTE (2)'!$W:$W,0)),IFERROR(INDEX('POSTE (3)'!R:R,MATCH(ROW()-2,'POSTE (3)'!$W:$W,0)),IFERROR(INDEX('POSTE (4)'!R:R,MATCH(ROW()-2,'POSTE (4)'!$W:$W,0)),IFERROR(INDEX('POSTE (5)'!R:R,MATCH(ROW()-2,'POSTE (5)'!$W:$W,0)),IFERROR(INDEX('POSTE (6)'!R:R,MATCH(ROW()-2,'POSTE (6)'!$W:$W,0)),IFERROR(INDEX('POSTE (7)'!R:R,MATCH(ROW()-2,'POSTE (7)'!$W:$W,0)),IFERROR(INDEX('POSTE (8)'!R:R,MATCH(ROW()-2,'POSTE (8)'!$W:$W,0)),IFERROR(INDEX('POSTE (9)'!R:R,MATCH(ROW()-2,'POSTE (9)'!$W:$W,0)),\"\")))))))))","v":8},{"$f":"IFERROR(INDEX('POSTE (1)'!S:S,MATCH(ROW()-2,'POSTE (1)'!$W:$W,0)),IFERROR(INDEX('POSTE (2)'!S:S,MATCH(ROW()-2,'POSTE (2)'!$W:$W,0)),IFERROR(INDEX('POSTE (3)'!S:S,MATCH(ROW()-2,'POSTE (3)'!$W:$W,0)),IFERROR(INDEX('POSTE (4)'!S:S,MATCH(ROW()-2,'POSTE (4)'!$W:$W,0)),IFERROR(INDEX('POSTE (5)'!S:S,MATCH(ROW()-2,'POSTE (5)'!$W:$W,0)),IFERROR(INDEX('POSTE (6)'!S:S,MATCH(ROW()-2,'POSTE (6)'!$W:$W,0)),IFERROR(INDEX('POSTE (7)'!S:S,MATCH(ROW()-2,'POSTE (7)'!$W:$W,0)),IFERROR(INDEX('POSTE (8)'!S:S,MATCH(ROW()-2,'POSTE (8)'!$W:$W,0)),IFERROR(INDEX('POSTE (9)'!S:S,MATCH(ROW()-2,'POSTE (9)'!$W:$W,0)),\"\")))))))))","v":1},{"$f":"IFERROR(INDEX('POSTE (1)'!T:T,MATCH(ROW()-2,'POSTE (1)'!$W:$W,0)),IFERROR(INDEX('POSTE (2)'!T:T,MATCH(ROW()-2,'POSTE (2)'!$W:$W,0)),IFERROR(INDEX('POSTE (3)'!T:T,MATCH(ROW()-2,'POSTE (3)'!$W:$W,0)),IFERROR(INDEX('POSTE (4)'!T:T,MATCH(ROW()-2,'POSTE (4)'!$W:$W,0)),IFERROR(INDEX('POSTE (5)'!T:T,MATCH(ROW()-2,'POSTE (5)'!$W:$W,0)),IFERROR(INDEX('POSTE (6)'!T:T,MATCH(ROW()-2,'POSTE (6)'!$W:$W,0)),IFERROR(INDEX('POSTE (7)'!T:T,MATCH(ROW()-2,'POSTE (7)'!$W:$W,0)),IFERROR(INDEX('POSTE (8)'!T:T,MATCH(ROW()-2,'POSTE (8)'!$W:$W,0)),IFERROR(INDEX('POSTE (9)'!T:T,MATCH(ROW()-2,'POSTE (9)'!$W:$W,0)),\"\")))))))))","v":8},{"$f":"IFERROR(INDEX('POSTE (1)'!U:U,MATCH(ROW()-2,'POSTE (1)'!$W:$W,0)),IFERROR(INDEX('POSTE (2)'!U:U,MATCH(ROW()-2,'POSTE (2)'!$W:$W,0)),IFERROR(INDEX('POSTE (3)'!U:U,MATCH(ROW()-2,'POSTE (3)'!$W:$W,0)),IFERROR(INDEX('POSTE (4)'!U:U,MATCH(ROW()-2,'POSTE (4)'!$W:$W,0)),IFERROR(INDEX('POSTE (5)'!U:U,MATCH(ROW()-2,'POSTE (5)'!$W:$W,0)),IFERROR(INDEX('POSTE (6)'!U:U,MATCH(ROW()-2,'POSTE (6)'!$W:$W,0)),IFERROR(INDEX('POSTE (7)'!U:U,MATCH(ROW()-2,'POSTE (7)'!$W:$W,0)),IFERROR(INDEX('POSTE (8)'!U:U,MATCH(ROW()-2,'POSTE (8)'!$W:$W,0)),IFERROR(INDEX('POSTE (9)'!U:U,MATCH(ROW()-2,'POSTE (9)'!$W:$W,0)),\"\")))))))))","v":"POSTE (8)"}]
[{"$f":"IFERROR(INDEX('POSTE (1)'!N:N,MATCH(ROW()-2,'POSTE (1)'!$W:$W,0)),IFERROR(INDEX('POSTE (2)'!N:N,MATCH(ROW()-2,'POSTE (2)'!$W:$W,0)),IFERROR(INDEX('POSTE (3)'!N:N,MATCH(ROW()-2,'POSTE (3)'!$W:$W,0)),IFERROR(INDEX('POSTE (4)'!N:N,MATCH(ROW()-2,'POSTE (4)'!$W:$W,0)),IFERROR(INDEX('POSTE (5)'!N:N,MATCH(ROW()-2,'POSTE (5)'!$W:$W,0)),IFERROR(INDEX('POSTE (6)'!N:N,MATCH(ROW()-2,'POSTE (6)'!$W:$W,0)),IFERROR(INDEX('POSTE (7)'!N:N,MATCH(ROW()-2,'POSTE (7)'!$W:$W,0)),IFERROR(INDEX('POSTE (8)'!N:N,MATCH(ROW()-2,'POSTE (8)'!$W:$W,0)),IFERROR(INDEX('POSTE (9)'!N:N,MATCH(ROW()-2,'POSTE (9)'!$W:$W,0)),\"\")))))))))","v":"(8)Fournisseur2"},{"$f":"IFERROR(INDEX('POSTE (1)'!O:O,MATCH(ROW()-2,'POSTE (1)'!$W:$W,0)),IFERROR(INDEX('POSTE (2)'!O:O,MATCH(ROW()-2,'POSTE (2)'!$W:$W,0)),IFERROR(INDEX('POSTE (3)'!O:O,MATCH(ROW()-2,'POSTE (3)'!$W:$W,0)),IFERROR(INDEX('POSTE (4)'!O:O,MATCH(ROW()-2,'POSTE (4)'!$W:$W,0)),IFERROR(INDEX('POSTE (5)'!O:O,MATCH(ROW()-2,'POSTE (5)'!$W:$W,0)),IFERROR(INDEX('POSTE (6)'!O:O,MATCH(ROW()-2,'POSTE (6)'!$W:$W,0)),IFERROR(INDEX('POSTE (7)'!O:O,MATCH(ROW()-2,'POSTE (7)'!$W:$W,0)),IFERROR(INDEX('POSTE (8)'!O:O,MATCH(ROW()-2,'POSTE (8)'!$W:$W,0)),IFERROR(INDEX('POSTE (9)'!O:O,MATCH(ROW()-2,'POSTE (9)'!$W:$W,0)),\"\")))))))))","v":"(8)Ref2"},{"$f":"IFERROR(INDEX('POSTE (1)'!P:P,MATCH(ROW()-2,'POSTE (1)'!$W:$W,0)),IFERROR(INDEX('POSTE (2)'!P:P,MATCH(ROW()-2,'POSTE (2)'!$W:$W,0)),IFERROR(INDEX('POSTE (3)'!P:P,MATCH(ROW()-2,'POSTE (3)'!$W:$W,0)),IFERROR(INDEX('POSTE (4)'!P:P,MATCH(ROW()-2,'POSTE (4)'!$W:$W,0)),IFERROR(INDEX('POSTE (5)'!P:P,MATCH(ROW()-2,'POSTE (5)'!$W:$W,0)),IFERROR(INDEX('POSTE (6)'!P:P,MATCH(ROW()-2,'POSTE (6)'!$W:$W,0)),IFERROR(INDEX('POSTE (7)'!P:P,MATCH(ROW()-2,'POSTE (7)'!$W:$W,0)),IFERROR(INDEX('POSTE (8)'!P:P,MATCH(ROW()-2,'POSTE (8)'!$W:$W,0)),IFERROR(INDEX('POSTE (9)'!P:P,MATCH(ROW()-2,'POSTE (9)'!$W:$W,0)),\"\")))))))))","v":"(8)DESIGNATION2"},{"$f":"IFERROR(INDEX('POSTE (1)'!Q:Q,MATCH(ROW()-2,'POSTE (1)'!$W:$W,0)),IFERROR(INDEX('POSTE (2)'!Q:Q,MATCH(ROW()-2,'POSTE (2)'!$W:$W,0)),IFERROR(INDEX('POSTE (3)'!Q:Q,MATCH(ROW()-2,'POSTE (3)'!$W:$W,0)),IFERROR(INDEX('POSTE (4)'!Q:Q,MATCH(ROW()-2,'POSTE (4)'!$W:$W,0)),IFERROR(INDEX('POSTE (5)'!Q:Q,MATCH(ROW()-2,'POSTE (5)'!$W:$W,0)),IFERROR(INDEX('POSTE (6)'!Q:Q,MATCH(ROW()-2,'POSTE (6)'!$W:$W,0)),IFERROR(INDEX('POSTE (7)'!Q:Q,MATCH(ROW()-2,'POSTE (7)'!$W:$W,0)),IFERROR(INDEX('POSTE (8)'!Q:Q,MATCH(ROW()-2,'POSTE (8)'!$W:$W,0)),IFERROR(INDEX('POSTE (9)'!Q:Q,MATCH(ROW()-2,'POSTE (9)'!$W:$W,0)),\"\")))))))))","v":"U(8)"},{"$f":"IFERROR(INDEX('POSTE (1)'!R:R,MATCH(ROW()-2,'POSTE (1)'!$W:$W,0)),IFERROR(INDEX('POSTE (2)'!R:R,MATCH(ROW()-2,'POSTE (2)'!$W:$W,0)),IFERROR(INDEX('POSTE (3)'!R:R,MATCH(ROW()-2,'POSTE (3)'!$W:$W,0)),IFERROR(INDEX('POSTE (4)'!R:R,MATCH(ROW()-2,'POSTE (4)'!$W:$W,0)),IFERROR(INDEX('POSTE (5)'!R:R,MATCH(ROW()-2,'POSTE (5)'!$W:$W,0)),IFERROR(INDEX('POSTE (6)'!R:R,MATCH(ROW()-2,'POSTE (6)'!$W:$W,0)),IFERROR(INDEX('POSTE (7)'!R:R,MATCH(ROW()-2,'POSTE (7)'!$W:$W,0)),IFERROR(INDEX('POSTE (8)'!R:R,MATCH(ROW()-2,'POSTE (8)'!$W:$W,0)),IFERROR(INDEX('POSTE (9)'!R:R,MATCH(ROW()-2,'POSTE (9)'!$W:$W,0)),\"\")))))))))","v":8},{"$f":"IFERROR(INDEX('POSTE (1)'!S:S,MATCH(ROW()-2,'POSTE (1)'!$W:$W,0)),IFERROR(INDEX('POSTE (2)'!S:S,MATCH(ROW()-2,'POSTE (2)'!$W:$W,0)),IFERROR(INDEX('POSTE (3)'!S:S,MATCH(ROW()-2,'POSTE (3)'!$W:$W,0)),IFERROR(INDEX('POSTE (4)'!S:S,MATCH(ROW()-2,'POSTE (4)'!$W:$W,0)),IFERROR(INDEX('POSTE (5)'!S:S,MATCH(ROW()-2,'POSTE (5)'!$W:$W,0)),IFERROR(INDEX('POSTE (6)'!S:S,MATCH(ROW()-2,'POSTE (6)'!$W:$W,0)),IFERROR(INDEX('POSTE (7)'!S:S,MATCH(ROW()-2,'POSTE (7)'!$W:$W,0)),IFERROR(INDEX('POSTE (8)'!S:S,MATCH(ROW()-2,'POSTE (8)'!$W:$W,0)),IFERROR(INDEX('POSTE (9)'!S:S,MATCH(ROW()-2,'POSTE (9)'!$W:$W,0)),\"\")))))))))","v":1},{"$f":"IFERROR(INDEX('POSTE (1)'!T:T,MATCH(ROW()-2,'POSTE (1)'!$W:$W,0)),IFERROR(INDEX('POSTE (2)'!T:T,MATCH(ROW()-2,'POSTE (2)'!$W:$W,0)),IFERROR(INDEX('POSTE (3)'!T:T,MATCH(ROW()-2,'POSTE (3)'!$W:$W,0)),IFERROR(INDEX('POSTE (4)'!T:T,MATCH(ROW()-2,'POSTE (4)'!$W:$W,0)),IFERROR(INDEX('POSTE (5)'!T:T,MATCH(ROW()-2,'POSTE (5)'!$W:$W,0)),IFERROR(INDEX('POSTE (6)'!T:T,MATCH(ROW()-2,'POSTE (6)'!$W:$W,0)),IFERROR(INDEX('POSTE (7)'!T:T,MATCH(ROW()-2,'POSTE (7)'!$W:$W,0)),IFERROR(INDEX('POSTE (8)'!T:T,MATCH(ROW()-2,'POSTE (8)'!$W:$W,0)),IFERROR(INDEX('POSTE (9)'!T:T,MATCH(ROW()-2,'POSTE (9)'!$W:$W,0)),\"\")))))))))","v":8},{"$f":"IFERROR(INDEX('POSTE (1)'!U:U,MATCH(ROW()-2,'POSTE (1)'!$W:$W,0)),IFERROR(INDEX('POSTE (2)'!U:U,MATCH(ROW()-2,'POSTE (2)'!$W:$W,0)),IFERROR(INDEX('POSTE (3)'!U:U,MATCH(ROW()-2,'POSTE (3)'!$W:$W,0)),IFERROR(INDEX('POSTE (4)'!U:U,MATCH(ROW()-2,'POSTE (4)'!$W:$W,0)),IFERROR(INDEX('POSTE (5)'!U:U,MATCH(ROW()-2,'POSTE (5)'!$W:$W,0)),IFERROR(INDEX('POSTE (6)'!U:U,MATCH(ROW()-2,'POSTE (6)'!$W:$W,0)),IFERROR(INDEX('POSTE (7)'!U:U,MATCH(ROW()-2,'POSTE (7)'!$W:$W,0)),IFERROR(INDEX('POSTE (8)'!U:U,MATCH(ROW()-2,'POSTE (8)'!$W:$W,0)),IFERROR(INDEX('POSTE (9)'!U:U,MATCH(ROW()-2,'POSTE (9)'!$W:$W,0)),\"\")))))))))","v":"POSTE (8)"}]
[{"$f":"IFERROR(INDEX('POSTE (1)'!N:N,MATCH(ROW()-2,'POSTE (1)'!$W:$W,0)),IFERROR(INDEX('POSTE (2)'!N:N,MATCH(ROW()-2,'POSTE (2)'!$W:$W,0)),IFERROR(INDEX('POSTE (3)'!N:N,MATCH(ROW()-2,'POSTE (3)'!$W:$W,0)),IFERROR(INDEX('POSTE (4)'!N:N,MATCH(ROW()-2,'POSTE (4)'!$W:$W,0)),IFERROR(INDEX('POSTE (5)'!N:N,MATCH(ROW()-2,'POSTE (5)'!$W:$W,0)),IFERROR(INDEX('POSTE (6)'!N:N,MATCH(ROW()-2,'POSTE (6)'!$W:$W,0)),IFERROR(INDEX('POSTE (7)'!N:N,MATCH(ROW()-2,'POSTE (7)'!$W:$W,0)),IFERROR(INDEX('POSTE (8)'!N:N,MATCH(ROW()-2,'POSTE (8)'!$W:$W,0)),IFERROR(INDEX('POSTE (9)'!N:N,MATCH(ROW()-2,'POSTE (9)'!$W:$W,0)),\"\")))))))))","v":"(8)Fournisseur3"},{"$f":"IFERROR(INDEX('POSTE (1)'!O:O,MATCH(ROW()-2,'POSTE (1)'!$W:$W,0)),IFERROR(INDEX('POSTE (2)'!O:O,MATCH(ROW()-2,'POSTE (2)'!$W:$W,0)),IFERROR(INDEX('POSTE (3)'!O:O,MATCH(ROW()-2,'POSTE (3)'!$W:$W,0)),IFERROR(INDEX('POSTE (4)'!O:O,MATCH(ROW()-2,'POSTE (4)'!$W:$W,0)),IFERROR(INDEX('POSTE (5)'!O:O,MATCH(ROW()-2,'POSTE (5)'!$W:$W,0)),IFERROR(INDEX('POSTE (6)'!O:O,MATCH(ROW()-2,'POSTE (6)'!$W:$W,0)),IFERROR(INDEX('POSTE (7)'!O:O,MATCH(ROW()-2,'POSTE (7)'!$W:$W,0)),IFERROR(INDEX('POSTE (8)'!O:O,MATCH(ROW()-2,'POSTE (8)'!$W:$W,0)),IFERROR(INDEX('POSTE (9)'!O:O,MATCH(ROW()-2,'POSTE (9)'!$W:$W,0)),\"\")))))))))","v":"(8)Ref3"},{"$f":"IFERROR(INDEX('POSTE (1)'!P:P,MATCH(ROW()-2,'POSTE (1)'!$W:$W,0)),IFERROR(INDEX('POSTE (2)'!P:P,MATCH(ROW()-2,'POSTE (2)'!$W:$W,0)),IFERROR(INDEX('POSTE (3)'!P:P,MATCH(ROW()-2,'POSTE (3)'!$W:$W,0)),IFERROR(INDEX('POSTE (4)'!P:P,MATCH(ROW()-2,'POSTE (4)'!$W:$W,0)),IFERROR(INDEX('POSTE (5)'!P:P,MATCH(ROW()-2,'POSTE (5)'!$W:$W,0)),IFERROR(INDEX('POSTE (6)'!P:P,MATCH(ROW()-2,'POSTE (6)'!$W:$W,0)),IFERROR(INDEX('POSTE (7)'!P:P,MATCH(ROW()-2,'POSTE (7)'!$W:$W,0)),IFERROR(INDEX('POSTE (8)'!P:P,MATCH(ROW()-2,'POSTE (8)'!$W:$W,0)),IFERROR(INDEX('POSTE (9)'!P:P,MATCH(ROW()-2,'POSTE (9)'!$W:$W,0)),\"\")))))))))","v":"(8)DESIGNATION3"},{"$f":"IFERROR(INDEX('POSTE (1)'!Q:Q,MATCH(ROW()-2,'POSTE (1)'!$W:$W,0)),IFERROR(INDEX('POSTE (2)'!Q:Q,MATCH(ROW()-2,'POSTE (2)'!$W:$W,0)),IFERROR(INDEX('POSTE (3)'!Q:Q,MATCH(ROW()-2,'POSTE (3)'!$W:$W,0)),IFERROR(INDEX('POSTE (4)'!Q:Q,MATCH(ROW()-2,'POSTE (4)'!$W:$W,0)),IFERROR(INDEX('POSTE (5)'!Q:Q,MATCH(ROW()-2,'POSTE (5)'!$W:$W,0)),IFERROR(INDEX('POSTE (6)'!Q:Q,MATCH(ROW()-2,'POSTE (6)'!$W:$W,0)),IFERROR(INDEX('POSTE (7)'!Q:Q,MATCH(ROW()-2,'POSTE (7)'!$W:$W,0)),IFERROR(INDEX('POSTE (8)'!Q:Q,MATCH(ROW()-2,'POSTE (8)'!$W:$W,0)),IFERROR(INDEX('POSTE (9)'!Q:Q,MATCH(ROW()-2,'POSTE (9)'!$W:$W,0)),\"\")))))))))","v":"U(8)"},{"$f":"IFERROR(INDEX('POSTE (1)'!R:R,MATCH(ROW()-2,'POSTE (1)'!$W:$W,0)),IFERROR(INDEX('POSTE (2)'!R:R,MATCH(ROW()-2,'POSTE (2)'!$W:$W,0)),IFERROR(INDEX('POSTE (3)'!R:R,MATCH(ROW()-2,'POSTE (3)'!$W:$W,0)),IFERROR(INDEX('POSTE (4)'!R:R,MATCH(ROW()-2,'POSTE (4)'!$W:$W,0)),IFERROR(INDEX('POSTE (5)'!R:R,MATCH(ROW()-2,'POSTE (5)'!$W:$W,0)),IFERROR(INDEX('POSTE (6)'!R:R,MATCH(ROW()-2,'POSTE (6)'!$W:$W,0)),IFERROR(INDEX('POSTE (7)'!R:R,MATCH(ROW()-2,'POSTE (7)'!$W:$W,0)),IFERROR(INDEX('POSTE (8)'!R:R,MATCH(ROW()-2,'POSTE (8)'!$W:$W,0)),IFERROR(INDEX('POSTE (9)'!R:R,MATCH(ROW()-2,'POSTE (9)'!$W:$W,0)),\"\")))))))))","v":8},{"$f":"IFERROR(INDEX('POSTE (1)'!S:S,MATCH(ROW()-2,'POSTE (1)'!$W:$W,0)),IFERROR(INDEX('POSTE (2)'!S:S,MATCH(ROW()-2,'POSTE (2)'!$W:$W,0)),IFERROR(INDEX('POSTE (3)'!S:S,MATCH(ROW()-2,'POSTE (3)'!$W:$W,0)),IFERROR(INDEX('POSTE (4)'!S:S,MATCH(ROW()-2,'POSTE (4)'!$W:$W,0)),IFERROR(INDEX('POSTE (5)'!S:S,MATCH(ROW()-2,'POSTE (5)'!$W:$W,0)),IFERROR(INDEX('POSTE (6)'!S:S,MATCH(ROW()-2,'POSTE (6)'!$W:$W,0)),IFERROR(INDEX('POSTE (7)'!S:S,MATCH(ROW()-2,'POSTE (7)'!$W:$W,0)),IFERROR(INDEX('POSTE (8)'!S:S,MATCH(ROW()-2,'POSTE (8)'!$W:$W,0)),IFERROR(INDEX('POSTE (9)'!S:S,MATCH(ROW()-2,'POSTE (9)'!$W:$W,0)),\"\")))))))))","v":1},{"$f":"IFERROR(INDEX('POSTE (1)'!T:T,MATCH(ROW()-2,'POSTE (1)'!$W:$W,0)),IFERROR(INDEX('POSTE (2)'!T:T,MATCH(ROW()-2,'POSTE (2)'!$W:$W,0)),IFERROR(INDEX('POSTE (3)'!T:T,MATCH(ROW()-2,'POSTE (3)'!$W:$W,0)),IFERROR(INDEX('POSTE (4)'!T:T,MATCH(ROW()-2,'POSTE (4)'!$W:$W,0)),IFERROR(INDEX('POSTE (5)'!T:T,MATCH(ROW()-2,'POSTE (5)'!$W:$W,0)),IFERROR(INDEX('POSTE (6)'!T:T,MATCH(ROW()-2,'POSTE (6)'!$W:$W,0)),IFERROR(INDEX('POSTE (7)'!T:T,MATCH(ROW()-2,'POSTE (7)'!$W:$W,0)),IFERROR(INDEX('POSTE (8)'!T:T,MATCH(ROW()-2,'POSTE (8)'!$W:$W,0)),IFERROR(INDEX('POSTE (9)'!T:T,MATCH(ROW()-2,'POSTE (9)'!$W:$W,0)),\"\")))))))))","v":8},{"$f":"IFERROR(INDEX('POSTE (1)'!U:U,MATCH(ROW()-2,'POSTE (1)'!$W:$W,0)),IFERROR(INDEX('POSTE (2)'!U:U,MATCH(ROW()-2,'POSTE (2)'!$W:$W,0)),IFERROR(INDEX('POSTE (3)'!U:U,MATCH(ROW()-2,'POSTE (3)'!$W:$W,0)),IFERROR(INDEX('POSTE (4)'!U:U,MATCH(ROW()-2,'POSTE (4)'!$W:$W,0)),IFERROR(INDEX('POSTE (5)'!U:U,MATCH(ROW()-2,'POSTE (5)'!$W:$W,0)),IFERROR(INDEX('POSTE (6)'!U:U,MATCH(ROW()-2,'POSTE (6)'!$W:$W,0)),IFERROR(INDEX('POSTE (7)'!U:U,MATCH(ROW()-2,'POSTE (7)'!$W:$W,0)),IFERROR(INDEX('POSTE (8)'!U:U,MATCH(ROW()-2,'POSTE (8)'!$W:$W,0)),IFERROR(INDEX('POSTE (9)'!U:U,MATCH(ROW()-2,'POSTE (9)'!$W:$W,0)),\"\")))))))))","v":"POSTE (8)"}]
[{"$f":"IFERROR(INDEX('POSTE (1)'!N:N,MATCH(ROW()-2,'POSTE (1)'!$W:$W,0)),IFERROR(INDEX('POSTE (2)'!N:N,MATCH(ROW()-2,'POSTE (2)'!$W:$W,0)),IFERROR(INDEX('POSTE (3)'!N:N,MATCH(ROW()-2,'POSTE (3)'!$W:$W,0)),IFERROR(INDEX('POSTE (4)'!N:N,MATCH(ROW()-2,'POSTE (4)'!$W:$W,0)),IFERROR(INDEX('POSTE (5)'!N:N,MATCH(ROW()-2,'POSTE (5)'!$W:$W,0)),IFERROR(INDEX('POSTE (6)'!N:N,MATCH(ROW()-2,'POSTE (6)'!$W:$W,0)),IFERROR(INDEX('POSTE (7)'!N:N,MATCH(ROW()-2,'POSTE (7)'!$W:$W,0)),IFERROR(INDEX('POSTE (8)'!N:N,MATCH(ROW()-2,'POSTE (8)'!$W:$W,0)),IFERROR(INDEX('POSTE (9)'!N:N,MATCH(ROW()-2,'POSTE (9)'!$W:$W,0)),\"\")))))))))","v":"(8)Fournisseur4"},{"$f":"IFERROR(INDEX('POSTE (1)'!O:O,MATCH(ROW()-2,'POSTE (1)'!$W:$W,0)),IFERROR(INDEX('POSTE (2)'!O:O,MATCH(ROW()-2,'POSTE (2)'!$W:$W,0)),IFERROR(INDEX('POSTE (3)'!O:O,MATCH(ROW()-2,'POSTE (3)'!$W:$W,0)),IFERROR(INDEX('POSTE (4)'!O:O,MATCH(ROW()-2,'POSTE (4)'!$W:$W,0)),IFERROR(INDEX('POSTE (5)'!O:O,MATCH(ROW()-2,'POSTE (5)'!$W:$W,0)),IFERROR(INDEX('POSTE (6)'!O:O,MATCH(ROW()-2,'POSTE (6)'!$W:$W,0)),IFERROR(INDEX('POSTE (7)'!O:O,MATCH(ROW()-2,'POSTE (7)'!$W:$W,0)),IFERROR(INDEX('POSTE (8)'!O:O,MATCH(ROW()-2,'POSTE (8)'!$W:$W,0)),IFERROR(INDEX('POSTE (9)'!O:O,MATCH(ROW()-2,'POSTE (9)'!$W:$W,0)),\"\")))))))))","v":"(8)Ref4"},{"$f":"IFERROR(INDEX('POSTE (1)'!P:P,MATCH(ROW()-2,'POSTE (1)'!$W:$W,0)),IFERROR(INDEX('POSTE (2)'!P:P,MATCH(ROW()-2,'POSTE (2)'!$W:$W,0)),IFERROR(INDEX('POSTE (3)'!P:P,MATCH(ROW()-2,'POSTE (3)'!$W:$W,0)),IFERROR(INDEX('POSTE (4)'!P:P,MATCH(ROW()-2,'POSTE (4)'!$W:$W,0)),IFERROR(INDEX('POSTE (5)'!P:P,MATCH(ROW()-2,'POSTE (5)'!$W:$W,0)),IFERROR(INDEX('POSTE (6)'!P:P,MATCH(ROW()-2,'POSTE (6)'!$W:$W,0)),IFERROR(INDEX('POSTE (7)'!P:P,MATCH(ROW()-2,'POSTE (7)'!$W:$W,0)),IFERROR(INDEX('POSTE (8)'!P:P,MATCH(ROW()-2,'POSTE (8)'!$W:$W,0)),IFERROR(INDEX('POSTE (9)'!P:P,MATCH(ROW()-2,'POSTE (9)'!$W:$W,0)),\"\")))))))))","v":"(8)DESIGNATION4"},{"$f":"IFERROR(INDEX('POSTE (1)'!Q:Q,MATCH(ROW()-2,'POSTE (1)'!$W:$W,0)),IFERROR(INDEX('POSTE (2)'!Q:Q,MATCH(ROW()-2,'POSTE (2)'!$W:$W,0)),IFERROR(INDEX('POSTE (3)'!Q:Q,MATCH(ROW()-2,'POSTE (3)'!$W:$W,0)),IFERROR(INDEX('POSTE (4)'!Q:Q,MATCH(ROW()-2,'POSTE (4)'!$W:$W,0)),IFERROR(INDEX('POSTE (5)'!Q:Q,MATCH(ROW()-2,'POSTE (5)'!$W:$W,0)),IFERROR(INDEX('POSTE (6)'!Q:Q,MATCH(ROW()-2,'POSTE (6)'!$W:$W,0)),IFERROR(INDEX('POSTE (7)'!Q:Q,MATCH(ROW()-2,'POSTE (7)'!$W:$W,0)),IFERROR(INDEX('POSTE (8)'!Q:Q,MATCH(ROW()-2,'POSTE (8)'!$W:$W,0)),IFERROR(INDEX('POSTE (9)'!Q:Q,MATCH(ROW()-2,'POSTE (9)'!$W:$W,0)),\"\")))))))))","v":"U(8)"},{"$f":"IFERROR(INDEX('POSTE (1)'!R:R,MATCH(ROW()-2,'POSTE (1)'!$W:$W,0)),IFERROR(INDEX('POSTE (2)'!R:R,MATCH(ROW()-2,'POSTE (2)'!$W:$W,0)),IFERROR(INDEX('POSTE (3)'!R:R,MATCH(ROW()-2,'POSTE (3)'!$W:$W,0)),IFERROR(INDEX('POSTE (4)'!R:R,MATCH(ROW()-2,'POSTE (4)'!$W:$W,0)),IFERROR(INDEX('POSTE (5)'!R:R,MATCH(ROW()-2,'POSTE (5)'!$W:$W,0)),IFERROR(INDEX('POSTE (6)'!R:R,MATCH(ROW()-2,'POSTE (6)'!$W:$W,0)),IFERROR(INDEX('POSTE (7)'!R:R,MATCH(ROW()-2,'POSTE (7)'!$W:$W,0)),IFERROR(INDEX('POSTE (8)'!R:R,MATCH(ROW()-2,'POSTE (8)'!$W:$W,0)),IFERROR(INDEX('POSTE (9)'!R:R,MATCH(ROW()-2,'POSTE (9)'!$W:$W,0)),\"\")))))))))","v":8},{"$f":"IFERROR(INDEX('POSTE (1)'!S:S,MATCH(ROW()-2,'POSTE (1)'!$W:$W,0)),IFERROR(INDEX('POSTE (2)'!S:S,MATCH(ROW()-2,'POSTE (2)'!$W:$W,0)),IFERROR(INDEX('POSTE (3)'!S:S,MATCH(ROW()-2,'POSTE (3)'!$W:$W,0)),IFERROR(INDEX('POSTE (4)'!S:S,MATCH(ROW()-2,'POSTE (4)'!$W:$W,0)),IFERROR(INDEX('POSTE (5)'!S:S,MATCH(ROW()-2,'POSTE (5)'!$W:$W,0)),IFERROR(INDEX('POSTE (6)'!S:S,MATCH(ROW()-2,'POSTE (6)'!$W:$W,0)),IFERROR(INDEX('POSTE (7)'!S:S,MATCH(ROW()-2,'POSTE (7)'!$W:$W,0)),IFERROR(INDEX('POSTE (8)'!S:S,MATCH(ROW()-2,'POSTE (8)'!$W:$W,0)),IFERROR(INDEX('POSTE (9)'!S:S,MATCH(ROW()-2,'POSTE (9)'!$W:$W,0)),\"\")))))))))","v":1},{"$f":"IFERROR(INDEX('POSTE (1)'!T:T,MATCH(ROW()-2,'POSTE (1)'!$W:$W,0)),IFERROR(INDEX('POSTE (2)'!T:T,MATCH(ROW()-2,'POSTE (2)'!$W:$W,0)),IFERROR(INDEX('POSTE (3)'!T:T,MATCH(ROW()-2,'POSTE (3)'!$W:$W,0)),IFERROR(INDEX('POSTE (4)'!T:T,MATCH(ROW()-2,'POSTE (4)'!$W:$W,0)),IFERROR(INDEX('POSTE (5)'!T:T,MATCH(ROW()-2,'POSTE (5)'!$W:$W,0)),IFERROR(INDEX('POSTE (6)'!T:T,MATCH(ROW()-2,'POSTE (6)'!$W:$W,0)),IFERROR(INDEX('POSTE (7)'!T:T,MATCH(ROW()-2,'POSTE (7)'!$W:$W,0)),IFERROR(INDEX('POSTE (8)'!T:T,MATCH(ROW()-2,'POSTE (8)'!$W:$W,0)),IFERROR(INDEX('POSTE (9)'!T:T,MATCH(ROW()-2,'POSTE (9)'!$W:$W,0)),\"\")))))))))","v":8},{"$f":"IFERROR(INDEX('POSTE (1)'!U:U,MATCH(ROW()-2,'POSTE (1)'!$W:$W,0)),IFERROR(INDEX('POSTE (2)'!U:U,MATCH(ROW()-2,'POSTE (2)'!$W:$W,0)),IFERROR(INDEX('POSTE (3)'!U:U,MATCH(ROW()-2,'POSTE (3)'!$W:$W,0)),IFERROR(INDEX('POSTE (4)'!U:U,MATCH(ROW()-2,'POSTE (4)'!$W:$W,0)),IFERROR(INDEX('POSTE (5)'!U:U,MATCH(ROW()-2,'POSTE (5)'!$W:$W,0)),IFERROR(INDEX('POSTE (6)'!U:U,MATCH(ROW()-2,'POSTE (6)'!$W:$W,0)),IFERROR(INDEX('POSTE (7)'!U:U,MATCH(ROW()-2,'POSTE (7)'!$W:$W,0)),IFERROR(INDEX('POSTE (8)'!U:U,MATCH(ROW()-2,'POSTE (8)'!$W:$W,0)),IFERROR(INDEX('POSTE (9)'!U:U,MATCH(ROW()-2,'POSTE (9)'!$W:$W,0)),\"\")))))))))","v":"POSTE (8)"}]
[{"$f":"IFERROR(INDEX('POSTE (1)'!N:N,MATCH(ROW()-2,'POSTE (1)'!$W:$W,0)),IFERROR(INDEX('POSTE (2)'!N:N,MATCH(ROW()-2,'POSTE (2)'!$W:$W,0)),IFERROR(INDEX('POSTE (3)'!N:N,MATCH(ROW()-2,'POSTE (3)'!$W:$W,0)),IFERROR(INDEX('POSTE (4)'!N:N,MATCH(ROW()-2,'POSTE (4)'!$W:$W,0)),IFERROR(INDEX('POSTE (5)'!N:N,MATCH(ROW()-2,'POSTE (5)'!$W:$W,0)),IFERROR(INDEX('POSTE (6)'!N:N,MATCH(ROW()-2,'POSTE (6)'!$W:$W,0)),IFERROR(INDEX('POSTE (7)'!N:N,MATCH(ROW()-2,'POSTE (7)'!$W:$W,0)),IFERROR(INDEX('POSTE (8)'!N:N,MATCH(ROW()-2,'POSTE (8)'!$W:$W,0)),IFERROR(INDEX('POSTE (9)'!N:N,MATCH(ROW()-2,'POSTE (9)'!$W:$W,0)),\"\")))))))))","v":"(8)Fournisseur5"},{"$f":"IFERROR(INDEX('POSTE (1)'!O:O,MATCH(ROW()-2,'POSTE (1)'!$W:$W,0)),IFERROR(INDEX('POSTE (2)'!O:O,MATCH(ROW()-2,'POSTE (2)'!$W:$W,0)),IFERROR(INDEX('POSTE (3)'!O:O,MATCH(ROW()-2,'POSTE (3)'!$W:$W,0)),IFERROR(INDEX('POSTE (4)'!O:O,MATCH(ROW()-2,'POSTE (4)'!$W:$W,0)),IFERROR(INDEX('POSTE (5)'!O:O,MATCH(ROW()-2,'POSTE (5)'!$W:$W,0)),IFERROR(INDEX('POSTE (6)'!O:O,MATCH(ROW()-2,'POSTE (6)'!$W:$W,0)),IFERROR(INDEX('POSTE (7)'!O:O,MATCH(ROW()-2,'POSTE (7)'!$W:$W,0)),IFERROR(INDEX('POSTE (8)'!O:O,MATCH(ROW()-2,'POSTE (8)'!$W:$W,0)),IFERROR(INDEX('POSTE (9)'!O:O,MATCH(ROW()-2,'POSTE (9)'!$W:$W,0)),\"\")))))))))","v":"(8)Ref5"},{"$f":"IFERROR(INDEX('POSTE (1)'!P:P,MATCH(ROW()-2,'POSTE (1)'!$W:$W,0)),IFERROR(INDEX('POSTE (2)'!P:P,MATCH(ROW()-2,'POSTE (2)'!$W:$W,0)),IFERROR(INDEX('POSTE (3)'!P:P,MATCH(ROW()-2,'POSTE (3)'!$W:$W,0)),IFERROR(INDEX('POSTE (4)'!P:P,MATCH(ROW()-2,'POSTE (4)'!$W:$W,0)),IFERROR(INDEX('POSTE (5)'!P:P,MATCH(ROW()-2,'POSTE (5)'!$W:$W,0)),IFERROR(INDEX('POSTE (6)'!P:P,MATCH(ROW()-2,'POSTE (6)'!$W:$W,0)),IFERROR(INDEX('POSTE (7)'!P:P,MATCH(ROW()-2,'POSTE (7)'!$W:$W,0)),IFERROR(INDEX('POSTE (8)'!P:P,MATCH(ROW()-2,'POSTE (8)'!$W:$W,0)),IFERROR(INDEX('POSTE (9)'!P:P,MATCH(ROW()-2,'POSTE (9)'!$W:$W,0)),\"\")))))))))","v":"(8)DESIGNATION5"},{"$f":"IFERROR(INDEX('POSTE (1)'!Q:Q,MATCH(ROW()-2,'POSTE (1)'!$W:$W,0)),IFERROR(INDEX('POSTE (2)'!Q:Q,MATCH(ROW()-2,'POSTE (2)'!$W:$W,0)),IFERROR(INDEX('POSTE (3)'!Q:Q,MATCH(ROW()-2,'POSTE (3)'!$W:$W,0)),IFERROR(INDEX('POSTE (4)'!Q:Q,MATCH(ROW()-2,'POSTE (4)'!$W:$W,0)),IFERROR(INDEX('POSTE (5)'!Q:Q,MATCH(ROW()-2,'POSTE (5)'!$W:$W,0)),IFERROR(INDEX('POSTE (6)'!Q:Q,MATCH(ROW()-2,'POSTE (6)'!$W:$W,0)),IFERROR(INDEX('POSTE (7)'!Q:Q,MATCH(ROW()-2,'POSTE (7)'!$W:$W,0)),IFERROR(INDEX('POSTE (8)'!Q:Q,MATCH(ROW()-2,'POSTE (8)'!$W:$W,0)),IFERROR(INDEX('POSTE (9)'!Q:Q,MATCH(ROW()-2,'POSTE (9)'!$W:$W,0)),\"\")))))))))","v":"U(8)"},{"$f":"IFERROR(INDEX('POSTE (1)'!R:R,MATCH(ROW()-2,'POSTE (1)'!$W:$W,0)),IFERROR(INDEX('POSTE (2)'!R:R,MATCH(ROW()-2,'POSTE (2)'!$W:$W,0)),IFERROR(INDEX('POSTE (3)'!R:R,MATCH(ROW()-2,'POSTE (3)'!$W:$W,0)),IFERROR(INDEX('POSTE (4)'!R:R,MATCH(ROW()-2,'POSTE (4)'!$W:$W,0)),IFERROR(INDEX('POSTE (5)'!R:R,MATCH(ROW()-2,'POSTE (5)'!$W:$W,0)),IFERROR(INDEX('POSTE (6)'!R:R,MATCH(ROW()-2,'POSTE (6)'!$W:$W,0)),IFERROR(INDEX('POSTE (7)'!R:R,MATCH(ROW()-2,'POSTE (7)'!$W:$W,0)),IFERROR(INDEX('POSTE (8)'!R:R,MATCH(ROW()-2,'POSTE (8)'!$W:$W,0)),IFERROR(INDEX('POSTE (9)'!R:R,MATCH(ROW()-2,'POSTE (9)'!$W:$W,0)),\"\")))))))))","v":8},{"$f":"IFERROR(INDEX('POSTE (1)'!S:S,MATCH(ROW()-2,'POSTE (1)'!$W:$W,0)),IFERROR(INDEX('POSTE (2)'!S:S,MATCH(ROW()-2,'POSTE (2)'!$W:$W,0)),IFERROR(INDEX('POSTE (3)'!S:S,MATCH(ROW()-2,'POSTE (3)'!$W:$W,0)),IFERROR(INDEX('POSTE (4)'!S:S,MATCH(ROW()-2,'POSTE (4)'!$W:$W,0)),IFERROR(INDEX('POSTE (5)'!S:S,MATCH(ROW()-2,'POSTE (5)'!$W:$W,0)),IFERROR(INDEX('POSTE (6)'!S:S,MATCH(ROW()-2,'POSTE (6)'!$W:$W,0)),IFERROR(INDEX('POSTE (7)'!S:S,MATCH(ROW()-2,'POSTE (7)'!$W:$W,0)),IFERROR(INDEX('POSTE (8)'!S:S,MATCH(ROW()-2,'POSTE (8)'!$W:$W,0)),IFERROR(INDEX('POSTE (9)'!S:S,MATCH(ROW()-2,'POSTE (9)'!$W:$W,0)),\"\")))))))))","v":1},{"$f":"IFERROR(INDEX('POSTE (1)'!T:T,MATCH(ROW()-2,'POSTE (1)'!$W:$W,0)),IFERROR(INDEX('POSTE (2)'!T:T,MATCH(ROW()-2,'POSTE (2)'!$W:$W,0)),IFERROR(INDEX('POSTE (3)'!T:T,MATCH(ROW()-2,'POSTE (3)'!$W:$W,0)),IFERROR(INDEX('POSTE (4)'!T:T,MATCH(ROW()-2,'POSTE (4)'!$W:$W,0)),IFERROR(INDEX('POSTE (5)'!T:T,MATCH(ROW()-2,'POSTE (5)'!$W:$W,0)),IFERROR(INDEX('POSTE (6)'!T:T,MATCH(ROW()-2,'POSTE (6)'!$W:$W,0)),IFERROR(INDEX('POSTE (7)'!T:T,MATCH(ROW()-2,'POSTE (7)'!$W:$W,0)),IFERROR(INDEX('POSTE (8)'!T:T,MATCH(ROW()-2,'POSTE (8)'!$W:$W,0)),IFERROR(INDEX('POSTE (9)'!T:T,MATCH(ROW()-2,'POSTE (9)'!$W:$W,0)),\"\")))))))))","v":8},{"$f":"IFERROR(INDEX('POSTE (1)'!U:U,MATCH(ROW()-2,'POSTE (1)'!$W:$W,0)),IFERROR(INDEX('POSTE (2)'!U:U,MATCH(ROW()-2,'POSTE (2)'!$W:$W,0)),IFERROR(INDEX('POSTE (3)'!U:U,MATCH(ROW()-2,'POSTE (3)'!$W:$W,0)),IFERROR(INDEX('POSTE (4)'!U:U,MATCH(ROW()-2,'POSTE (4)'!$W:$W,0)),IFERROR(INDEX('POSTE (5)'!U:U,MATCH(ROW()-2,'POSTE (5)'!$W:$W,0)),IFERROR(INDEX('POSTE (6)'!U:U,MATCH(ROW()-2,'POSTE (6)'!$W:$W,0)),IFERROR(INDEX('POSTE (7)'!U:U,MATCH(ROW()-2,'POSTE (7)'!$W:$W,0)),IFERROR(INDEX('POSTE (8)'!U:U,MATCH(ROW()-2,'POSTE (8)'!$W:$W,0)),IFERROR(INDEX('POSTE (9)'!U:U,MATCH(ROW()-2,'POSTE (9)'!$W:$W,0)),\"\")))))))))","v":"POSTE (8)"}]
[{"$f":"IFERROR(INDEX('POSTE (1)'!N:N,MATCH(ROW()-2,'POSTE (1)'!$W:$W,0)),IFERROR(INDEX('POSTE (2)'!N:N,MATCH(ROW()-2,'POSTE (2)'!$W:$W,0)),IFERROR(INDEX('POSTE (3)'!N:N,MATCH(ROW()-2,'POSTE (3)'!$W:$W,0)),IFERROR(INDEX('POSTE (4)'!N:N,MATCH(ROW()-2,'POSTE (4)'!$W:$W,0)),IFERROR(INDEX('POSTE (5)'!N:N,MATCH(ROW()-2,'POSTE (5)'!$W:$W,0)),IFERROR(INDEX('POSTE (6)'!N:N,MATCH(ROW()-2,'POSTE (6)'!$W:$W,0)),IFERROR(INDEX('POSTE (7)'!N:N,MATCH(ROW()-2,'POSTE (7)'!$W:$W,0)),IFERROR(INDEX('POSTE (8)'!N:N,MATCH(ROW()-2,'POSTE (8)'!$W:$W,0)),IFERROR(INDEX('POSTE (9)'!N:N,MATCH(ROW()-2,'POSTE (9)'!$W:$W,0)),\"\")))))))))","v":"(8)Fournisseur6"},{"$f":"IFERROR(INDEX('POSTE (1)'!O:O,MATCH(ROW()-2,'POSTE (1)'!$W:$W,0)),IFERROR(INDEX('POSTE (2)'!O:O,MATCH(ROW()-2,'POSTE (2)'!$W:$W,0)),IFERROR(INDEX('POSTE (3)'!O:O,MATCH(ROW()-2,'POSTE (3)'!$W:$W,0)),IFERROR(INDEX('POSTE (4)'!O:O,MATCH(ROW()-2,'POSTE (4)'!$W:$W,0)),IFERROR(INDEX('POSTE (5)'!O:O,MATCH(ROW()-2,'POSTE (5)'!$W:$W,0)),IFERROR(INDEX('POSTE (6)'!O:O,MATCH(ROW()-2,'POSTE (6)'!$W:$W,0)),IFERROR(INDEX('POSTE (7)'!O:O,MATCH(ROW()-2,'POSTE (7)'!$W:$W,0)),IFERROR(INDEX('POSTE (8)'!O:O,MATCH(ROW()-2,'POSTE (8)'!$W:$W,0)),IFERROR(INDEX('POSTE (9)'!O:O,MATCH(ROW()-2,'POSTE (9)'!$W:$W,0)),\"\")))))))))","v":"(8)Ref6"},{"$f":"IFERROR(INDEX('POSTE (1)'!P:P,MATCH(ROW()-2,'POSTE (1)'!$W:$W,0)),IFERROR(INDEX('POSTE (2)'!P:P,MATCH(ROW()-2,'POSTE (2)'!$W:$W,0)),IFERROR(INDEX('POSTE (3)'!P:P,MATCH(ROW()-2,'POSTE (3)'!$W:$W,0)),IFERROR(INDEX('POSTE (4)'!P:P,MATCH(ROW()-2,'POSTE (4)'!$W:$W,0)),IFERROR(INDEX('POSTE (5)'!P:P,MATCH(ROW()-2,'POSTE (5)'!$W:$W,0)),IFERROR(INDEX('POSTE (6)'!P:P,MATCH(ROW()-2,'POSTE (6)'!$W:$W,0)),IFERROR(INDEX('POSTE (7)'!P:P,MATCH(ROW()-2,'POSTE (7)'!$W:$W,0)),IFERROR(INDEX('POSTE (8)'!P:P,MATCH(ROW()-2,'POSTE (8)'!$W:$W,0)),IFERROR(INDEX('POSTE (9)'!P:P,MATCH(ROW()-2,'POSTE (9)'!$W:$W,0)),\"\")))))))))","v":"(8)DESIGNATION6"},{"$f":"IFERROR(INDEX('POSTE (1)'!Q:Q,MATCH(ROW()-2,'POSTE (1)'!$W:$W,0)),IFERROR(INDEX('POSTE (2)'!Q:Q,MATCH(ROW()-2,'POSTE (2)'!$W:$W,0)),IFERROR(INDEX('POSTE (3)'!Q:Q,MATCH(ROW()-2,'POSTE (3)'!$W:$W,0)),IFERROR(INDEX('POSTE (4)'!Q:Q,MATCH(ROW()-2,'POSTE (4)'!$W:$W,0)),IFERROR(INDEX('POSTE (5)'!Q:Q,MATCH(ROW()-2,'POSTE (5)'!$W:$W,0)),IFERROR(INDEX('POSTE (6)'!Q:Q,MATCH(ROW()-2,'POSTE (6)'!$W:$W,0)),IFERROR(INDEX('POSTE (7)'!Q:Q,MATCH(ROW()-2,'POSTE (7)'!$W:$W,0)),IFERROR(INDEX('POSTE (8)'!Q:Q,MATCH(ROW()-2,'POSTE (8)'!$W:$W,0)),IFERROR(INDEX('POSTE (9)'!Q:Q,MATCH(ROW()-2,'POSTE (9)'!$W:$W,0)),\"\")))))))))","v":"U(8)"},{"$f":"IFERROR(INDEX('POSTE (1)'!R:R,MATCH(ROW()-2,'POSTE (1)'!$W:$W,0)),IFERROR(INDEX('POSTE (2)'!R:R,MATCH(ROW()-2,'POSTE (2)'!$W:$W,0)),IFERROR(INDEX('POSTE (3)'!R:R,MATCH(ROW()-2,'POSTE (3)'!$W:$W,0)),IFERROR(INDEX('POSTE (4)'!R:R,MATCH(ROW()-2,'POSTE (4)'!$W:$W,0)),IFERROR(INDEX('POSTE (5)'!R:R,MATCH(ROW()-2,'POSTE (5)'!$W:$W,0)),IFERROR(INDEX('POSTE (6)'!R:R,MATCH(ROW()-2,'POSTE (6)'!$W:$W,0)),IFERROR(INDEX('POSTE (7)'!R:R,MATCH(ROW()-2,'POSTE (7)'!$W:$W,0)),IFERROR(INDEX('POSTE (8)'!R:R,MATCH(ROW()-2,'POSTE (8)'!$W:$W,0)),IFERROR(INDEX('POSTE (9)'!R:R,MATCH(ROW()-2,'POSTE (9)'!$W:$W,0)),\"\")))))))))","v":8},{"$f":"IFERROR(INDEX('POSTE (1)'!S:S,MATCH(ROW()-2,'POSTE (1)'!$W:$W,0)),IFERROR(INDEX('POSTE (2)'!S:S,MATCH(ROW()-2,'POSTE (2)'!$W:$W,0)),IFERROR(INDEX('POSTE (3)'!S:S,MATCH(ROW()-2,'POSTE (3)'!$W:$W,0)),IFERROR(INDEX('POSTE (4)'!S:S,MATCH(ROW()-2,'POSTE (4)'!$W:$W,0)),IFERROR(INDEX('POSTE (5)'!S:S,MATCH(ROW()-2,'POSTE (5)'!$W:$W,0)),IFERROR(INDEX('POSTE (6)'!S:S,MATCH(ROW()-2,'POSTE (6)'!$W:$W,0)),IFERROR(INDEX('POSTE (7)'!S:S,MATCH(ROW()-2,'POSTE (7)'!$W:$W,0)),IFERROR(INDEX('POSTE (8)'!S:S,MATCH(ROW()-2,'POSTE (8)'!$W:$W,0)),IFERROR(INDEX('POSTE (9)'!S:S,MATCH(ROW()-2,'POSTE (9)'!$W:$W,0)),\"\")))))))))","v":1},{"$f":"IFERROR(INDEX('POSTE (1)'!T:T,MATCH(ROW()-2,'POSTE (1)'!$W:$W,0)),IFERROR(INDEX('POSTE (2)'!T:T,MATCH(ROW()-2,'POSTE (2)'!$W:$W,0)),IFERROR(INDEX('POSTE (3)'!T:T,MATCH(ROW()-2,'POSTE (3)'!$W:$W,0)),IFERROR(INDEX('POSTE (4)'!T:T,MATCH(ROW()-2,'POSTE (4)'!$W:$W,0)),IFERROR(INDEX('POSTE (5)'!T:T,MATCH(ROW()-2,'POSTE (5)'!$W:$W,0)),IFERROR(INDEX('POSTE (6)'!T:T,MATCH(ROW()-2,'POSTE (6)'!$W:$W,0)),IFERROR(INDEX('POSTE (7)'!T:T,MATCH(ROW()-2,'POSTE (7)'!$W:$W,0)),IFERROR(INDEX('POSTE (8)'!T:T,MATCH(ROW()-2,'POSTE (8)'!$W:$W,0)),IFERROR(INDEX('POSTE (9)'!T:T,MATCH(ROW()-2,'POSTE (9)'!$W:$W,0)),\"\")))))))))","v":8},{"$f":"IFERROR(INDEX('POSTE (1)'!U:U,MATCH(ROW()-2,'POSTE (1)'!$W:$W,0)),IFERROR(INDEX('POSTE (2)'!U:U,MATCH(ROW()-2,'POSTE (2)'!$W:$W,0)),IFERROR(INDEX('POSTE (3)'!U:U,MATCH(ROW()-2,'POSTE (3)'!$W:$W,0)),IFERROR(INDEX('POSTE (4)'!U:U,MATCH(ROW()-2,'POSTE (4)'!$W:$W,0)),IFERROR(INDEX('POSTE (5)'!U:U,MATCH(ROW()-2,'POSTE (5)'!$W:$W,0)),IFERROR(INDEX('POSTE (6)'!U:U,MATCH(ROW()-2,'POSTE (6)'!$W:$W,0)),IFERROR(INDEX('POSTE (7)'!U:U,MATCH(ROW()-2,'POSTE (7)'!$W:$W,0)),IFERROR(INDEX('POSTE (8)'!U:U,MATCH(ROW()-2,'POSTE (8)'!$W:$W,0)),IFERROR(INDEX('POSTE (9)'!U:U,MATCH(ROW()-2,'POSTE (9)'!$W:$W,0)),\"\")))))))))","v":"POSTE (8)"}]
[{"$f":"IFERROR(INDEX('POSTE (1)'!N:N,MATCH(ROW()-2,'POSTE (1)'!$W:$W,0)),IFERROR(INDEX('POSTE (2)'!N:N,MATCH(ROW()-2,'POSTE (2)'!$W:$W,0)),IFERROR(INDEX('POSTE (3)'!N:N,MATCH(ROW()-2,'POSTE (3)'!$W:$W,0)),IFERROR(INDEX('POSTE (4)'!N:N,MATCH(ROW()-2,'POSTE (4)'!$W:$W,0)),IFERROR(INDEX('POSTE (5)'!N:N,MATCH(ROW()-2,'POSTE (5)'!$W:$W,0)),IFERROR(INDEX('POSTE (6)'!N:N,MATCH(ROW()-2,'POSTE (6)'!$W:$W,0)),IFERROR(INDEX('POSTE (7)'!N:N,MATCH(ROW()-2,'POSTE (7)'!$W:$W,0)),IFERROR(INDEX('POSTE (8)'!N:N,MATCH(ROW()-2,'POSTE (8)'!$W:$W,0)),IFERROR(INDEX('POSTE (9)'!N:N,MATCH(ROW()-2,'POSTE (9)'!$W:$W,0)),\"\")))))))))","v":"(8)Fournisseur7"},{"$f":"IFERROR(INDEX('POSTE (1)'!O:O,MATCH(ROW()-2,'POSTE (1)'!$W:$W,0)),IFERROR(INDEX('POSTE (2)'!O:O,MATCH(ROW()-2,'POSTE (2)'!$W:$W,0)),IFERROR(INDEX('POSTE (3)'!O:O,MATCH(ROW()-2,'POSTE (3)'!$W:$W,0)),IFERROR(INDEX('POSTE (4)'!O:O,MATCH(ROW()-2,'POSTE (4)'!$W:$W,0)),IFERROR(INDEX('POSTE (5)'!O:O,MATCH(ROW()-2,'POSTE (5)'!$W:$W,0)),IFERROR(INDEX('POSTE (6)'!O:O,MATCH(ROW()-2,'POSTE (6)'!$W:$W,0)),IFERROR(INDEX('POSTE (7)'!O:O,MATCH(ROW()-2,'POSTE (7)'!$W:$W,0)),IFERROR(INDEX('POSTE (8)'!O:O,MATCH(ROW()-2,'POSTE (8)'!$W:$W,0)),IFERROR(INDEX('POSTE (9)'!O:O,MATCH(ROW()-2,'POSTE (9)'!$W:$W,0)),\"\")))))))))","v":"(8)Ref7"},{"$f":"IFERROR(INDEX('POSTE (1)'!P:P,MATCH(ROW()-2,'POSTE (1)'!$W:$W,0)),IFERROR(INDEX('POSTE (2)'!P:P,MATCH(ROW()-2,'POSTE (2)'!$W:$W,0)),IFERROR(INDEX('POSTE (3)'!P:P,MATCH(ROW()-2,'POSTE (3)'!$W:$W,0)),IFERROR(INDEX('POSTE (4)'!P:P,MATCH(ROW()-2,'POSTE (4)'!$W:$W,0)),IFERROR(INDEX('POSTE (5)'!P:P,MATCH(ROW()-2,'POSTE (5)'!$W:$W,0)),IFERROR(INDEX('POSTE (6)'!P:P,MATCH(ROW()-2,'POSTE (6)'!$W:$W,0)),IFERROR(INDEX('POSTE (7)'!P:P,MATCH(ROW()-2,'POSTE (7)'!$W:$W,0)),IFERROR(INDEX('POSTE (8)'!P:P,MATCH(ROW()-2,'POSTE (8)'!$W:$W,0)),IFERROR(INDEX('POSTE (9)'!P:P,MATCH(ROW()-2,'POSTE (9)'!$W:$W,0)),\"\")))))))))","v":"(8)DESIGNATION7"},{"$f":"IFERROR(INDEX('POSTE (1)'!Q:Q,MATCH(ROW()-2,'POSTE (1)'!$W:$W,0)),IFERROR(INDEX('POSTE (2)'!Q:Q,MATCH(ROW()-2,'POSTE (2)'!$W:$W,0)),IFERROR(INDEX('POSTE (3)'!Q:Q,MATCH(ROW()-2,'POSTE (3)'!$W:$W,0)),IFERROR(INDEX('POSTE (4)'!Q:Q,MATCH(ROW()-2,'POSTE (4)'!$W:$W,0)),IFERROR(INDEX('POSTE (5)'!Q:Q,MATCH(ROW()-2,'POSTE (5)'!$W:$W,0)),IFERROR(INDEX('POSTE (6)'!Q:Q,MATCH(ROW()-2,'POSTE (6)'!$W:$W,0)),IFERROR(INDEX('POSTE (7)'!Q:Q,MATCH(ROW()-2,'POSTE (7)'!$W:$W,0)),IFERROR(INDEX('POSTE (8)'!Q:Q,MATCH(ROW()-2,'POSTE (8)'!$W:$W,0)),IFERROR(INDEX('POSTE (9)'!Q:Q,MATCH(ROW()-2,'POSTE (9)'!$W:$W,0)),\"\")))))))))","v":"U(8)"},{"$f":"IFERROR(INDEX('POSTE (1)'!R:R,MATCH(ROW()-2,'POSTE (1)'!$W:$W,0)),IFERROR(INDEX('POSTE (2)'!R:R,MATCH(ROW()-2,'POSTE (2)'!$W:$W,0)),IFERROR(INDEX('POSTE (3)'!R:R,MATCH(ROW()-2,'POSTE (3)'!$W:$W,0)),IFERROR(INDEX('POSTE (4)'!R:R,MATCH(ROW()-2,'POSTE (4)'!$W:$W,0)),IFERROR(INDEX('POSTE (5)'!R:R,MATCH(ROW()-2,'POSTE (5)'!$W:$W,0)),IFERROR(INDEX('POSTE (6)'!R:R,MATCH(ROW()-2,'POSTE (6)'!$W:$W,0)),IFERROR(INDEX('POSTE (7)'!R:R,MATCH(ROW()-2,'POSTE (7)'!$W:$W,0)),IFERROR(INDEX('POSTE (8)'!R:R,MATCH(ROW()-2,'POSTE (8)'!$W:$W,0)),IFERROR(INDEX('POSTE (9)'!R:R,MATCH(ROW()-2,'POSTE (9)'!$W:$W,0)),\"\")))))))))","v":8},{"$f":"IFERROR(INDEX('POSTE (1)'!S:S,MATCH(ROW()-2,'POSTE (1)'!$W:$W,0)),IFERROR(INDEX('POSTE (2)'!S:S,MATCH(ROW()-2,'POSTE (2)'!$W:$W,0)),IFERROR(INDEX('POSTE (3)'!S:S,MATCH(ROW()-2,'POSTE (3)'!$W:$W,0)),IFERROR(INDEX('POSTE (4)'!S:S,MATCH(ROW()-2,'POSTE (4)'!$W:$W,0)),IFERROR(INDEX('POSTE (5)'!S:S,MATCH(ROW()-2,'POSTE (5)'!$W:$W,0)),IFERROR(INDEX('POSTE (6)'!S:S,MATCH(ROW()-2,'POSTE (6)'!$W:$W,0)),IFERROR(INDEX('POSTE (7)'!S:S,MATCH(ROW()-2,'POSTE (7)'!$W:$W,0)),IFERROR(INDEX('POSTE (8)'!S:S,MATCH(ROW()-2,'POSTE (8)'!$W:$W,0)),IFERROR(INDEX('POSTE (9)'!S:S,MATCH(ROW()-2,'POSTE (9)'!$W:$W,0)),\"\")))))))))","v":1},{"$f":"IFERROR(INDEX('POSTE (1)'!T:T,MATCH(ROW()-2,'POSTE (1)'!$W:$W,0)),IFERROR(INDEX('POSTE (2)'!T:T,MATCH(ROW()-2,'POSTE (2)'!$W:$W,0)),IFERROR(INDEX('POSTE (3)'!T:T,MATCH(ROW()-2,'POSTE (3)'!$W:$W,0)),IFERROR(INDEX('POSTE (4)'!T:T,MATCH(ROW()-2,'POSTE (4)'!$W:$W,0)),IFERROR(INDEX('POSTE (5)'!T:T,MATCH(ROW()-2,'POSTE (5)'!$W:$W,0)),IFERROR(INDEX('POSTE (6)'!T:T,MATCH(ROW()-2,'POSTE (6)'!$W:$W,0)),IFERROR(INDEX('POSTE (7)'!T:T,MATCH(ROW()-2,'POSTE (7)'!$W:$W,0)),IFERROR(INDEX('POSTE (8)'!T:T,MATCH(ROW()-2,'POSTE (8)'!$W:$W,0)),IFERROR(INDEX('POSTE (9)'!T:T,MATCH(ROW()-2,'POSTE (9)'!$W:$W,0)),\"\")))))))))","v":8},{"$f":"IFERROR(INDEX('POSTE (1)'!U:U,MATCH(ROW()-2,'POSTE (1)'!$W:$W,0)),IFERROR(INDEX('POSTE (2)'!U:U,MATCH(ROW()-2,'POSTE (2)'!$W:$W,0)),IFERROR(INDEX('POSTE (3)'!U:U,MATCH(ROW()-2,'POSTE (3)'!$W:$W,0)),IFERROR(INDEX('POSTE (4)'!U:U,MATCH(ROW()-2,'POSTE (4)'!$W:$W,0)),IFERROR(INDEX('POSTE (5)'!U:U,MATCH(ROW()-2,'POSTE (5)'!$W:$W,0)),IFERROR(INDEX('POSTE (6)'!U:U,MATCH(ROW()-2,'POSTE (6)'!$W:$W,0)),IFERROR(INDEX('POSTE (7)'!U:U,MATCH(ROW()-2,'POSTE (7)'!$W:$W,0)),IFERROR(INDEX('POSTE (8)'!U:U,MATCH(ROW()-2,'POSTE (8)'!$W:$W,0)),IFERROR(INDEX('POSTE (9)'!U:U,MATCH(ROW()-2,'POSTE (9)'!$W:$W,0)),\"\")))))))))","v":"POSTE (8)"}]
[{"$f":"IFERROR(INDEX('POSTE (1)'!N:N,MATCH(ROW()-2,'POSTE (1)'!$W:$W,0)),IFERROR(INDEX('POSTE (2)'!N:N,MATCH(ROW()-2,'POSTE (2)'!$W:$W,0)),IFERROR(INDEX('POSTE (3)'!N:N,MATCH(ROW()-2,'POSTE (3)'!$W:$W,0)),IFERROR(INDEX('POSTE (4)'!N:N,MATCH(ROW()-2,'POSTE (4)'!$W:$W,0)),IFERROR(INDEX('POSTE (5)'!N:N,MATCH(ROW()-2,'POSTE (5)'!$W:$W,0)),IFERROR(INDEX('POSTE (6)'!N:N,MATCH(ROW()-2,'POSTE (6)'!$W:$W,0)),IFERROR(INDEX('POSTE (7)'!N:N,MATCH(ROW()-2,'POSTE (7)'!$W:$W,0)),IFERROR(INDEX('POSTE (8)'!N:N,MATCH(ROW()-2,'POSTE (8)'!$W:$W,0)),IFERROR(INDEX('POSTE (9)'!N:N,MATCH(ROW()-2,'POSTE (9)'!$W:$W,0)),\"\")))))))))","v":"(8)Fournisseur8"},{"$f":"IFERROR(INDEX('POSTE (1)'!O:O,MATCH(ROW()-2,'POSTE (1)'!$W:$W,0)),IFERROR(INDEX('POSTE (2)'!O:O,MATCH(ROW()-2,'POSTE (2)'!$W:$W,0)),IFERROR(INDEX('POSTE (3)'!O:O,MATCH(ROW()-2,'POSTE (3)'!$W:$W,0)),IFERROR(INDEX('POSTE (4)'!O:O,MATCH(ROW()-2,'POSTE (4)'!$W:$W,0)),IFERROR(INDEX('POSTE (5)'!O:O,MATCH(ROW()-2,'POSTE (5)'!$W:$W,0)),IFERROR(INDEX('POSTE (6)'!O:O,MATCH(ROW()-2,'POSTE (6)'!$W:$W,0)),IFERROR(INDEX('POSTE (7)'!O:O,MATCH(ROW()-2,'POSTE (7)'!$W:$W,0)),IFERROR(INDEX('POSTE (8)'!O:O,MATCH(ROW()-2,'POSTE (8)'!$W:$W,0)),IFERROR(INDEX('POSTE (9)'!O:O,MATCH(ROW()-2,'POSTE (9)'!$W:$W,0)),\"\")))))))))","v":"(8)Ref8"},{"$f":"IFERROR(INDEX('POSTE (1)'!P:P,MATCH(ROW()-2,'POSTE (1)'!$W:$W,0)),IFERROR(INDEX('POSTE (2)'!P:P,MATCH(ROW()-2,'POSTE (2)'!$W:$W,0)),IFERROR(INDEX('POSTE (3)'!P:P,MATCH(ROW()-2,'POSTE (3)'!$W:$W,0)),IFERROR(INDEX('POSTE (4)'!P:P,MATCH(ROW()-2,'POSTE (4)'!$W:$W,0)),IFERROR(INDEX('POSTE (5)'!P:P,MATCH(ROW()-2,'POSTE (5)'!$W:$W,0)),IFERROR(INDEX('POSTE (6)'!P:P,MATCH(ROW()-2,'POSTE (6)'!$W:$W,0)),IFERROR(INDEX('POSTE (7)'!P:P,MATCH(ROW()-2,'POSTE (7)'!$W:$W,0)),IFERROR(INDEX('POSTE (8)'!P:P,MATCH(ROW()-2,'POSTE (8)'!$W:$W,0)),IFERROR(INDEX('POSTE (9)'!P:P,MATCH(ROW()-2,'POSTE (9)'!$W:$W,0)),\"\")))))))))","v":"(8)DESIGNATION8"},{"$f":"IFERROR(INDEX('POSTE (1)'!Q:Q,MATCH(ROW()-2,'POSTE (1)'!$W:$W,0)),IFERROR(INDEX('POSTE (2)'!Q:Q,MATCH(ROW()-2,'POSTE (2)'!$W:$W,0)),IFERROR(INDEX('POSTE (3)'!Q:Q,MATCH(ROW()-2,'POSTE (3)'!$W:$W,0)),IFERROR(INDEX('POSTE (4)'!Q:Q,MATCH(ROW()-2,'POSTE (4)'!$W:$W,0)),IFERROR(INDEX('POSTE (5)'!Q:Q,MATCH(ROW()-2,'POSTE (5)'!$W:$W,0)),IFERROR(INDEX('POSTE (6)'!Q:Q,MATCH(ROW()-2,'POSTE (6)'!$W:$W,0)),IFERROR(INDEX('POSTE (7)'!Q:Q,MATCH(ROW()-2,'POSTE (7)'!$W:$W,0)),IFERROR(INDEX('POSTE (8)'!Q:Q,MATCH(ROW()-2,'POSTE (8)'!$W:$W,0)),IFERROR(INDEX('POSTE (9)'!Q:Q,MATCH(ROW()-2,'POSTE (9)'!$W:$W,0)),\"\")))))))))","v":"U(8)"},{"$f":"IFERROR(INDEX('POSTE (1)'!R:R,MATCH(ROW()-2,'POSTE (1)'!$W:$W,0)),IFERROR(INDEX('POSTE (2)'!R:R,MATCH(ROW()-2,'POSTE (2)'!$W:$W,0)),IFERROR(INDEX('POSTE (3)'!R:R,MATCH(ROW()-2,'POSTE (3)'!$W:$W,0)),IFERROR(INDEX('POSTE (4)'!R:R,MATCH(ROW()-2,'POSTE (4)'!$W:$W,0)),IFERROR(INDEX('POSTE (5)'!R:R,MATCH(ROW()-2,'POSTE (5)'!$W:$W,0)),IFERROR(INDEX('POSTE (6)'!R:R,MATCH(ROW()-2,'POSTE (6)'!$W:$W,0)),IFERROR(INDEX('POSTE (7)'!R:R,MATCH(ROW()-2,'POSTE (7)'!$W:$W,0)),IFERROR(INDEX('POSTE (8)'!R:R,MATCH(ROW()-2,'POSTE (8)'!$W:$W,0)),IFERROR(INDEX('POSTE (9)'!R:R,MATCH(ROW()-2,'POSTE (9)'!$W:$W,0)),\"\")))))))))","v":8},{"$f":"IFERROR(INDEX('POSTE (1)'!S:S,MATCH(ROW()-2,'POSTE (1)'!$W:$W,0)),IFERROR(INDEX('POSTE (2)'!S:S,MATCH(ROW()-2,'POSTE (2)'!$W:$W,0)),IFERROR(INDEX('POSTE (3)'!S:S,MATCH(ROW()-2,'POSTE (3)'!$W:$W,0)),IFERROR(INDEX('POSTE (4)'!S:S,MATCH(ROW()-2,'POSTE (4)'!$W:$W,0)),IFERROR(INDEX('POSTE (5)'!S:S,MATCH(ROW()-2,'POSTE (5)'!$W:$W,0)),IFERROR(INDEX('POSTE (6)'!S:S,MATCH(ROW()-2,'POSTE (6)'!$W:$W,0)),IFERROR(INDEX('POSTE (7)'!S:S,MATCH(ROW()-2,'POSTE (7)'!$W:$W,0)),IFERROR(INDEX('POSTE (8)'!S:S,MATCH(ROW()-2,'POSTE (8)'!$W:$W,0)),IFERROR(INDEX('POSTE (9)'!S:S,MATCH(ROW()-2,'POSTE (9)'!$W:$W,0)),\"\")))))))))","v":1},{"$f":"IFERROR(INDEX('POSTE (1)'!T:T,MATCH(ROW()-2,'POSTE (1)'!$W:$W,0)),IFERROR(INDEX('POSTE (2)'!T:T,MATCH(ROW()-2,'POSTE (2)'!$W:$W,0)),IFERROR(INDEX('POSTE (3)'!T:T,MATCH(ROW()-2,'POSTE (3)'!$W:$W,0)),IFERROR(INDEX('POSTE (4)'!T:T,MATCH(ROW()-2,'POSTE (4)'!$W:$W,0)),IFERROR(INDEX('POSTE (5)'!T:T,MATCH(ROW()-2,'POSTE (5)'!$W:$W,0)),IFERROR(INDEX('POSTE (6)'!T:T,MATCH(ROW()-2,'POSTE (6)'!$W:$W,0)),IFERROR(INDEX('POSTE (7)'!T:T,MATCH(ROW()-2,'POSTE (7)'!$W:$W,0)),IFERROR(INDEX('POSTE (8)'!T:T,MATCH(ROW()-2,'POSTE (8)'!$W:$W,0)),IFERROR(INDEX('POSTE (9)'!T:T,MATCH(ROW()-2,'POSTE (9)'!$W:$W,0)),\"\")))))))))","v":8},{"$f":"IFERROR(INDEX('POSTE (1)'!U:U,MATCH(ROW()-2,'POSTE (1)'!$W:$W,0)),IFERROR(INDEX('POSTE (2)'!U:U,MATCH(ROW()-2,'POSTE (2)'!$W:$W,0)),IFERROR(INDEX('POSTE (3)'!U:U,MATCH(ROW()-2,'POSTE (3)'!$W:$W,0)),IFERROR(INDEX('POSTE (4)'!U:U,MATCH(ROW()-2,'POSTE (4)'!$W:$W,0)),IFERROR(INDEX('POSTE (5)'!U:U,MATCH(ROW()-2,'POSTE (5)'!$W:$W,0)),IFERROR(INDEX('POSTE (6)'!U:U,MATCH(ROW()-2,'POSTE (6)'!$W:$W,0)),IFERROR(INDEX('POSTE (7)'!U:U,MATCH(ROW()-2,'POSTE (7)'!$W:$W,0)),IFERROR(INDEX('POSTE (8)'!U:U,MATCH(ROW()-2,'POSTE (8)'!$W:$W,0)),IFERROR(INDEX('POSTE (9)'!U:U,MATCH(ROW()-2,'POSTE (9)'!$W:$W,0)),\"\")))))))))","v":"POSTE (8)"}]
[{"$f":"IFERROR(INDEX('POSTE (1)'!N:N,MATCH(ROW()-2,'POSTE (1)'!$W:$W,0)),IFERROR(INDEX('POSTE (2)'!N:N,MATCH(ROW()-2,'POSTE (2)'!$W:$W,0)),IFERROR(INDEX('POSTE (3)'!N:N,MATCH(ROW()-2,'POSTE (3)'!$W:$W,0)),IFERROR(INDEX('POSTE (4)'!N:N,MATCH(ROW()-2,'POSTE (4)'!$W:$W,0)),IFERROR(INDEX('POSTE (5)'!N:N,MATCH(ROW()-2,'POSTE (5)'!$W:$W,0)),IFERROR(INDEX('POSTE (6)'!N:N,MATCH(ROW()-2,'POSTE (6)'!$W:$W,0)),IFERROR(INDEX('POSTE (7)'!N:N,MATCH(ROW()-2,'POSTE (7)'!$W:$W,0)),IFERROR(INDEX('POSTE (8)'!N:N,MATCH(ROW()-2,'POSTE (8)'!$W:$W,0)),IFERROR(INDEX('POSTE (9)'!N:N,MATCH(ROW()-2,'POSTE (9)'!$W:$W,0)),\"\")))))))))","v":"(9)Fournisseur"},{"$f":"IFERROR(INDEX('POSTE (1)'!O:O,MATCH(ROW()-2,'POSTE (1)'!$W:$W,0)),IFERROR(INDEX('POSTE (2)'!O:O,MATCH(ROW()-2,'POSTE (2)'!$W:$W,0)),IFERROR(INDEX('POSTE (3)'!O:O,MATCH(ROW()-2,'POSTE (3)'!$W:$W,0)),IFERROR(INDEX('POSTE (4)'!O:O,MATCH(ROW()-2,'POSTE (4)'!$W:$W,0)),IFERROR(INDEX('POSTE (5)'!O:O,MATCH(ROW()-2,'POSTE (5)'!$W:$W,0)),IFERROR(INDEX('POSTE (6)'!O:O,MATCH(ROW()-2,'POSTE (6)'!$W:$W,0)),IFERROR(INDEX('POSTE (7)'!O:O,MATCH(ROW()-2,'POSTE (7)'!$W:$W,0)),IFERROR(INDEX('POSTE (8)'!O:O,MATCH(ROW()-2,'POSTE (8)'!$W:$W,0)),IFERROR(INDEX('POSTE (9)'!O:O,MATCH(ROW()-2,'POSTE (9)'!$W:$W,0)),\"\")))))))))","v":"(9)Ref"},{"$f":"IFERROR(INDEX('POSTE (1)'!P:P,MATCH(ROW()-2,'POSTE (1)'!$W:$W,0)),IFERROR(INDEX('POSTE (2)'!P:P,MATCH(ROW()-2,'POSTE (2)'!$W:$W,0)),IFERROR(INDEX('POSTE (3)'!P:P,MATCH(ROW()-2,'POSTE (3)'!$W:$W,0)),IFERROR(INDEX('POSTE (4)'!P:P,MATCH(ROW()-2,'POSTE (4)'!$W:$W,0)),IFERROR(INDEX('POSTE (5)'!P:P,MATCH(ROW()-2,'POSTE (5)'!$W:$W,0)),IFERROR(INDEX('POSTE (6)'!P:P,MATCH(ROW()-2,'POSTE (6)'!$W:$W,0)),IFERROR(INDEX('POSTE (7)'!P:P,MATCH(ROW()-2,'POSTE (7)'!$W:$W,0)),IFERROR(INDEX('POSTE (8)'!P:P,MATCH(ROW()-2,'POSTE (8)'!$W:$W,0)),IFERROR(INDEX('POSTE (9)'!P:P,MATCH(ROW()-2,'POSTE (9)'!$W:$W,0)),\"\")))))))))","v":"(9)DESIGNATION"},{"$f":"IFERROR(INDEX('POSTE (1)'!Q:Q,MATCH(ROW()-2,'POSTE (1)'!$W:$W,0)),IFERROR(INDEX('POSTE (2)'!Q:Q,MATCH(ROW()-2,'POSTE (2)'!$W:$W,0)),IFERROR(INDEX('POSTE (3)'!Q:Q,MATCH(ROW()-2,'POSTE (3)'!$W:$W,0)),IFERROR(INDEX('POSTE (4)'!Q:Q,MATCH(ROW()-2,'POSTE (4)'!$W:$W,0)),IFERROR(INDEX('POSTE (5)'!Q:Q,MATCH(ROW()-2,'POSTE (5)'!$W:$W,0)),IFERROR(INDEX('POSTE (6)'!Q:Q,MATCH(ROW()-2,'POSTE (6)'!$W:$W,0)),IFERROR(INDEX('POSTE (7)'!Q:Q,MATCH(ROW()-2,'POSTE (7)'!$W:$W,0)),IFERROR(INDEX('POSTE (8)'!Q:Q,MATCH(ROW()-2,'POSTE (8)'!$W:$W,0)),IFERROR(INDEX('POSTE (9)'!Q:Q,MATCH(ROW()-2,'POSTE (9)'!$W:$W,0)),\"\")))))))))","v":"U(9)"},{"$f":"IFERROR(INDEX('POSTE (1)'!R:R,MATCH(ROW()-2,'POSTE (1)'!$W:$W,0)),IFERROR(INDEX('POSTE (2)'!R:R,MATCH(ROW()-2,'POSTE (2)'!$W:$W,0)),IFERROR(INDEX('POSTE (3)'!R:R,MATCH(ROW()-2,'POSTE (3)'!$W:$W,0)),IFERROR(INDEX('POSTE (4)'!R:R,MATCH(ROW()-2,'POSTE (4)'!$W:$W,0)),IFERROR(INDEX('POSTE (5)'!R:R,MATCH(ROW()-2,'POSTE (5)'!$W:$W,0)),IFERROR(INDEX('POSTE (6)'!R:R,MATCH(ROW()-2,'POSTE (6)'!$W:$W,0)),IFERROR(INDEX('POSTE (7)'!R:R,MATCH(ROW()-2,'POSTE (7)'!$W:$W,0)),IFERROR(INDEX('POSTE (8)'!R:R,MATCH(ROW()-2,'POSTE (8)'!$W:$W,0)),IFERROR(INDEX('POSTE (9)'!R:R,MATCH(ROW()-2,'POSTE (9)'!$W:$W,0)),\"\")))))))))","v":9},{"$f":"IFERROR(INDEX('POSTE (1)'!S:S,MATCH(ROW()-2,'POSTE (1)'!$W:$W,0)),IFERROR(INDEX('POSTE (2)'!S:S,MATCH(ROW()-2,'POSTE (2)'!$W:$W,0)),IFERROR(INDEX('POSTE (3)'!S:S,MATCH(ROW()-2,'POSTE (3)'!$W:$W,0)),IFERROR(INDEX('POSTE (4)'!S:S,MATCH(ROW()-2,'POSTE (4)'!$W:$W,0)),IFERROR(INDEX('POSTE (5)'!S:S,MATCH(ROW()-2,'POSTE (5)'!$W:$W,0)),IFERROR(INDEX('POSTE (6)'!S:S,MATCH(ROW()-2,'POSTE (6)'!$W:$W,0)),IFERROR(INDEX('POSTE (7)'!S:S,MATCH(ROW()-2,'POSTE (7)'!$W:$W,0)),IFERROR(INDEX('POSTE (8)'!S:S,MATCH(ROW()-2,'POSTE (8)'!$W:$W,0)),IFERROR(INDEX('POSTE (9)'!S:S,MATCH(ROW()-2,'POSTE (9)'!$W:$W,0)),\"\")))))))))","v":1},{"$f":"IFERROR(INDEX('POSTE (1)'!T:T,MATCH(ROW()-2,'POSTE (1)'!$W:$W,0)),IFERROR(INDEX('POSTE (2)'!T:T,MATCH(ROW()-2,'POSTE (2)'!$W:$W,0)),IFERROR(INDEX('POSTE (3)'!T:T,MATCH(ROW()-2,'POSTE (3)'!$W:$W,0)),IFERROR(INDEX('POSTE (4)'!T:T,MATCH(ROW()-2,'POSTE (4)'!$W:$W,0)),IFERROR(INDEX('POSTE (5)'!T:T,MATCH(ROW()-2,'POSTE (5)'!$W:$W,0)),IFERROR(INDEX('POSTE (6)'!T:T,MATCH(ROW()-2,'POSTE (6)'!$W:$W,0)),IFERROR(INDEX('POSTE (7)'!T:T,MATCH(ROW()-2,'POSTE (7)'!$W:$W,0)),IFERROR(INDEX('POSTE (8)'!T:T,MATCH(ROW()-2,'POSTE (8)'!$W:$W,0)),IFERROR(INDEX('POSTE (9)'!T:T,MATCH(ROW()-2,'POSTE (9)'!$W:$W,0)),\"\")))))))))","v":9},{"$f":"IFERROR(INDEX('POSTE (1)'!U:U,MATCH(ROW()-2,'POSTE (1)'!$W:$W,0)),IFERROR(INDEX('POSTE (2)'!U:U,MATCH(ROW()-2,'POSTE (2)'!$W:$W,0)),IFERROR(INDEX('POSTE (3)'!U:U,MATCH(ROW()-2,'POSTE (3)'!$W:$W,0)),IFERROR(INDEX('POSTE (4)'!U:U,MATCH(ROW()-2,'POSTE (4)'!$W:$W,0)),IFERROR(INDEX('POSTE (5)'!U:U,MATCH(ROW()-2,'POSTE (5)'!$W:$W,0)),IFERROR(INDEX('POSTE (6)'!U:U,MATCH(ROW()-2,'POSTE (6)'!$W:$W,0)),IFERROR(INDEX('POSTE (7)'!U:U,MATCH(ROW()-2,'POSTE (7)'!$W:$W,0)),IFERROR(INDEX('POSTE (8)'!U:U,MATCH(ROW()-2,'POSTE (8)'!$W:$W,0)),IFERROR(INDEX('POSTE (9)'!U:U,MATCH(ROW()-2,'POSTE (9)'!$W:$W,0)),\"\")))))))))","v":"POSTE (9)"}]
[{"$f":"IFERROR(INDEX('POSTE (1)'!N:N,MATCH(ROW()-2,'POSTE (1)'!$W:$W,0)),IFERROR(INDEX('POSTE (2)'!N:N,MATCH(ROW()-2,'POSTE (2)'!$W:$W,0)),IFERROR(INDEX('POSTE (3)'!N:N,MATCH(ROW()-2,'POSTE (3)'!$W:$W,0)),IFERROR(INDEX('POSTE (4)'!N:N,MATCH(ROW()-2,'POSTE (4)'!$W:$W,0)),IFERROR(INDEX('POSTE (5)'!N:N,MATCH(ROW()-2,'POSTE (5)'!$W:$W,0)),IFERROR(INDEX('POSTE (6)'!N:N,MATCH(ROW()-2,'POSTE (6)'!$W:$W,0)),IFERROR(INDEX('POSTE (7)'!N:N,MATCH(ROW()-2,'POSTE (7)'!$W:$W,0)),IFERROR(INDEX('POSTE (8)'!N:N,MATCH(ROW()-2,'POSTE (8)'!$W:$W,0)),IFERROR(INDEX('POSTE (9)'!N:N,MATCH(ROW()-2,'POSTE (9)'!$W:$W,0)),\"\")))))))))","v":"(9)Fournisseur2"},{"$f":"IFERROR(INDEX('POSTE (1)'!O:O,MATCH(ROW()-2,'POSTE (1)'!$W:$W,0)),IFERROR(INDEX('POSTE (2)'!O:O,MATCH(ROW()-2,'POSTE (2)'!$W:$W,0)),IFERROR(INDEX('POSTE (3)'!O:O,MATCH(ROW()-2,'POSTE (3)'!$W:$W,0)),IFERROR(INDEX('POSTE (4)'!O:O,MATCH(ROW()-2,'POSTE (4)'!$W:$W,0)),IFERROR(INDEX('POSTE (5)'!O:O,MATCH(ROW()-2,'POSTE (5)'!$W:$W,0)),IFERROR(INDEX('POSTE (6)'!O:O,MATCH(ROW()-2,'POSTE (6)'!$W:$W,0)),IFERROR(INDEX('POSTE (7)'!O:O,MATCH(ROW()-2,'POSTE (7)'!$W:$W,0)),IFERROR(INDEX('POSTE (8)'!O:O,MATCH(ROW()-2,'POSTE (8)'!$W:$W,0)),IFERROR(INDEX('POSTE (9)'!O:O,MATCH(ROW()-2,'POSTE (9)'!$W:$W,0)),\"\")))))))))","v":"(9)Ref2"},{"$f":"IFERROR(INDEX('POSTE (1)'!P:P,MATCH(ROW()-2,'POSTE (1)'!$W:$W,0)),IFERROR(INDEX('POSTE (2)'!P:P,MATCH(ROW()-2,'POSTE (2)'!$W:$W,0)),IFERROR(INDEX('POSTE (3)'!P:P,MATCH(ROW()-2,'POSTE (3)'!$W:$W,0)),IFERROR(INDEX('POSTE (4)'!P:P,MATCH(ROW()-2,'POSTE (4)'!$W:$W,0)),IFERROR(INDEX('POSTE (5)'!P:P,MATCH(ROW()-2,'POSTE (5)'!$W:$W,0)),IFERROR(INDEX('POSTE (6)'!P:P,MATCH(ROW()-2,'POSTE (6)'!$W:$W,0)),IFERROR(INDEX('POSTE (7)'!P:P,MATCH(ROW()-2,'POSTE (7)'!$W:$W,0)),IFERROR(INDEX('POSTE (8)'!P:P,MATCH(ROW()-2,'POSTE (8)'!$W:$W,0)),IFERROR(INDEX('POSTE (9)'!P:P,MATCH(ROW()-2,'POSTE (9)'!$W:$W,0)),\"\")))))))))","v":"(9)DESIGNATION2"},{"$f":"IFERROR(INDEX('POSTE (1)'!Q:Q,MATCH(ROW()-2,'POSTE (1)'!$W:$W,0)),IFERROR(INDEX('POSTE (2)'!Q:Q,MATCH(ROW()-2,'POSTE (2)'!$W:$W,0)),IFERROR(INDEX('POSTE (3)'!Q:Q,MATCH(ROW()-2,'POSTE (3)'!$W:$W,0)),IFERROR(INDEX('POSTE (4)'!Q:Q,MATCH(ROW()-2,'POSTE (4)'!$W:$W,0)),IFERROR(INDEX('POSTE (5)'!Q:Q,MATCH(ROW()-2,'POSTE (5)'!$W:$W,0)),IFERROR(INDEX('POSTE (6)'!Q:Q,MATCH(ROW()-2,'POSTE (6)'!$W:$W,0)),IFERROR(INDEX('POSTE (7)'!Q:Q,MATCH(ROW()-2,'POSTE (7)'!$W:$W,0)),IFERROR(INDEX('POSTE (8)'!Q:Q,MATCH(ROW()-2,'POSTE (8)'!$W:$W,0)),IFERROR(INDEX('POSTE (9)'!Q:Q,MATCH(ROW()-2,'POSTE (9)'!$W:$W,0)),\"\")))))))))","v":"U(9)"},{"$f":"IFERROR(INDEX('POSTE (1)'!R:R,MATCH(ROW()-2,'POSTE (1)'!$W:$W,0)),IFERROR(INDEX('POSTE (2)'!R:R,MATCH(ROW()-2,'POSTE (2)'!$W:$W,0)),IFERROR(INDEX('POSTE (3)'!R:R,MATCH(ROW()-2,'POSTE (3)'!$W:$W,0)),IFERROR(INDEX('POSTE (4)'!R:R,MATCH(ROW()-2,'POSTE (4)'!$W:$W,0)),IFERROR(INDEX('POSTE (5)'!R:R,MATCH(ROW()-2,'POSTE (5)'!$W:$W,0)),IFERROR(INDEX('POSTE (6)'!R:R,MATCH(ROW()-2,'POSTE (6)'!$W:$W,0)),IFERROR(INDEX('POSTE (7)'!R:R,MATCH(ROW()-2,'POSTE (7)'!$W:$W,0)),IFERROR(INDEX('POSTE (8)'!R:R,MATCH(ROW()-2,'POSTE (8)'!$W:$W,0)),IFERROR(INDEX('POSTE (9)'!R:R,MATCH(ROW()-2,'POSTE (9)'!$W:$W,0)),\"\")))))))))","v":9},{"$f":"IFERROR(INDEX('POSTE (1)'!S:S,MATCH(ROW()-2,'POSTE (1)'!$W:$W,0)),IFERROR(INDEX('POSTE (2)'!S:S,MATCH(ROW()-2,'POSTE (2)'!$W:$W,0)),IFERROR(INDEX('POSTE (3)'!S:S,MATCH(ROW()-2,'POSTE (3)'!$W:$W,0)),IFERROR(INDEX('POSTE (4)'!S:S,MATCH(ROW()-2,'POSTE (4)'!$W:$W,0)),IFERROR(INDEX('POSTE (5)'!S:S,MATCH(ROW()-2,'POSTE (5)'!$W:$W,0)),IFERROR(INDEX('POSTE (6)'!S:S,MATCH(ROW()-2,'POSTE (6)'!$W:$W,0)),IFERROR(INDEX('POSTE (7)'!S:S,MATCH(ROW()-2,'POSTE (7)'!$W:$W,0)),IFERROR(INDEX('POSTE (8)'!S:S,MATCH(ROW()-2,'POSTE (8)'!$W:$W,0)),IFERROR(INDEX('POSTE (9)'!S:S,MATCH(ROW()-2,'POSTE (9)'!$W:$W,0)),\"\")))))))))","v":1},{"$f":"IFERROR(INDEX('POSTE (1)'!T:T,MATCH(ROW()-2,'POSTE (1)'!$W:$W,0)),IFERROR(INDEX('POSTE (2)'!T:T,MATCH(ROW()-2,'POSTE (2)'!$W:$W,0)),IFERROR(INDEX('POSTE (3)'!T:T,MATCH(ROW()-2,'POSTE (3)'!$W:$W,0)),IFERROR(INDEX('POSTE (4)'!T:T,MATCH(ROW()-2,'POSTE (4)'!$W:$W,0)),IFERROR(INDEX('POSTE (5)'!T:T,MATCH(ROW()-2,'POSTE (5)'!$W:$W,0)),IFERROR(INDEX('POSTE (6)'!T:T,MATCH(ROW()-2,'POSTE (6)'!$W:$W,0)),IFERROR(INDEX('POSTE (7)'!T:T,MATCH(ROW()-2,'POSTE (7)'!$W:$W,0)),IFERROR(INDEX('POSTE (8)'!T:T,MATCH(ROW()-2,'POSTE (8)'!$W:$W,0)),IFERROR(INDEX('POSTE (9)'!T:T,MATCH(ROW()-2,'POSTE (9)'!$W:$W,0)),\"\")))))))))","v":9},{"$f":"IFERROR(INDEX('POSTE (1)'!U:U,MATCH(ROW()-2,'POSTE (1)'!$W:$W,0)),IFERROR(INDEX('POSTE (2)'!U:U,MATCH(ROW()-2,'POSTE (2)'!$W:$W,0)),IFERROR(INDEX('POSTE (3)'!U:U,MATCH(ROW()-2,'POSTE (3)'!$W:$W,0)),IFERROR(INDEX('POSTE (4)'!U:U,MATCH(ROW()-2,'POSTE (4)'!$W:$W,0)),IFERROR(INDEX('POSTE (5)'!U:U,MATCH(ROW()-2,'POSTE (5)'!$W:$W,0)),IFERROR(INDEX('POSTE (6)'!U:U,MATCH(ROW()-2,'POSTE (6)'!$W:$W,0)),IFERROR(INDEX('POSTE (7)'!U:U,MATCH(ROW()-2,'POSTE (7)'!$W:$W,0)),IFERROR(INDEX('POSTE (8)'!U:U,MATCH(ROW()-2,'POSTE (8)'!$W:$W,0)),IFERROR(INDEX('POSTE (9)'!U:U,MATCH(ROW()-2,'POSTE (9)'!$W:$W,0)),\"\")))))))))","v":"POSTE (9)"}]
[{"$f":"IFERROR(INDEX('POSTE (1)'!N:N,MATCH(ROW()-2,'POSTE (1)'!$W:$W,0)),IFERROR(INDEX('POSTE (2)'!N:N,MATCH(ROW()-2,'POSTE (2)'!$W:$W,0)),IFERROR(INDEX('POSTE (3)'!N:N,MATCH(ROW()-2,'POSTE (3)'!$W:$W,0)),IFERROR(INDEX('POSTE (4)'!N:N,MATCH(ROW()-2,'POSTE (4)'!$W:$W,0)),IFERROR(INDEX('POSTE (5)'!N:N,MATCH(ROW()-2,'POSTE (5)'!$W:$W,0)),IFERROR(INDEX('POSTE (6)'!N:N,MATCH(ROW()-2,'POSTE (6)'!$W:$W,0)),IFERROR(INDEX('POSTE (7)'!N:N,MATCH(ROW()-2,'POSTE (7)'!$W:$W,0)),IFERROR(INDEX('POSTE (8)'!N:N,MATCH(ROW()-2,'POSTE (8)'!$W:$W,0)),IFERROR(INDEX('POSTE (9)'!N:N,MATCH(ROW()-2,'POSTE (9)'!$W:$W,0)),\"\")))))))))","v":"(9)Fournisseur3"},{"$f":"IFERROR(INDEX('POSTE (1)'!O:O,MATCH(ROW()-2,'POSTE (1)'!$W:$W,0)),IFERROR(INDEX('POSTE (2)'!O:O,MATCH(ROW()-2,'POSTE (2)'!$W:$W,0)),IFERROR(INDEX('POSTE (3)'!O:O,MATCH(ROW()-2,'POSTE (3)'!$W:$W,0)),IFERROR(INDEX('POSTE (4)'!O:O,MATCH(ROW()-2,'POSTE (4)'!$W:$W,0)),IFERROR(INDEX('POSTE (5)'!O:O,MATCH(ROW()-2,'POSTE (5)'!$W:$W,0)),IFERROR(INDEX('POSTE (6)'!O:O,MATCH(ROW()-2,'POSTE (6)'!$W:$W,0)),IFERROR(INDEX('POSTE (7)'!O:O,MATCH(ROW()-2,'POSTE (7)'!$W:$W,0)),IFERROR(INDEX('POSTE (8)'!O:O,MATCH(ROW()-2,'POSTE (8)'!$W:$W,0)),IFERROR(INDEX('POSTE (9)'!O:O,MATCH(ROW()-2,'POSTE (9)'!$W:$W,0)),\"\")))))))))","v":"(9)Ref3"},{"$f":"IFERROR(INDEX('POSTE (1)'!P:P,MATCH(ROW()-2,'POSTE (1)'!$W:$W,0)),IFERROR(INDEX('POSTE (2)'!P:P,MATCH(ROW()-2,'POSTE (2)'!$W:$W,0)),IFERROR(INDEX('POSTE (3)'!P:P,MATCH(ROW()-2,'POSTE (3)'!$W:$W,0)),IFERROR(INDEX('POSTE (4)'!P:P,MATCH(ROW()-2,'POSTE (4)'!$W:$W,0)),IFERROR(INDEX('POSTE (5)'!P:P,MATCH(ROW()-2,'POSTE (5)'!$W:$W,0)),IFERROR(INDEX('POSTE (6)'!P:P,MATCH(ROW()-2,'POSTE (6)'!$W:$W,0)),IFERROR(INDEX('POSTE (7)'!P:P,MATCH(ROW()-2,'POSTE (7)'!$W:$W,0)),IFERROR(INDEX('POSTE (8)'!P:P,MATCH(ROW()-2,'POSTE (8)'!$W:$W,0)),IFERROR(INDEX('POSTE (9)'!P:P,MATCH(ROW()-2,'POSTE (9)'!$W:$W,0)),\"\")))))))))","v":"(9)DESIGNATION3"},{"$f":"IFERROR(INDEX('POSTE (1)'!Q:Q,MATCH(ROW()-2,'POSTE (1)'!$W:$W,0)),IFERROR(INDEX('POSTE (2)'!Q:Q,MATCH(ROW()-2,'POSTE (2)'!$W:$W,0)),IFERROR(INDEX('POSTE (3)'!Q:Q,MATCH(ROW()-2,'POSTE (3)'!$W:$W,0)),IFERROR(INDEX('POSTE (4)'!Q:Q,MATCH(ROW()-2,'POSTE (4)'!$W:$W,0)),IFERROR(INDEX('POSTE (5)'!Q:Q,MATCH(ROW()-2,'POSTE (5)'!$W:$W,0)),IFERROR(INDEX('POSTE (6)'!Q:Q,MATCH(ROW()-2,'POSTE (6)'!$W:$W,0)),IFERROR(INDEX('POSTE (7)'!Q:Q,MATCH(ROW()-2,'POSTE (7)'!$W:$W,0)),IFERROR(INDEX('POSTE (8)'!Q:Q,MATCH(ROW()-2,'POSTE (8)'!$W:$W,0)),IFERROR(INDEX('POSTE (9)'!Q:Q,MATCH(ROW()-2,'POSTE (9)'!$W:$W,0)),\"\")))))))))","v":"U(9)"},{"$f":"IFERROR(INDEX('POSTE (1)'!R:R,MATCH(ROW()-2,'POSTE (1)'!$W:$W,0)),IFERROR(INDEX('POSTE (2)'!R:R,MATCH(ROW()-2,'POSTE (2)'!$W:$W,0)),IFERROR(INDEX('POSTE (3)'!R:R,MATCH(ROW()-2,'POSTE (3)'!$W:$W,0)),IFERROR(INDEX('POSTE (4)'!R:R,MATCH(ROW()-2,'POSTE (4)'!$W:$W,0)),IFERROR(INDEX('POSTE (5)'!R:R,MATCH(ROW()-2,'POSTE (5)'!$W:$W,0)),IFERROR(INDEX('POSTE (6)'!R:R,MATCH(ROW()-2,'POSTE (6)'!$W:$W,0)),IFERROR(INDEX('POSTE (7)'!R:R,MATCH(ROW()-2,'POSTE (7)'!$W:$W,0)),IFERROR(INDEX('POSTE (8)'!R:R,MATCH(ROW()-2,'POSTE (8)'!$W:$W,0)),IFERROR(INDEX('POSTE (9)'!R:R,MATCH(ROW()-2,'POSTE (9)'!$W:$W,0)),\"\")))))))))","v":9},{"$f":"IFERROR(INDEX('POSTE (1)'!S:S,MATCH(ROW()-2,'POSTE (1)'!$W:$W,0)),IFERROR(INDEX('POSTE (2)'!S:S,MATCH(ROW()-2,'POSTE (2)'!$W:$W,0)),IFERROR(INDEX('POSTE (3)'!S:S,MATCH(ROW()-2,'POSTE (3)'!$W:$W,0)),IFERROR(INDEX('POSTE (4)'!S:S,MATCH(ROW()-2,'POSTE (4)'!$W:$W,0)),IFERROR(INDEX('POSTE (5)'!S:S,MATCH(ROW()-2,'POSTE (5)'!$W:$W,0)),IFERROR(INDEX('POSTE (6)'!S:S,MATCH(ROW()-2,'POSTE (6)'!$W:$W,0)),IFERROR(INDEX('POSTE (7)'!S:S,MATCH(ROW()-2,'POSTE (7)'!$W:$W,0)),IFERROR(INDEX('POSTE (8)'!S:S,MATCH(ROW()-2,'POSTE (8)'!$W:$W,0)),IFERROR(INDEX('POSTE (9)'!S:S,MATCH(ROW()-2,'POSTE (9)'!$W:$W,0)),\"\")))))))))","v":1},{"$f":"IFERROR(INDEX('POSTE (1)'!T:T,MATCH(ROW()-2,'POSTE (1)'!$W:$W,0)),IFERROR(INDEX('POSTE (2)'!T:T,MATCH(ROW()-2,'POSTE (2)'!$W:$W,0)),IFERROR(INDEX('POSTE (3)'!T:T,MATCH(ROW()-2,'POSTE (3)'!$W:$W,0)),IFERROR(INDEX('POSTE (4)'!T:T,MATCH(ROW()-2,'POSTE (4)'!$W:$W,0)),IFERROR(INDEX('POSTE (5)'!T:T,MATCH(ROW()-2,'POSTE (5)'!$W:$W,0)),IFERROR(INDEX('POSTE (6)'!T:T,MATCH(ROW()-2,'POSTE (6)'!$W:$W,0)),IFERROR(INDEX('POSTE (7)'!T:T,MATCH(ROW()-2,'POSTE (7)'!$W:$W,0)),IFERROR(INDEX('POSTE (8)'!T:T,MATCH(ROW()-2,'POSTE (8)'!$W:$W,0)),IFERROR(INDEX('POSTE (9)'!T:T,MATCH(ROW()-2,'POSTE (9)'!$W:$W,0)),\"\")))))))))","v":9},{"$f":"IFERROR(INDEX('POSTE (1)'!U:U,MATCH(ROW()-2,'POSTE (1)'!$W:$W,0)),IFERROR(INDEX('POSTE (2)'!U:U,MATCH(ROW()-2,'POSTE (2)'!$W:$W,0)),IFERROR(INDEX('POSTE (3)'!U:U,MATCH(ROW()-2,'POSTE (3)'!$W:$W,0)),IFERROR(INDEX('POSTE (4)'!U:U,MATCH(ROW()-2,'POSTE (4)'!$W:$W,0)),IFERROR(INDEX('POSTE (5)'!U:U,MATCH(ROW()-2,'POSTE (5)'!$W:$W,0)),IFERROR(INDEX('POSTE (6)'!U:U,MATCH(ROW()-2,'POSTE (6)'!$W:$W,0)),IFERROR(INDEX('POSTE (7)'!U:U,MATCH(ROW()-2,'POSTE (7)'!$W:$W,0)),IFERROR(INDEX('POSTE (8)'!U:U,MATCH(ROW()-2,'POSTE (8)'!$W:$W,0)),IFERROR(INDEX('POSTE (9)'!U:U,MATCH(ROW()-2,'POSTE (9)'!$W:$W,0)),\"\")))))))))","v":"POSTE (9)"}]
[{"$f":"IFERROR(INDEX('POSTE (1)'!N:N,MATCH(ROW()-2,'POSTE (1)'!$W:$W,0)),IFERROR(INDEX('POSTE (2)'!N:N,MATCH(ROW()-2,'POSTE (2)'!$W:$W,0)),IFERROR(INDEX('POSTE (3)'!N:N,MATCH(ROW()-2,'POSTE (3)'!$W:$W,0)),IFERROR(INDEX('POSTE (4)'!N:N,MATCH(ROW()-2,'POSTE (4)'!$W:$W,0)),IFERROR(INDEX('POSTE (5)'!N:N,MATCH(ROW()-2,'POSTE (5)'!$W:$W,0)),IFERROR(INDEX('POSTE (6)'!N:N,MATCH(ROW()-2,'POSTE (6)'!$W:$W,0)),IFERROR(INDEX('POSTE (7)'!N:N,MATCH(ROW()-2,'POSTE (7)'!$W:$W,0)),IFERROR(INDEX('POSTE (8)'!N:N,MATCH(ROW()-2,'POSTE (8)'!$W:$W,0)),IFERROR(INDEX('POSTE (9)'!N:N,MATCH(ROW()-2,'POSTE (9)'!$W:$W,0)),\"\")))))))))","v":"(9)Fournisseur4"},{"$f":"IFERROR(INDEX('POSTE (1)'!O:O,MATCH(ROW()-2,'POSTE (1)'!$W:$W,0)),IFERROR(INDEX('POSTE (2)'!O:O,MATCH(ROW()-2,'POSTE (2)'!$W:$W,0)),IFERROR(INDEX('POSTE (3)'!O:O,MATCH(ROW()-2,'POSTE (3)'!$W:$W,0)),IFERROR(INDEX('POSTE (4)'!O:O,MATCH(ROW()-2,'POSTE (4)'!$W:$W,0)),IFERROR(INDEX('POSTE (5)'!O:O,MATCH(ROW()-2,'POSTE (5)'!$W:$W,0)),IFERROR(INDEX('POSTE (6)'!O:O,MATCH(ROW()-2,'POSTE (6)'!$W:$W,0)),IFERROR(INDEX('POSTE (7)'!O:O,MATCH(ROW()-2,'POSTE (7)'!$W:$W,0)),IFERROR(INDEX('POSTE (8)'!O:O,MATCH(ROW()-2,'POSTE (8)'!$W:$W,0)),IFERROR(INDEX('POSTE (9)'!O:O,MATCH(ROW()-2,'POSTE (9)'!$W:$W,0)),\"\")))))))))","v":"(9)Ref4"},{"$f":"IFERROR(INDEX('POSTE (1)'!P:P,MATCH(ROW()-2,'POSTE (1)'!$W:$W,0)),IFERROR(INDEX('POSTE (2)'!P:P,MATCH(ROW()-2,'POSTE (2)'!$W:$W,0)),IFERROR(INDEX('POSTE (3)'!P:P,MATCH(ROW()-2,'POSTE (3)'!$W:$W,0)),IFERROR(INDEX('POSTE (4)'!P:P,MATCH(ROW()-2,'POSTE (4)'!$W:$W,0)),IFERROR(INDEX('POSTE (5)'!P:P,MATCH(ROW()-2,'POSTE (5)'!$W:$W,0)),IFERROR(INDEX('POSTE (6)'!P:P,MATCH(ROW()-2,'POSTE (6)'!$W:$W,0)),IFERROR(INDEX('POSTE (7)'!P:P,MATCH(ROW()-2,'POSTE (7)'!$W:$W,0)),IFERROR(INDEX('POSTE (8)'!P:P,MATCH(ROW()-2,'POSTE (8)'!$W:$W,0)),IFERROR(INDEX('POSTE (9)'!P:P,MATCH(ROW()-2,'POSTE (9)'!$W:$W,0)),\"\")))))))))","v":"(9)DESIGNATION4"},{"$f":"IFERROR(INDEX('POSTE (1)'!Q:Q,MATCH(ROW()-2,'POSTE (1)'!$W:$W,0)),IFERROR(INDEX('POSTE (2)'!Q:Q,MATCH(ROW()-2,'POSTE (2)'!$W:$W,0)),IFERROR(INDEX('POSTE (3)'!Q:Q,MATCH(ROW()-2,'POSTE (3)'!$W:$W,0)),IFERROR(INDEX('POSTE (4)'!Q:Q,MATCH(ROW()-2,'POSTE (4)'!$W:$W,0)),IFERROR(INDEX('POSTE (5)'!Q:Q,MATCH(ROW()-2,'POSTE (5)'!$W:$W,0)),IFERROR(INDEX('POSTE (6)'!Q:Q,MATCH(ROW()-2,'POSTE (6)'!$W:$W,0)),IFERROR(INDEX('POSTE (7)'!Q:Q,MATCH(ROW()-2,'POSTE (7)'!$W:$W,0)),IFERROR(INDEX('POSTE (8)'!Q:Q,MATCH(ROW()-2,'POSTE (8)'!$W:$W,0)),IFERROR(INDEX('POSTE (9)'!Q:Q,MATCH(ROW()-2,'POSTE (9)'!$W:$W,0)),\"\")))))))))","v":"U(9)"},{"$f":"IFERROR(INDEX('POSTE (1)'!R:R,MATCH(ROW()-2,'POSTE (1)'!$W:$W,0)),IFERROR(INDEX('POSTE (2)'!R:R,MATCH(ROW()-2,'POSTE (2)'!$W:$W,0)),IFERROR(INDEX('POSTE (3)'!R:R,MATCH(ROW()-2,'POSTE (3)'!$W:$W,0)),IFERROR(INDEX('POSTE (4)'!R:R,MATCH(ROW()-2,'POSTE (4)'!$W:$W,0)),IFERROR(INDEX('POSTE (5)'!R:R,MATCH(ROW()-2,'POSTE (5)'!$W:$W,0)),IFERROR(INDEX('POSTE (6)'!R:R,MATCH(ROW()-2,'POSTE (6)'!$W:$W,0)),IFERROR(INDEX('POSTE (7)'!R:R,MATCH(ROW()-2,'POSTE (7)'!$W:$W,0)),IFERROR(INDEX('POSTE (8)'!R:R,MATCH(ROW()-2,'POSTE (8)'!$W:$W,0)),IFERROR(INDEX('POSTE (9)'!R:R,MATCH(ROW()-2,'POSTE (9)'!$W:$W,0)),\"\")))))))))","v":9},{"$f":"IFERROR(INDEX('POSTE (1)'!S:S,MATCH(ROW()-2,'POSTE (1)'!$W:$W,0)),IFERROR(INDEX('POSTE (2)'!S:S,MATCH(ROW()-2,'POSTE (2)'!$W:$W,0)),IFERROR(INDEX('POSTE (3)'!S:S,MATCH(ROW()-2,'POSTE (3)'!$W:$W,0)),IFERROR(INDEX('POSTE (4)'!S:S,MATCH(ROW()-2,'POSTE (4)'!$W:$W,0)),IFERROR(INDEX('POSTE (5)'!S:S,MATCH(ROW()-2,'POSTE (5)'!$W:$W,0)),IFERROR(INDEX('POSTE (6)'!S:S,MATCH(ROW()-2,'POSTE (6)'!$W:$W,0)),IFERROR(INDEX('POSTE (7)'!S:S,MATCH(ROW()-2,'POSTE (7)'!$W:$W,0)),IFERROR(INDEX('POSTE (8)'!S:S,MATCH(ROW()-2,'POSTE (8)'!$W:$W,0)),IFERROR(INDEX('POSTE (9)'!S:S,MATCH(ROW()-2,'POSTE (9)'!$W:$W,0)),\"\")))))))))","v":1},{"$f":"IFERROR(INDEX('POSTE (1)'!T:T,MATCH(ROW()-2,'POSTE (1)'!$W:$W,0)),IFERROR(INDEX('POSTE (2)'!T:T,MATCH(ROW()-2,'POSTE (2)'!$W:$W,0)),IFERROR(INDEX('POSTE (3)'!T:T,MATCH(ROW()-2,'POSTE (3)'!$W:$W,0)),IFERROR(INDEX('POSTE (4)'!T:T,MATCH(ROW()-2,'POSTE (4)'!$W:$W,0)),IFERROR(INDEX('POSTE (5)'!T:T,MATCH(ROW()-2,'POSTE (5)'!$W:$W,0)),IFERROR(INDEX('POSTE (6)'!T:T,MATCH(ROW()-2,'POSTE (6)'!$W:$W,0)),IFERROR(INDEX('POSTE (7)'!T:T,MATCH(ROW()-2,'POSTE (7)'!$W:$W,0)),IFERROR(INDEX('POSTE (8)'!T:T,MATCH(ROW()-2,'POSTE (8)'!$W:$W,0)),IFERROR(INDEX('POSTE (9)'!T:T,MATCH(ROW()-2,'POSTE (9)'!$W:$W,0)),\"\")))))))))","v":9},{"$f":"IFERROR(INDEX('POSTE (1)'!U:U,MATCH(ROW()-2,'POSTE (1)'!$W:$W,0)),IFERROR(INDEX('POSTE (2)'!U:U,MATCH(ROW()-2,'POSTE (2)'!$W:$W,0)),IFERROR(INDEX('POSTE (3)'!U:U,MATCH(ROW()-2,'POSTE (3)'!$W:$W,0)),IFERROR(INDEX('POSTE (4)'!U:U,MATCH(ROW()-2,'POSTE (4)'!$W:$W,0)),IFERROR(INDEX('POSTE (5)'!U:U,MATCH(ROW()-2,'POSTE (5)'!$W:$W,0)),IFERROR(INDEX('POSTE (6)'!U:U,MATCH(ROW()-2,'POSTE (6)'!$W:$W,0)),IFERROR(INDEX('POSTE (7)'!U:U,MATCH(ROW()-2,'POSTE (7)'!$W:$W,0)),IFERROR(INDEX('POSTE (8)'!U:U,MATCH(ROW()-2,'POSTE (8)'!$W:$W,0)),IFERROR(INDEX('POSTE (9)'!U:U,MATCH(ROW()-2,'POSTE (9)'!$W:$W,0)),\"\")))))))))","v":"POSTE (9)"}]
[{"$f":"IFERROR(INDEX('POSTE (1)'!N:N,MATCH(ROW()-2,'POSTE (1)'!$W:$W,0)),IFERROR(INDEX('POSTE (2)'!N:N,MATCH(ROW()-2,'POSTE (2)'!$W:$W,0)),IFERROR(INDEX('POSTE (3)'!N:N,MATCH(ROW()-2,'POSTE (3)'!$W:$W,0)),IFERROR(INDEX('POSTE (4)'!N:N,MATCH(ROW()-2,'POSTE (4)'!$W:$W,0)),IFERROR(INDEX('POSTE (5)'!N:N,MATCH(ROW()-2,'POSTE (5)'!$W:$W,0)),IFERROR(INDEX('POSTE (6)'!N:N,MATCH(ROW()-2,'POSTE (6)'!$W:$W,0)),IFERROR(INDEX('POSTE (7)'!N:N,MATCH(ROW()-2,'POSTE (7)'!$W:$W,0)),IFERROR(INDEX('POSTE (8)'!N:N,MATCH(ROW()-2,'POSTE (8)'!$W:$W,0)),IFERROR(INDEX('POSTE (9)'!N:N,MATCH(ROW()-2,'POSTE (9)'!$W:$W,0)),\"\")))))))))","v":"(9)Fournisseur5"},{"$f":"IFERROR(INDEX('POSTE (1)'!O:O,MATCH(ROW()-2,'POSTE (1)'!$W:$W,0)),IFERROR(INDEX('POSTE (2)'!O:O,MATCH(ROW()-2,'POSTE (2)'!$W:$W,0)),IFERROR(INDEX('POSTE (3)'!O:O,MATCH(ROW()-2,'POSTE (3)'!$W:$W,0)),IFERROR(INDEX('POSTE (4)'!O:O,MATCH(ROW()-2,'POSTE (4)'!$W:$W,0)),IFERROR(INDEX('POSTE (5)'!O:O,MATCH(ROW()-2,'POSTE (5)'!$W:$W,0)),IFERROR(INDEX('POSTE (6)'!O:O,MATCH(ROW()-2,'POSTE (6)'!$W:$W,0)),IFERROR(INDEX('POSTE (7)'!O:O,MATCH(ROW()-2,'POSTE (7)'!$W:$W,0)),IFERROR(INDEX('POSTE (8)'!O:O,MATCH(ROW()-2,'POSTE (8)'!$W:$W,0)),IFERROR(INDEX('POSTE (9)'!O:O,MATCH(ROW()-2,'POSTE (9)'!$W:$W,0)),\"\")))))))))","v":"(9)Ref5"},{"$f":"IFERROR(INDEX('POSTE (1)'!P:P,MATCH(ROW()-2,'POSTE (1)'!$W:$W,0)),IFERROR(INDEX('POSTE (2)'!P:P,MATCH(ROW()-2,'POSTE (2)'!$W:$W,0)),IFERROR(INDEX('POSTE (3)'!P:P,MATCH(ROW()-2,'POSTE (3)'!$W:$W,0)),IFERROR(INDEX('POSTE (4)'!P:P,MATCH(ROW()-2,'POSTE (4)'!$W:$W,0)),IFERROR(INDEX('POSTE (5)'!P:P,MATCH(ROW()-2,'POSTE (5)'!$W:$W,0)),IFERROR(INDEX('POSTE (6)'!P:P,MATCH(ROW()-2,'POSTE (6)'!$W:$W,0)),IFERROR(INDEX('POSTE (7)'!P:P,MATCH(ROW()-2,'POSTE (7)'!$W:$W,0)),IFERROR(INDEX('POSTE (8)'!P:P,MATCH(ROW()-2,'POSTE (8)'!$W:$W,0)),IFERROR(INDEX('POSTE (9)'!P:P,MATCH(ROW()-2,'POSTE (9)'!$W:$W,0)),\"\")))))))))","v":"(9)DESIGNATION5"},{"$f":"IFERROR(INDEX('POSTE (1)'!Q:Q,MATCH(ROW()-2,'POSTE (1)'!$W:$W,0)),IFERROR(INDEX('POSTE (2)'!Q:Q,MATCH(ROW()-2,'POSTE (2)'!$W:$W,0)),IFERROR(INDEX('POSTE (3)'!Q:Q,MATCH(ROW()-2,'POSTE (3)'!$W:$W,0)),IFERROR(INDEX('POSTE (4)'!Q:Q,MATCH(ROW()-2,'POSTE (4)'!$W:$W,0)),IFERROR(INDEX('POSTE (5)'!Q:Q,MATCH(ROW()-2,'POSTE (5)'!$W:$W,0)),IFERROR(INDEX('POSTE (6)'!Q:Q,MATCH(ROW()-2,'POSTE (6)'!$W:$W,0)),IFERROR(INDEX('POSTE (7)'!Q:Q,MATCH(ROW()-2,'POSTE (7)'!$W:$W,0)),IFERROR(INDEX('POSTE (8)'!Q:Q,MATCH(ROW()-2,'POSTE (8)'!$W:$W,0)),IFERROR(INDEX('POSTE (9)'!Q:Q,MATCH(ROW()-2,'POSTE (9)'!$W:$W,0)),\"\")))))))))","v":"U(9)"},{"$f":"IFERROR(INDEX('POSTE (1)'!R:R,MATCH(ROW()-2,'POSTE (1)'!$W:$W,0)),IFERROR(INDEX('POSTE (2)'!R:R,MATCH(ROW()-2,'POSTE (2)'!$W:$W,0)),IFERROR(INDEX('POSTE (3)'!R:R,MATCH(ROW()-2,'POSTE (3)'!$W:$W,0)),IFERROR(INDEX('POSTE (4)'!R:R,MATCH(ROW()-2,'POSTE (4)'!$W:$W,0)),IFERROR(INDEX('POSTE (5)'!R:R,MATCH(ROW()-2,'POSTE (5)'!$W:$W,0)),IFERROR(INDEX('POSTE (6)'!R:R,MATCH(ROW()-2,'POSTE (6)'!$W:$W,0)),IFERROR(INDEX('POSTE (7)'!R:R,MATCH(ROW()-2,'POSTE (7)'!$W:$W,0)),IFERROR(INDEX('POSTE (8)'!R:R,MATCH(ROW()-2,'POSTE (8)'!$W:$W,0)),IFERROR(INDEX('POSTE (9)'!R:R,MATCH(ROW()-2,'POSTE (9)'!$W:$W,0)),\"\")))))))))","v":9},{"$f":"IFERROR(INDEX('POSTE (1)'!S:S,MATCH(ROW()-2,'POSTE (1)'!$W:$W,0)),IFERROR(INDEX('POSTE (2)'!S:S,MATCH(ROW()-2,'POSTE (2)'!$W:$W,0)),IFERROR(INDEX('POSTE (3)'!S:S,MATCH(ROW()-2,'POSTE (3)'!$W:$W,0)),IFERROR(INDEX('POSTE (4)'!S:S,MATCH(ROW()-2,'POSTE (4)'!$W:$W,0)),IFERROR(INDEX('POSTE (5)'!S:S,MATCH(ROW()-2,'POSTE (5)'!$W:$W,0)),IFERROR(INDEX('POSTE (6)'!S:S,MATCH(ROW()-2,'POSTE (6)'!$W:$W,0)),IFERROR(INDEX('POSTE (7)'!S:S,MATCH(ROW()-2,'POSTE (7)'!$W:$W,0)),IFERROR(INDEX('POSTE (8)'!S:S,MATCH(ROW()-2,'POSTE (8)'!$W:$W,0)),IFERROR(INDEX('POSTE (9)'!S:S,MATCH(ROW()-2,'POSTE (9)'!$W:$W,0)),\"\")))))))))","v":1},{"$f":"IFERROR(INDEX('POSTE (1)'!T:T,MATCH(ROW()-2,'POSTE (1)'!$W:$W,0)),IFERROR(INDEX('POSTE (2)'!T:T,MATCH(ROW()-2,'POSTE (2)'!$W:$W,0)),IFERROR(INDEX('POSTE (3)'!T:T,MATCH(ROW()-2,'POSTE (3)'!$W:$W,0)),IFERROR(INDEX('POSTE (4)'!T:T,MATCH(ROW()-2,'POSTE (4)'!$W:$W,0)),IFERROR(INDEX('POSTE (5)'!T:T,MATCH(ROW()-2,'POSTE (5)'!$W:$W,0)),IFERROR(INDEX('POSTE (6)'!T:T,MATCH(ROW()-2,'POSTE (6)'!$W:$W,0)),IFERROR(INDEX('POSTE (7)'!T:T,MATCH(ROW()-2,'POSTE (7)'!$W:$W,0)),IFERROR(INDEX('POSTE (8)'!T:T,MATCH(ROW()-2,'POSTE (8)'!$W:$W,0)),IFERROR(INDEX('POSTE (9)'!T:T,MATCH(ROW()-2,'POSTE (9)'!$W:$W,0)),\"\")))))))))","v":9},{"$f":"IFERROR(INDEX('POSTE (1)'!U:U,MATCH(ROW()-2,'POSTE (1)'!$W:$W,0)),IFERROR(INDEX('POSTE (2)'!U:U,MATCH(ROW()-2,'POSTE (2)'!$W:$W,0)),IFERROR(INDEX('POSTE (3)'!U:U,MATCH(ROW()-2,'POSTE (3)'!$W:$W,0)),IFERROR(INDEX('POSTE (4)'!U:U,MATCH(ROW()-2,'POSTE (4)'!$W:$W,0)),IFERROR(INDEX('POSTE (5)'!U:U,MATCH(ROW()-2,'POSTE (5)'!$W:$W,0)),IFERROR(INDEX('POSTE (6)'!U:U,MATCH(ROW()-2,'POSTE (6)'!$W:$W,0)),IFERROR(INDEX('POSTE (7)'!U:U,MATCH(ROW()-2,'POSTE (7)'!$W:$W,0)),IFERROR(INDEX('POSTE (8)'!U:U,MATCH(ROW()-2,'POSTE (8)'!$W:$W,0)),IFERROR(INDEX('POSTE (9)'!U:U,MATCH(ROW()-2,'POSTE (9)'!$W:$W,0)),\"\")))))))))","v":"POSTE (9)"}]
[{"$f":"IFERROR(INDEX('POSTE (1)'!N:N,MATCH(ROW()-2,'POSTE (1)'!$W:$W,0)),IFERROR(INDEX('POSTE (2)'!N:N,MATCH(ROW()-2,'POSTE (2)'!$W:$W,0)),IFERROR(INDEX('POSTE (3)'!N:N,MATCH(ROW()-2,'POSTE (3)'!$W:$W,0)),IFERROR(INDEX('POSTE (4)'!N:N,MATCH(ROW()-2,'POSTE (4)'!$W:$W,0)),IFERROR(INDEX('POSTE (5)'!N:N,MATCH(ROW()-2,'POSTE (5)'!$W:$W,0)),IFERROR(INDEX('POSTE (6)'!N:N,MATCH(ROW()-2,'POSTE (6)'!$W:$W,0)),IFERROR(INDEX('POSTE (7)'!N:N,MATCH(ROW()-2,'POSTE (7)'!$W:$W,0)),IFERROR(INDEX('POSTE (8)'!N:N,MATCH(ROW()-2,'POSTE (8)'!$W:$W,0)),IFERROR(INDEX('POSTE (9)'!N:N,MATCH(ROW()-2,'POSTE (9)'!$W:$W,0)),\"\")))))))))","v":"(9)Fournisseur6"},{"$f":"IFERROR(INDEX('POSTE (1)'!O:O,MATCH(ROW()-2,'POSTE (1)'!$W:$W,0)),IFERROR(INDEX('POSTE (2)'!O:O,MATCH(ROW()-2,'POSTE (2)'!$W:$W,0)),IFERROR(INDEX('POSTE (3)'!O:O,MATCH(ROW()-2,'POSTE (3)'!$W:$W,0)),IFERROR(INDEX('POSTE (4)'!O:O,MATCH(ROW()-2,'POSTE (4)'!$W:$W,0)),IFERROR(INDEX('POSTE (5)'!O:O,MATCH(ROW()-2,'POSTE (5)'!$W:$W,0)),IFERROR(INDEX('POSTE (6)'!O:O,MATCH(ROW()-2,'POSTE (6)'!$W:$W,0)),IFERROR(INDEX('POSTE (7)'!O:O,MATCH(ROW()-2,'POSTE (7)'!$W:$W,0)),IFERROR(INDEX('POSTE (8)'!O:O,MATCH(ROW()-2,'POSTE (8)'!$W:$W,0)),IFERROR(INDEX('POSTE (9)'!O:O,MATCH(ROW()-2,'POSTE (9)'!$W:$W,0)),\"\")))))))))","v":"(9)Ref6"},{"$f":"IFERROR(INDEX('POSTE (1)'!P:P,MATCH(ROW()-2,'POSTE (1)'!$W:$W,0)),IFERROR(INDEX('POSTE (2)'!P:P,MATCH(ROW()-2,'POSTE (2)'!$W:$W,0)),IFERROR(INDEX('POSTE (3)'!P:P,MATCH(ROW()-2,'POSTE (3)'!$W:$W,0)),IFERROR(INDEX('POSTE (4)'!P:P,MATCH(ROW()-2,'POSTE (4)'!$W:$W,0)),IFERROR(INDEX('POSTE (5)'!P:P,MATCH(ROW()-2,'POSTE (5)'!$W:$W,0)),IFERROR(INDEX('POSTE (6)'!P:P,MATCH(ROW()-2,'POSTE (6)'!$W:$W,0)),IFERROR(INDEX('POSTE (7)'!P:P,MATCH(ROW()-2,'POSTE (7)'!$W:$W,0)),IFERROR(INDEX('POSTE (8)'!P:P,MATCH(ROW()-2,'POSTE (8)'!$W:$W,0)),IFERROR(INDEX('POSTE (9)'!P:P,MATCH(ROW()-2,'POSTE (9)'!$W:$W,0)),\"\")))))))))","v":"(9)DESIGNATION6"},{"$f":"IFERROR(INDEX('POSTE (1)'!Q:Q,MATCH(ROW()-2,'POSTE (1)'!$W:$W,0)),IFERROR(INDEX('POSTE (2)'!Q:Q,MATCH(ROW()-2,'POSTE (2)'!$W:$W,0)),IFERROR(INDEX('POSTE (3)'!Q:Q,MATCH(ROW()-2,'POSTE (3)'!$W:$W,0)),IFERROR(INDEX('POSTE (4)'!Q:Q,MATCH(ROW()-2,'POSTE (4)'!$W:$W,0)),IFERROR(INDEX('POSTE (5)'!Q:Q,MATCH(ROW()-2,'POSTE (5)'!$W:$W,0)),IFERROR(INDEX('POSTE (6)'!Q:Q,MATCH(ROW()-2,'POSTE (6)'!$W:$W,0)),IFERROR(INDEX('POSTE (7)'!Q:Q,MATCH(ROW()-2,'POSTE (7)'!$W:$W,0)),IFERROR(INDEX('POSTE (8)'!Q:Q,MATCH(ROW()-2,'POSTE (8)'!$W:$W,0)),IFERROR(INDEX('POSTE (9)'!Q:Q,MATCH(ROW()-2,'POSTE (9)'!$W:$W,0)),\"\")))))))))","v":"U(9)"},{"$f":"IFERROR(INDEX('POSTE (1)'!R:R,MATCH(ROW()-2,'POSTE (1)'!$W:$W,0)),IFERROR(INDEX('POSTE (2)'!R:R,MATCH(ROW()-2,'POSTE (2)'!$W:$W,0)),IFERROR(INDEX('POSTE (3)'!R:R,MATCH(ROW()-2,'POSTE (3)'!$W:$W,0)),IFERROR(INDEX('POSTE (4)'!R:R,MATCH(ROW()-2,'POSTE (4)'!$W:$W,0)),IFERROR(INDEX('POSTE (5)'!R:R,MATCH(ROW()-2,'POSTE (5)'!$W:$W,0)),IFERROR(INDEX('POSTE (6)'!R:R,MATCH(ROW()-2,'POSTE (6)'!$W:$W,0)),IFERROR(INDEX('POSTE (7)'!R:R,MATCH(ROW()-2,'POSTE (7)'!$W:$W,0)),IFERROR(INDEX('POSTE (8)'!R:R,MATCH(ROW()-2,'POSTE (8)'!$W:$W,0)),IFERROR(INDEX('POSTE (9)'!R:R,MATCH(ROW()-2,'POSTE (9)'!$W:$W,0)),\"\")))))))))","v":9},{"$f":"IFERROR(INDEX('POSTE (1)'!S:S,MATCH(ROW()-2,'POSTE (1)'!$W:$W,0)),IFERROR(INDEX('POSTE (2)'!S:S,MATCH(ROW()-2,'POSTE (2)'!$W:$W,0)),IFERROR(INDEX('POSTE (3)'!S:S,MATCH(ROW()-2,'POSTE (3)'!$W:$W,0)),IFERROR(INDEX('POSTE (4)'!S:S,MATCH(ROW()-2,'POSTE (4)'!$W:$W,0)),IFERROR(INDEX('POSTE (5)'!S:S,MATCH(ROW()-2,'POSTE (5)'!$W:$W,0)),IFERROR(INDEX('POSTE (6)'!S:S,MATCH(ROW()-2,'POSTE (6)'!$W:$W,0)),IFERROR(INDEX('POSTE (7)'!S:S,MATCH(ROW()-2,'POSTE (7)'!$W:$W,0)),IFERROR(INDEX('POSTE (8)'!S:S,MATCH(ROW()-2,'POSTE (8)'!$W:$W,0)),IFERROR(INDEX('POSTE (9)'!S:S,MATCH(ROW()-2,'POSTE (9)'!$W:$W,0)),\"\")))))))))","v":1},{"$f":"IFERROR(INDEX('POSTE (1)'!T:T,MATCH(ROW()-2,'POSTE (1)'!$W:$W,0)),IFERROR(INDEX('POSTE (2)'!T:T,MATCH(ROW()-2,'POSTE (2)'!$W:$W,0)),IFERROR(INDEX('POSTE (3)'!T:T,MATCH(ROW()-2,'POSTE (3)'!$W:$W,0)),IFERROR(INDEX('POSTE (4)'!T:T,MATCH(ROW()-2,'POSTE (4)'!$W:$W,0)),IFERROR(INDEX('POSTE (5)'!T:T,MATCH(ROW()-2,'POSTE (5)'!$W:$W,0)),IFERROR(INDEX('POSTE (6)'!T:T,MATCH(ROW()-2,'POSTE (6)'!$W:$W,0)),IFERROR(INDEX('POSTE (7)'!T:T,MATCH(ROW()-2,'POSTE (7)'!$W:$W,0)),IFERROR(INDEX('POSTE (8)'!T:T,MATCH(ROW()-2,'POSTE (8)'!$W:$W,0)),IFERROR(INDEX('POSTE (9)'!T:T,MATCH(ROW()-2,'POSTE (9)'!$W:$W,0)),\"\")))))))))","v":9},{"$f":"IFERROR(INDEX('POSTE (1)'!U:U,MATCH(ROW()-2,'POSTE (1)'!$W:$W,0)),IFERROR(INDEX('POSTE (2)'!U:U,MATCH(ROW()-2,'POSTE (2)'!$W:$W,0)),IFERROR(INDEX('POSTE (3)'!U:U,MATCH(ROW()-2,'POSTE (3)'!$W:$W,0)),IFERROR(INDEX('POSTE (4)'!U:U,MATCH(ROW()-2,'POSTE (4)'!$W:$W,0)),IFERROR(INDEX('POSTE (5)'!U:U,MATCH(ROW()-2,'POSTE (5)'!$W:$W,0)),IFERROR(INDEX('POSTE (6)'!U:U,MATCH(ROW()-2,'POSTE (6)'!$W:$W,0)),IFERROR(INDEX('POSTE (7)'!U:U,MATCH(ROW()-2,'POSTE (7)'!$W:$W,0)),IFERROR(INDEX('POSTE (8)'!U:U,MATCH(ROW()-2,'POSTE (8)'!$W:$W,0)),IFERROR(INDEX('POSTE (9)'!U:U,MATCH(ROW()-2,'POSTE (9)'!$W:$W,0)),\"\")))))))))","v":"POSTE (9)"}]
[{"$f":"IFERROR(INDEX('POSTE (1)'!N:N,MATCH(ROW()-2,'POSTE (1)'!$W:$W,0)),IFERROR(INDEX('POSTE (2)'!N:N,MATCH(ROW()-2,'POSTE (2)'!$W:$W,0)),IFERROR(INDEX('POSTE (3)'!N:N,MATCH(ROW()-2,'POSTE (3)'!$W:$W,0)),IFERROR(INDEX('POSTE (4)'!N:N,MATCH(ROW()-2,'POSTE (4)'!$W:$W,0)),IFERROR(INDEX('POSTE (5)'!N:N,MATCH(ROW()-2,'POSTE (5)'!$W:$W,0)),IFERROR(INDEX('POSTE (6)'!N:N,MATCH(ROW()-2,'POSTE (6)'!$W:$W,0)),IFERROR(INDEX('POSTE (7)'!N:N,MATCH(ROW()-2,'POSTE (7)'!$W:$W,0)),IFERROR(INDEX('POSTE (8)'!N:N,MATCH(ROW()-2,'POSTE (8)'!$W:$W,0)),IFERROR(INDEX('POSTE (9)'!N:N,MATCH(ROW()-2,'POSTE (9)'!$W:$W,0)),\"\")))))))))","v":"(9)Fournisseur7"},{"$f":"IFERROR(INDEX('POSTE (1)'!O:O,MATCH(ROW()-2,'POSTE (1)'!$W:$W,0)),IFERROR(INDEX('POSTE (2)'!O:O,MATCH(ROW()-2,'POSTE (2)'!$W:$W,0)),IFERROR(INDEX('POSTE (3)'!O:O,MATCH(ROW()-2,'POSTE (3)'!$W:$W,0)),IFERROR(INDEX('POSTE (4)'!O:O,MATCH(ROW()-2,'POSTE (4)'!$W:$W,0)),IFERROR(INDEX('POSTE (5)'!O:O,MATCH(ROW()-2,'POSTE (5)'!$W:$W,0)),IFERROR(INDEX('POSTE (6)'!O:O,MATCH(ROW()-2,'POSTE (6)'!$W:$W,0)),IFERROR(INDEX('POSTE (7)'!O:O,MATCH(ROW()-2,'POSTE (7)'!$W:$W,0)),IFERROR(INDEX('POSTE (8)'!O:O,MATCH(ROW()-2,'POSTE (8)'!$W:$W,0)),IFERROR(INDEX('POSTE (9)'!O:O,MATCH(ROW()-2,'POSTE (9)'!$W:$W,0)),\"\")))))))))","v":"(9)Ref7"},{"$f":"IFERROR(INDEX('POSTE (1)'!P:P,MATCH(ROW()-2,'POSTE (1)'!$W:$W,0)),IFERROR(INDEX('POSTE (2)'!P:P,MATCH(ROW()-2,'POSTE (2)'!$W:$W,0)),IFERROR(INDEX('POSTE (3)'!P:P,MATCH(ROW()-2,'POSTE (3)'!$W:$W,0)),IFERROR(INDEX('POSTE (4)'!P:P,MATCH(ROW()-2,'POSTE (4)'!$W:$W,0)),IFERROR(INDEX('POSTE (5)'!P:P,MATCH(ROW()-2,'POSTE (5)'!$W:$W,0)),IFERROR(INDEX('POSTE (6)'!P:P,MATCH(ROW()-2,'POSTE (6)'!$W:$W,0)),IFERROR(INDEX('POSTE (7)'!P:P,MATCH(ROW()-2,'POSTE (7)'!$W:$W,0)),IFERROR(INDEX('POSTE (8)'!P:P,MATCH(ROW()-2,'POSTE (8)'!$W:$W,0)),IFERROR(INDEX('POSTE (9)'!P:P,MATCH(ROW()-2,'POSTE (9)'!$W:$W,0)),\"\")))))))))","v":"(9)DESIGNATION7"},{"$f":"IFERROR(INDEX('POSTE (1)'!Q:Q,MATCH(ROW()-2,'POSTE (1)'!$W:$W,0)),IFERROR(INDEX('POSTE (2)'!Q:Q,MATCH(ROW()-2,'POSTE (2)'!$W:$W,0)),IFERROR(INDEX('POSTE (3)'!Q:Q,MATCH(ROW()-2,'POSTE (3)'!$W:$W,0)),IFERROR(INDEX('POSTE (4)'!Q:Q,MATCH(ROW()-2,'POSTE (4)'!$W:$W,0)),IFERROR(INDEX('POSTE (5)'!Q:Q,MATCH(ROW()-2,'POSTE (5)'!$W:$W,0)),IFERROR(INDEX('POSTE (6)'!Q:Q,MATCH(ROW()-2,'POSTE (6)'!$W:$W,0)),IFERROR(INDEX('POSTE (7)'!Q:Q,MATCH(ROW()-2,'POSTE (7)'!$W:$W,0)),IFERROR(INDEX('POSTE (8)'!Q:Q,MATCH(ROW()-2,'POSTE (8)'!$W:$W,0)),IFERROR(INDEX('POSTE (9)'!Q:Q,MATCH(ROW()-2,'POSTE (9)'!$W:$W,0)),\"\")))))))))","v":"U(9)"},{"$f":"IFERROR(INDEX('POSTE (1)'!R:R,MATCH(ROW()-2,'POSTE (1)'!$W:$W,0)),IFERROR(INDEX('POSTE (2)'!R:R,MATCH(ROW()-2,'POSTE (2)'!$W:$W,0)),IFERROR(INDEX('POSTE (3)'!R:R,MATCH(ROW()-2,'POSTE (3)'!$W:$W,0)),IFERROR(INDEX('POSTE (4)'!R:R,MATCH(ROW()-2,'POSTE (4)'!$W:$W,0)),IFERROR(INDEX('POSTE (5)'!R:R,MATCH(ROW()-2,'POSTE (5)'!$W:$W,0)),IFERROR(INDEX('POSTE (6)'!R:R,MATCH(ROW()-2,'POSTE (6)'!$W:$W,0)),IFERROR(INDEX('POSTE (7)'!R:R,MATCH(ROW()-2,'POSTE (7)'!$W:$W,0)),IFERROR(INDEX('POSTE (8)'!R:R,MATCH(ROW()-2,'POSTE (8)'!$W:$W,0)),IFERROR(INDEX('POSTE (9)'!R:R,MATCH(ROW()-2,'POSTE (9)'!$W:$W,0)),\"\")))))))))","v":9},{"$f":"IFERROR(INDEX('POSTE (1)'!S:S,MATCH(ROW()-2,'POSTE (1)'!$W:$W,0)),IFERROR(INDEX('POSTE (2)'!S:S,MATCH(ROW()-2,'POSTE (2)'!$W:$W,0)),IFERROR(INDEX('POSTE (3)'!S:S,MATCH(ROW()-2,'POSTE (3)'!$W:$W,0)),IFERROR(INDEX('POSTE (4)'!S:S,MATCH(ROW()-2,'POSTE (4)'!$W:$W,0)),IFERROR(INDEX('POSTE (5)'!S:S,MATCH(ROW()-2,'POSTE (5)'!$W:$W,0)),IFERROR(INDEX('POSTE (6)'!S:S,MATCH(ROW()-2,'POSTE (6)'!$W:$W,0)),IFERROR(INDEX('POSTE (7)'!S:S,MATCH(ROW()-2,'POSTE (7)'!$W:$W,0)),IFERROR(INDEX('POSTE (8)'!S:S,MATCH(ROW()-2,'POSTE (8)'!$W:$W,0)),IFERROR(INDEX('POSTE (9)'!S:S,MATCH(ROW()-2,'POSTE (9)'!$W:$W,0)),\"\")))))))))","v":1},{"$f":"IFERROR(INDEX('POSTE (1)'!T:T,MATCH(ROW()-2,'POSTE (1)'!$W:$W,0)),IFERROR(INDEX('POSTE (2)'!T:T,MATCH(ROW()-2,'POSTE (2)'!$W:$W,0)),IFERROR(INDEX('POSTE (3)'!T:T,MATCH(ROW()-2,'POSTE (3)'!$W:$W,0)),IFERROR(INDEX('POSTE (4)'!T:T,MATCH(ROW()-2,'POSTE (4)'!$W:$W,0)),IFERROR(INDEX('POSTE (5)'!T:T,MATCH(ROW()-2,'POSTE (5)'!$W:$W,0)),IFERROR(INDEX('POSTE (6)'!T:T,MATCH(ROW()-2,'POSTE (6)'!$W:$W,0)),IFERROR(INDEX('POSTE (7)'!T:T,MATCH(ROW()-2,'POSTE (7)'!$W:$W,0)),IFERROR(INDEX('POSTE (8)'!T:T,MATCH(ROW()-2,'POSTE (8)'!$W:$W,0)),IFERROR(INDEX('POSTE (9)'!T:T,MATCH(ROW()-2,'POSTE (9)'!$W:$W,0)),\"\")))))))))","v":9},{"$f":"IFERROR(INDEX('POSTE (1)'!U:U,MATCH(ROW()-2,'POSTE (1)'!$W:$W,0)),IFERROR(INDEX('POSTE (2)'!U:U,MATCH(ROW()-2,'POSTE (2)'!$W:$W,0)),IFERROR(INDEX('POSTE (3)'!U:U,MATCH(ROW()-2,'POSTE (3)'!$W:$W,0)),IFERROR(INDEX('POSTE (4)'!U:U,MATCH(ROW()-2,'POSTE (4)'!$W:$W,0)),IFERROR(INDEX('POSTE (5)'!U:U,MATCH(ROW()-2,'POSTE (5)'!$W:$W,0)),IFERROR(INDEX('POSTE (6)'!U:U,MATCH(ROW()-2,'POSTE (6)'!$W:$W,0)),IFERROR(INDEX('POSTE (7)'!U:U,MATCH(ROW()-2,'POSTE (7)'!$W:$W,0)),IFERROR(INDEX('POSTE (8)'!U:U,MATCH(ROW()-2,'POSTE (8)'!$W:$W,0)),IFERROR(INDEX('POSTE (9)'!U:U,MATCH(ROW()-2,'POSTE (9)'!$W:$W,0)),\"\")))))))))","v":"POSTE (9)"}]
[{"$f":"IFERROR(INDEX('POSTE (1)'!N:N,MATCH(ROW()-2,'POSTE (1)'!$W:$W,0)),IFERROR(INDEX('POSTE (2)'!N:N,MATCH(ROW()-2,'POSTE (2)'!$W:$W,0)),IFERROR(INDEX('POSTE (3)'!N:N,MATCH(ROW()-2,'POSTE (3)'!$W:$W,0)),IFERROR(INDEX('POSTE (4)'!N:N,MATCH(ROW()-2,'POSTE (4)'!$W:$W,0)),IFERROR(INDEX('POSTE (5)'!N:N,MATCH(ROW()-2,'POSTE (5)'!$W:$W,0)),IFERROR(INDEX('POSTE (6)'!N:N,MATCH(ROW()-2,'POSTE (6)'!$W:$W,0)),IFERROR(INDEX('POSTE (7)'!N:N,MATCH(ROW()-2,'POSTE (7)'!$W:$W,0)),IFERROR(INDEX('POSTE (8)'!N:N,MATCH(ROW()-2,'POSTE (8)'!$W:$W,0)),IFERROR(INDEX('POSTE (9)'!N:N,MATCH(ROW()-2,'POSTE (9)'!$W:$W,0)),\"\")))))))))","v":"(9)Fournisseur8"},{"$f":"IFERROR(INDEX('POSTE (1)'!O:O,MATCH(ROW()-2,'POSTE (1)'!$W:$W,0)),IFERROR(INDEX('POSTE (2)'!O:O,MATCH(ROW()-2,'POSTE (2)'!$W:$W,0)),IFERROR(INDEX('POSTE (3)'!O:O,MATCH(ROW()-2,'POSTE (3)'!$W:$W,0)),IFERROR(INDEX('POSTE (4)'!O:O,MATCH(ROW()-2,'POSTE (4)'!$W:$W,0)),IFERROR(INDEX('POSTE (5)'!O:O,MATCH(ROW()-2,'POSTE (5)'!$W:$W,0)),IFERROR(INDEX('POSTE (6)'!O:O,MATCH(ROW()-2,'POSTE (6)'!$W:$W,0)),IFERROR(INDEX('POSTE (7)'!O:O,MATCH(ROW()-2,'POSTE (7)'!$W:$W,0)),IFERROR(INDEX('POSTE (8)'!O:O,MATCH(ROW()-2,'POSTE (8)'!$W:$W,0)),IFERROR(INDEX('POSTE (9)'!O:O,MATCH(ROW()-2,'POSTE (9)'!$W:$W,0)),\"\")))))))))","v":"(9)Ref8"},{"$f":"IFERROR(INDEX('POSTE (1)'!P:P,MATCH(ROW()-2,'POSTE (1)'!$W:$W,0)),IFERROR(INDEX('POSTE (2)'!P:P,MATCH(ROW()-2,'POSTE (2)'!$W:$W,0)),IFERROR(INDEX('POSTE (3)'!P:P,MATCH(ROW()-2,'POSTE (3)'!$W:$W,0)),IFERROR(INDEX('POSTE (4)'!P:P,MATCH(ROW()-2,'POSTE (4)'!$W:$W,0)),IFERROR(INDEX('POSTE (5)'!P:P,MATCH(ROW()-2,'POSTE (5)'!$W:$W,0)),IFERROR(INDEX('POSTE (6)'!P:P,MATCH(ROW()-2,'POSTE (6)'!$W:$W,0)),IFERROR(INDEX('POSTE (7)'!P:P,MATCH(ROW()-2,'POSTE (7)'!$W:$W,0)),IFERROR(INDEX('POSTE (8)'!P:P,MATCH(ROW()-2,'POSTE (8)'!$W:$W,0)),IFERROR(INDEX('POSTE (9)'!P:P,MATCH(ROW()-2,'POSTE (9)'!$W:$W,0)),\"\")))))))))","v":"(9)DESIGNATION8"},{"$f":"IFERROR(INDEX('POSTE (1)'!Q:Q,MATCH(ROW()-2,'POSTE (1)'!$W:$W,0)),IFERROR(INDEX('POSTE (2)'!Q:Q,MATCH(ROW()-2,'POSTE (2)'!$W:$W,0)),IFERROR(INDEX('POSTE (3)'!Q:Q,MATCH(ROW()-2,'POSTE (3)'!$W:$W,0)),IFERROR(INDEX('POSTE (4)'!Q:Q,MATCH(ROW()-2,'POSTE (4)'!$W:$W,0)),IFERROR(INDEX('POSTE (5)'!Q:Q,MATCH(ROW()-2,'POSTE (5)'!$W:$W,0)),IFERROR(INDEX('POSTE (6)'!Q:Q,MATCH(ROW()-2,'POSTE (6)'!$W:$W,0)),IFERROR(INDEX('POSTE (7)'!Q:Q,MATCH(ROW()-2,'POSTE (7)'!$W:$W,0)),IFERROR(INDEX('POSTE (8)'!Q:Q,MATCH(ROW()-2,'POSTE (8)'!$W:$W,0)),IFERROR(INDEX('POSTE (9)'!Q:Q,MATCH(ROW()-2,'POSTE (9)'!$W:$W,0)),\"\")))))))))","v":"U(9)"},{"$f":"IFERROR(INDEX('POSTE (1)'!R:R,MATCH(ROW()-2,'POSTE (1)'!$W:$W,0)),IFERROR(INDEX('POSTE (2)'!R:R,MATCH(ROW()-2,'POSTE (2)'!$W:$W,0)),IFERROR(INDEX('POSTE (3)'!R:R,MATCH(ROW()-2,'POSTE (3)'!$W:$W,0)),IFERROR(INDEX('POSTE (4)'!R:R,MATCH(ROW()-2,'POSTE (4)'!$W:$W,0)),IFERROR(INDEX('POSTE (5)'!R:R,MATCH(ROW()-2,'POSTE (5)'!$W:$W,0)),IFERROR(INDEX('POSTE (6)'!R:R,MATCH(ROW()-2,'POSTE (6)'!$W:$W,0)),IFERROR(INDEX('POSTE (7)'!R:R,MATCH(ROW()-2,'POSTE (7)'!$W:$W,0)),IFERROR(INDEX('POSTE (8)'!R:R,MATCH(ROW()-2,'POSTE (8)'!$W:$W,0)),IFERROR(INDEX('POSTE (9)'!R:R,MATCH(ROW()-2,'POSTE (9)'!$W:$W,0)),\"\")))))))))","v":9},{"$f":"IFERROR(INDEX('POSTE (1)'!S:S,MATCH(ROW()-2,'POSTE (1)'!$W:$W,0)),IFERROR(INDEX('POSTE (2)'!S:S,MATCH(ROW()-2,'POSTE (2)'!$W:$W,0)),IFERROR(INDEX('POSTE (3)'!S:S,MATCH(ROW()-2,'POSTE (3)'!$W:$W,0)),IFERROR(INDEX('POSTE (4)'!S:S,MATCH(ROW()-2,'POSTE (4)'!$W:$W,0)),IFERROR(INDEX('POSTE (5)'!S:S,MATCH(ROW()-2,'POSTE (5)'!$W:$W,0)),IFERROR(INDEX('POSTE (6)'!S:S,MATCH(ROW()-2,'POSTE (6)'!$W:$W,0)),IFERROR(INDEX('POSTE (7)'!S:S,MATCH(ROW()-2,'POSTE (7)'!$W:$W,0)),IFERROR(INDEX('POSTE (8)'!S:S,MATCH(ROW()-2,'POSTE (8)'!$W:$W,0)),IFERROR(INDEX('POSTE (9)'!S:S,MATCH(ROW()-2,'POSTE (9)'!$W:$W,0)),\"\")))))))))","v":1},{"$f":"IFERROR(INDEX('POSTE (1)'!T:T,MATCH(ROW()-2,'POSTE (1)'!$W:$W,0)),IFERROR(INDEX('POSTE (2)'!T:T,MATCH(ROW()-2,'POSTE (2)'!$W:$W,0)),IFERROR(INDEX('POSTE (3)'!T:T,MATCH(ROW()-2,'POSTE (3)'!$W:$W,0)),IFERROR(INDEX('POSTE (4)'!T:T,MATCH(ROW()-2,'POSTE (4)'!$W:$W,0)),IFERROR(INDEX('POSTE (5)'!T:T,MATCH(ROW()-2,'POSTE (5)'!$W:$W,0)),IFERROR(INDEX('POSTE (6)'!T:T,MATCH(ROW()-2,'POSTE (6)'!$W:$W,0)),IFERROR(INDEX('POSTE (7)'!T:T,MATCH(ROW()-2,'POSTE (7)'!$W:$W,0)),IFERROR(INDEX('POSTE (8)'!T:T,MATCH(ROW()-2,'POSTE (8)'!$W:$W,0)),IFERROR(INDEX('POSTE (9)'!T:T,MATCH(ROW()-2,'POSTE (9)'!$W:$W,0)),\"\")))))))))","v":9},{"$f":"IFERROR(INDEX('POSTE (1)'!U:U,MATCH(ROW()-2,'POSTE (1)'!$W:$W,0)),IFERROR(INDEX('POSTE (2)'!U:U,MATCH(ROW()-2,'POSTE (2)'!$W:$W,0)),IFERROR(INDEX('POSTE (3)'!U:U,MATCH(ROW()-2,'POSTE (3)'!$W:$W,0)),IFERROR(INDEX('POSTE (4)'!U:U,MATCH(ROW()-2,'POSTE (4)'!$W:$W,0)),IFERROR(INDEX('POSTE (5)'!U:U,MATCH(ROW()-2,'POSTE (5)'!$W:$W,0)),IFERROR(INDEX('POSTE (6)'!U:U,MATCH(ROW()-2,'POSTE (6)'!$W:$W,0)),IFERROR(INDEX('POSTE (7)'!U:U,MATCH(ROW()-2,'POSTE (7)'!$W:$W,0)),IFERROR(INDEX('POSTE (8)'!U:U,MATCH(ROW()-2,'POSTE (8)'!$W:$W,0)),IFERROR(INDEX('POSTE (9)'!U:U,MATCH(ROW()-2,'POSTE (9)'!$W:$W,0)),\"\")))))))))","v":"POSTE (9)"}]
[{"$f":"IFERROR(INDEX('POSTE (1)'!N:N,MATCH(ROW()-2,'POSTE (1)'!$W:$W,0)),IFERROR(INDEX('POSTE (2)'!N:N,MATCH(ROW()-2,'POSTE (2)'!$W:$W,0)),IFERROR(INDEX('POSTE (3)'!N:N,MATCH(ROW()-2,'POSTE (3)'!$W:$W,0)),IFERROR(INDEX('POSTE (4)'!N:N,MATCH(ROW()-2,'POSTE (4)'!$W:$W,0)),IFERROR(INDEX('POSTE (5)'!N:N,MATCH(ROW()-2,'POSTE (5)'!$W:$W,0)),IFERROR(INDEX('POSTE (6)'!N:N,MATCH(ROW()-2,'POSTE (6)'!$W:$W,0)),IFERROR(INDEX('POSTE (7)'!N:N,MATCH(ROW()-2,'POSTE (7)'!$W:$W,0)),IFERROR(INDEX('POSTE (8)'!N:N,MATCH(ROW()-2,'POSTE (8)'!$W:$W,0)),IFERROR(INDEX('POSTE (9)'!N:N,MATCH(ROW()-2,'POSTE (9)'!$W:$W,0)),\"\")))))))))","v":"(9)Fournisseur9"},{"$f":"IFERROR(INDEX('POSTE (1)'!O:O,MATCH(ROW()-2,'POSTE (1)'!$W:$W,0)),IFERROR(INDEX('POSTE (2)'!O:O,MATCH(ROW()-2,'POSTE (2)'!$W:$W,0)),IFERROR(INDEX('POSTE (3)'!O:O,MATCH(ROW()-2,'POSTE (3)'!$W:$W,0)),IFERROR(INDEX('POSTE (4)'!O:O,MATCH(ROW()-2,'POSTE (4)'!$W:$W,0)),IFERROR(INDEX('POSTE (5)'!O:O,MATCH(ROW()-2,'POSTE (5)'!$W:$W,0)),IFERROR(INDEX('POSTE (6)'!O:O,MATCH(ROW()-2,'POSTE (6)'!$W:$W,0)),IFERROR(INDEX('POSTE (7)'!O:O,MATCH(ROW()-2,'POSTE (7)'!$W:$W,0)),IFERROR(INDEX('POSTE (8)'!O:O,MATCH(ROW()-2,'POSTE (8)'!$W:$W,0)),IFERROR(INDEX('POSTE (9)'!O:O,MATCH(ROW()-2,'POSTE (9)'!$W:$W,0)),\"\")))))))))","v":"(9)Ref9"},{"$f":"IFERROR(INDEX('POSTE (1)'!P:P,MATCH(ROW()-2,'POSTE (1)'!$W:$W,0)),IFERROR(INDEX('POSTE (2)'!P:P,MATCH(ROW()-2,'POSTE (2)'!$W:$W,0)),IFERROR(INDEX('POSTE (3)'!P:P,MATCH(ROW()-2,'POSTE (3)'!$W:$W,0)),IFERROR(INDEX('POSTE (4)'!P:P,MATCH(ROW()-2,'POSTE (4)'!$W:$W,0)),IFERROR(INDEX('POSTE (5)'!P:P,MATCH(ROW()-2,'POSTE (5)'!$W:$W,0)),IFERROR(INDEX('POSTE (6)'!P:P,MATCH(ROW()-2,'POSTE (6)'!$W:$W,0)),IFERROR(INDEX('POSTE (7)'!P:P,MATCH(ROW()-2,'POSTE (7)'!$W:$W,0)),IFERROR(INDEX('POSTE (8)'!P:P,MATCH(ROW()-2,'POSTE (8)'!$W:$W,0)),IFERROR(INDEX('POSTE (9)'!P:P,MATCH(ROW()-2,'POSTE (9)'!$W:$W,0)),\"\")))))))))","v":"(9)DESIGNATION9"},{"$f":"IFERROR(INDEX('POSTE (1)'!Q:Q,MATCH(ROW()-2,'POSTE (1)'!$W:$W,0)),IFERROR(INDEX('POSTE (2)'!Q:Q,MATCH(ROW()-2,'POSTE (2)'!$W:$W,0)),IFERROR(INDEX('POSTE (3)'!Q:Q,MATCH(ROW()-2,'POSTE (3)'!$W:$W,0)),IFERROR(INDEX('POSTE (4)'!Q:Q,MATCH(ROW()-2,'POSTE (4)'!$W:$W,0)),IFERROR(INDEX('POSTE (5)'!Q:Q,MATCH(ROW()-2,'POSTE (5)'!$W:$W,0)),IFERROR(INDEX('POSTE (6)'!Q:Q,MATCH(ROW()-2,'POSTE (6)'!$W:$W,0)),IFERROR(INDEX('POSTE (7)'!Q:Q,MATCH(ROW()-2,'POSTE (7)'!$W:$W,0)),IFERROR(INDEX('POSTE (8)'!Q:Q,MATCH(ROW()-2,'POSTE (8)'!$W:$W,0)),IFERROR(INDEX('POSTE (9)'!Q:Q,MATCH(ROW()-2,'POSTE (9)'!$W:$W,0)),\"\")))))))))","v":"U(9)"},{"$f":"IFERROR(INDEX('POSTE (1)'!R:R,MATCH(ROW()-2,'POSTE (1)'!$W:$W,0)),IFERROR(INDEX('POSTE (2)'!R:R,MATCH(ROW()-2,'POSTE (2)'!$W:$W,0)),IFERROR(INDEX('POSTE (3)'!R:R,MATCH(ROW()-2,'POSTE (3)'!$W:$W,0)),IFERROR(INDEX('POSTE (4)'!R:R,MATCH(ROW()-2,'POSTE (4)'!$W:$W,0)),IFERROR(INDEX('POSTE (5)'!R:R,MATCH(ROW()-2,'POSTE (5)'!$W:$W,0)),IFERROR(INDEX('POSTE (6)'!R:R,MATCH(ROW()-2,'POSTE (6)'!$W:$W,0)),IFERROR(INDEX('POSTE (7)'!R:R,MATCH(ROW()-2,'POSTE (7)'!$W:$W,0)),IFERROR(INDEX('POSTE (8)'!R:R,MATCH(ROW()-2,'POSTE (8)'!$W:$W,0)),IFERROR(INDEX('POSTE (9)'!R:R,MATCH(ROW()-2,'POSTE (9)'!$W:$W,0)),\"\")))))))))","v":9},{"$f":"IFERROR(INDEX('POSTE (1)'!S:S,MATCH(ROW()-2,'POSTE (1)'!$W:$W,0)),IFERROR(INDEX('POSTE (2)'!S:S,MATCH(ROW()-2,'POSTE (2)'!$W:$W,0)),IFERROR(INDEX('POSTE (3)'!S:S,MATCH(ROW()-2,'POSTE (3)'!$W:$W,0)),IFERROR(INDEX('POSTE (4)'!S:S,MATCH(ROW()-2,'POSTE (4)'!$W:$W,0)),IFERROR(INDEX('POSTE (5)'!S:S,MATCH(ROW()-2,'POSTE (5)'!$W:$W,0)),IFERROR(INDEX('POSTE (6)'!S:S,MATCH(ROW()-2,'POSTE (6)'!$W:$W,0)),IFERROR(INDEX('POSTE (7)'!S:S,MATCH(ROW()-2,'POSTE (7)'!$W:$W,0)),IFERROR(INDEX('POSTE (8)'!S:S,MATCH(ROW()-2,'POSTE (8)'!$W:$W,0)),IFERROR(INDEX('POSTE (9)'!S:S,MATCH(ROW()-2,'POSTE (9)'!$W:$W,0)),\"\")))))))))","v":1},{"$f":"IFERROR(INDEX('POSTE (1)'!T:T,MATCH(ROW()-2,'POSTE (1)'!$W:$W,0)),IFERROR(INDEX('POSTE (2)'!T:T,MATCH(ROW()-2,'POSTE (2)'!$W:$W,0)),IFERROR(INDEX('POSTE (3)'!T:T,MATCH(ROW()-2,'POSTE (3)'!$W:$W,0)),IFERROR(INDEX('POSTE (4)'!T:T,MATCH(ROW()-2,'POSTE (4)'!$W:$W,0)),IFERROR(INDEX('POSTE (5)'!T:T,MATCH(ROW()-2,'POSTE (5)'!$W:$W,0)),IFERROR(INDEX('POSTE (6)'!T:T,MATCH(ROW()-2,'POSTE (6)'!$W:$W,0)),IFERROR(INDEX('POSTE (7)'!T:T,MATCH(ROW()-2,'POSTE (7)'!$W:$W,0)),IFERROR(INDEX('POSTE (8)'!T:T,MATCH(ROW()-2,'POSTE (8)'!$W:$W,0)),IFERROR(INDEX('POSTE (9)'!T:T,MATCH(ROW()-2,'POSTE (9)'!$W:$W,0)),\"\")))))))))","v":9},{"$f":"IFERROR(INDEX('POSTE (1)'!U:U,MATCH(ROW()-2,'POSTE (1)'!$W:$W,0)),IFERROR(INDEX('POSTE (2)'!U:U,MATCH(ROW()-2,'POSTE (2)'!$W:$W,0)),IFERROR(INDEX('POSTE (3)'!U:U,MATCH(ROW()-2,'POSTE (3)'!$W:$W,0)),IFERROR(INDEX('POSTE (4)'!U:U,MATCH(ROW()-2,'POSTE (4)'!$W:$W,0)),IFERROR(INDEX('POSTE (5)'!U:U,MATCH(ROW()-2,'POSTE (5)'!$W:$W,0)),IFERROR(INDEX('POSTE (6)'!U:U,MATCH(ROW()-2,'POSTE (6)'!$W:$W,0)),IFERROR(INDEX('POSTE (7)'!U:U,MATCH(ROW()-2,'POSTE (7)'!$W:$W,0)),IFERROR(INDEX('POSTE (8)'!U:U,MATCH(ROW()-2,'POSTE (8)'!$W:$W,0)),IFERROR(INDEX('POSTE (9)'!U:U,MATCH(ROW()-2,'POSTE (9)'!$W:$W,0)),\"\")))))))))","v":"POSTE (9)"}]
[{"$f":"IFERROR(INDEX('POSTE (1)'!N:N,MATCH(ROW()-2,'POSTE (1)'!$W:$W,0)),IFERROR(INDEX('POSTE (2)'!N:N,MATCH(ROW()-2,'POSTE (2)'!$W:$W,0)),IFERROR(INDEX('POSTE (3)'!N:N,MATCH(ROW()-2,'POSTE (3)'!$W:$W,0)),IFERROR(INDEX('POSTE (4)'!N:N,MATCH(ROW()-2,'POSTE (4)'!$W:$W,0)),IFERROR(INDEX('POSTE (5)'!N:N,MATCH(ROW()-2,'POSTE (5)'!$W:$W,0)),IFERROR(INDEX('POSTE (6)'!N:N,MATCH(ROW()-2,'POSTE (6)'!$W:$W,0)),IFERROR(INDEX('POSTE (7)'!N:N,MATCH(ROW()-2,'POSTE (7)'!$W:$W,0)),IFERROR(INDEX('POSTE (8)'!N:N,MATCH(ROW()-2,'POSTE (8)'!$W:$W,0)),IFERROR(INDEX('POSTE (9)'!N:N,MATCH(ROW()-2,'POSTE (9)'!$W:$W,0)),\"\")))))))))","v":""},{"$f":"IFERROR(INDEX('POSTE (1)'!O:O,MATCH(ROW()-2,'POSTE (1)'!$W:$W,0)),IFERROR(INDEX('POSTE (2)'!O:O,MATCH(ROW()-2,'POSTE (2)'!$W:$W,0)),IFERROR(INDEX('POSTE (3)'!O:O,MATCH(ROW()-2,'POSTE (3)'!$W:$W,0)),IFERROR(INDEX('POSTE (4)'!O:O,MATCH(ROW()-2,'POSTE (4)'!$W:$W,0)),IFERROR(INDEX('POSTE (5)'!O:O,MATCH(ROW()-2,'POSTE (5)'!$W:$W,0)),IFERROR(INDEX('POSTE (6)'!O:O,MATCH(ROW()-2,'POSTE (6)'!$W:$W,0)),IFERROR(INDEX('POSTE (7)'!O:O,MATCH(ROW()-2,'POSTE (7)'!$W:$W,0)),IFERROR(INDEX('POSTE (8)'!O:O,MATCH(ROW()-2,'POSTE (8)'!$W:$W,0)),IFERROR(INDEX('POSTE (9)'!O:O,MATCH(ROW()-2,'POSTE (9)'!$W:$W,0)),\"\")))))))))","v":""},{"$f":"IFERROR(INDEX('POSTE (1)'!P:P,MATCH(ROW()-2,'POSTE (1)'!$W:$W,0)),IFERROR(INDEX('POSTE (2)'!P:P,MATCH(ROW()-2,'POSTE (2)'!$W:$W,0)),IFERROR(INDEX('POSTE (3)'!P:P,MATCH(ROW()-2,'POSTE (3)'!$W:$W,0)),IFERROR(INDEX('POSTE (4)'!P:P,MATCH(ROW()-2,'POSTE (4)'!$W:$W,0)),IFERROR(INDEX('POSTE (5)'!P:P,MATCH(ROW()-2,'POSTE (5)'!$W:$W,0)),IFERROR(INDEX('POSTE (6)'!P:P,MATCH(ROW()-2,'POSTE (6)'!$W:$W,0)),IFERROR(INDEX('POSTE (7)'!P:P,MATCH(ROW()-2,'POSTE (7)'!$W:$W,0)),IFERROR(INDEX('POSTE (8)'!P:P,MATCH(ROW()-2,'POSTE (8)'!$W:$W,0)),IFERROR(INDEX('POSTE (9)'!P:P,MATCH(ROW()-2,'POSTE (9)'!$W:$W,0)),\"\")))))))))","v":""},{"$f":"IFERROR(INDEX('POSTE (1)'!Q:Q,MATCH(ROW()-2,'POSTE (1)'!$W:$W,0)),IFERROR(INDEX('POSTE (2)'!Q:Q,MATCH(ROW()-2,'POSTE (2)'!$W:$W,0)),IFERROR(INDEX('POSTE (3)'!Q:Q,MATCH(ROW()-2,'POSTE (3)'!$W:$W,0)),IFERROR(INDEX('POSTE (4)'!Q:Q,MATCH(ROW()-2,'POSTE (4)'!$W:$W,0)),IFERROR(INDEX('POSTE (5)'!Q:Q,MATCH(ROW()-2,'POSTE (5)'!$W:$W,0)),IFERROR(INDEX('POSTE (6)'!Q:Q,MATCH(ROW()-2,'POSTE (6)'!$W:$W,0)),IFERROR(INDEX('POSTE (7)'!Q:Q,MATCH(ROW()-2,'POSTE (7)'!$W:$W,0)),IFERROR(INDEX('POSTE (8)'!Q:Q,MATCH(ROW()-2,'POSTE (8)'!$W:$W,0)),IFERROR(INDEX('POSTE (9)'!Q:Q,MATCH(ROW()-2,'POSTE (9)'!$W:$W,0)),\"\")))))))))","v":""},{"$f":"IFERROR(INDEX('POSTE (1)'!R:R,MATCH(ROW()-2,'POSTE (1)'!$W:$W,0)),IFERROR(INDEX('POSTE (2)'!R:R,MATCH(ROW()-2,'POSTE (2)'!$W:$W,0)),IFERROR(INDEX('POSTE (3)'!R:R,MATCH(ROW()-2,'POSTE (3)'!$W:$W,0)),IFERROR(INDEX('POSTE (4)'!R:R,MATCH(ROW()-2,'POSTE (4)'!$W:$W,0)),IFERROR(INDEX('POSTE (5)'!R:R,MATCH(ROW()-2,'POSTE (5)'!$W:$W,0)),IFERROR(INDEX('POSTE (6)'!R:R,MATCH(ROW()-2,'POSTE (6)'!$W:$W,0)),IFERROR(INDEX('POSTE (7)'!R:R,MATCH(ROW()-2,'POSTE (7)'!$W:$W,0)),IFERROR(INDEX('POSTE (8)'!R:R,MATCH(ROW()-2,'POSTE (8)'!$W:$W,0)),IFERROR(INDEX('POSTE (9)'!R:R,MATCH(ROW()-2,'POSTE (9)'!$W:$W,0)),\"\")))))))))","v":""},{"$f":"IFERROR(INDEX('POSTE (1)'!S:S,MATCH(ROW()-2,'POSTE (1)'!$W:$W,0)),IFERROR(INDEX('POSTE (2)'!S:S,MATCH(ROW()-2,'POSTE (2)'!$W:$W,0)),IFERROR(INDEX('POSTE (3)'!S:S,MATCH(ROW()-2,'POSTE (3)'!$W:$W,0)),IFERROR(INDEX('POSTE (4)'!S:S,MATCH(ROW()-2,'POSTE (4)'!$W:$W,0)),IFERROR(INDEX('POSTE (5)'!S:S,MATCH(ROW()-2,'POSTE (5)'!$W:$W,0)),IFERROR(INDEX('POSTE (6)'!S:S,MATCH(ROW()-2,'POSTE (6)'!$W:$W,0)),IFERROR(INDEX('POSTE (7)'!S:S,MATCH(ROW()-2,'POSTE (7)'!$W:$W,0)),IFERROR(INDEX('POSTE (8)'!S:S,MATCH(ROW()-2,'POSTE (8)'!$W:$W,0)),IFERROR(INDEX('POSTE (9)'!S:S,MATCH(ROW()-2,'POSTE (9)'!$W:$W,0)),\"\")))))))))","v":""},{"$f":"IFERROR(INDEX('POSTE (1)'!T:T,MATCH(ROW()-2,'POSTE (1)'!$W:$W,0)),IFERROR(INDEX('POSTE (2)'!T:T,MATCH(ROW()-2,'POSTE (2)'!$W:$W,0)),IFERROR(INDEX('POSTE (3)'!T:T,MATCH(ROW()-2,'POSTE (3)'!$W:$W,0)),IFERROR(INDEX('POSTE (4)'!T:T,MATCH(ROW()-2,'POSTE (4)'!$W:$W,0)),IFERROR(INDEX('POSTE (5)'!T:T,MATCH(ROW()-2,'POSTE (5)'!$W:$W,0)),IFERROR(INDEX('POSTE (6)'!T:T,MATCH(ROW()-2,'POSTE (6)'!$W:$W,0)),IFERROR(INDEX('POSTE (7)'!T:T,MATCH(ROW()-2,'POSTE (7)'!$W:$W,0)),IFERROR(INDEX('POSTE (8)'!T:T,MATCH(ROW()-2,'POSTE (8)'!$W:$W,0)),IFERROR(INDEX('POSTE (9)'!T:T,MATCH(ROW()-2,'POSTE (9)'!$W:$W,0)),\"\")))))))))","v":""},{"$f":"IFERROR(INDEX('POSTE (1)'!U:U,MATCH(ROW()-2,'POSTE (1)'!$W:$W,0)),IFERROR(INDEX('POSTE (2)'!U:U,MATCH(ROW()-2,'POSTE (2)'!$W:$W,0)),IFERROR(INDEX('POSTE (3)'!U:U,MATCH(ROW()-2,'POSTE (3)'!$W:$W,0)),IFERROR(INDEX('POSTE (4)'!U:U,MATCH(ROW()-2,'POSTE (4)'!$W:$W,0)),IFERROR(INDEX('POSTE (5)'!U:U,MATCH(ROW()-2,'POSTE (5)'!$W:$W,0)),IFERROR(INDEX('POSTE (6)'!U:U,MATCH(ROW()-2,'POSTE (6)'!$W:$W,0)),IFERROR(INDEX('POSTE (7)'!U:U,MATCH(ROW()-2,'POSTE (7)'!$W:$W,0)),IFERROR(INDEX('POSTE (8)'!U:U,MATCH(ROW()-2,'POSTE (8)'!$W:$W,0)),IFERROR(INDEX('POSTE (9)'!U:U,MATCH(ROW()-2,'POSTE (9)'!$W:$W,0)),\"\")))))))))","v":""}]
[{"$f":"IFERROR(INDEX('POSTE (1)'!N:N,MATCH(ROW()-2,'POSTE (1)'!$W:$W,0)),IFERROR(INDEX('POSTE (2)'!N:N,MATCH(ROW()-2,'POSTE (2)'!$W:$W,0)),IFERROR(INDEX('POSTE (3)'!N:N,MATCH(ROW()-2,'POSTE (3)'!$W:$W,0)),IFERROR(INDEX('POSTE (4)'!N:N,MATCH(ROW()-2,'POSTE (4)'!$W:$W,0)),IFERROR(INDEX('POSTE (5)'!N:N,MATCH(ROW()-2,'POSTE (5)'!$W:$W,0)),IFERROR(INDEX('POSTE (6)'!N:N,MATCH(ROW()-2,'POSTE (6)'!$W:$W,0)),IFERROR(INDEX('POSTE (7)'!N:N,MATCH(ROW()-2,'POSTE (7)'!$W:$W,0)),IFERROR(INDEX('POSTE (8)'!N:N,MATCH(ROW()-2,'POSTE (8)'!$W:$W,0)),IFERROR(INDEX('POSTE (9)'!N:N,MATCH(ROW()-2,'POSTE (9)'!$W:$W,0)),\"\")))))))))","v":""},{"$f":"IFERROR(INDEX('POSTE (1)'!O:O,MATCH(ROW()-2,'POSTE (1)'!$W:$W,0)),IFERROR(INDEX('POSTE (2)'!O:O,MATCH(ROW()-2,'POSTE (2)'!$W:$W,0)),IFERROR(INDEX('POSTE (3)'!O:O,MATCH(ROW()-2,'POSTE (3)'!$W:$W,0)),IFERROR(INDEX('POSTE (4)'!O:O,MATCH(ROW()-2,'POSTE (4)'!$W:$W,0)),IFERROR(INDEX('POSTE (5)'!O:O,MATCH(ROW()-2,'POSTE (5)'!$W:$W,0)),IFERROR(INDEX('POSTE (6)'!O:O,MATCH(ROW()-2,'POSTE (6)'!$W:$W,0)),IFERROR(INDEX('POSTE (7)'!O:O,MATCH(ROW()-2,'POSTE (7)'!$W:$W,0)),IFERROR(INDEX('POSTE (8)'!O:O,MATCH(ROW()-2,'POSTE (8)'!$W:$W,0)),IFERROR(INDEX('POSTE (9)'!O:O,MATCH(ROW()-2,'POSTE (9)'!$W:$W,0)),\"\")))))))))","v":""},{"$f":"IFERROR(INDEX('POSTE (1)'!P:P,MATCH(ROW()-2,'POSTE (1)'!$W:$W,0)),IFERROR(INDEX('POSTE (2)'!P:P,MATCH(ROW()-2,'POSTE (2)'!$W:$W,0)),IFERROR(INDEX('POSTE (3)'!P:P,MATCH(ROW()-2,'POSTE (3)'!$W:$W,0)),IFERROR(INDEX('POSTE (4)'!P:P,MATCH(ROW()-2,'POSTE (4)'!$W:$W,0)),IFERROR(INDEX('POSTE (5)'!P:P,MATCH(ROW()-2,'POSTE (5)'!$W:$W,0)),IFERROR(INDEX('POSTE (6)'!P:P,MATCH(ROW()-2,'POSTE (6)'!$W:$W,0)),IFERROR(INDEX('POSTE (7)'!P:P,MATCH(ROW()-2,'POSTE (7)'!$W:$W,0)),IFERROR(INDEX('POSTE (8)'!P:P,MATCH(ROW()-2,'POSTE (8)'!$W:$W,0)),IFERROR(INDEX('POSTE (9)'!P:P,MATCH(ROW()-2,'POSTE (9)'!$W:$W,0)),\"\")))))))))","v":""},{"$f":"IFERROR(INDEX('POSTE (1)'!Q:Q,MATCH(ROW()-2,'POSTE (1)'!$W:$W,0)),IFERROR(INDEX('POSTE (2)'!Q:Q,MATCH(ROW()-2,'POSTE (2)'!$W:$W,0)),IFERROR(INDEX('POSTE (3)'!Q:Q,MATCH(ROW()-2,'POSTE (3)'!$W:$W,0)),IFERROR(INDEX('POSTE (4)'!Q:Q,MATCH(ROW()-2,'POSTE (4)'!$W:$W,0)),IFERROR(INDEX('POSTE (5)'!Q:Q,MATCH(ROW()-2,'POSTE (5)'!$W:$W,0)),IFERROR(INDEX('POSTE (6)'!Q:Q,MATCH(ROW()-2,'POSTE (6)'!$W:$W,0)),IFERROR(INDEX('POSTE (7)'!Q:Q,MATCH(ROW()-2,'POSTE (7)'!$W:$W,0)),IFERROR(INDEX('POSTE (8)'!Q:Q,MATCH(ROW()-2,'POSTE (8)'!$W:$W,0)),IFERROR(INDEX('POSTE (9)'!Q:Q,MATCH(ROW()-2,'POSTE (9)'!$W:$W,0)),\"\")))))))))","v":""},{"$f":"IFERROR(INDEX('POSTE (1)'!R:R,MATCH(ROW()-2,'POSTE (1)'!$W:$W,0)),IFERROR(INDEX('POSTE (2)'!R:R,MATCH(ROW()-2,'POSTE (2)'!$W:$W,0)),IFERROR(INDEX('POSTE (3)'!R:R,MATCH(ROW()-2,'POSTE (3)'!$W:$W,0)),IFERROR(INDEX('POSTE (4)'!R:R,MATCH(ROW()-2,'POSTE (4)'!$W:$W,0)),IFERROR(INDEX('POSTE (5)'!R:R,MATCH(ROW()-2,'POSTE (5)'!$W:$W,0)),IFERROR(INDEX('POSTE (6)'!R:R,MATCH(ROW()-2,'POSTE (6)'!$W:$W,0)),IFERROR(INDEX('POSTE (7)'!R:R,MATCH(ROW()-2,'POSTE (7)'!$W:$W,0)),IFERROR(INDEX('POSTE (8)'!R:R,MATCH(ROW()-2,'POSTE (8)'!$W:$W,0)),IFERROR(INDEX('POSTE (9)'!R:R,MATCH(ROW()-2,'POSTE (9)'!$W:$W,0)),\"\")))))))))","v":""},{"$f":"IFERROR(INDEX('POSTE (1)'!S:S,MATCH(ROW()-2,'POSTE (1)'!$W:$W,0)),IFERROR(INDEX('POSTE (2)'!S:S,MATCH(ROW()-2,'POSTE (2)'!$W:$W,0)),IFERROR(INDEX('POSTE (3)'!S:S,MATCH(ROW()-2,'POSTE (3)'!$W:$W,0)),IFERROR(INDEX('POSTE (4)'!S:S,MATCH(ROW()-2,'POSTE (4)'!$W:$W,0)),IFERROR(INDEX('POSTE (5)'!S:S,MATCH(ROW()-2,'POSTE (5)'!$W:$W,0)),IFERROR(INDEX('POSTE (6)'!S:S,MATCH(ROW()-2,'POSTE (6)'!$W:$W,0)),IFERROR(INDEX('POSTE (7)'!S:S,MATCH(ROW()-2,'POSTE (7)'!$W:$W,0)),IFERROR(INDEX('POSTE (8)'!S:S,MATCH(ROW()-2,'POSTE (8)'!$W:$W,0)),IFERROR(INDEX('POSTE (9)'!S:S,MATCH(ROW()-2,'POSTE (9)'!$W:$W,0)),\"\")))))))))","v":""},{"$f":"IFERROR(INDEX('POSTE (1)'!T:T,MATCH(ROW()-2,'POSTE (1)'!$W:$W,0)),IFERROR(INDEX('POSTE (2)'!T:T,MATCH(ROW()-2,'POSTE (2)'!$W:$W,0)),IFERROR(INDEX('POSTE (3)'!T:T,MATCH(ROW()-2,'POSTE (3)'!$W:$W,0)),IFERROR(INDEX('POSTE (4)'!T:T,MATCH(ROW()-2,'POSTE (4)'!$W:$W,0)),IFERROR(INDEX('POSTE (5)'!T:T,MATCH(ROW()-2,'POSTE (5)'!$W:$W,0)),IFERROR(INDEX('POSTE (6)'!T:T,MATCH(ROW()-2,'POSTE (6)'!$W:$W,0)),IFERROR(INDEX('POSTE (7)'!T:T,MATCH(ROW()-2,'POSTE (7)'!$W:$W,0)),IFERROR(INDEX('POSTE (8)'!T:T,MATCH(ROW()-2,'POSTE (8)'!$W:$W,0)),IFERROR(INDEX('POSTE (9)'!T:T,MATCH(ROW()-2,'POSTE (9)'!$W:$W,0)),\"\")))))))))","v":""},{"$f":"IFERROR(INDEX('POSTE (1)'!U:U,MATCH(ROW()-2,'POSTE (1)'!$W:$W,0)),IFERROR(INDEX('POSTE (2)'!U:U,MATCH(ROW()-2,'POSTE (2)'!$W:$W,0)),IFERROR(INDEX('POSTE (3)'!U:U,MATCH(ROW()-2,'POSTE (3)'!$W:$W,0)),IFERROR(INDEX('POSTE (4)'!U:U,MATCH(ROW()-2,'POSTE (4)'!$W:$W,0)),IFERROR(INDEX('POSTE (5)'!U:U,MATCH(ROW()-2,'POSTE (5)'!$W:$W,0)),IFERROR(INDEX('POSTE (6)'!U:U,MATCH(ROW()-2,'POSTE (6)'!$W:$W,0)),IFERROR(INDEX('POSTE (7)'!U:U,MATCH(ROW()-2,'POSTE (7)'!$W:$W,0)),IFERROR(INDEX('POSTE (8)'!U:U,MATCH(ROW()-2,'POSTE (8)'!$W:$W,0)),IFERROR(INDEX('POSTE (9)'!U:U,MATCH(ROW()-2,'POSTE (9)'!$W:$W,0)),\"\")))))))))","v":""}]
[{"$f":"IFERROR(INDEX('POSTE (1)'!N:N,MATCH(ROW()-2,'POSTE (1)'!$W:$W,0)),IFERROR(INDEX('POSTE (2)'!N:N,MATCH(ROW()-2,'POSTE (2)'!$W:$W,0)),IFERROR(INDEX('POSTE (3)'!N:N,MATCH(ROW()-2,'POSTE (3)'!$W:$W,0)),IFERROR(INDEX('POSTE (4)'!N:N,MATCH(ROW()-2,'POSTE (4)'!$W:$W,0)),IFERROR(INDEX('POSTE (5)'!N:N,MATCH(ROW()-2,'POSTE (5)'!$W:$W,0)),IFERROR(INDEX('POSTE (6)'!N:N,MATCH(ROW()-2,'POSTE (6)'!$W:$W,0)),IFERROR(INDEX('POSTE (7)'!N:N,MATCH(ROW()-2,'POSTE (7)'!$W:$W,0)),IFERROR(INDEX('POSTE (8)'!N:N,MATCH(ROW()-2,'POSTE (8)'!$W:$W,0)),IFERROR(INDEX('POSTE (9)'!N:N,MATCH(ROW()-2,'POSTE (9)'!$W:$W,0)),\"\")))))))))","v":""},{"$f":"IFERROR(INDEX('POSTE (1)'!O:O,MATCH(ROW()-2,'POSTE (1)'!$W:$W,0)),IFERROR(INDEX('POSTE (2)'!O:O,MATCH(ROW()-2,'POSTE (2)'!$W:$W,0)),IFERROR(INDEX('POSTE (3)'!O:O,MATCH(ROW()-2,'POSTE (3)'!$W:$W,0)),IFERROR(INDEX('POSTE (4)'!O:O,MATCH(ROW()-2,'POSTE (4)'!$W:$W,0)),IFERROR(INDEX('POSTE (5)'!O:O,MATCH(ROW()-2,'POSTE (5)'!$W:$W,0)),IFERROR(INDEX('POSTE (6)'!O:O,MATCH(ROW()-2,'POSTE (6)'!$W:$W,0)),IFERROR(INDEX('POSTE (7)'!O:O,MATCH(ROW()-2,'POSTE (7)'!$W:$W,0)),IFERROR(INDEX('POSTE (8)'!O:O,MATCH(ROW()-2,'POSTE (8)'!$W:$W,0)),IFERROR(INDEX('POSTE (9)'!O:O,MATCH(ROW()-2,'POSTE (9)'!$W:$W,0)),\"\")))))))))","v":""},{"$f":"IFERROR(INDEX('POSTE (1)'!P:P,MATCH(ROW()-2,'POSTE (1)'!$W:$W,0)),IFERROR(INDEX('POSTE (2)'!P:P,MATCH(ROW()-2,'POSTE (2)'!$W:$W,0)),IFERROR(INDEX('POSTE (3)'!P:P,MATCH(ROW()-2,'POSTE (3)'!$W:$W,0)),IFERROR(INDEX('POSTE (4)'!P:P,MATCH(ROW()-2,'POSTE (4)'!$W:$W,0)),IFERROR(INDEX('POSTE (5)'!P:P,MATCH(ROW()-2,'POSTE (5)'!$W:$W,0)),IFERROR(INDEX('POSTE (6)'!P:P,MATCH(ROW()-2,'POSTE (6)'!$W:$W,0)),IFERROR(INDEX('POSTE (7)'!P:P,MATCH(ROW()-2,'POSTE (7)'!$W:$W,0)),IFERROR(INDEX('POSTE (8)'!P:P,MATCH(ROW()-2,'POSTE (8)'!$W:$W,0)),IFERROR(INDEX('POSTE (9)'!P:P,MATCH(ROW()-2,'POSTE (9)'!$W:$W,0)),\"\")))))))))","v":""},{"$f":"IFERROR(INDEX('POSTE (1)'!Q:Q,MATCH(ROW()-2,'POSTE (1)'!$W:$W,0)),IFERROR(INDEX('POSTE (2)'!Q:Q,MATCH(ROW()-2,'POSTE (2)'!$W:$W,0)),IFERROR(INDEX('POSTE (3)'!Q:Q,MATCH(ROW()-2,'POSTE (3)'!$W:$W,0)),IFERROR(INDEX('POSTE (4)'!Q:Q,MATCH(ROW()-2,'POSTE (4)'!$W:$W,0)),IFERROR(INDEX('POSTE (5)'!Q:Q,MATCH(ROW()-2,'POSTE (5)'!$W:$W,0)),IFERROR(INDEX('POSTE (6)'!Q:Q,MATCH(ROW()-2,'POSTE (6)'!$W:$W,0)),IFERROR(INDEX('POSTE (7)'!Q:Q,MATCH(ROW()-2,'POSTE (7)'!$W:$W,0)),IFERROR(INDEX('POSTE (8)'!Q:Q,MATCH(ROW()-2,'POSTE (8)'!$W:$W,0)),IFERROR(INDEX('POSTE (9)'!Q:Q,MATCH(ROW()-2,'POSTE (9)'!$W:$W,0)),\"\")))))))))","v":""},{"$f":"IFERROR(INDEX('POSTE (1)'!R:R,MATCH(ROW()-2,'POSTE (1)'!$W:$W,0)),IFERROR(INDEX('POSTE (2)'!R:R,MATCH(ROW()-2,'POSTE (2)'!$W:$W,0)),IFERROR(INDEX('POSTE (3)'!R:R,MATCH(ROW()-2,'POSTE (3)'!$W:$W,0)),IFERROR(INDEX('POSTE (4)'!R:R,MATCH(ROW()-2,'POSTE (4)'!$W:$W,0)),IFERROR(INDEX('POSTE (5)'!R:R,MATCH(ROW()-2,'POSTE (5)'!$W:$W,0)),IFERROR(INDEX('POSTE (6)'!R:R,MATCH(ROW()-2,'POSTE (6)'!$W:$W,0)),IFERROR(INDEX('POSTE (7)'!R:R,MATCH(ROW()-2,'POSTE (7)'!$W:$W,0)),IFERROR(INDEX('POSTE (8)'!R:R,MATCH(ROW()-2,'POSTE (8)'!$W:$W,0)),IFERROR(INDEX('POSTE (9)'!R:R,MATCH(ROW()-2,'POSTE (9)'!$W:$W,0)),\"\")))))))))","v":""},{"$f":"IFERROR(INDEX('POSTE (1)'!S:S,MATCH(ROW()-2,'POSTE (1)'!$W:$W,0)),IFERROR(INDEX('POSTE (2)'!S:S,MATCH(ROW()-2,'POSTE (2)'!$W:$W,0)),IFERROR(INDEX('POSTE (3)'!S:S,MATCH(ROW()-2,'POSTE (3)'!$W:$W,0)),IFERROR(INDEX('POSTE (4)'!S:S,MATCH(ROW()-2,'POSTE (4)'!$W:$W,0)),IFERROR(INDEX('POSTE (5)'!S:S,MATCH(ROW()-2,'POSTE (5)'!$W:$W,0)),IFERROR(INDEX('POSTE (6)'!S:S,MATCH(ROW()-2,'POSTE (6)'!$W:$W,0)),IFERROR(INDEX('POSTE (7)'!S:S,MATCH(ROW()-2,'POSTE (7)'!$W:$W,0)),IFERROR(INDEX('POSTE (8)'!S:S,MATCH(ROW()-2,'POSTE (8)'!$W:$W,0)),IFERROR(INDEX('POSTE (9)'!S:S,MATCH(ROW()-2,'POSTE (9)'!$W:$W,0)),\"\")))))))))","v":""},{"$f":"IFERROR(INDEX('POSTE (1)'!T:T,MATCH(ROW()-2,'POSTE (1)'!$W:$W,0)),IFERROR(INDEX('POSTE (2)'!T:T,MATCH(ROW()-2,'POSTE (2)'!$W:$W,0)),IFERROR(INDEX('POSTE (3)'!T:T,MATCH(ROW()-2,'POSTE (3)'!$W:$W,0)),IFERROR(INDEX('POSTE (4)'!T:T,MATCH(ROW()-2,'POSTE (4)'!$W:$W,0)),IFERROR(INDEX('POSTE (5)'!T:T,MATCH(ROW()-2,'POSTE (5)'!$W:$W,0)),IFERROR(INDEX('POSTE (6)'!T:T,MATCH(ROW()-2,'POSTE (6)'!$W:$W,0)),IFERROR(INDEX('POSTE (7)'!T:T,MATCH(ROW()-2,'POSTE (7)'!$W:$W,0)),IFERROR(INDEX('POSTE (8)'!T:T,MATCH(ROW()-2,'POSTE (8)'!$W:$W,0)),IFERROR(INDEX('POSTE (9)'!T:T,MATCH(ROW()-2,'POSTE (9)'!$W:$W,0)),\"\")))))))))","v":""},{"$f":"IFERROR(INDEX('POSTE (1)'!U:U,MATCH(ROW()-2,'POSTE (1)'!$W:$W,0)),IFERROR(INDEX('POSTE (2)'!U:U,MATCH(ROW()-2,'POSTE (2)'!$W:$W,0)),IFERROR(INDEX('POSTE (3)'!U:U,MATCH(ROW()-2,'POSTE (3)'!$W:$W,0)),IFERROR(INDEX('POSTE (4)'!U:U,MATCH(ROW()-2,'POSTE (4)'!$W:$W,0)),IFERROR(INDEX('POSTE (5)'!U:U,MATCH(ROW()-2,'POSTE (5)'!$W:$W,0)),IFERROR(INDEX('POSTE (6)'!U:U,MATCH(ROW()-2,'POSTE (6)'!$W:$W,0)),IFERROR(INDEX('POSTE (7)'!U:U,MATCH(ROW()-2,'POSTE (7)'!$W:$W,0)),IFERROR(INDEX('POSTE (8)'!U:U,MATCH(ROW()-2,'POSTE (8)'!$W:$W,0)),IFERROR(INDEX('POSTE (9)'!U:U,MATCH(ROW()-2,'POSTE (9)'!$W:$W,0)),\"\")))))))))","v":""}]
[{"$f":"IFERROR(INDEX('POSTE (1)'!N:N,MATCH(ROW()-2,'POSTE (1)'!$W:$W,0)),IFERROR(INDEX('POSTE (2)'!N:N,MATCH(ROW()-2,'POSTE (2)'!$W:$W,0)),IFERROR(INDEX('POSTE (3)'!N:N,MATCH(ROW()-2,'POSTE (3)'!$W:$W,0)),IFERROR(INDEX('POSTE (4)'!N:N,MATCH(ROW()-2,'POSTE (4)'!$W:$W,0)),IFERROR(INDEX('POSTE (5)'!N:N,MATCH(ROW()-2,'POSTE (5)'!$W:$W,0)),IFERROR(INDEX('POSTE (6)'!N:N,MATCH(ROW()-2,'POSTE (6)'!$W:$W,0)),IFERROR(INDEX('POSTE (7)'!N:N,MATCH(ROW()-2,'POSTE (7)'!$W:$W,0)),IFERROR(INDEX('POSTE (8)'!N:N,MATCH(ROW()-2,'POSTE (8)'!$W:$W,0)),IFERROR(INDEX('POSTE (9)'!N:N,MATCH(ROW()-2,'POSTE (9)'!$W:$W,0)),\"\")))))))))","v":""},{"$f":"IFERROR(INDEX('POSTE (1)'!O:O,MATCH(ROW()-2,'POSTE (1)'!$W:$W,0)),IFERROR(INDEX('POSTE (2)'!O:O,MATCH(ROW()-2,'POSTE (2)'!$W:$W,0)),IFERROR(INDEX('POSTE (3)'!O:O,MATCH(ROW()-2,'POSTE (3)'!$W:$W,0)),IFERROR(INDEX('POSTE (4)'!O:O,MATCH(ROW()-2,'POSTE (4)'!$W:$W,0)),IFERROR(INDEX('POSTE (5)'!O:O,MATCH(ROW()-2,'POSTE (5)'!$W:$W,0)),IFERROR(INDEX('POSTE (6)'!O:O,MATCH(ROW()-2,'POSTE (6)'!$W:$W,0)),IFERROR(INDEX('POSTE (7)'!O:O,MATCH(ROW()-2,'POSTE (7)'!$W:$W,0)),IFERROR(INDEX('POSTE (8)'!O:O,MATCH(ROW()-2,'POSTE (8)'!$W:$W,0)),IFERROR(INDEX('POSTE (9)'!O:O,MATCH(ROW()-2,'POSTE (9)'!$W:$W,0)),\"\")))))))))","v":""},{"$f":"IFERROR(INDEX('POSTE (1)'!P:P,MATCH(ROW()-2,'POSTE (1)'!$W:$W,0)),IFERROR(INDEX('POSTE (2)'!P:P,MATCH(ROW()-2,'POSTE (2)'!$W:$W,0)),IFERROR(INDEX('POSTE (3)'!P:P,MATCH(ROW()-2,'POSTE (3)'!$W:$W,0)),IFERROR(INDEX('POSTE (4)'!P:P,MATCH(ROW()-2,'POSTE (4)'!$W:$W,0)),IFERROR(INDEX('POSTE (5)'!P:P,MATCH(ROW()-2,'POSTE (5)'!$W:$W,0)),IFERROR(INDEX('POSTE (6)'!P:P,MATCH(ROW()-2,'POSTE (6)'!$W:$W,0)),IFERROR(INDEX('POSTE (7)'!P:P,MATCH(ROW()-2,'POSTE (7)'!$W:$W,0)),IFERROR(INDEX('POSTE (8)'!P:P,MATCH(ROW()-2,'POSTE (8)'!$W:$W,0)),IFERROR(INDEX('POSTE (9)'!P:P,MATCH(ROW()-2,'POSTE (9)'!$W:$W,0)),\"\")))))))))","v":""},{"$f":"IFERROR(INDEX('POSTE (1)'!Q:Q,MATCH(ROW()-2,'POSTE (1)'!$W:$W,0)),IFERROR(INDEX('POSTE (2)'!Q:Q,MATCH(ROW()-2,'POSTE (2)'!$W:$W,0)),IFERROR(INDEX('POSTE (3)'!Q:Q,MATCH(ROW()-2,'POSTE (3)'!$W:$W,0)),IFERROR(INDEX('POSTE (4)'!Q:Q,MATCH(ROW()-2,'POSTE (4)'!$W:$W,0)),IFERROR(INDEX('POSTE (5)'!Q:Q,MATCH(ROW()-2,'POSTE (5)'!$W:$W,0)),IFERROR(INDEX('POSTE (6)'!Q:Q,MATCH(ROW()-2,'POSTE (6)'!$W:$W,0)),IFERROR(INDEX('POSTE (7)'!Q:Q,MATCH(ROW()-2,'POSTE (7)'!$W:$W,0)),IFERROR(INDEX('POSTE (8)'!Q:Q,MATCH(ROW()-2,'POSTE (8)'!$W:$W,0)),IFERROR(INDEX('POSTE (9)'!Q:Q,MATCH(ROW()-2,'POSTE (9)'!$W:$W,0)),\"\")))))))))","v":""},{"$f":"IFERROR(INDEX('POSTE (1)'!R:R,MATCH(ROW()-2,'POSTE (1)'!$W:$W,0)),IFERROR(INDEX('POSTE (2)'!R:R,MATCH(ROW()-2,'POSTE (2)'!$W:$W,0)),IFERROR(INDEX('POSTE (3)'!R:R,MATCH(ROW()-2,'POSTE (3)'!$W:$W,0)),IFERROR(INDEX('POSTE (4)'!R:R,MATCH(ROW()-2,'POSTE (4)'!$W:$W,0)),IFERROR(INDEX('POSTE (5)'!R:R,MATCH(ROW()-2,'POSTE (5)'!$W:$W,0)),IFERROR(INDEX('POSTE (6)'!R:R,MATCH(ROW()-2,'POSTE (6)'!$W:$W,0)),IFERROR(INDEX('POSTE (7)'!R:R,MATCH(ROW()-2,'POSTE (7)'!$W:$W,0)),IFERROR(INDEX('POSTE (8)'!R:R,MATCH(ROW()-2,'POSTE (8)'!$W:$W,0)),IFERROR(INDEX('POSTE (9)'!R:R,MATCH(ROW()-2,'POSTE (9)'!$W:$W,0)),\"\")))))))))","v":""},{"$f":"IFERROR(INDEX('POSTE (1)'!S:S,MATCH(ROW()-2,'POSTE (1)'!$W:$W,0)),IFERROR(INDEX('POSTE (2)'!S:S,MATCH(ROW()-2,'POSTE (2)'!$W:$W,0)),IFERROR(INDEX('POSTE (3)'!S:S,MATCH(ROW()-2,'POSTE (3)'!$W:$W,0)),IFERROR(INDEX('POSTE (4)'!S:S,MATCH(ROW()-2,'POSTE (4)'!$W:$W,0)),IFERROR(INDEX('POSTE (5)'!S:S,MATCH(ROW()-2,'POSTE (5)'!$W:$W,0)),IFERROR(INDEX('POSTE (6)'!S:S,MATCH(ROW()-2,'POSTE (6)'!$W:$W,0)),IFERROR(INDEX('POSTE (7)'!S:S,MATCH(ROW()-2,'POSTE (7)'!$W:$W,0)),IFERROR(INDEX('POSTE (8)'!S:S,MATCH(ROW()-2,'POSTE (8)'!$W:$W,0)),IFERROR(INDEX('POSTE (9)'!S:S,MATCH(ROW()-2,'POSTE (9)'!$W:$W,0)),\"\")))))))))","v":""},{"$f":"IFERROR(INDEX('POSTE (1)'!T:T,MATCH(ROW()-2,'POSTE (1)'!$W:$W,0)),IFERROR(INDEX('POSTE (2)'!T:T,MATCH(ROW()-2,'POSTE (2)'!$W:$W,0)),IFERROR(INDEX('POSTE (3)'!T:T,MATCH(ROW()-2,'POSTE (3)'!$W:$W,0)),IFERROR(INDEX('POSTE (4)'!T:T,MATCH(ROW()-2,'POSTE (4)'!$W:$W,0)),IFERROR(INDEX('POSTE (5)'!T:T,MATCH(ROW()-2,'POSTE (5)'!$W:$W,0)),IFERROR(INDEX('POSTE (6)'!T:T,MATCH(ROW()-2,'POSTE (6)'!$W:$W,0)),IFERROR(INDEX('POSTE (7)'!T:T,MATCH(ROW()-2,'POSTE (7)'!$W:$W,0)),IFERROR(INDEX('POSTE (8)'!T:T,MATCH(ROW()-2,'POSTE (8)'!$W:$W,0)),IFERROR(INDEX('POSTE (9)'!T:T,MATCH(ROW()-2,'POSTE (9)'!$W:$W,0)),\"\")))))))))","v":""},{"$f":"IFERROR(INDEX('POSTE (1)'!U:U,MATCH(ROW()-2,'POSTE (1)'!$W:$W,0)),IFERROR(INDEX('POSTE (2)'!U:U,MATCH(ROW()-2,'POSTE (2)'!$W:$W,0)),IFERROR(INDEX('POSTE (3)'!U:U,MATCH(ROW()-2,'POSTE (3)'!$W:$W,0)),IFERROR(INDEX('POSTE (4)'!U:U,MATCH(ROW()-2,'POSTE (4)'!$W:$W,0)),IFERROR(INDEX('POSTE (5)'!U:U,MATCH(ROW()-2,'POSTE (5)'!$W:$W,0)),IFERROR(INDEX('POSTE (6)'!U:U,MATCH(ROW()-2,'POSTE (6)'!$W:$W,0)),IFERROR(INDEX('POSTE (7)'!U:U,MATCH(ROW()-2,'POSTE (7)'!$W:$W,0)),IFERROR(INDEX('POSTE (8)'!U:U,MATCH(ROW()-2,'POSTE (8)'!$W:$W,0)),IFERROR(INDEX('POSTE (9)'!U:U,MATCH(ROW()-2,'POSTE (9)'!$W:$W,0)),\"\")))))))))","v":""}]
[{"$f":"IFERROR(INDEX('POSTE (1)'!N:N,MATCH(ROW()-2,'POSTE (1)'!$W:$W,0)),IFERROR(INDEX('POSTE (2)'!N:N,MATCH(ROW()-2,'POSTE (2)'!$W:$W,0)),IFERROR(INDEX('POSTE (3)'!N:N,MATCH(ROW()-2,'POSTE (3)'!$W:$W,0)),IFERROR(INDEX('POSTE (4)'!N:N,MATCH(ROW()-2,'POSTE (4)'!$W:$W,0)),IFERROR(INDEX('POSTE (5)'!N:N,MATCH(ROW()-2,'POSTE (5)'!$W:$W,0)),IFERROR(INDEX('POSTE (6)'!N:N,MATCH(ROW()-2,'POSTE (6)'!$W:$W,0)),IFERROR(INDEX('POSTE (7)'!N:N,MATCH(ROW()-2,'POSTE (7)'!$W:$W,0)),IFERROR(INDEX('POSTE (8)'!N:N,MATCH(ROW()-2,'POSTE (8)'!$W:$W,0)),IFERROR(INDEX('POSTE (9)'!N:N,MATCH(ROW()-2,'POSTE (9)'!$W:$W,0)),\"\")))))))))","v":""},{"$f":"IFERROR(INDEX('POSTE (1)'!O:O,MATCH(ROW()-2,'POSTE (1)'!$W:$W,0)),IFERROR(INDEX('POSTE (2)'!O:O,MATCH(ROW()-2,'POSTE (2)'!$W:$W,0)),IFERROR(INDEX('POSTE (3)'!O:O,MATCH(ROW()-2,'POSTE (3)'!$W:$W,0)),IFERROR(INDEX('POSTE (4)'!O:O,MATCH(ROW()-2,'POSTE (4)'!$W:$W,0)),IFERROR(INDEX('POSTE (5)'!O:O,MATCH(ROW()-2,'POSTE (5)'!$W:$W,0)),IFERROR(INDEX('POSTE (6)'!O:O,MATCH(ROW()-2,'POSTE (6)'!$W:$W,0)),IFERROR(INDEX('POSTE (7)'!O:O,MATCH(ROW()-2,'POSTE (7)'!$W:$W,0)),IFERROR(INDEX('POSTE (8)'!O:O,MATCH(ROW()-2,'POSTE (8)'!$W:$W,0)),IFERROR(INDEX('POSTE (9)'!O:O,MATCH(ROW()-2,'POSTE (9)'!$W:$W,0)),\"\")))))))))","v":""},{"$f":"IFERROR(INDEX('POSTE (1)'!P:P,MATCH(ROW()-2,'POSTE (1)'!$W:$W,0)),IFERROR(INDEX('POSTE (2)'!P:P,MATCH(ROW()-2,'POSTE (2)'!$W:$W,0)),IFERROR(INDEX('POSTE (3)'!P:P,MATCH(ROW()-2,'POSTE (3)'!$W:$W,0)),IFERROR(INDEX('POSTE (4)'!P:P,MATCH(ROW()-2,'POSTE (4)'!$W:$W,0)),IFERROR(INDEX('POSTE (5)'!P:P,MATCH(ROW()-2,'POSTE (5)'!$W:$W,0)),IFERROR(INDEX('POSTE (6)'!P:P,MATCH(ROW()-2,'POSTE (6)'!$W:$W,0)),IFERROR(INDEX('POSTE (7)'!P:P,MATCH(ROW()-2,'POSTE (7)'!$W:$W,0)),IFERROR(INDEX('POSTE (8)'!P:P,MATCH(ROW()-2,'POSTE (8)'!$W:$W,0)),IFERROR(INDEX('POSTE (9)'!P:P,MATCH(ROW()-2,'POSTE (9)'!$W:$W,0)),\"\")))))))))","v":""},{"$f":"IFERROR(INDEX('POSTE (1)'!Q:Q,MATCH(ROW()-2,'POSTE (1)'!$W:$W,0)),IFERROR(INDEX('POSTE (2)'!Q:Q,MATCH(ROW()-2,'POSTE (2)'!$W:$W,0)),IFERROR(INDEX('POSTE (3)'!Q:Q,MATCH(ROW()-2,'POSTE (3)'!$W:$W,0)),IFERROR(INDEX('POSTE (4)'!Q:Q,MATCH(ROW()-2,'POSTE (4)'!$W:$W,0)),IFERROR(INDEX('POSTE (5)'!Q:Q,MATCH(ROW()-2,'POSTE (5)'!$W:$W,0)),IFERROR(INDEX('POSTE (6)'!Q:Q,MATCH(ROW()-2,'POSTE (6)'!$W:$W,0)),IFERROR(INDEX('POSTE (7)'!Q:Q,MATCH(ROW()-2,'POSTE (7)'!$W:$W,0)),IFERROR(INDEX('POSTE (8)'!Q:Q,MATCH(ROW()-2,'POSTE (8)'!$W:$W,0)),IFERROR(INDEX('POSTE (9)'!Q:Q,MATCH(ROW()-2,'POSTE (9)'!$W:$W,0)),\"\")))))))))","v":""},{"$f":"IFERROR(INDEX('POSTE (1)'!R:R,MATCH(ROW()-2,'POSTE (1)'!$W:$W,0)),IFERROR(INDEX('POSTE (2)'!R:R,MATCH(ROW()-2,'POSTE (2)'!$W:$W,0)),IFERROR(INDEX('POSTE (3)'!R:R,MATCH(ROW()-2,'POSTE (3)'!$W:$W,0)),IFERROR(INDEX('POSTE (4)'!R:R,MATCH(ROW()-2,'POSTE (4)'!$W:$W,0)),IFERROR(INDEX('POSTE (5)'!R:R,MATCH(ROW()-2,'POSTE (5)'!$W:$W,0)),IFERROR(INDEX('POSTE (6)'!R:R,MATCH(ROW()-2,'POSTE (6)'!$W:$W,0)),IFERROR(INDEX('POSTE (7)'!R:R,MATCH(ROW()-2,'POSTE (7)'!$W:$W,0)),IFERROR(INDEX('POSTE (8)'!R:R,MATCH(ROW()-2,'POSTE (8)'!$W:$W,0)),IFERROR(INDEX('POSTE (9)'!R:R,MATCH(ROW()-2,'POSTE (9)'!$W:$W,0)),\"\")))))))))","v":""},{"$f":"IFERROR(INDEX('POSTE (1)'!S:S,MATCH(ROW()-2,'POSTE (1)'!$W:$W,0)),IFERROR(INDEX('POSTE (2)'!S:S,MATCH(ROW()-2,'POSTE (2)'!$W:$W,0)),IFERROR(INDEX('POSTE (3)'!S:S,MATCH(ROW()-2,'POSTE (3)'!$W:$W,0)),IFERROR(INDEX('POSTE (4)'!S:S,MATCH(ROW()-2,'POSTE (4)'!$W:$W,0)),IFERROR(INDEX('POSTE (5)'!S:S,MATCH(ROW()-2,'POSTE (5)'!$W:$W,0)),IFERROR(INDEX('POSTE (6)'!S:S,MATCH(ROW()-2,'POSTE (6)'!$W:$W,0)),IFERROR(INDEX('POSTE (7)'!S:S,MATCH(ROW()-2,'POSTE (7)'!$W:$W,0)),IFERROR(INDEX('POSTE (8)'!S:S,MATCH(ROW()-2,'POSTE (8)'!$W:$W,0)),IFERROR(INDEX('POSTE (9)'!S:S,MATCH(ROW()-2,'POSTE (9)'!$W:$W,0)),\"\")))))))))","v":""},{"$f":"IFERROR(INDEX('POSTE (1)'!T:T,MATCH(ROW()-2,'POSTE (1)'!$W:$W,0)),IFERROR(INDEX('POSTE (2)'!T:T,MATCH(ROW()-2,'POSTE (2)'!$W:$W,0)),IFERROR(INDEX('POSTE (3)'!T:T,MATCH(ROW()-2,'POSTE (3)'!$W:$W,0)),IFERROR(INDEX('POSTE (4)'!T:T,MATCH(ROW()-2,'POSTE (4)'!$W:$W,0)),IFERROR(INDEX('POSTE (5)'!T:T,MATCH(ROW()-2,'POSTE (5)'!$W:$W,0)),IFERROR(INDEX('POSTE (6)'!T:T,MATCH(ROW()-2,'POSTE (6)'!$W:$W,0)),IFERROR(INDEX('POSTE (7)'!T:T,MATCH(ROW()-2,'POSTE (7)'!$W:$W,0)),IFERROR(INDEX('POSTE (8)'!T:T,MATCH(ROW()-2,'POSTE (8)'!$W:$W,0)),IFERROR(INDEX('POSTE (9)'!T:T,MATCH(ROW()-2,'POSTE (9)'!$W:$W,0)),\"\")))))))))","v":""},{"$f":"IFERROR(INDEX('POSTE (1)'!U:U,MATCH(ROW()-2,'POSTE (1)'!$W:$W,0)),IFERROR(INDEX('POSTE (2)'!U:U,MATCH(ROW()-2,'POSTE (2)'!$W:$W,0)),IFERROR(INDEX('POSTE (3)'!U:U,MATCH(ROW()-2,'POSTE (3)'!$W:$W,0)),IFERROR(INDEX('POSTE (4)'!U:U,MATCH(ROW()-2,'POSTE (4)'!$W:$W,0)),IFERROR(INDEX('POSTE (5)'!U:U,MATCH(ROW()-2,'POSTE (5)'!$W:$W,0)),IFERROR(INDEX('POSTE (6)'!U:U,MATCH(ROW()-2,'POSTE (6)'!$W:$W,0)),IFERROR(INDEX('POSTE (7)'!U:U,MATCH(ROW()-2,'POSTE (7)'!$W:$W,0)),IFERROR(INDEX('POSTE (8)'!U:U,MATCH(ROW()-2,'POSTE (8)'!$W:$W,0)),IFERROR(INDEX('POSTE (9)'!U:U,MATCH(ROW()-2,'POSTE (9)'!$W:$W,0)),\"\")))))))))","v":""}]
[{"$f":"IFERROR(INDEX('POSTE (1)'!N:N,MATCH(ROW()-2,'POSTE (1)'!$W:$W,0)),IFERROR(INDEX('POSTE (2)'!N:N,MATCH(ROW()-2,'POSTE (2)'!$W:$W,0)),IFERROR(INDEX('POSTE (3)'!N:N,MATCH(ROW()-2,'POSTE (3)'!$W:$W,0)),IFERROR(INDEX('POSTE (4)'!N:N,MATCH(ROW()-2,'POSTE (4)'!$W:$W,0)),IFERROR(INDEX('POSTE (5)'!N:N,MATCH(ROW()-2,'POSTE (5)'!$W:$W,0)),IFERROR(INDEX('POSTE (6)'!N:N,MATCH(ROW()-2,'POSTE (6)'!$W:$W,0)),IFERROR(INDEX('POSTE (7)'!N:N,MATCH(ROW()-2,'POSTE (7)'!$W:$W,0)),IFERROR(INDEX('POSTE (8)'!N:N,MATCH(ROW()-2,'POSTE (8)'!$W:$W,0)),IFERROR(INDEX('POSTE (9)'!N:N,MATCH(ROW()-2,'POSTE (9)'!$W:$W,0)),\"\")))))))))","v":""},{"$f":"IFERROR(INDEX('POSTE (1)'!O:O,MATCH(ROW()-2,'POSTE (1)'!$W:$W,0)),IFERROR(INDEX('POSTE (2)'!O:O,MATCH(ROW()-2,'POSTE (2)'!$W:$W,0)),IFERROR(INDEX('POSTE (3)'!O:O,MATCH(ROW()-2,'POSTE (3)'!$W:$W,0)),IFERROR(INDEX('POSTE (4)'!O:O,MATCH(ROW()-2,'POSTE (4)'!$W:$W,0)),IFERROR(INDEX('POSTE (5)'!O:O,MATCH(ROW()-2,'POSTE (5)'!$W:$W,0)),IFERROR(INDEX('POSTE (6)'!O:O,MATCH(ROW()-2,'POSTE (6)'!$W:$W,0)),IFERROR(INDEX('POSTE (7)'!O:O,MATCH(ROW()-2,'POSTE (7)'!$W:$W,0)),IFERROR(INDEX('POSTE (8)'!O:O,MATCH(ROW()-2,'POSTE (8)'!$W:$W,0)),IFERROR(INDEX('POSTE (9)'!O:O,MATCH(ROW()-2,'POSTE (9)'!$W:$W,0)),\"\")))))))))","v":""},{"$f":"IFERROR(INDEX('POSTE (1)'!P:P,MATCH(ROW()-2,'POSTE (1)'!$W:$W,0)),IFERROR(INDEX('POSTE (2)'!P:P,MATCH(ROW()-2,'POSTE (2)'!$W:$W,0)),IFERROR(INDEX('POSTE (3)'!P:P,MATCH(ROW()-2,'POSTE (3)'!$W:$W,0)),IFERROR(INDEX('POSTE (4)'!P:P,MATCH(ROW()-2,'POSTE (4)'!$W:$W,0)),IFERROR(INDEX('POSTE (5)'!P:P,MATCH(ROW()-2,'POSTE (5)'!$W:$W,0)),IFERROR(INDEX('POSTE (6)'!P:P,MATCH(ROW()-2,'POSTE (6)'!$W:$W,0)),IFERROR(INDEX('POSTE (7)'!P:P,MATCH(ROW()-2,'POSTE (7)'!$W:$W,0)),IFERROR(INDEX('POSTE (8)'!P:P,MATCH(ROW()-2,'POSTE (8)'!$W:$W,0)),IFERROR(INDEX('POSTE (9)'!P:P,MATCH(ROW()-2,'POSTE (9)'!$W:$W,0)),\"\")))))))))","v":""},{"$f":"IFERROR(INDEX('POSTE (1)'!Q:Q,MATCH(ROW()-2,'POSTE (1)'!$W:$W,0)),IFERROR(INDEX('POSTE (2)'!Q:Q,MATCH(ROW()-2,'POSTE (2)'!$W:$W,0)),IFERROR(INDEX('POSTE (3)'!Q:Q,MATCH(ROW()-2,'POSTE (3)'!$W:$W,0)),IFERROR(INDEX('POSTE (4)'!Q:Q,MATCH(ROW()-2,'POSTE (4)'!$W:$W,0)),IFERROR(INDEX('POSTE (5)'!Q:Q,MATCH(ROW()-2,'POSTE (5)'!$W:$W,0)),IFERROR(INDEX('POSTE (6)'!Q:Q,MATCH(ROW()-2,'POSTE (6)'!$W:$W,0)),IFERROR(INDEX('POSTE (7)'!Q:Q,MATCH(ROW()-2,'POSTE (7)'!$W:$W,0)),IFERROR(INDEX('POSTE (8)'!Q:Q,MATCH(ROW()-2,'POSTE (8)'!$W:$W,0)),IFERROR(INDEX('POSTE (9)'!Q:Q,MATCH(ROW()-2,'POSTE (9)'!$W:$W,0)),\"\")))))))))","v":""},{"$f":"IFERROR(INDEX('POSTE (1)'!R:R,MATCH(ROW()-2,'POSTE (1)'!$W:$W,0)),IFERROR(INDEX('POSTE (2)'!R:R,MATCH(ROW()-2,'POSTE (2)'!$W:$W,0)),IFERROR(INDEX('POSTE (3)'!R:R,MATCH(ROW()-2,'POSTE (3)'!$W:$W,0)),IFERROR(INDEX('POSTE (4)'!R:R,MATCH(ROW()-2,'POSTE (4)'!$W:$W,0)),IFERROR(INDEX('POSTE (5)'!R:R,MATCH(ROW()-2,'POSTE (5)'!$W:$W,0)),IFERROR(INDEX('POSTE (6)'!R:R,MATCH(ROW()-2,'POSTE (6)'!$W:$W,0)),IFERROR(INDEX('POSTE (7)'!R:R,MATCH(ROW()-2,'POSTE (7)'!$W:$W,0)),IFERROR(INDEX('POSTE (8)'!R:R,MATCH(ROW()-2,'POSTE (8)'!$W:$W,0)),IFERROR(INDEX('POSTE (9)'!R:R,MATCH(ROW()-2,'POSTE (9)'!$W:$W,0)),\"\")))))))))","v":""},{"$f":"IFERROR(INDEX('POSTE (1)'!S:S,MATCH(ROW()-2,'POSTE (1)'!$W:$W,0)),IFERROR(INDEX('POSTE (2)'!S:S,MATCH(ROW()-2,'POSTE (2)'!$W:$W,0)),IFERROR(INDEX('POSTE (3)'!S:S,MATCH(ROW()-2,'POSTE (3)'!$W:$W,0)),IFERROR(INDEX('POSTE (4)'!S:S,MATCH(ROW()-2,'POSTE (4)'!$W:$W,0)),IFERROR(INDEX('POSTE (5)'!S:S,MATCH(ROW()-2,'POSTE (5)'!$W:$W,0)),IFERROR(INDEX('POSTE (6)'!S:S,MATCH(ROW()-2,'POSTE (6)'!$W:$W,0)),IFERROR(INDEX('POSTE (7)'!S:S,MATCH(ROW()-2,'POSTE (7)'!$W:$W,0)),IFERROR(INDEX('POSTE (8)'!S:S,MATCH(ROW()-2,'POSTE (8)'!$W:$W,0)),IFERROR(INDEX('POSTE (9)'!S:S,MATCH(ROW()-2,'POSTE (9)'!$W:$W,0)),\"\")))))))))","v":""},{"$f":"IFERROR(INDEX('POSTE (1)'!T:T,MATCH(ROW()-2,'POSTE (1)'!$W:$W,0)),IFERROR(INDEX('POSTE (2)'!T:T,MATCH(ROW()-2,'POSTE (2)'!$W:$W,0)),IFERROR(INDEX('POSTE (3)'!T:T,MATCH(ROW()-2,'POSTE (3)'!$W:$W,0)),IFERROR(INDEX('POSTE (4)'!T:T,MATCH(ROW()-2,'POSTE (4)'!$W:$W,0)),IFERROR(INDEX('POSTE (5)'!T:T,MATCH(ROW()-2,'POSTE (5)'!$W:$W,0)),IFERROR(INDEX('POSTE (6)'!T:T,MATCH(ROW()-2,'POSTE (6)'!$W:$W,0)),IFERROR(INDEX('POSTE (7)'!T:T,MATCH(ROW()-2,'POSTE (7)'!$W:$W,0)),IFERROR(INDEX('POSTE (8)'!T:T,MATCH(ROW()-2,'POSTE (8)'!$W:$W,0)),IFERROR(INDEX('POSTE (9)'!T:T,MATCH(ROW()-2,'POSTE (9)'!$W:$W,0)),\"\")))))))))","v":""},{"$f":"IFERROR(INDEX('POSTE (1)'!U:U,MATCH(ROW()-2,'POSTE (1)'!$W:$W,0)),IFERROR(INDEX('POSTE (2)'!U:U,MATCH(ROW()-2,'POSTE (2)'!$W:$W,0)),IFERROR(INDEX('POSTE (3)'!U:U,MATCH(ROW()-2,'POSTE (3)'!$W:$W,0)),IFERROR(INDEX('POSTE (4)'!U:U,MATCH(ROW()-2,'POSTE (4)'!$W:$W,0)),IFERROR(INDEX('POSTE (5)'!U:U,MATCH(ROW()-2,'POSTE (5)'!$W:$W,0)),IFERROR(INDEX('POSTE (6)'!U:U,MATCH(ROW()-2,'POSTE (6)'!$W:$W,0)),IFERROR(INDEX('POSTE (7)'!U:U,MATCH(ROW()-2,'POSTE (7)'!$W:$W,0)),IFERROR(INDEX('POSTE (8)'!U:U,MATCH(ROW()-2,'POSTE (8)'!$W:$W,0)),IFERROR(INDEX('POSTE (9)'!U:U,MATCH(ROW()-2,'POSTE (9)'!$W:$W,0)),\"\")))))))))","v":""}]
[{"$f":"IFERROR(INDEX('POSTE (1)'!N:N,MATCH(ROW()-2,'POSTE (1)'!$W:$W,0)),IFERROR(INDEX('POSTE (2)'!N:N,MATCH(ROW()-2,'POSTE (2)'!$W:$W,0)),IFERROR(INDEX('POSTE (3)'!N:N,MATCH(ROW()-2,'POSTE (3)'!$W:$W,0)),IFERROR(INDEX('POSTE (4)'!N:N,MATCH(ROW()-2,'POSTE (4)'!$W:$W,0)),IFERROR(INDEX('POSTE (5)'!N:N,MATCH(ROW()-2,'POSTE (5)'!$W:$W,0)),IFERROR(INDEX('POSTE (6)'!N:N,MATCH(ROW()-2,'POSTE (6)'!$W:$W,0)),IFERROR(INDEX('POSTE (7)'!N:N,MATCH(ROW()-2,'POSTE (7)'!$W:$W,0)),IFERROR(INDEX('POSTE (8)'!N:N,MATCH(ROW()-2,'POSTE (8)'!$W:$W,0)),IFERROR(INDEX('POSTE (9)'!N:N,MATCH(ROW()-2,'POSTE (9)'!$W:$W,0)),\"\")))))))))","v":""},{"$f":"IFERROR(INDEX('POSTE (1)'!O:O,MATCH(ROW()-2,'POSTE (1)'!$W:$W,0)),IFERROR(INDEX('POSTE (2)'!O:O,MATCH(ROW()-2,'POSTE (2)'!$W:$W,0)),IFERROR(INDEX('POSTE (3)'!O:O,MATCH(ROW()-2,'POSTE (3)'!$W:$W,0)),IFERROR(INDEX('POSTE (4)'!O:O,MATCH(ROW()-2,'POSTE (4)'!$W:$W,0)),IFERROR(INDEX('POSTE (5)'!O:O,MATCH(ROW()-2,'POSTE (5)'!$W:$W,0)),IFERROR(INDEX('POSTE (6)'!O:O,MATCH(ROW()-2,'POSTE (6)'!$W:$W,0)),IFERROR(INDEX('POSTE (7)'!O:O,MATCH(ROW()-2,'POSTE (7)'!$W:$W,0)),IFERROR(INDEX('POSTE (8)'!O:O,MATCH(ROW()-2,'POSTE (8)'!$W:$W,0)),IFERROR(INDEX('POSTE (9)'!O:O,MATCH(ROW()-2,'POSTE (9)'!$W:$W,0)),\"\")))))))))","v":""},{"$f":"IFERROR(INDEX('POSTE (1)'!P:P,MATCH(ROW()-2,'POSTE (1)'!$W:$W,0)),IFERROR(INDEX('POSTE (2)'!P:P,MATCH(ROW()-2,'POSTE (2)'!$W:$W,0)),IFERROR(INDEX('POSTE (3)'!P:P,MATCH(ROW()-2,'POSTE (3)'!$W:$W,0)),IFERROR(INDEX('POSTE (4)'!P:P,MATCH(ROW()-2,'POSTE (4)'!$W:$W,0)),IFERROR(INDEX('POSTE (5)'!P:P,MATCH(ROW()-2,'POSTE (5)'!$W:$W,0)),IFERROR(INDEX('POSTE (6)'!P:P,MATCH(ROW()-2,'POSTE (6)'!$W:$W,0)),IFERROR(INDEX('POSTE (7)'!P:P,MATCH(ROW()-2,'POSTE (7)'!$W:$W,0)),IFERROR(INDEX('POSTE (8)'!P:P,MATCH(ROW()-2,'POSTE (8)'!$W:$W,0)),IFERROR(INDEX('POSTE (9)'!P:P,MATCH(ROW()-2,'POSTE (9)'!$W:$W,0)),\"\")))))))))","v":""},{"$f":"IFERROR(INDEX('POSTE (1)'!Q:Q,MATCH(ROW()-2,'POSTE (1)'!$W:$W,0)),IFERROR(INDEX('POSTE (2)'!Q:Q,MATCH(ROW()-2,'POSTE (2)'!$W:$W,0)),IFERROR(INDEX('POSTE (3)'!Q:Q,MATCH(ROW()-2,'POSTE (3)'!$W:$W,0)),IFERROR(INDEX('POSTE (4)'!Q:Q,MATCH(ROW()-2,'POSTE (4)'!$W:$W,0)),IFERROR(INDEX('POSTE (5)'!Q:Q,MATCH(ROW()-2,'POSTE (5)'!$W:$W,0)),IFERROR(INDEX('POSTE (6)'!Q:Q,MATCH(ROW()-2,'POSTE (6)'!$W:$W,0)),IFERROR(INDEX('POSTE (7)'!Q:Q,MATCH(ROW()-2,'POSTE (7)'!$W:$W,0)),IFERROR(INDEX('POSTE (8)'!Q:Q,MATCH(ROW()-2,'POSTE (8)'!$W:$W,0)),IFERROR(INDEX('POSTE (9)'!Q:Q,MATCH(ROW()-2,'POSTE (9)'!$W:$W,0)),\"\")))))))))","v":""},{"$f":"IFERROR(INDEX('POSTE (1)'!R:R,MATCH(ROW()-2,'POSTE (1)'!$W:$W,0)),IFERROR(INDEX('POSTE (2)'!R:R,MATCH(ROW()-2,'POSTE (2)'!$W:$W,0)),IFERROR(INDEX('POSTE (3)'!R:R,MATCH(ROW()-2,'POSTE (3)'!$W:$W,0)),IFERROR(INDEX('POSTE (4)'!R:R,MATCH(ROW()-2,'POSTE (4)'!$W:$W,0)),IFERROR(INDEX('POSTE (5)'!R:R,MATCH(ROW()-2,'POSTE (5)'!$W:$W,0)),IFERROR(INDEX('POSTE (6)'!R:R,MATCH(ROW()-2,'POSTE (6)'!$W:$W,0)),IFERROR(INDEX('POSTE (7)'!R:R,MATCH(ROW()-2,'POSTE (7)'!$W:$W,0)),IFERROR(INDEX('POSTE (8)'!R:R,MATCH(ROW()-2,'POSTE (8)'!$W:$W,0)),IFERROR(INDEX('POSTE (9)'!R:R,MATCH(ROW()-2,'POSTE (9)'!$W:$W,0)),\"\")))))))))","v":""},{"$f":"IFERROR(INDEX('POSTE (1)'!S:S,MATCH(ROW()-2,'POSTE (1)'!$W:$W,0)),IFERROR(INDEX('POSTE (2)'!S:S,MATCH(ROW()-2,'POSTE (2)'!$W:$W,0)),IFERROR(INDEX('POSTE (3)'!S:S,MATCH(ROW()-2,'POSTE (3)'!$W:$W,0)),IFERROR(INDEX('POSTE (4)'!S:S,MATCH(ROW()-2,'POSTE (4)'!$W:$W,0)),IFERROR(INDEX('POSTE (5)'!S:S,MATCH(ROW()-2,'POSTE (5)'!$W:$W,0)),IFERROR(INDEX('POSTE (6)'!S:S,MATCH(ROW()-2,'POSTE (6)'!$W:$W,0)),IFERROR(INDEX('POSTE (7)'!S:S,MATCH(ROW()-2,'POSTE (7)'!$W:$W,0)),IFERROR(INDEX('POSTE (8)'!S:S,MATCH(ROW()-2,'POSTE (8)'!$W:$W,0)),IFERROR(INDEX('POSTE (9)'!S:S,MATCH(ROW()-2,'POSTE (9)'!$W:$W,0)),\"\")))))))))","v":""},{"$f":"IFERROR(INDEX('POSTE (1)'!T:T,MATCH(ROW()-2,'POSTE (1)'!$W:$W,0)),IFERROR(INDEX('POSTE (2)'!T:T,MATCH(ROW()-2,'POSTE (2)'!$W:$W,0)),IFERROR(INDEX('POSTE (3)'!T:T,MATCH(ROW()-2,'POSTE (3)'!$W:$W,0)),IFERROR(INDEX('POSTE (4)'!T:T,MATCH(ROW()-2,'POSTE (4)'!$W:$W,0)),IFERROR(INDEX('POSTE (5)'!T:T,MATCH(ROW()-2,'POSTE (5)'!$W:$W,0)),IFERROR(INDEX('POSTE (6)'!T:T,MATCH(ROW()-2,'POSTE (6)'!$W:$W,0)),IFERROR(INDEX('POSTE (7)'!T:T,MATCH(ROW()-2,'POSTE (7)'!$W:$W,0)),IFERROR(INDEX('POSTE (8)'!T:T,MATCH(ROW()-2,'POSTE (8)'!$W:$W,0)),IFERROR(INDEX('POSTE (9)'!T:T,MATCH(ROW()-2,'POSTE (9)'!$W:$W,0)),\"\")))))))))","v":""},{"$f":"IFERROR(INDEX('POSTE (1)'!U:U,MATCH(ROW()-2,'POSTE (1)'!$W:$W,0)),IFERROR(INDEX('POSTE (2)'!U:U,MATCH(ROW()-2,'POSTE (2)'!$W:$W,0)),IFERROR(INDEX('POSTE (3)'!U:U,MATCH(ROW()-2,'POSTE (3)'!$W:$W,0)),IFERROR(INDEX('POSTE (4)'!U:U,MATCH(ROW()-2,'POSTE (4)'!$W:$W,0)),IFERROR(INDEX('POSTE (5)'!U:U,MATCH(ROW()-2,'POSTE (5)'!$W:$W,0)),IFERROR(INDEX('POSTE (6)'!U:U,MATCH(ROW()-2,'POSTE (6)'!$W:$W,0)),IFERROR(INDEX('POSTE (7)'!U:U,MATCH(ROW()-2,'POSTE (7)'!$W:$W,0)),IFERROR(INDEX('POSTE (8)'!U:U,MATCH(ROW()-2,'POSTE (8)'!$W:$W,0)),IFERROR(INDEX('POSTE (9)'!U:U,MATCH(ROW()-2,'POSTE (9)'!$W:$W,0)),\"\")))))))))","v":""}]
[{"$f":"IFERROR(INDEX('POSTE (1)'!N:N,MATCH(ROW()-2,'POSTE (1)'!$W:$W,0)),IFERROR(INDEX('POSTE (2)'!N:N,MATCH(ROW()-2,'POSTE (2)'!$W:$W,0)),IFERROR(INDEX('POSTE (3)'!N:N,MATCH(ROW()-2,'POSTE (3)'!$W:$W,0)),IFERROR(INDEX('POSTE (4)'!N:N,MATCH(ROW()-2,'POSTE (4)'!$W:$W,0)),IFERROR(INDEX('POSTE (5)'!N:N,MATCH(ROW()-2,'POSTE (5)'!$W:$W,0)),IFERROR(INDEX('POSTE (6)'!N:N,MATCH(ROW()-2,'POSTE (6)'!$W:$W,0)),IFERROR(INDEX('POSTE (7)'!N:N,MATCH(ROW()-2,'POSTE (7)'!$W:$W,0)),IFERROR(INDEX('POSTE (8)'!N:N,MATCH(ROW()-2,'POSTE (8)'!$W:$W,0)),IFERROR(INDEX('POSTE (9)'!N:N,MATCH(ROW()-2,'POSTE (9)'!$W:$W,0)),\"\")))))))))","v":""},{"$f":"IFERROR(INDEX('POSTE (1)'!O:O,MATCH(ROW()-2,'POSTE (1)'!$W:$W,0)),IFERROR(INDEX('POSTE (2)'!O:O,MATCH(ROW()-2,'POSTE (2)'!$W:$W,0)),IFERROR(INDEX('POSTE (3)'!O:O,MATCH(ROW()-2,'POSTE (3)'!$W:$W,0)),IFERROR(INDEX('POSTE (4)'!O:O,MATCH(ROW()-2,'POSTE (4)'!$W:$W,0)),IFERROR(INDEX('POSTE (5)'!O:O,MATCH(ROW()-2,'POSTE (5)'!$W:$W,0)),IFERROR(INDEX('POSTE (6)'!O:O,MATCH(ROW()-2,'POSTE (6)'!$W:$W,0)),IFERROR(INDEX('POSTE (7)'!O:O,MATCH(ROW()-2,'POSTE (7)'!$W:$W,0)),IFERROR(INDEX('POSTE (8)'!O:O,MATCH(ROW()-2,'POSTE (8)'!$W:$W,0)),IFERROR(INDEX('POSTE (9)'!O:O,MATCH(ROW()-2,'POSTE (9)'!$W:$W,0)),\"\")))))))))","v":""},{"$f":"IFERROR(INDEX('POSTE (1)'!P:P,MATCH(ROW()-2,'POSTE (1)'!$W:$W,0)),IFERROR(INDEX('POSTE (2)'!P:P,MATCH(ROW()-2,'POSTE (2)'!$W:$W,0)),IFERROR(INDEX('POSTE (3)'!P:P,MATCH(ROW()-2,'POSTE (3)'!$W:$W,0)),IFERROR(INDEX('POSTE (4)'!P:P,MATCH(ROW()-2,'POSTE (4)'!$W:$W,0)),IFERROR(INDEX('POSTE (5)'!P:P,MATCH(ROW()-2,'POSTE (5)'!$W:$W,0)),IFERROR(INDEX('POSTE (6)'!P:P,MATCH(ROW()-2,'POSTE (6)'!$W:$W,0)),IFERROR(INDEX('POSTE (7)'!P:P,MATCH(ROW()-2,'POSTE (7)'!$W:$W,0)),IFERROR(INDEX('POSTE (8)'!P:P,MATCH(ROW()-2,'POSTE (8)'!$W:$W,0)),IFERROR(INDEX('POSTE (9)'!P:P,MATCH(ROW()-2,'POSTE (9)'!$W:$W,0)),\"\")))))))))","v":""},{"$f":"IFERROR(INDEX('POSTE (1)'!Q:Q,MATCH(ROW()-2,'POSTE (1)'!$W:$W,0)),IFERROR(INDEX('POSTE (2)'!Q:Q,MATCH(ROW()-2,'POSTE (2)'!$W:$W,0)),IFERROR(INDEX('POSTE (3)'!Q:Q,MATCH(ROW()-2,'POSTE (3)'!$W:$W,0)),IFERROR(INDEX('POSTE (4)'!Q:Q,MATCH(ROW()-2,'POSTE (4)'!$W:$W,0)),IFERROR(INDEX('POSTE (5)'!Q:Q,MATCH(ROW()-2,'POSTE (5)'!$W:$W,0)),IFERROR(INDEX('POSTE (6)'!Q:Q,MATCH(ROW()-2,'POSTE (6)'!$W:$W,0)),IFERROR(INDEX('POSTE (7)'!Q:Q,MATCH(ROW()-2,'POSTE (7)'!$W:$W,0)),IFERROR(INDEX('POSTE (8)'!Q:Q,MATCH(ROW()-2,'POSTE (8)'!$W:$W,0)),IFERROR(INDEX('POSTE (9)'!Q:Q,MATCH(ROW()-2,'POSTE (9)'!$W:$W,0)),\"\")))))))))","v":""},{"$f":"IFERROR(INDEX('POSTE (1)'!R:R,MATCH(ROW()-2,'POSTE (1)'!$W:$W,0)),IFERROR(INDEX('POSTE (2)'!R:R,MATCH(ROW()-2,'POSTE (2)'!$W:$W,0)),IFERROR(INDEX('POSTE (3)'!R:R,MATCH(ROW()-2,'POSTE (3)'!$W:$W,0)),IFERROR(INDEX('POSTE (4)'!R:R,MATCH(ROW()-2,'POSTE (4)'!$W:$W,0)),IFERROR(INDEX('POSTE (5)'!R:R,MATCH(ROW()-2,'POSTE (5)'!$W:$W,0)),IFERROR(INDEX('POSTE (6)'!R:R,MATCH(ROW()-2,'POSTE (6)'!$W:$W,0)),IFERROR(INDEX('POSTE (7)'!R:R,MATCH(ROW()-2,'POSTE (7)'!$W:$W,0)),IFERROR(INDEX('POSTE (8)'!R:R,MATCH(ROW()-2,'POSTE (8)'!$W:$W,0)),IFERROR(INDEX('POSTE (9)'!R:R,MATCH(ROW()-2,'POSTE (9)'!$W:$W,0)),\"\")))))))))","v":""},{"$f":"IFERROR(INDEX('POSTE (1)'!S:S,MATCH(ROW()-2,'POSTE (1)'!$W:$W,0)),IFERROR(INDEX('POSTE (2)'!S:S,MATCH(ROW()-2,'POSTE (2)'!$W:$W,0)),IFERROR(INDEX('POSTE (3)'!S:S,MATCH(ROW()-2,'POSTE (3)'!$W:$W,0)),IFERROR(INDEX('POSTE (4)'!S:S,MATCH(ROW()-2,'POSTE (4)'!$W:$W,0)),IFERROR(INDEX('POSTE (5)'!S:S,MATCH(ROW()-2,'POSTE (5)'!$W:$W,0)),IFERROR(INDEX('POSTE (6)'!S:S,MATCH(ROW()-2,'POSTE (6)'!$W:$W,0)),IFERROR(INDEX('POSTE (7)'!S:S,MATCH(ROW()-2,'POSTE (7)'!$W:$W,0)),IFERROR(INDEX('POSTE (8)'!S:S,MATCH(ROW()-2,'POSTE (8)'!$W:$W,0)),IFERROR(INDEX('POSTE (9)'!S:S,MATCH(ROW()-2,'POSTE (9)'!$W:$W,0)),\"\")))))))))","v":""},{"$f":"IFERROR(INDEX('POSTE (1)'!T:T,MATCH(ROW()-2,'POSTE (1)'!$W:$W,0)),IFERROR(INDEX('POSTE (2)'!T:T,MATCH(ROW()-2,'POSTE (2)'!$W:$W,0)),IFERROR(INDEX('POSTE (3)'!T:T,MATCH(ROW()-2,'POSTE (3)'!$W:$W,0)),IFERROR(INDEX('POSTE (4)'!T:T,MATCH(ROW()-2,'POSTE (4)'!$W:$W,0)),IFERROR(INDEX('POSTE (5)'!T:T,MATCH(ROW()-2,'POSTE (5)'!$W:$W,0)),IFERROR(INDEX('POSTE (6)'!T:T,MATCH(ROW()-2,'POSTE (6)'!$W:$W,0)),IFERROR(INDEX('POSTE (7)'!T:T,MATCH(ROW()-2,'POSTE (7)'!$W:$W,0)),IFERROR(INDEX('POSTE (8)'!T:T,MATCH(ROW()-2,'POSTE (8)'!$W:$W,0)),IFERROR(INDEX('POSTE (9)'!T:T,MATCH(ROW()-2,'POSTE (9)'!$W:$W,0)),\"\")))))))))","v":""},{"$f":"IFERROR(INDEX('POSTE (1)'!U:U,MATCH(ROW()-2,'POSTE (1)'!$W:$W,0)),IFERROR(INDEX('POSTE (2)'!U:U,MATCH(ROW()-2,'POSTE (2)'!$W:$W,0)),IFERROR(INDEX('POSTE (3)'!U:U,MATCH(ROW()-2,'POSTE (3)'!$W:$W,0)),IFERROR(INDEX('POSTE (4)'!U:U,MATCH(ROW()-2,'POSTE (4)'!$W:$W,0)),IFERROR(INDEX('POSTE (5)'!U:U,MATCH(ROW()-2,'POSTE (5)'!$W:$W,0)),IFERROR(INDEX('POSTE (6)'!U:U,MATCH(ROW()-2,'POSTE (6)'!$W:$W,0)),IFERROR(INDEX('POSTE (7)'!U:U,MATCH(ROW()-2,'POSTE (7)'!$W:$W,0)),IFERROR(INDEX('POSTE (8)'!U:U,MATCH(ROW()-2,'POSTE (8)'!$W:$W,0)),IFERROR(INDEX('POSTE (9)'!U:U,MATCH(ROW()-2,'POSTE (9)'!$W:$W,0)),\"\")))))))))","v":""}]
[{"$f":"IFERROR(INDEX('POSTE (1)'!N:N,MATCH(ROW()-2,'POSTE (1)'!$W:$W,0)),IFERROR(INDEX('POSTE (2)'!N:N,MATCH(ROW()-2,'POSTE (2)'!$W:$W,0)),IFERROR(INDEX('POSTE (3)'!N:N,MATCH(ROW()-2,'POSTE (3)'!$W:$W,0)),IFERROR(INDEX('POSTE (4)'!N:N,MATCH(ROW()-2,'POSTE (4)'!$W:$W,0)),IFERROR(INDEX('POSTE (5)'!N:N,MATCH(ROW()-2,'POSTE (5)'!$W:$W,0)),IFERROR(INDEX('POSTE (6)'!N:N,MATCH(ROW()-2,'POSTE (6)'!$W:$W,0)),IFERROR(INDEX('POSTE (7)'!N:N,MATCH(ROW()-2,'POSTE (7)'!$W:$W,0)),IFERROR(INDEX('POSTE (8)'!N:N,MATCH(ROW()-2,'POSTE (8)'!$W:$W,0)),IFERROR(INDEX('POSTE (9)'!N:N,MATCH(ROW()-2,'POSTE (9)'!$W:$W,0)),\"\")))))))))","v":""},{"$f":"IFERROR(INDEX('POSTE (1)'!O:O,MATCH(ROW()-2,'POSTE (1)'!$W:$W,0)),IFERROR(INDEX('POSTE (2)'!O:O,MATCH(ROW()-2,'POSTE (2)'!$W:$W,0)),IFERROR(INDEX('POSTE (3)'!O:O,MATCH(ROW()-2,'POSTE (3)'!$W:$W,0)),IFERROR(INDEX('POSTE (4)'!O:O,MATCH(ROW()-2,'POSTE (4)'!$W:$W,0)),IFERROR(INDEX('POSTE (5)'!O:O,MATCH(ROW()-2,'POSTE (5)'!$W:$W,0)),IFERROR(INDEX('POSTE (6)'!O:O,MATCH(ROW()-2,'POSTE (6)'!$W:$W,0)),IFERROR(INDEX('POSTE (7)'!O:O,MATCH(ROW()-2,'POSTE (7)'!$W:$W,0)),IFERROR(INDEX('POSTE (8)'!O:O,MATCH(ROW()-2,'POSTE (8)'!$W:$W,0)),IFERROR(INDEX('POSTE (9)'!O:O,MATCH(ROW()-2,'POSTE (9)'!$W:$W,0)),\"\")))))))))","v":""},{"$f":"IFERROR(INDEX('POSTE (1)'!P:P,MATCH(ROW()-2,'POSTE (1)'!$W:$W,0)),IFERROR(INDEX('POSTE (2)'!P:P,MATCH(ROW()-2,'POSTE (2)'!$W:$W,0)),IFERROR(INDEX('POSTE (3)'!P:P,MATCH(ROW()-2,'POSTE (3)'!$W:$W,0)),IFERROR(INDEX('POSTE (4)'!P:P,MATCH(ROW()-2,'POSTE (4)'!$W:$W,0)),IFERROR(INDEX('POSTE (5)'!P:P,MATCH(ROW()-2,'POSTE (5)'!$W:$W,0)),IFERROR(INDEX('POSTE (6)'!P:P,MATCH(ROW()-2,'POSTE (6)'!$W:$W,0)),IFERROR(INDEX('POSTE (7)'!P:P,MATCH(ROW()-2,'POSTE (7)'!$W:$W,0)),IFERROR(INDEX('POSTE (8)'!P:P,MATCH(ROW()-2,'POSTE (8)'!$W:$W,0)),IFERROR(INDEX('POSTE (9)'!P:P,MATCH(ROW()-2,'POSTE (9)'!$W:$W,0)),\"\")))))))))","v":""},{"$f":"IFERROR(INDEX('POSTE (1)'!Q:Q,MATCH(ROW()-2,'POSTE (1)'!$W:$W,0)),IFERROR(INDEX('POSTE (2)'!Q:Q,MATCH(ROW()-2,'POSTE (2)'!$W:$W,0)),IFERROR(INDEX('POSTE (3)'!Q:Q,MATCH(ROW()-2,'POSTE (3)'!$W:$W,0)),IFERROR(INDEX('POSTE (4)'!Q:Q,MATCH(ROW()-2,'POSTE (4)'!$W:$W,0)),IFERROR(INDEX('POSTE (5)'!Q:Q,MATCH(ROW()-2,'POSTE (5)'!$W:$W,0)),IFERROR(INDEX('POSTE (6)'!Q:Q,MATCH(ROW()-2,'POSTE (6)'!$W:$W,0)),IFERROR(INDEX('POSTE (7)'!Q:Q,MATCH(ROW()-2,'POSTE (7)'!$W:$W,0)),IFERROR(INDEX('POSTE (8)'!Q:Q,MATCH(ROW()-2,'POSTE (8)'!$W:$W,0)),IFERROR(INDEX('POSTE (9)'!Q:Q,MATCH(ROW()-2,'POSTE (9)'!$W:$W,0)),\"\")))))))))","v":""},{"$f":"IFERROR(INDEX('POSTE (1)'!R:R,MATCH(ROW()-2,'POSTE (1)'!$W:$W,0)),IFERROR(INDEX('POSTE (2)'!R:R,MATCH(ROW()-2,'POSTE (2)'!$W:$W,0)),IFERROR(INDEX('POSTE (3)'!R:R,MATCH(ROW()-2,'POSTE (3)'!$W:$W,0)),IFERROR(INDEX('POSTE (4)'!R:R,MATCH(ROW()-2,'POSTE (4)'!$W:$W,0)),IFERROR(INDEX('POSTE (5)'!R:R,MATCH(ROW()-2,'POSTE (5)'!$W:$W,0)),IFERROR(INDEX('POSTE (6)'!R:R,MATCH(ROW()-2,'POSTE (6)'!$W:$W,0)),IFERROR(INDEX('POSTE (7)'!R:R,MATCH(ROW()-2,'POSTE (7)'!$W:$W,0)),IFERROR(INDEX('POSTE (8)'!R:R,MATCH(ROW()-2,'POSTE (8)'!$W:$W,0)),IFERROR(INDEX('POSTE (9)'!R:R,MATCH(ROW()-2,'POSTE (9)'!$W:$W,0)),\"\")))))))))","v":""},{"$f":"IFERROR(INDEX('POSTE (1)'!S:S,MATCH(ROW()-2,'POSTE (1)'!$W:$W,0)),IFERROR(INDEX('POSTE (2)'!S:S,MATCH(ROW()-2,'POSTE (2)'!$W:$W,0)),IFERROR(INDEX('POSTE (3)'!S:S,MATCH(ROW()-2,'POSTE (3)'!$W:$W,0)),IFERROR(INDEX('POSTE (4)'!S:S,MATCH(ROW()-2,'POSTE (4)'!$W:$W,0)),IFERROR(INDEX('POSTE (5)'!S:S,MATCH(ROW()-2,'POSTE (5)'!$W:$W,0)),IFERROR(INDEX('POSTE (6)'!S:S,MATCH(ROW()-2,'POSTE (6)'!$W:$W,0)),IFERROR(INDEX('POSTE (7)'!S:S,MATCH(ROW()-2,'POSTE (7)'!$W:$W,0)),IFERROR(INDEX('POSTE (8)'!S:S,MATCH(ROW()-2,'POSTE (8)'!$W:$W,0)),IFERROR(INDEX('POSTE (9)'!S:S,MATCH(ROW()-2,'POSTE (9)'!$W:$W,0)),\"\")))))))))","v":""},{"$f":"IFERROR(INDEX('POSTE (1)'!T:T,MATCH(ROW()-2,'POSTE (1)'!$W:$W,0)),IFERROR(INDEX('POSTE (2)'!T:T,MATCH(ROW()-2,'POSTE (2)'!$W:$W,0)),IFERROR(INDEX('POSTE (3)'!T:T,MATCH(ROW()-2,'POSTE (3)'!$W:$W,0)),IFERROR(INDEX('POSTE (4)'!T:T,MATCH(ROW()-2,'POSTE (4)'!$W:$W,0)),IFERROR(INDEX('POSTE (5)'!T:T,MATCH(ROW()-2,'POSTE (5)'!$W:$W,0)),IFERROR(INDEX('POSTE (6)'!T:T,MATCH(ROW()-2,'POSTE (6)'!$W:$W,0)),IFERROR(INDEX('POSTE (7)'!T:T,MATCH(ROW()-2,'POSTE (7)'!$W:$W,0)),IFERROR(INDEX('POSTE (8)'!T:T,MATCH(ROW()-2,'POSTE (8)'!$W:$W,0)),IFERROR(INDEX('POSTE (9)'!T:T,MATCH(ROW()-2,'POSTE (9)'!$W:$W,0)),\"\")))))))))","v":""},{"$f":"IFERROR(INDEX('POSTE (1)'!U:U,MATCH(ROW()-2,'POSTE (1)'!$W:$W,0)),IFERROR(INDEX('POSTE (2)'!U:U,MATCH(ROW()-2,'POSTE (2)'!$W:$W,0)),IFERROR(INDEX('POSTE (3)'!U:U,MATCH(ROW()-2,'POSTE (3)'!$W:$W,0)),IFERROR(INDEX('POSTE (4)'!U:U,MATCH(ROW()-2,'POSTE (4)'!$W:$W,0)),IFERROR(INDEX('POSTE (5)'!U:U,MATCH(ROW()-2,'POSTE (5)'!$W:$W,0)),IFERROR(INDEX('POSTE (6)'!U:U,MATCH(ROW()-2,'POSTE (6)'!$W:$W,0)),IFERROR(INDEX('POSTE (7)'!U:U,MATCH(ROW()-2,'POSTE (7)'!$W:$W,0)),IFERROR(INDEX('POSTE (8)'!U:U,MATCH(ROW()-2,'POSTE (8)'!$W:$W,0)),IFERROR(INDEX('POSTE (9)'!U:U,MATCH(ROW()-2,'POSTE (9)'!$W:$W,0)),\"\")))))))))","v":""}]
[{"$f":"IFERROR(INDEX('POSTE (1)'!N:N,MATCH(ROW()-2,'POSTE (1)'!$W:$W,0)),IFERROR(INDEX('POSTE (2)'!N:N,MATCH(ROW()-2,'POSTE (2)'!$W:$W,0)),IFERROR(INDEX('POSTE (3)'!N:N,MATCH(ROW()-2,'POSTE (3)'!$W:$W,0)),IFERROR(INDEX('POSTE (4)'!N:N,MATCH(ROW()-2,'POSTE (4)'!$W:$W,0)),IFERROR(INDEX('POSTE (5)'!N:N,MATCH(ROW()-2,'POSTE (5)'!$W:$W,0)),IFERROR(INDEX('POSTE (6)'!N:N,MATCH(ROW()-2,'POSTE (6)'!$W:$W,0)),IFERROR(INDEX('POSTE (7)'!N:N,MATCH(ROW()-2,'POSTE (7)'!$W:$W,0)),IFERROR(INDEX('POSTE (8)'!N:N,MATCH(ROW()-2,'POSTE (8)'!$W:$W,0)),IFERROR(INDEX('POSTE (9)'!N:N,MATCH(ROW()-2,'POSTE (9)'!$W:$W,0)),\"\")))))))))","v":""},{"$f":"IFERROR(INDEX('POSTE (1)'!O:O,MATCH(ROW()-2,'POSTE (1)'!$W:$W,0)),IFERROR(INDEX('POSTE (2)'!O:O,MATCH(ROW()-2,'POSTE (2)'!$W:$W,0)),IFERROR(INDEX('POSTE (3)'!O:O,MATCH(ROW()-2,'POSTE (3)'!$W:$W,0)),IFERROR(INDEX('POSTE (4)'!O:O,MATCH(ROW()-2,'POSTE (4)'!$W:$W,0)),IFERROR(INDEX('POSTE (5)'!O:O,MATCH(ROW()-2,'POSTE (5)'!$W:$W,0)),IFERROR(INDEX('POSTE (6)'!O:O,MATCH(ROW()-2,'POSTE (6)'!$W:$W,0)),IFERROR(INDEX('POSTE (7)'!O:O,MATCH(ROW()-2,'POSTE (7)'!$W:$W,0)),IFERROR(INDEX('POSTE (8)'!O:O,MATCH(ROW()-2,'POSTE (8)'!$W:$W,0)),IFERROR(INDEX('POSTE (9)'!O:O,MATCH(ROW()-2,'POSTE (9)'!$W:$W,0)),\"\")))))))))","v":""},{"$f":"IFERROR(INDEX('POSTE (1)'!P:P,MATCH(ROW()-2,'POSTE (1)'!$W:$W,0)),IFERROR(INDEX('POSTE (2)'!P:P,MATCH(ROW()-2,'POSTE (2)'!$W:$W,0)),IFERROR(INDEX('POSTE (3)'!P:P,MATCH(ROW()-2,'POSTE (3)'!$W:$W,0)),IFERROR(INDEX('POSTE (4)'!P:P,MATCH(ROW()-2,'POSTE (4)'!$W:$W,0)),IFERROR(INDEX('POSTE (5)'!P:P,MATCH(ROW()-2,'POSTE (5)'!$W:$W,0)),IFERROR(INDEX('POSTE (6)'!P:P,MATCH(ROW()-2,'POSTE (6)'!$W:$W,0)),IFERROR(INDEX('POSTE (7)'!P:P,MATCH(ROW()-2,'POSTE (7)'!$W:$W,0)),IFERROR(INDEX('POSTE (8)'!P:P,MATCH(ROW()-2,'POSTE (8)'!$W:$W,0)),IFERROR(INDEX('POSTE (9)'!P:P,MATCH(ROW()-2,'POSTE (9)'!$W:$W,0)),\"\")))))))))","v":""},{"$f":"IFERROR(INDEX('POSTE (1)'!Q:Q,MATCH(ROW()-2,'POSTE (1)'!$W:$W,0)),IFERROR(INDEX('POSTE (2)'!Q:Q,MATCH(ROW()-2,'POSTE (2)'!$W:$W,0)),IFERROR(INDEX('POSTE (3)'!Q:Q,MATCH(ROW()-2,'POSTE (3)'!$W:$W,0)),IFERROR(INDEX('POSTE (4)'!Q:Q,MATCH(ROW()-2,'POSTE (4)'!$W:$W,0)),IFERROR(INDEX('POSTE (5)'!Q:Q,MATCH(ROW()-2,'POSTE (5)'!$W:$W,0)),IFERROR(INDEX('POSTE (6)'!Q:Q,MATCH(ROW()-2,'POSTE (6)'!$W:$W,0)),IFERROR(INDEX('POSTE (7)'!Q:Q,MATCH(ROW()-2,'POSTE (7)'!$W:$W,0)),IFERROR(INDEX('POSTE (8)'!Q:Q,MATCH(ROW()-2,'POSTE (8)'!$W:$W,0)),IFERROR(INDEX('POSTE (9)'!Q:Q,MATCH(ROW()-2,'POSTE (9)'!$W:$W,0)),\"\")))))))))","v":""},{"$f":"IFERROR(INDEX('POSTE (1)'!R:R,MATCH(ROW()-2,'POSTE (1)'!$W:$W,0)),IFERROR(INDEX('POSTE (2)'!R:R,MATCH(ROW()-2,'POSTE (2)'!$W:$W,0)),IFERROR(INDEX('POSTE (3)'!R:R,MATCH(ROW()-2,'POSTE (3)'!$W:$W,0)),IFERROR(INDEX('POSTE (4)'!R:R,MATCH(ROW()-2,'POSTE (4)'!$W:$W,0)),IFERROR(INDEX('POSTE (5)'!R:R,MATCH(ROW()-2,'POSTE (5)'!$W:$W,0)),IFERROR(INDEX('POSTE (6)'!R:R,MATCH(ROW()-2,'POSTE (6)'!$W:$W,0)),IFERROR(INDEX('POSTE (7)'!R:R,MATCH(ROW()-2,'POSTE (7)'!$W:$W,0)),IFERROR(INDEX('POSTE (8)'!R:R,MATCH(ROW()-2,'POSTE (8)'!$W:$W,0)),IFERROR(INDEX('POSTE (9)'!R:R,MATCH(ROW()-2,'POSTE (9)'!$W:$W,0)),\"\")))))))))","v":""},{"$f":"IFERROR(INDEX('POSTE (1)'!S:S,MATCH(ROW()-2,'POSTE (1)'!$W:$W,0)),IFERROR(INDEX('POSTE (2)'!S:S,MATCH(ROW()-2,'POSTE (2)'!$W:$W,0)),IFERROR(INDEX('POSTE (3)'!S:S,MATCH(ROW()-2,'POSTE (3)'!$W:$W,0)),IFERROR(INDEX('POSTE (4)'!S:S,MATCH(ROW()-2,'POSTE (4)'!$W:$W,0)),IFERROR(INDEX('POSTE (5)'!S:S,MATCH(ROW()-2,'POSTE (5)'!$W:$W,0)),IFERROR(INDEX('POSTE (6)'!S:S,MATCH(ROW()-2,'POSTE (6)'!$W:$W,0)),IFERROR(INDEX('POSTE (7)'!S:S,MATCH(ROW()-2,'POSTE (7)'!$W:$W,0)),IFERROR(INDEX('POSTE (8)'!S:S,MATCH(ROW()-2,'POSTE (8)'!$W:$W,0)),IFERROR(INDEX('POSTE (9)'!S:S,MATCH(ROW()-2,'POSTE (9)'!$W:$W,0)),\"\")))))))))","v":""},{"$f":"IFERROR(INDEX('POSTE (1)'!T:T,MATCH(ROW()-2,'POSTE (1)'!$W:$W,0)),IFERROR(INDEX('POSTE (2)'!T:T,MATCH(ROW()-2,'POSTE (2)'!$W:$W,0)),IFERROR(INDEX('POSTE (3)'!T:T,MATCH(ROW()-2,'POSTE (3)'!$W:$W,0)),IFERROR(INDEX('POSTE (4)'!T:T,MATCH(ROW()-2,'POSTE (4)'!$W:$W,0)),IFERROR(INDEX('POSTE (5)'!T:T,MATCH(ROW()-2,'POSTE (5)'!$W:$W,0)),IFERROR(INDEX('POSTE (6)'!T:T,MATCH(ROW()-2,'POSTE (6)'!$W:$W,0)),IFERROR(INDEX('POSTE (7)'!T:T,MATCH(ROW()-2,'POSTE (7)'!$W:$W,0)),IFERROR(INDEX('POSTE (8)'!T:T,MATCH(ROW()-2,'POSTE (8)'!$W:$W,0)),IFERROR(INDEX('POSTE (9)'!T:T,MATCH(ROW()-2,'POSTE (9)'!$W:$W,0)),\"\")))))))))","v":""},{"$f":"IFERROR(INDEX('POSTE (1)'!U:U,MATCH(ROW()-2,'POSTE (1)'!$W:$W,0)),IFERROR(INDEX('POSTE (2)'!U:U,MATCH(ROW()-2,'POSTE (2)'!$W:$W,0)),IFERROR(INDEX('POSTE (3)'!U:U,MATCH(ROW()-2,'POSTE (3)'!$W:$W,0)),IFERROR(INDEX('POSTE (4)'!U:U,MATCH(ROW()-2,'POSTE (4)'!$W:$W,0)),IFERROR(INDEX('POSTE (5)'!U:U,MATCH(ROW()-2,'POSTE (5)'!$W:$W,0)),IFERROR(INDEX('POSTE (6)'!U:U,MATCH(ROW()-2,'POSTE (6)'!$W:$W,0)),IFERROR(INDEX('POSTE (7)'!U:U,MATCH(ROW()-2,'POSTE (7)'!$W:$W,0)),IFERROR(INDEX('POSTE (8)'!U:U,MATCH(ROW()-2,'POSTE (8)'!$W:$W,0)),IFERROR(INDEX('POSTE (9)'!U:U,MATCH(ROW()-2,'POSTE (9)'!$W:$W,0)),\"\")))))))))","v":""}]
[{"$f":"IFERROR(INDEX('POSTE (1)'!N:N,MATCH(ROW()-2,'POSTE (1)'!$W:$W,0)),IFERROR(INDEX('POSTE (2)'!N:N,MATCH(ROW()-2,'POSTE (2)'!$W:$W,0)),IFERROR(INDEX('POSTE (3)'!N:N,MATCH(ROW()-2,'POSTE (3)'!$W:$W,0)),IFERROR(INDEX('POSTE (4)'!N:N,MATCH(ROW()-2,'POSTE (4)'!$W:$W,0)),IFERROR(INDEX('POSTE (5)'!N:N,MATCH(ROW()-2,'POSTE (5)'!$W:$W,0)),IFERROR(INDEX('POSTE (6)'!N:N,MATCH(ROW()-2,'POSTE (6)'!$W:$W,0)),IFERROR(INDEX('POSTE (7)'!N:N,MATCH(ROW()-2,'POSTE (7)'!$W:$W,0)),IFERROR(INDEX('POSTE (8)'!N:N,MATCH(ROW()-2,'POSTE (8)'!$W:$W,0)),IFERROR(INDEX('POSTE (9)'!N:N,MATCH(ROW()-2,'POSTE (9)'!$W:$W,0)),\"\")))))))))","v":""},{"$f":"IFERROR(INDEX('POSTE (1)'!O:O,MATCH(ROW()-2,'POSTE (1)'!$W:$W,0)),IFERROR(INDEX('POSTE (2)'!O:O,MATCH(ROW()-2,'POSTE (2)'!$W:$W,0)),IFERROR(INDEX('POSTE (3)'!O:O,MATCH(ROW()-2,'POSTE (3)'!$W:$W,0)),IFERROR(INDEX('POSTE (4)'!O:O,MATCH(ROW()-2,'POSTE (4)'!$W:$W,0)),IFERROR(INDEX('POSTE (5)'!O:O,MATCH(ROW()-2,'POSTE (5)'!$W:$W,0)),IFERROR(INDEX('POSTE (6)'!O:O,MATCH(ROW()-2,'POSTE (6)'!$W:$W,0)),IFERROR(INDEX('POSTE (7)'!O:O,MATCH(ROW()-2,'POSTE (7)'!$W:$W,0)),IFERROR(INDEX('POSTE (8)'!O:O,MATCH(ROW()-2,'POSTE (8)'!$W:$W,0)),IFERROR(INDEX('POSTE (9)'!O:O,MATCH(ROW()-2,'POSTE (9)'!$W:$W,0)),\"\")))))))))","v":""},{"$f":"IFERROR(INDEX('POSTE (1)'!P:P,MATCH(ROW()-2,'POSTE (1)'!$W:$W,0)),IFERROR(INDEX('POSTE (2)'!P:P,MATCH(ROW()-2,'POSTE (2)'!$W:$W,0)),IFERROR(INDEX('POSTE (3)'!P:P,MATCH(ROW()-2,'POSTE (3)'!$W:$W,0)),IFERROR(INDEX('POSTE (4)'!P:P,MATCH(ROW()-2,'POSTE (4)'!$W:$W,0)),IFERROR(INDEX('POSTE (5)'!P:P,MATCH(ROW()-2,'POSTE (5)'!$W:$W,0)),IFERROR(INDEX('POSTE (6)'!P:P,MATCH(ROW()-2,'POSTE (6)'!$W:$W,0)),IFERROR(INDEX('POSTE (7)'!P:P,MATCH(ROW()-2,'POSTE (7)'!$W:$W,0)),IFERROR(INDEX('POSTE (8)'!P:P,MATCH(ROW()-2,'POSTE (8)'!$W:$W,0)),IFERROR(INDEX('POSTE (9)'!P:P,MATCH(ROW()-2,'POSTE (9)'!$W:$W,0)),\"\")))))))))","v":""},{"$f":"IFERROR(INDEX('POSTE (1)'!Q:Q,MATCH(ROW()-2,'POSTE (1)'!$W:$W,0)),IFERROR(INDEX('POSTE (2)'!Q:Q,MATCH(ROW()-2,'POSTE (2)'!$W:$W,0)),IFERROR(INDEX('POSTE (3)'!Q:Q,MATCH(ROW()-2,'POSTE (3)'!$W:$W,0)),IFERROR(INDEX('POSTE (4)'!Q:Q,MATCH(ROW()-2,'POSTE (4)'!$W:$W,0)),IFERROR(INDEX('POSTE (5)'!Q:Q,MATCH(ROW()-2,'POSTE (5)'!$W:$W,0)),IFERROR(INDEX('POSTE (6)'!Q:Q,MATCH(ROW()-2,'POSTE (6)'!$W:$W,0)),IFERROR(INDEX('POSTE (7)'!Q:Q,MATCH(ROW()-2,'POSTE (7)'!$W:$W,0)),IFERROR(INDEX('POSTE (8)'!Q:Q,MATCH(ROW()-2,'POSTE (8)'!$W:$W,0)),IFERROR(INDEX('POSTE (9)'!Q:Q,MATCH(ROW()-2,'POSTE (9)'!$W:$W,0)),\"\")))))))))","v":""},{"$f":"IFERROR(INDEX('POSTE (1)'!R:R,MATCH(ROW()-2,'POSTE (1)'!$W:$W,0)),IFERROR(INDEX('POSTE (2)'!R:R,MATCH(ROW()-2,'POSTE (2)'!$W:$W,0)),IFERROR(INDEX('POSTE (3)'!R:R,MATCH(ROW()-2,'POSTE (3)'!$W:$W,0)),IFERROR(INDEX('POSTE (4)'!R:R,MATCH(ROW()-2,'POSTE (4)'!$W:$W,0)),IFERROR(INDEX('POSTE (5)'!R:R,MATCH(ROW()-2,'POSTE (5)'!$W:$W,0)),IFERROR(INDEX('POSTE (6)'!R:R,MATCH(ROW()-2,'POSTE (6)'!$W:$W,0)),IFERROR(INDEX('POSTE (7)'!R:R,MATCH(ROW()-2,'POSTE (7)'!$W:$W,0)),IFERROR(INDEX('POSTE (8)'!R:R,MATCH(ROW()-2,'POSTE (8)'!$W:$W,0)),IFERROR(INDEX('POSTE (9)'!R:R,MATCH(ROW()-2,'POSTE (9)'!$W:$W,0)),\"\")))))))))","v":""},{"$f":"IFERROR(INDEX('POSTE (1)'!S:S,MATCH(ROW()-2,'POSTE (1)'!$W:$W,0)),IFERROR(INDEX('POSTE (2)'!S:S,MATCH(ROW()-2,'POSTE (2)'!$W:$W,0)),IFERROR(INDEX('POSTE (3)'!S:S,MATCH(ROW()-2,'POSTE (3)'!$W:$W,0)),IFERROR(INDEX('POSTE (4)'!S:S,MATCH(ROW()-2,'POSTE (4)'!$W:$W,0)),IFERROR(INDEX('POSTE (5)'!S:S,MATCH(ROW()-2,'POSTE (5)'!$W:$W,0)),IFERROR(INDEX('POSTE (6)'!S:S,MATCH(ROW()-2,'POSTE (6)'!$W:$W,0)),IFERROR(INDEX('POSTE (7)'!S:S,MATCH(ROW()-2,'POSTE (7)'!$W:$W,0)),IFERROR(INDEX('POSTE (8)'!S:S,MATCH(ROW()-2,'POSTE (8)'!$W:$W,0)),IFERROR(INDEX('POSTE (9)'!S:S,MATCH(ROW()-2,'POSTE (9)'!$W:$W,0)),\"\")))))))))","v":""},{"$f":"IFERROR(INDEX('POSTE (1)'!T:T,MATCH(ROW()-2,'POSTE (1)'!$W:$W,0)),IFERROR(INDEX('POSTE (2)'!T:T,MATCH(ROW()-2,'POSTE (2)'!$W:$W,0)),IFERROR(INDEX('POSTE (3)'!T:T,MATCH(ROW()-2,'POSTE (3)'!$W:$W,0)),IFERROR(INDEX('POSTE (4)'!T:T,MATCH(ROW()-2,'POSTE (4)'!$W:$W,0)),IFERROR(INDEX('POSTE (5)'!T:T,MATCH(ROW()-2,'POSTE (5)'!$W:$W,0)),IFERROR(INDEX('POSTE (6)'!T:T,MATCH(ROW()-2,'POSTE (6)'!$W:$W,0)),IFERROR(INDEX('POSTE (7)'!T:T,MATCH(ROW()-2,'POSTE (7)'!$W:$W,0)),IFERROR(INDEX('POSTE (8)'!T:T,MATCH(ROW()-2,'POSTE (8)'!$W:$W,0)),IFERROR(INDEX('POSTE (9)'!T:T,MATCH(ROW()-2,'POSTE (9)'!$W:$W,0)),\"\")))))))))","v":""},{"$f":"IFERROR(INDEX('POSTE (1)'!U:U,MATCH(ROW()-2,'POSTE (1)'!$W:$W,0)),IFERROR(INDEX('POSTE (2)'!U:U,MATCH(ROW()-2,'POSTE (2)'!$W:$W,0)),IFERROR(INDEX('POSTE (3)'!U:U,MATCH(ROW()-2,'POSTE (3)'!$W:$W,0)),IFERROR(INDEX('POSTE (4)'!U:U,MATCH(ROW()-2,'POSTE (4)'!$W:$W,0)),IFERROR(INDEX('POSTE (5)'!U:U,MATCH(ROW()-2,'POSTE (5)'!$W:$W,0)),IFERROR(INDEX('POSTE (6)'!U:U,MATCH(ROW()-2,'POSTE (6)'!$W:$W,0)),IFERROR(INDEX('POSTE (7)'!U:U,MATCH(ROW()-2,'POSTE (7)'!$W:$W,0)),IFERROR(INDEX('POSTE (8)'!U:U,MATCH(ROW()-2,'POSTE (8)'!$W:$W,0)),IFERROR(INDEX('POSTE (9)'!U:U,MATCH(ROW()-2,'POSTE (9)'!$W:$W,0)),\"\")))))))))","v":""}]
[{"$f":"IFERROR(INDEX('POSTE (1)'!N:N,MATCH(ROW()-2,'POSTE (1)'!$W:$W,0)),IFERROR(INDEX('POSTE (2)'!N:N,MATCH(ROW()-2,'POSTE (2)'!$W:$W,0)),IFERROR(INDEX('POSTE (3)'!N:N,MATCH(ROW()-2,'POSTE (3)'!$W:$W,0)),IFERROR(INDEX('POSTE (4)'!N:N,MATCH(ROW()-2,'POSTE (4)'!$W:$W,0)),IFERROR(INDEX('POSTE (5)'!N:N,MATCH(ROW()-2,'POSTE (5)'!$W:$W,0)),IFERROR(INDEX('POSTE (6)'!N:N,MATCH(ROW()-2,'POSTE (6)'!$W:$W,0)),IFERROR(INDEX('POSTE (7)'!N:N,MATCH(ROW()-2,'POSTE (7)'!$W:$W,0)),IFERROR(INDEX('POSTE (8)'!N:N,MATCH(ROW()-2,'POSTE (8)'!$W:$W,0)),IFERROR(INDEX('POSTE (9)'!N:N,MATCH(ROW()-2,'POSTE (9)'!$W:$W,0)),\"\")))))))))","v":""},{"$f":"IFERROR(INDEX('POSTE (1)'!O:O,MATCH(ROW()-2,'POSTE (1)'!$W:$W,0)),IFERROR(INDEX('POSTE (2)'!O:O,MATCH(ROW()-2,'POSTE (2)'!$W:$W,0)),IFERROR(INDEX('POSTE (3)'!O:O,MATCH(ROW()-2,'POSTE (3)'!$W:$W,0)),IFERROR(INDEX('POSTE (4)'!O:O,MATCH(ROW()-2,'POSTE (4)'!$W:$W,0)),IFERROR(INDEX('POSTE (5)'!O:O,MATCH(ROW()-2,'POSTE (5)'!$W:$W,0)),IFERROR(INDEX('POSTE (6)'!O:O,MATCH(ROW()-2,'POSTE (6)'!$W:$W,0)),IFERROR(INDEX('POSTE (7)'!O:O,MATCH(ROW()-2,'POSTE (7)'!$W:$W,0)),IFERROR(INDEX('POSTE (8)'!O:O,MATCH(ROW()-2,'POSTE (8)'!$W:$W,0)),IFERROR(INDEX('POSTE (9)'!O:O,MATCH(ROW()-2,'POSTE (9)'!$W:$W,0)),\"\")))))))))","v":""},{"$f":"IFERROR(INDEX('POSTE (1)'!P:P,MATCH(ROW()-2,'POSTE (1)'!$W:$W,0)),IFERROR(INDEX('POSTE (2)'!P:P,MATCH(ROW()-2,'POSTE (2)'!$W:$W,0)),IFERROR(INDEX('POSTE (3)'!P:P,MATCH(ROW()-2,'POSTE (3)'!$W:$W,0)),IFERROR(INDEX('POSTE (4)'!P:P,MATCH(ROW()-2,'POSTE (4)'!$W:$W,0)),IFERROR(INDEX('POSTE (5)'!P:P,MATCH(ROW()-2,'POSTE (5)'!$W:$W,0)),IFERROR(INDEX('POSTE (6)'!P:P,MATCH(ROW()-2,'POSTE (6)'!$W:$W,0)),IFERROR(INDEX('POSTE (7)'!P:P,MATCH(ROW()-2,'POSTE (7)'!$W:$W,0)),IFERROR(INDEX('POSTE (8)'!P:P,MATCH(ROW()-2,'POSTE (8)'!$W:$W,0)),IFERROR(INDEX('POSTE (9)'!P:P,MATCH(ROW()-2,'POSTE (9)'!$W:$W,0)),\"\")))))))))","v":""},{"$f":"IFERROR(INDEX('POSTE (1)'!Q:Q,MATCH(ROW()-2,'POSTE (1)'!$W:$W,0)),IFERROR(INDEX('POSTE (2)'!Q:Q,MATCH(ROW()-2,'POSTE (2)'!$W:$W,0)),IFERROR(INDEX('POSTE (3)'!Q:Q,MATCH(ROW()-2,'POSTE (3)'!$W:$W,0)),IFERROR(INDEX('POSTE (4)'!Q:Q,MATCH(ROW()-2,'POSTE (4)'!$W:$W,0)),IFERROR(INDEX('POSTE (5)'!Q:Q,MATCH(ROW()-2,'POSTE (5)'!$W:$W,0)),IFERROR(INDEX('POSTE (6)'!Q:Q,MATCH(ROW()-2,'POSTE (6)'!$W:$W,0)),IFERROR(INDEX('POSTE (7)'!Q:Q,MATCH(ROW()-2,'POSTE (7)'!$W:$W,0)),IFERROR(INDEX('POSTE (8)'!Q:Q,MATCH(ROW()-2,'POSTE (8)'!$W:$W,0)),IFERROR(INDEX('POSTE (9)'!Q:Q,MATCH(ROW()-2,'POSTE (9)'!$W:$W,0)),\"\")))))))))","v":""},{"$f":"IFERROR(INDEX('POSTE (1)'!R:R,MATCH(ROW()-2,'POSTE (1)'!$W:$W,0)),IFERROR(INDEX('POSTE (2)'!R:R,MATCH(ROW()-2,'POSTE (2)'!$W:$W,0)),IFERROR(INDEX('POSTE (3)'!R:R,MATCH(ROW()-2,'POSTE (3)'!$W:$W,0)),IFERROR(INDEX('POSTE (4)'!R:R,MATCH(ROW()-2,'POSTE (4)'!$W:$W,0)),IFERROR(INDEX('POSTE (5)'!R:R,MATCH(ROW()-2,'POSTE (5)'!$W:$W,0)),IFERROR(INDEX('POSTE (6)'!R:R,MATCH(ROW()-2,'POSTE (6)'!$W:$W,0)),IFERROR(INDEX('POSTE (7)'!R:R,MATCH(ROW()-2,'POSTE (7)'!$W:$W,0)),IFERROR(INDEX('POSTE (8)'!R:R,MATCH(ROW()-2,'POSTE (8)'!$W:$W,0)),IFERROR(INDEX('POSTE (9)'!R:R,MATCH(ROW()-2,'POSTE (9)'!$W:$W,0)),\"\")))))))))","v":""},{"$f":"IFERROR(INDEX('POSTE (1)'!S:S,MATCH(ROW()-2,'POSTE (1)'!$W:$W,0)),IFERROR(INDEX('POSTE (2)'!S:S,MATCH(ROW()-2,'POSTE (2)'!$W:$W,0)),IFERROR(INDEX('POSTE (3)'!S:S,MATCH(ROW()-2,'POSTE (3)'!$W:$W,0)),IFERROR(INDEX('POSTE (4)'!S:S,MATCH(ROW()-2,'POSTE (4)'!$W:$W,0)),IFERROR(INDEX('POSTE (5)'!S:S,MATCH(ROW()-2,'POSTE (5)'!$W:$W,0)),IFERROR(INDEX('POSTE (6)'!S:S,MATCH(ROW()-2,'POSTE (6)'!$W:$W,0)),IFERROR(INDEX('POSTE (7)'!S:S,MATCH(ROW()-2,'POSTE (7)'!$W:$W,0)),IFERROR(INDEX('POSTE (8)'!S:S,MATCH(ROW()-2,'POSTE (8)'!$W:$W,0)),IFERROR(INDEX('POSTE (9)'!S:S,MATCH(ROW()-2,'POSTE (9)'!$W:$W,0)),\"\")))))))))","v":""},{"$f":"IFERROR(INDEX('POSTE (1)'!T:T,MATCH(ROW()-2,'POSTE (1)'!$W:$W,0)),IFERROR(INDEX('POSTE (2)'!T:T,MATCH(ROW()-2,'POSTE (2)'!$W:$W,0)),IFERROR(INDEX('POSTE (3)'!T:T,MATCH(ROW()-2,'POSTE (3)'!$W:$W,0)),IFERROR(INDEX('POSTE (4)'!T:T,MATCH(ROW()-2,'POSTE (4)'!$W:$W,0)),IFERROR(INDEX('POSTE (5)'!T:T,MATCH(ROW()-2,'POSTE (5)'!$W:$W,0)),IFERROR(INDEX('POSTE (6)'!T:T,MATCH(ROW()-2,'POSTE (6)'!$W:$W,0)),IFERROR(INDEX('POSTE (7)'!T:T,MATCH(ROW()-2,'POSTE (7)'!$W:$W,0)),IFERROR(INDEX('POSTE (8)'!T:T,MATCH(ROW()-2,'POSTE (8)'!$W:$W,0)),IFERROR(INDEX('POSTE (9)'!T:T,MATCH(ROW()-2,'POSTE (9)'!$W:$W,0)),\"\")))))))))","v":""},{"$f":"IFERROR(INDEX('POSTE (1)'!U:U,MATCH(ROW()-2,'POSTE (1)'!$W:$W,0)),IFERROR(INDEX('POSTE (2)'!U:U,MATCH(ROW()-2,'POSTE (2)'!$W:$W,0)),IFERROR(INDEX('POSTE (3)'!U:U,MATCH(ROW()-2,'POSTE (3)'!$W:$W,0)),IFERROR(INDEX('POSTE (4)'!U:U,MATCH(ROW()-2,'POSTE (4)'!$W:$W,0)),IFERROR(INDEX('POSTE (5)'!U:U,MATCH(ROW()-2,'POSTE (5)'!$W:$W,0)),IFERROR(INDEX('POSTE (6)'!U:U,MATCH(ROW()-2,'POSTE (6)'!$W:$W,0)),IFERROR(INDEX('POSTE (7)'!U:U,MATCH(ROW()-2,'POSTE (7)'!$W:$W,0)),IFERROR(INDEX('POSTE (8)'!U:U,MATCH(ROW()-2,'POSTE (8)'!$W:$W,0)),IFERROR(INDEX('POSTE (9)'!U:U,MATCH(ROW()-2,'POSTE (9)'!$W:$W,0)),\"\")))))))))","v":""}]
[{"$f":"IFERROR(INDEX('POSTE (1)'!N:N,MATCH(ROW()-2,'POSTE (1)'!$W:$W,0)),IFERROR(INDEX('POSTE (2)'!N:N,MATCH(ROW()-2,'POSTE (2)'!$W:$W,0)),IFERROR(INDEX('POSTE (3)'!N:N,MATCH(ROW()-2,'POSTE (3)'!$W:$W,0)),IFERROR(INDEX('POSTE (4)'!N:N,MATCH(ROW()-2,'POSTE (4)'!$W:$W,0)),IFERROR(INDEX('POSTE (5)'!N:N,MATCH(ROW()-2,'POSTE (5)'!$W:$W,0)),IFERROR(INDEX('POSTE (6)'!N:N,MATCH(ROW()-2,'POSTE (6)'!$W:$W,0)),IFERROR(INDEX('POSTE (7)'!N:N,MATCH(ROW()-2,'POSTE (7)'!$W:$W,0)),IFERROR(INDEX('POSTE (8)'!N:N,MATCH(ROW()-2,'POSTE (8)'!$W:$W,0)),IFERROR(INDEX('POSTE (9)'!N:N,MATCH(ROW()-2,'POSTE (9)'!$W:$W,0)),\"\")))))))))","v":""},{"$f":"IFERROR(INDEX('POSTE (1)'!O:O,MATCH(ROW()-2,'POSTE (1)'!$W:$W,0)),IFERROR(INDEX('POSTE (2)'!O:O,MATCH(ROW()-2,'POSTE (2)'!$W:$W,0)),IFERROR(INDEX('POSTE (3)'!O:O,MATCH(ROW()-2,'POSTE (3)'!$W:$W,0)),IFERROR(INDEX('POSTE (4)'!O:O,MATCH(ROW()-2,'POSTE (4)'!$W:$W,0)),IFERROR(INDEX('POSTE (5)'!O:O,MATCH(ROW()-2,'POSTE (5)'!$W:$W,0)),IFERROR(INDEX('POSTE (6)'!O:O,MATCH(ROW()-2,'POSTE (6)'!$W:$W,0)),IFERROR(INDEX('POSTE (7)'!O:O,MATCH(ROW()-2,'POSTE (7)'!$W:$W,0)),IFERROR(INDEX('POSTE (8)'!O:O,MATCH(ROW()-2,'POSTE (8)'!$W:$W,0)),IFERROR(INDEX('POSTE (9)'!O:O,MATCH(ROW()-2,'POSTE (9)'!$W:$W,0)),\"\")))))))))","v":""},{"$f":"IFERROR(INDEX('POSTE (1)'!P:P,MATCH(ROW()-2,'POSTE (1)'!$W:$W,0)),IFERROR(INDEX('POSTE (2)'!P:P,MATCH(ROW()-2,'POSTE (2)'!$W:$W,0)),IFERROR(INDEX('POSTE (3)'!P:P,MATCH(ROW()-2,'POSTE (3)'!$W:$W,0)),IFERROR(INDEX('POSTE (4)'!P:P,MATCH(ROW()-2,'POSTE (4)'!$W:$W,0)),IFERROR(INDEX('POSTE (5)'!P:P,MATCH(ROW()-2,'POSTE (5)'!$W:$W,0)),IFERROR(INDEX('POSTE (6)'!P:P,MATCH(ROW()-2,'POSTE (6)'!$W:$W,0)),IFERROR(INDEX('POSTE (7)'!P:P,MATCH(ROW()-2,'POSTE (7)'!$W:$W,0)),IFERROR(INDEX('POSTE (8)'!P:P,MATCH(ROW()-2,'POSTE (8)'!$W:$W,0)),IFERROR(INDEX('POSTE (9)'!P:P,MATCH(ROW()-2,'POSTE (9)'!$W:$W,0)),\"\")))))))))","v":""},{"$f":"IFERROR(INDEX('POSTE (1)'!Q:Q,MATCH(ROW()-2,'POSTE (1)'!$W:$W,0)),IFERROR(INDEX('POSTE (2)'!Q:Q,MATCH(ROW()-2,'POSTE (2)'!$W:$W,0)),IFERROR(INDEX('POSTE (3)'!Q:Q,MATCH(ROW()-2,'POSTE (3)'!$W:$W,0)),IFERROR(INDEX('POSTE (4)'!Q:Q,MATCH(ROW()-2,'POSTE (4)'!$W:$W,0)),IFERROR(INDEX('POSTE (5)'!Q:Q,MATCH(ROW()-2,'POSTE (5)'!$W:$W,0)),IFERROR(INDEX('POSTE (6)'!Q:Q,MATCH(ROW()-2,'POSTE (6)'!$W:$W,0)),IFERROR(INDEX('POSTE (7)'!Q:Q,MATCH(ROW()-2,'POSTE (7)'!$W:$W,0)),IFERROR(INDEX('POSTE (8)'!Q:Q,MATCH(ROW()-2,'POSTE (8)'!$W:$W,0)),IFERROR(INDEX('POSTE (9)'!Q:Q,MATCH(ROW()-2,'POSTE (9)'!$W:$W,0)),\"\")))))))))","v":""},{"$f":"IFERROR(INDEX('POSTE (1)'!R:R,MATCH(ROW()-2,'POSTE (1)'!$W:$W,0)),IFERROR(INDEX('POSTE (2)'!R:R,MATCH(ROW()-2,'POSTE (2)'!$W:$W,0)),IFERROR(INDEX('POSTE (3)'!R:R,MATCH(ROW()-2,'POSTE (3)'!$W:$W,0)),IFERROR(INDEX('POSTE (4)'!R:R,MATCH(ROW()-2,'POSTE (4)'!$W:$W,0)),IFERROR(INDEX('POSTE (5)'!R:R,MATCH(ROW()-2,'POSTE (5)'!$W:$W,0)),IFERROR(INDEX('POSTE (6)'!R:R,MATCH(ROW()-2,'POSTE (6)'!$W:$W,0)),IFERROR(INDEX('POSTE (7)'!R:R,MATCH(ROW()-2,'POSTE (7)'!$W:$W,0)),IFERROR(INDEX('POSTE (8)'!R:R,MATCH(ROW()-2,'POSTE (8)'!$W:$W,0)),IFERROR(INDEX('POSTE (9)'!R:R,MATCH(ROW()-2,'POSTE (9)'!$W:$W,0)),\"\")))))))))","v":""},{"$f":"IFERROR(INDEX('POSTE (1)'!S:S,MATCH(ROW()-2,'POSTE (1)'!$W:$W,0)),IFERROR(INDEX('POSTE (2)'!S:S,MATCH(ROW()-2,'POSTE (2)'!$W:$W,0)),IFERROR(INDEX('POSTE (3)'!S:S,MATCH(ROW()-2,'POSTE (3)'!$W:$W,0)),IFERROR(INDEX('POSTE (4)'!S:S,MATCH(ROW()-2,'POSTE (4)'!$W:$W,0)),IFERROR(INDEX('POSTE (5)'!S:S,MATCH(ROW()-2,'POSTE (5)'!$W:$W,0)),IFERROR(INDEX('POSTE (6)'!S:S,MATCH(ROW()-2,'POSTE (6)'!$W:$W,0)),IFERROR(INDEX('POSTE (7)'!S:S,MATCH(ROW()-2,'POSTE (7)'!$W:$W,0)),IFERROR(INDEX('POSTE (8)'!S:S,MATCH(ROW()-2,'POSTE (8)'!$W:$W,0)),IFERROR(INDEX('POSTE (9)'!S:S,MATCH(ROW()-2,'POSTE (9)'!$W:$W,0)),\"\")))))))))","v":""},{"$f":"IFERROR(INDEX('POSTE (1)'!T:T,MATCH(ROW()-2,'POSTE (1)'!$W:$W,0)),IFERROR(INDEX('POSTE (2)'!T:T,MATCH(ROW()-2,'POSTE (2)'!$W:$W,0)),IFERROR(INDEX('POSTE (3)'!T:T,MATCH(ROW()-2,'POSTE (3)'!$W:$W,0)),IFERROR(INDEX('POSTE (4)'!T:T,MATCH(ROW()-2,'POSTE (4)'!$W:$W,0)),IFERROR(INDEX('POSTE (5)'!T:T,MATCH(ROW()-2,'POSTE (5)'!$W:$W,0)),IFERROR(INDEX('POSTE (6)'!T:T,MATCH(ROW()-2,'POSTE (6)'!$W:$W,0)),IFERROR(INDEX('POSTE (7)'!T:T,MATCH(ROW()-2,'POSTE (7)'!$W:$W,0)),IFERROR(INDEX('POSTE (8)'!T:T,MATCH(ROW()-2,'POSTE (8)'!$W:$W,0)),IFERROR(INDEX('POSTE (9)'!T:T,MATCH(ROW()-2,'POSTE (9)'!$W:$W,0)),\"\")))))))))","v":""},{"$f":"IFERROR(INDEX('POSTE (1)'!U:U,MATCH(ROW()-2,'POSTE (1)'!$W:$W,0)),IFERROR(INDEX('POSTE (2)'!U:U,MATCH(ROW()-2,'POSTE (2)'!$W:$W,0)),IFERROR(INDEX('POSTE (3)'!U:U,MATCH(ROW()-2,'POSTE (3)'!$W:$W,0)),IFERROR(INDEX('POSTE (4)'!U:U,MATCH(ROW()-2,'POSTE (4)'!$W:$W,0)),IFERROR(INDEX('POSTE (5)'!U:U,MATCH(ROW()-2,'POSTE (5)'!$W:$W,0)),IFERROR(INDEX('POSTE (6)'!U:U,MATCH(ROW()-2,'POSTE (6)'!$W:$W,0)),IFERROR(INDEX('POSTE (7)'!U:U,MATCH(ROW()-2,'POSTE (7)'!$W:$W,0)),IFERROR(INDEX('POSTE (8)'!U:U,MATCH(ROW()-2,'POSTE (8)'!$W:$W,0)),IFERROR(INDEX('POSTE (9)'!U:U,MATCH(ROW()-2,'POSTE (9)'!$W:$W,0)),\"\")))))))))","v":""}]
[{"$f":"IFERROR(INDEX('POSTE (1)'!N:N,MATCH(ROW()-2,'POSTE (1)'!$W:$W,0)),IFERROR(INDEX('POSTE (2)'!N:N,MATCH(ROW()-2,'POSTE (2)'!$W:$W,0)),IFERROR(INDEX('POSTE (3)'!N:N,MATCH(ROW()-2,'POSTE (3)'!$W:$W,0)),IFERROR(INDEX('POSTE (4)'!N:N,MATCH(ROW()-2,'POSTE (4)'!$W:$W,0)),IFERROR(INDEX('POSTE (5)'!N:N,MATCH(ROW()-2,'POSTE (5)'!$W:$W,0)),IFERROR(INDEX('POSTE (6)'!N:N,MATCH(ROW()-2,'POSTE (6)'!$W:$W,0)),IFERROR(INDEX('POSTE (7)'!N:N,MATCH(ROW()-2,'POSTE (7)'!$W:$W,0)),IFERROR(INDEX('POSTE (8)'!N:N,MATCH(ROW()-2,'POSTE (8)'!$W:$W,0)),IFERROR(INDEX('POSTE (9)'!N:N,MATCH(ROW()-2,'POSTE (9)'!$W:$W,0)),\"\")))))))))","v":""},{"$f":"IFERROR(INDEX('POSTE (1)'!O:O,MATCH(ROW()-2,'POSTE (1)'!$W:$W,0)),IFERROR(INDEX('POSTE (2)'!O:O,MATCH(ROW()-2,'POSTE (2)'!$W:$W,0)),IFERROR(INDEX('POSTE (3)'!O:O,MATCH(ROW()-2,'POSTE (3)'!$W:$W,0)),IFERROR(INDEX('POSTE (4)'!O:O,MATCH(ROW()-2,'POSTE (4)'!$W:$W,0)),IFERROR(INDEX('POSTE (5)'!O:O,MATCH(ROW()-2,'POSTE (5)'!$W:$W,0)),IFERROR(INDEX('POSTE (6)'!O:O,MATCH(ROW()-2,'POSTE (6)'!$W:$W,0)),IFERROR(INDEX('POSTE (7)'!O:O,MATCH(ROW()-2,'POSTE (7)'!$W:$W,0)),IFERROR(INDEX('POSTE (8)'!O:O,MATCH(ROW()-2,'POSTE (8)'!$W:$W,0)),IFERROR(INDEX('POSTE (9)'!O:O,MATCH(ROW()-2,'POSTE (9)'!$W:$W,0)),\"\")))))))))","v":""},{"$f":"IFERROR(INDEX('POSTE (1)'!P:P,MATCH(ROW()-2,'POSTE (1)'!$W:$W,0)),IFERROR(INDEX('POSTE (2)'!P:P,MATCH(ROW()-2,'POSTE (2)'!$W:$W,0)),IFERROR(INDEX('POSTE (3)'!P:P,MATCH(ROW()-2,'POSTE (3)'!$W:$W,0)),IFERROR(INDEX('POSTE (4)'!P:P,MATCH(ROW()-2,'POSTE (4)'!$W:$W,0)),IFERROR(INDEX('POSTE (5)'!P:P,MATCH(ROW()-2,'POSTE (5)'!$W:$W,0)),IFERROR(INDEX('POSTE (6)'!P:P,MATCH(ROW()-2,'POSTE (6)'!$W:$W,0)),IFERROR(INDEX('POSTE (7)'!P:P,MATCH(ROW()-2,'POSTE (7)'!$W:$W,0)),IFERROR(INDEX('POSTE (8)'!P:P,MATCH(ROW()-2,'POSTE (8)'!$W:$W,0)),IFERROR(INDEX('POSTE (9)'!P:P,MATCH(ROW()-2,'POSTE (9)'!$W:$W,0)),\"\")))))))))","v":""},{"$f":"IFERROR(INDEX('POSTE (1)'!Q:Q,MATCH(ROW()-2,'POSTE (1)'!$W:$W,0)),IFERROR(INDEX('POSTE (2)'!Q:Q,MATCH(ROW()-2,'POSTE (2)'!$W:$W,0)),IFERROR(INDEX('POSTE (3)'!Q:Q,MATCH(ROW()-2,'POSTE (3)'!$W:$W,0)),IFERROR(INDEX('POSTE (4)'!Q:Q,MATCH(ROW()-2,'POSTE (4)'!$W:$W,0)),IFERROR(INDEX('POSTE (5)'!Q:Q,MATCH(ROW()-2,'POSTE (5)'!$W:$W,0)),IFERROR(INDEX('POSTE (6)'!Q:Q,MATCH(ROW()-2,'POSTE (6)'!$W:$W,0)),IFERROR(INDEX('POSTE (7)'!Q:Q,MATCH(ROW()-2,'POSTE (7)'!$W:$W,0)),IFERROR(INDEX('POSTE (8)'!Q:Q,MATCH(ROW()-2,'POSTE (8)'!$W:$W,0)),IFERROR(INDEX('POSTE (9)'!Q:Q,MATCH(ROW()-2,'POSTE (9)'!$W:$W,0)),\"\")))))))))","v":""},{"$f":"IFERROR(INDEX('POSTE (1)'!R:R,MATCH(ROW()-2,'POSTE (1)'!$W:$W,0)),IFERROR(INDEX('POSTE (2)'!R:R,MATCH(ROW()-2,'POSTE (2)'!$W:$W,0)),IFERROR(INDEX('POSTE (3)'!R:R,MATCH(ROW()-2,'POSTE (3)'!$W:$W,0)),IFERROR(INDEX('POSTE (4)'!R:R,MATCH(ROW()-2,'POSTE (4)'!$W:$W,0)),IFERROR(INDEX('POSTE (5)'!R:R,MATCH(ROW()-2,'POSTE (5)'!$W:$W,0)),IFERROR(INDEX('POSTE (6)'!R:R,MATCH(ROW()-2,'POSTE (6)'!$W:$W,0)),IFERROR(INDEX('POSTE (7)'!R:R,MATCH(ROW()-2,'POSTE (7)'!$W:$W,0)),IFERROR(INDEX('POSTE (8)'!R:R,MATCH(ROW()-2,'POSTE (8)'!$W:$W,0)),IFERROR(INDEX('POSTE (9)'!R:R,MATCH(ROW()-2,'POSTE (9)'!$W:$W,0)),\"\")))))))))","v":""},{"$f":"IFERROR(INDEX('POSTE (1)'!S:S,MATCH(ROW()-2,'POSTE (1)'!$W:$W,0)),IFERROR(INDEX('POSTE (2)'!S:S,MATCH(ROW()-2,'POSTE (2)'!$W:$W,0)),IFERROR(INDEX('POSTE (3)'!S:S,MATCH(ROW()-2,'POSTE (3)'!$W:$W,0)),IFERROR(INDEX('POSTE (4)'!S:S,MATCH(ROW()-2,'POSTE (4)'!$W:$W,0)),IFERROR(INDEX('POSTE (5)'!S:S,MATCH(ROW()-2,'POSTE (5)'!$W:$W,0)),IFERROR(INDEX('POSTE (6)'!S:S,MATCH(ROW()-2,'POSTE (6)'!$W:$W,0)),IFERROR(INDEX('POSTE (7)'!S:S,MATCH(ROW()-2,'POSTE (7)'!$W:$W,0)),IFERROR(INDEX('POSTE (8)'!S:S,MATCH(ROW()-2,'POSTE (8)'!$W:$W,0)),IFERROR(INDEX('POSTE (9)'!S:S,MATCH(ROW()-2,'POSTE (9)'!$W:$W,0)),\"\")))))))))","v":""},{"$f":"IFERROR(INDEX('POSTE (1)'!T:T,MATCH(ROW()-2,'POSTE (1)'!$W:$W,0)),IFERROR(INDEX('POSTE (2)'!T:T,MATCH(ROW()-2,'POSTE (2)'!$W:$W,0)),IFERROR(INDEX('POSTE (3)'!T:T,MATCH(ROW()-2,'POSTE (3)'!$W:$W,0)),IFERROR(INDEX('POSTE (4)'!T:T,MATCH(ROW()-2,'POSTE (4)'!$W:$W,0)),IFERROR(INDEX('POSTE (5)'!T:T,MATCH(ROW()-2,'POSTE (5)'!$W:$W,0)),IFERROR(INDEX('POSTE (6)'!T:T,MATCH(ROW()-2,'POSTE (6)'!$W:$W,0)),IFERROR(INDEX('POSTE (7)'!T:T,MATCH(ROW()-2,'POSTE (7)'!$W:$W,0)),IFERROR(INDEX('POSTE (8)'!T:T,MATCH(ROW()-2,'POSTE (8)'!$W:$W,0)),IFERROR(INDEX('POSTE (9)'!T:T,MATCH(ROW()-2,'POSTE (9)'!$W:$W,0)),\"\")))))))))","v":""},{"$f":"IFERROR(INDEX('POSTE (1)'!U:U,MATCH(ROW()-2,'POSTE (1)'!$W:$W,0)),IFERROR(INDEX('POSTE (2)'!U:U,MATCH(ROW()-2,'POSTE (2)'!$W:$W,0)),IFERROR(INDEX('POSTE (3)'!U:U,MATCH(ROW()-2,'POSTE (3)'!$W:$W,0)),IFERROR(INDEX('POSTE (4)'!U:U,MATCH(ROW()-2,'POSTE (4)'!$W:$W,0)),IFERROR(INDEX('POSTE (5)'!U:U,MATCH(ROW()-2,'POSTE (5)'!$W:$W,0)),IFERROR(INDEX('POSTE (6)'!U:U,MATCH(ROW()-2,'POSTE (6)'!$W:$W,0)),IFERROR(INDEX('POSTE (7)'!U:U,MATCH(ROW()-2,'POSTE (7)'!$W:$W,0)),IFERROR(INDEX('POSTE (8)'!U:U,MATCH(ROW()-2,'POSTE (8)'!$W:$W,0)),IFERROR(INDEX('POSTE (9)'!U:U,MATCH(ROW()-2,'POSTE (9)'!$W:$W,0)),\"\")))))))))","v":""}]
[{"$f":"IFERROR(INDEX('POSTE (1)'!N:N,MATCH(ROW()-2,'POSTE (1)'!$W:$W,0)),IFERROR(INDEX('POSTE (2)'!N:N,MATCH(ROW()-2,'POSTE (2)'!$W:$W,0)),IFERROR(INDEX('POSTE (3)'!N:N,MATCH(ROW()-2,'POSTE (3)'!$W:$W,0)),IFERROR(INDEX('POSTE (4)'!N:N,MATCH(ROW()-2,'POSTE (4)'!$W:$W,0)),IFERROR(INDEX('POSTE (5)'!N:N,MATCH(ROW()-2,'POSTE (5)'!$W:$W,0)),IFERROR(INDEX('POSTE (6)'!N:N,MATCH(ROW()-2,'POSTE (6)'!$W:$W,0)),IFERROR(INDEX('POSTE (7)'!N:N,MATCH(ROW()-2,'POSTE (7)'!$W:$W,0)),IFERROR(INDEX('POSTE (8)'!N:N,MATCH(ROW()-2,'POSTE (8)'!$W:$W,0)),IFERROR(INDEX('POSTE (9)'!N:N,MATCH(ROW()-2,'POSTE (9)'!$W:$W,0)),\"\")))))))))","v":""},{"$f":"IFERROR(INDEX('POSTE (1)'!O:O,MATCH(ROW()-2,'POSTE (1)'!$W:$W,0)),IFERROR(INDEX('POSTE (2)'!O:O,MATCH(ROW()-2,'POSTE (2)'!$W:$W,0)),IFERROR(INDEX('POSTE (3)'!O:O,MATCH(ROW()-2,'POSTE (3)'!$W:$W,0)),IFERROR(INDEX('POSTE (4)'!O:O,MATCH(ROW()-2,'POSTE (4)'!$W:$W,0)),IFERROR(INDEX('POSTE (5)'!O:O,MATCH(ROW()-2,'POSTE (5)'!$W:$W,0)),IFERROR(INDEX('POSTE (6)'!O:O,MATCH(ROW()-2,'POSTE (6)'!$W:$W,0)),IFERROR(INDEX('POSTE (7)'!O:O,MATCH(ROW()-2,'POSTE (7)'!$W:$W,0)),IFERROR(INDEX('POSTE (8)'!O:O,MATCH(ROW()-2,'POSTE (8)'!$W:$W,0)),IFERROR(INDEX('POSTE (9)'!O:O,MATCH(ROW()-2,'POSTE (9)'!$W:$W,0)),\"\")))))))))","v":""},{"$f":"IFERROR(INDEX('POSTE (1)'!P:P,MATCH(ROW()-2,'POSTE (1)'!$W:$W,0)),IFERROR(INDEX('POSTE (2)'!P:P,MATCH(ROW()-2,'POSTE (2)'!$W:$W,0)),IFERROR(INDEX('POSTE (3)'!P:P,MATCH(ROW()-2,'POSTE (3)'!$W:$W,0)),IFERROR(INDEX('POSTE (4)'!P:P,MATCH(ROW()-2,'POSTE (4)'!$W:$W,0)),IFERROR(INDEX('POSTE (5)'!P:P,MATCH(ROW()-2,'POSTE (5)'!$W:$W,0)),IFERROR(INDEX('POSTE (6)'!P:P,MATCH(ROW()-2,'POSTE (6)'!$W:$W,0)),IFERROR(INDEX('POSTE (7)'!P:P,MATCH(ROW()-2,'POSTE (7)'!$W:$W,0)),IFERROR(INDEX('POSTE (8)'!P:P,MATCH(ROW()-2,'POSTE (8)'!$W:$W,0)),IFERROR(INDEX('POSTE (9)'!P:P,MATCH(ROW()-2,'POSTE (9)'!$W:$W,0)),\"\")))))))))","v":""},{"$f":"IFERROR(INDEX('POSTE (1)'!Q:Q,MATCH(ROW()-2,'POSTE (1)'!$W:$W,0)),IFERROR(INDEX('POSTE (2)'!Q:Q,MATCH(ROW()-2,'POSTE (2)'!$W:$W,0)),IFERROR(INDEX('POSTE (3)'!Q:Q,MATCH(ROW()-2,'POSTE (3)'!$W:$W,0)),IFERROR(INDEX('POSTE (4)'!Q:Q,MATCH(ROW()-2,'POSTE (4)'!$W:$W,0)),IFERROR(INDEX('POSTE (5)'!Q:Q,MATCH(ROW()-2,'POSTE (5)'!$W:$W,0)),IFERROR(INDEX('POSTE (6)'!Q:Q,MATCH(ROW()-2,'POSTE (6)'!$W:$W,0)),IFERROR(INDEX('POSTE (7)'!Q:Q,MATCH(ROW()-2,'POSTE (7)'!$W:$W,0)),IFERROR(INDEX('POSTE (8)'!Q:Q,MATCH(ROW()-2,'POSTE (8)'!$W:$W,0)),IFERROR(INDEX('POSTE (9)'!Q:Q,MATCH(ROW()-2,'POSTE (9)'!$W:$W,0)),\"\")))))))))","v":""},{"$f":"IFERROR(INDEX('POSTE (1)'!R:R,MATCH(ROW()-2,'POSTE (1)'!$W:$W,0)),IFERROR(INDEX('POSTE (2)'!R:R,MATCH(ROW()-2,'POSTE (2)'!$W:$W,0)),IFERROR(INDEX('POSTE (3)'!R:R,MATCH(ROW()-2,'POSTE (3)'!$W:$W,0)),IFERROR(INDEX('POSTE (4)'!R:R,MATCH(ROW()-2,'POSTE (4)'!$W:$W,0)),IFERROR(INDEX('POSTE (5)'!R:R,MATCH(ROW()-2,'POSTE (5)'!$W:$W,0)),IFERROR(INDEX('POSTE (6)'!R:R,MATCH(ROW()-2,'POSTE (6)'!$W:$W,0)),IFERROR(INDEX('POSTE (7)'!R:R,MATCH(ROW()-2,'POSTE (7)'!$W:$W,0)),IFERROR(INDEX('POSTE (8)'!R:R,MATCH(ROW()-2,'POSTE (8)'!$W:$W,0)),IFERROR(INDEX('POSTE (9)'!R:R,MATCH(ROW()-2,'POSTE (9)'!$W:$W,0)),\"\")))))))))","v":""},{"$f":"IFERROR(INDEX('POSTE (1)'!S:S,MATCH(ROW()-2,'POSTE (1)'!$W:$W,0)),IFERROR(INDEX('POSTE (2)'!S:S,MATCH(ROW()-2,'POSTE (2)'!$W:$W,0)),IFERROR(INDEX('POSTE (3)'!S:S,MATCH(ROW()-2,'POSTE (3)'!$W:$W,0)),IFERROR(INDEX('POSTE (4)'!S:S,MATCH(ROW()-2,'POSTE (4)'!$W:$W,0)),IFERROR(INDEX('POSTE (5)'!S:S,MATCH(ROW()-2,'POSTE (5)'!$W:$W,0)),IFERROR(INDEX('POSTE (6)'!S:S,MATCH(ROW()-2,'POSTE (6)'!$W:$W,0)),IFERROR(INDEX('POSTE (7)'!S:S,MATCH(ROW()-2,'POSTE (7)'!$W:$W,0)),IFERROR(INDEX('POSTE (8)'!S:S,MATCH(ROW()-2,'POSTE (8)'!$W:$W,0)),IFERROR(INDEX('POSTE (9)'!S:S,MATCH(ROW()-2,'POSTE (9)'!$W:$W,0)),\"\")))))))))","v":""},{"$f":"IFERROR(INDEX('POSTE (1)'!T:T,MATCH(ROW()-2,'POSTE (1)'!$W:$W,0)),IFERROR(INDEX('POSTE (2)'!T:T,MATCH(ROW()-2,'POSTE (2)'!$W:$W,0)),IFERROR(INDEX('POSTE (3)'!T:T,MATCH(ROW()-2,'POSTE (3)'!$W:$W,0)),IFERROR(INDEX('POSTE (4)'!T:T,MATCH(ROW()-2,'POSTE (4)'!$W:$W,0)),IFERROR(INDEX('POSTE (5)'!T:T,MATCH(ROW()-2,'POSTE (5)'!$W:$W,0)),IFERROR(INDEX('POSTE (6)'!T:T,MATCH(ROW()-2,'POSTE (6)'!$W:$W,0)),IFERROR(INDEX('POSTE (7)'!T:T,MATCH(ROW()-2,'POSTE (7)'!$W:$W,0)),IFERROR(INDEX('POSTE (8)'!T:T,MATCH(ROW()-2,'POSTE (8)'!$W:$W,0)),IFERROR(INDEX('POSTE (9)'!T:T,MATCH(ROW()-2,'POSTE (9)'!$W:$W,0)),\"\")))))))))","v":""},{"$f":"IFERROR(INDEX('POSTE (1)'!U:U,MATCH(ROW()-2,'POSTE (1)'!$W:$W,0)),IFERROR(INDEX('POSTE (2)'!U:U,MATCH(ROW()-2,'POSTE (2)'!$W:$W,0)),IFERROR(INDEX('POSTE (3)'!U:U,MATCH(ROW()-2,'POSTE (3)'!$W:$W,0)),IFERROR(INDEX('POSTE (4)'!U:U,MATCH(ROW()-2,'POSTE (4)'!$W:$W,0)),IFERROR(INDEX('POSTE (5)'!U:U,MATCH(ROW()-2,'POSTE (5)'!$W:$W,0)),IFERROR(INDEX('POSTE (6)'!U:U,MATCH(ROW()-2,'POSTE (6)'!$W:$W,0)),IFERROR(INDEX('POSTE (7)'!U:U,MATCH(ROW()-2,'POSTE (7)'!$W:$W,0)),IFERROR(INDEX('POSTE (8)'!U:U,MATCH(ROW()-2,'POSTE (8)'!$W:$W,0)),IFERROR(INDEX('POSTE (9)'!U:U,MATCH(ROW()-2,'POSTE (9)'!$W:$W,0)),\"\")))))))))","v":""}]
[{"$f":"IFERROR(INDEX('POSTE (1)'!N:N,MATCH(ROW()-2,'POSTE (1)'!$W:$W,0)),IFERROR(INDEX('POSTE (2)'!N:N,MATCH(ROW()-2,'POSTE (2)'!$W:$W,0)),IFERROR(INDEX('POSTE (3)'!N:N,MATCH(ROW()-2,'POSTE (3)'!$W:$W,0)),IFERROR(INDEX('POSTE (4)'!N:N,MATCH(ROW()-2,'POSTE (4)'!$W:$W,0)),IFERROR(INDEX('POSTE (5)'!N:N,MATCH(ROW()-2,'POSTE (5)'!$W:$W,0)),IFERROR(INDEX('POSTE (6)'!N:N,MATCH(ROW()-2,'POSTE (6)'!$W:$W,0)),IFERROR(INDEX('POSTE (7)'!N:N,MATCH(ROW()-2,'POSTE (7)'!$W:$W,0)),IFERROR(INDEX('POSTE (8)'!N:N,MATCH(ROW()-2,'POSTE (8)'!$W:$W,0)),IFERROR(INDEX('POSTE (9)'!N:N,MATCH(ROW()-2,'POSTE (9)'!$W:$W,0)),\"\")))))))))","v":""},{"$f":"IFERROR(INDEX('POSTE (1)'!O:O,MATCH(ROW()-2,'POSTE (1)'!$W:$W,0)),IFERROR(INDEX('POSTE (2)'!O:O,MATCH(ROW()-2,'POSTE (2)'!$W:$W,0)),IFERROR(INDEX('POSTE (3)'!O:O,MATCH(ROW()-2,'POSTE (3)'!$W:$W,0)),IFERROR(INDEX('POSTE (4)'!O:O,MATCH(ROW()-2,'POSTE (4)'!$W:$W,0)),IFERROR(INDEX('POSTE (5)'!O:O,MATCH(ROW()-2,'POSTE (5)'!$W:$W,0)),IFERROR(INDEX('POSTE (6)'!O:O,MATCH(ROW()-2,'POSTE (6)'!$W:$W,0)),IFERROR(INDEX('POSTE (7)'!O:O,MATCH(ROW()-2,'POSTE (7)'!$W:$W,0)),IFERROR(INDEX('POSTE (8)'!O:O,MATCH(ROW()-2,'POSTE (8)'!$W:$W,0)),IFERROR(INDEX('POSTE (9)'!O:O,MATCH(ROW()-2,'POSTE (9)'!$W:$W,0)),\"\")))))))))","v":""},{"$f":"IFERROR(INDEX('POSTE (1)'!P:P,MATCH(ROW()-2,'POSTE (1)'!$W:$W,0)),IFERROR(INDEX('POSTE (2)'!P:P,MATCH(ROW()-2,'POSTE (2)'!$W:$W,0)),IFERROR(INDEX('POSTE (3)'!P:P,MATCH(ROW()-2,'POSTE (3)'!$W:$W,0)),IFERROR(INDEX('POSTE (4)'!P:P,MATCH(ROW()-2,'POSTE (4)'!$W:$W,0)),IFERROR(INDEX('POSTE (5)'!P:P,MATCH(ROW()-2,'POSTE (5)'!$W:$W,0)),IFERROR(INDEX('POSTE (6)'!P:P,MATCH(ROW()-2,'POSTE (6)'!$W:$W,0)),IFERROR(INDEX('POSTE (7)'!P:P,MATCH(ROW()-2,'POSTE (7)'!$W:$W,0)),IFERROR(INDEX('POSTE (8)'!P:P,MATCH(ROW()-2,'POSTE (8)'!$W:$W,0)),IFERROR(INDEX('POSTE (9)'!P:P,MATCH(ROW()-2,'POSTE (9)'!$W:$W,0)),\"\")))))))))","v":""},{"$f":"IFERROR(INDEX('POSTE (1)'!Q:Q,MATCH(ROW()-2,'POSTE (1)'!$W:$W,0)),IFERROR(INDEX('POSTE (2)'!Q:Q,MATCH(ROW()-2,'POSTE (2)'!$W:$W,0)),IFERROR(INDEX('POSTE (3)'!Q:Q,MATCH(ROW()-2,'POSTE (3)'!$W:$W,0)),IFERROR(INDEX('POSTE (4)'!Q:Q,MATCH(ROW()-2,'POSTE (4)'!$W:$W,0)),IFERROR(INDEX('POSTE (5)'!Q:Q,MATCH(ROW()-2,'POSTE (5)'!$W:$W,0)),IFERROR(INDEX('POSTE (6)'!Q:Q,MATCH(ROW()-2,'POSTE (6)'!$W:$W,0)),IFERROR(INDEX('POSTE (7)'!Q:Q,MATCH(ROW()-2,'POSTE (7)'!$W:$W,0)),IFERROR(INDEX('POSTE (8)'!Q:Q,MATCH(ROW()-2,'POSTE (8)'!$W:$W,0)),IFERROR(INDEX('POSTE (9)'!Q:Q,MATCH(ROW()-2,'POSTE (9)'!$W:$W,0)),\"\")))))))))","v":""},{"$f":"IFERROR(INDEX('POSTE (1)'!R:R,MATCH(ROW()-2,'POSTE (1)'!$W:$W,0)),IFERROR(INDEX('POSTE (2)'!R:R,MATCH(ROW()-2,'POSTE (2)'!$W:$W,0)),IFERROR(INDEX('POSTE (3)'!R:R,MATCH(ROW()-2,'POSTE (3)'!$W:$W,0)),IFERROR(INDEX('POSTE (4)'!R:R,MATCH(ROW()-2,'POSTE (4)'!$W:$W,0)),IFERROR(INDEX('POSTE (5)'!R:R,MATCH(ROW()-2,'POSTE (5)'!$W:$W,0)),IFERROR(INDEX('POSTE (6)'!R:R,MATCH(ROW()-2,'POSTE (6)'!$W:$W,0)),IFERROR(INDEX('POSTE (7)'!R:R,MATCH(ROW()-2,'POSTE (7)'!$W:$W,0)),IFERROR(INDEX('POSTE (8)'!R:R,MATCH(ROW()-2,'POSTE (8)'!$W:$W,0)),IFERROR(INDEX('POSTE (9)'!R:R,MATCH(ROW()-2,'POSTE (9)'!$W:$W,0)),\"\")))))))))","v":""},{"$f":"IFERROR(INDEX('POSTE (1)'!S:S,MATCH(ROW()-2,'POSTE (1)'!$W:$W,0)),IFERROR(INDEX('POSTE (2)'!S:S,MATCH(ROW()-2,'POSTE (2)'!$W:$W,0)),IFERROR(INDEX('POSTE (3)'!S:S,MATCH(ROW()-2,'POSTE (3)'!$W:$W,0)),IFERROR(INDEX('POSTE (4)'!S:S,MATCH(ROW()-2,'POSTE (4)'!$W:$W,0)),IFERROR(INDEX('POSTE (5)'!S:S,MATCH(ROW()-2,'POSTE (5)'!$W:$W,0)),IFERROR(INDEX('POSTE (6)'!S:S,MATCH(ROW()-2,'POSTE (6)'!$W:$W,0)),IFERROR(INDEX('POSTE (7)'!S:S,MATCH(ROW()-2,'POSTE (7)'!$W:$W,0)),IFERROR(INDEX('POSTE (8)'!S:S,MATCH(ROW()-2,'POSTE (8)'!$W:$W,0)),IFERROR(INDEX('POSTE (9)'!S:S,MATCH(ROW()-2,'POSTE (9)'!$W:$W,0)),\"\")))))))))","v":""},{"$f":"IFERROR(INDEX('POSTE (1)'!T:T,MATCH(ROW()-2,'POSTE (1)'!$W:$W,0)),IFERROR(INDEX('POSTE (2)'!T:T,MATCH(ROW()-2,'POSTE (2)'!$W:$W,0)),IFERROR(INDEX('POSTE (3)'!T:T,MATCH(ROW()-2,'POSTE (3)'!$W:$W,0)),IFERROR(INDEX('POSTE (4)'!T:T,MATCH(ROW()-2,'POSTE (4)'!$W:$W,0)),IFERROR(INDEX('POSTE (5)'!T:T,MATCH(ROW()-2,'POSTE (5)'!$W:$W,0)),IFERROR(INDEX('POSTE (6)'!T:T,MATCH(ROW()-2,'POSTE (6)'!$W:$W,0)),IFERROR(INDEX('POSTE (7)'!T:T,MATCH(ROW()-2,'POSTE (7)'!$W:$W,0)),IFERROR(INDEX('POSTE (8)'!T:T,MATCH(ROW()-2,'POSTE (8)'!$W:$W,0)),IFERROR(INDEX('POSTE (9)'!T:T,MATCH(ROW()-2,'POSTE (9)'!$W:$W,0)),\"\")))))))))","v":""},{"$f":"IFERROR(INDEX('POSTE (1)'!U:U,MATCH(ROW()-2,'POSTE (1)'!$W:$W,0)),IFERROR(INDEX('POSTE (2)'!U:U,MATCH(ROW()-2,'POSTE (2)'!$W:$W,0)),IFERROR(INDEX('POSTE (3)'!U:U,MATCH(ROW()-2,'POSTE (3)'!$W:$W,0)),IFERROR(INDEX('POSTE (4)'!U:U,MATCH(ROW()-2,'POSTE (4)'!$W:$W,0)),IFERROR(INDEX('POSTE (5)'!U:U,MATCH(ROW()-2,'POSTE (5)'!$W:$W,0)),IFERROR(INDEX('POSTE (6)'!U:U,MATCH(ROW()-2,'POSTE (6)'!$W:$W,0)),IFERROR(INDEX('POSTE (7)'!U:U,MATCH(ROW()-2,'POSTE (7)'!$W:$W,0)),IFERROR(INDEX('POSTE (8)'!U:U,MATCH(ROW()-2,'POSTE (8)'!$W:$W,0)),IFERROR(INDEX('POSTE (9)'!U:U,MATCH(ROW()-2,'POSTE (9)'!$W:$W,0)),\"\")))))))))","v":""}]
[{"$f":"IFERROR(INDEX('POSTE (1)'!N:N,MATCH(ROW()-2,'POSTE (1)'!$W:$W,0)),IFERROR(INDEX('POSTE (2)'!N:N,MATCH(ROW()-2,'POSTE (2)'!$W:$W,0)),IFERROR(INDEX('POSTE (3)'!N:N,MATCH(ROW()-2,'POSTE (3)'!$W:$W,0)),IFERROR(INDEX('POSTE (4)'!N:N,MATCH(ROW()-2,'POSTE (4)'!$W:$W,0)),IFERROR(INDEX('POSTE (5)'!N:N,MATCH(ROW()-2,'POSTE (5)'!$W:$W,0)),IFERROR(INDEX('POSTE (6)'!N:N,MATCH(ROW()-2,'POSTE (6)'!$W:$W,0)),IFERROR(INDEX('POSTE (7)'!N:N,MATCH(ROW()-2,'POSTE (7)'!$W:$W,0)),IFERROR(INDEX('POSTE (8)'!N:N,MATCH(ROW()-2,'POSTE (8)'!$W:$W,0)),IFERROR(INDEX('POSTE (9)'!N:N,MATCH(ROW()-2,'POSTE (9)'!$W:$W,0)),\"\")))))))))","v":""},{"$f":"IFERROR(INDEX('POSTE (1)'!O:O,MATCH(ROW()-2,'POSTE (1)'!$W:$W,0)),IFERROR(INDEX('POSTE (2)'!O:O,MATCH(ROW()-2,'POSTE (2)'!$W:$W,0)),IFERROR(INDEX('POSTE (3)'!O:O,MATCH(ROW()-2,'POSTE (3)'!$W:$W,0)),IFERROR(INDEX('POSTE (4)'!O:O,MATCH(ROW()-2,'POSTE (4)'!$W:$W,0)),IFERROR(INDEX('POSTE (5)'!O:O,MATCH(ROW()-2,'POSTE (5)'!$W:$W,0)),IFERROR(INDEX('POSTE (6)'!O:O,MATCH(ROW()-2,'POSTE (6)'!$W:$W,0)),IFERROR(INDEX('POSTE (7)'!O:O,MATCH(ROW()-2,'POSTE (7)'!$W:$W,0)),IFERROR(INDEX('POSTE (8)'!O:O,MATCH(ROW()-2,'POSTE (8)'!$W:$W,0)),IFERROR(INDEX('POSTE (9)'!O:O,MATCH(ROW()-2,'POSTE (9)'!$W:$W,0)),\"\")))))))))","v":""},{"$f":"IFERROR(INDEX('POSTE (1)'!P:P,MATCH(ROW()-2,'POSTE (1)'!$W:$W,0)),IFERROR(INDEX('POSTE (2)'!P:P,MATCH(ROW()-2,'POSTE (2)'!$W:$W,0)),IFERROR(INDEX('POSTE (3)'!P:P,MATCH(ROW()-2,'POSTE (3)'!$W:$W,0)),IFERROR(INDEX('POSTE (4)'!P:P,MATCH(ROW()-2,'POSTE (4)'!$W:$W,0)),IFERROR(INDEX('POSTE (5)'!P:P,MATCH(ROW()-2,'POSTE (5)'!$W:$W,0)),IFERROR(INDEX('POSTE (6)'!P:P,MATCH(ROW()-2,'POSTE (6)'!$W:$W,0)),IFERROR(INDEX('POSTE (7)'!P:P,MATCH(ROW()-2,'POSTE (7)'!$W:$W,0)),IFERROR(INDEX('POSTE (8)'!P:P,MATCH(ROW()-2,'POSTE (8)'!$W:$W,0)),IFERROR(INDEX('POSTE (9)'!P:P,MATCH(ROW()-2,'POSTE (9)'!$W:$W,0)),\"\")))))))))","v":""},{"$f":"IFERROR(INDEX('POSTE (1)'!Q:Q,MATCH(ROW()-2,'POSTE (1)'!$W:$W,0)),IFERROR(INDEX('POSTE (2)'!Q:Q,MATCH(ROW()-2,'POSTE (2)'!$W:$W,0)),IFERROR(INDEX('POSTE (3)'!Q:Q,MATCH(ROW()-2,'POSTE (3)'!$W:$W,0)),IFERROR(INDEX('POSTE (4)'!Q:Q,MATCH(ROW()-2,'POSTE (4)'!$W:$W,0)),IFERROR(INDEX('POSTE (5)'!Q:Q,MATCH(ROW()-2,'POSTE (5)'!$W:$W,0)),IFERROR(INDEX('POSTE (6)'!Q:Q,MATCH(ROW()-2,'POSTE (6)'!$W:$W,0)),IFERROR(INDEX('POSTE (7)'!Q:Q,MATCH(ROW()-2,'POSTE (7)'!$W:$W,0)),IFERROR(INDEX('POSTE (8)'!Q:Q,MATCH(ROW()-2,'POSTE (8)'!$W:$W,0)),IFERROR(INDEX('POSTE (9)'!Q:Q,MATCH(ROW()-2,'POSTE (9)'!$W:$W,0)),\"\")))))))))","v":""},{"$f":"IFERROR(INDEX('POSTE (1)'!R:R,MATCH(ROW()-2,'POSTE (1)'!$W:$W,0)),IFERROR(INDEX('POSTE (2)'!R:R,MATCH(ROW()-2,'POSTE (2)'!$W:$W,0)),IFERROR(INDEX('POSTE (3)'!R:R,MATCH(ROW()-2,'POSTE (3)'!$W:$W,0)),IFERROR(INDEX('POSTE (4)'!R:R,MATCH(ROW()-2,'POSTE (4)'!$W:$W,0)),IFERROR(INDEX('POSTE (5)'!R:R,MATCH(ROW()-2,'POSTE (5)'!$W:$W,0)),IFERROR(INDEX('POSTE (6)'!R:R,MATCH(ROW()-2,'POSTE (6)'!$W:$W,0)),IFERROR(INDEX('POSTE (7)'!R:R,MATCH(ROW()-2,'POSTE (7)'!$W:$W,0)),IFERROR(INDEX('POSTE (8)'!R:R,MATCH(ROW()-2,'POSTE (8)'!$W:$W,0)),IFERROR(INDEX('POSTE (9)'!R:R,MATCH(ROW()-2,'POSTE (9)'!$W:$W,0)),\"\")))))))))","v":""},{"$f":"IFERROR(INDEX('POSTE (1)'!S:S,MATCH(ROW()-2,'POSTE (1)'!$W:$W,0)),IFERROR(INDEX('POSTE (2)'!S:S,MATCH(ROW()-2,'POSTE (2)'!$W:$W,0)),IFERROR(INDEX('POSTE (3)'!S:S,MATCH(ROW()-2,'POSTE (3)'!$W:$W,0)),IFERROR(INDEX('POSTE (4)'!S:S,MATCH(ROW()-2,'POSTE (4)'!$W:$W,0)),IFERROR(INDEX('POSTE (5)'!S:S,MATCH(ROW()-2,'POSTE (5)'!$W:$W,0)),IFERROR(INDEX('POSTE (6)'!S:S,MATCH(ROW()-2,'POSTE (6)'!$W:$W,0)),IFERROR(INDEX('POSTE (7)'!S:S,MATCH(ROW()-2,'POSTE (7)'!$W:$W,0)),IFERROR(INDEX('POSTE (8)'!S:S,MATCH(ROW()-2,'POSTE (8)'!$W:$W,0)),IFERROR(INDEX('POSTE (9)'!S:S,MATCH(ROW()-2,'POSTE (9)'!$W:$W,0)),\"\")))))))))","v":""},{"$f":"IFERROR(INDEX('POSTE (1)'!T:T,MATCH(ROW()-2,'POSTE (1)'!$W:$W,0)),IFERROR(INDEX('POSTE (2)'!T:T,MATCH(ROW()-2,'POSTE (2)'!$W:$W,0)),IFERROR(INDEX('POSTE (3)'!T:T,MATCH(ROW()-2,'POSTE (3)'!$W:$W,0)),IFERROR(INDEX('POSTE (4)'!T:T,MATCH(ROW()-2,'POSTE (4)'!$W:$W,0)),IFERROR(INDEX('POSTE (5)'!T:T,MATCH(ROW()-2,'POSTE (5)'!$W:$W,0)),IFERROR(INDEX('POSTE (6)'!T:T,MATCH(ROW()-2,'POSTE (6)'!$W:$W,0)),IFERROR(INDEX('POSTE (7)'!T:T,MATCH(ROW()-2,'POSTE (7)'!$W:$W,0)),IFERROR(INDEX('POSTE (8)'!T:T,MATCH(ROW()-2,'POSTE (8)'!$W:$W,0)),IFERROR(INDEX('POSTE (9)'!T:T,MATCH(ROW()-2,'POSTE (9)'!$W:$W,0)),\"\")))))))))","v":""},{"$f":"IFERROR(INDEX('POSTE (1)'!U:U,MATCH(ROW()-2,'POSTE (1)'!$W:$W,0)),IFERROR(INDEX('POSTE (2)'!U:U,MATCH(ROW()-2,'POSTE (2)'!$W:$W,0)),IFERROR(INDEX('POSTE (3)'!U:U,MATCH(ROW()-2,'POSTE (3)'!$W:$W,0)),IFERROR(INDEX('POSTE (4)'!U:U,MATCH(ROW()-2,'POSTE (4)'!$W:$W,0)),IFERROR(INDEX('POSTE (5)'!U:U,MATCH(ROW()-2,'POSTE (5)'!$W:$W,0)),IFERROR(INDEX('POSTE (6)'!U:U,MATCH(ROW()-2,'POSTE (6)'!$W:$W,0)),IFERROR(INDEX('POSTE (7)'!U:U,MATCH(ROW()-2,'POSTE (7)'!$W:$W,0)),IFERROR(INDEX('POSTE (8)'!U:U,MATCH(ROW()-2,'POSTE (8)'!$W:$W,0)),IFERROR(INDEX('POSTE (9)'!U:U,MATCH(ROW()-2,'POSTE (9)'!$W:$W,0)),\"\")))))))))","v":""}]
[{"$f":"IFERROR(INDEX('POSTE (1)'!N:N,MATCH(ROW()-2,'POSTE (1)'!$W:$W,0)),IFERROR(INDEX('POSTE (2)'!N:N,MATCH(ROW()-2,'POSTE (2)'!$W:$W,0)),IFERROR(INDEX('POSTE (3)'!N:N,MATCH(ROW()-2,'POSTE (3)'!$W:$W,0)),IFERROR(INDEX('POSTE (4)'!N:N,MATCH(ROW()-2,'POSTE (4)'!$W:$W,0)),IFERROR(INDEX('POSTE (5)'!N:N,MATCH(ROW()-2,'POSTE (5)'!$W:$W,0)),IFERROR(INDEX('POSTE (6)'!N:N,MATCH(ROW()-2,'POSTE (6)'!$W:$W,0)),IFERROR(INDEX('POSTE (7)'!N:N,MATCH(ROW()-2,'POSTE (7)'!$W:$W,0)),IFERROR(INDEX('POSTE (8)'!N:N,MATCH(ROW()-2,'POSTE (8)'!$W:$W,0)),IFERROR(INDEX('POSTE (9)'!N:N,MATCH(ROW()-2,'POSTE (9)'!$W:$W,0)),\"\")))))))))","v":""},{"$f":"IFERROR(INDEX('POSTE (1)'!O:O,MATCH(ROW()-2,'POSTE (1)'!$W:$W,0)),IFERROR(INDEX('POSTE (2)'!O:O,MATCH(ROW()-2,'POSTE (2)'!$W:$W,0)),IFERROR(INDEX('POSTE (3)'!O:O,MATCH(ROW()-2,'POSTE (3)'!$W:$W,0)),IFERROR(INDEX('POSTE (4)'!O:O,MATCH(ROW()-2,'POSTE (4)'!$W:$W,0)),IFERROR(INDEX('POSTE (5)'!O:O,MATCH(ROW()-2,'POSTE (5)'!$W:$W,0)),IFERROR(INDEX('POSTE (6)'!O:O,MATCH(ROW()-2,'POSTE (6)'!$W:$W,0)),IFERROR(INDEX('POSTE (7)'!O:O,MATCH(ROW()-2,'POSTE (7)'!$W:$W,0)),IFERROR(INDEX('POSTE (8)'!O:O,MATCH(ROW()-2,'POSTE (8)'!$W:$W,0)),IFERROR(INDEX('POSTE (9)'!O:O,MATCH(ROW()-2,'POSTE (9)'!$W:$W,0)),\"\")))))))))","v":""},{"$f":"IFERROR(INDEX('POSTE (1)'!P:P,MATCH(ROW()-2,'POSTE (1)'!$W:$W,0)),IFERROR(INDEX('POSTE (2)'!P:P,MATCH(ROW()-2,'POSTE (2)'!$W:$W,0)),IFERROR(INDEX('POSTE (3)'!P:P,MATCH(ROW()-2,'POSTE (3)'!$W:$W,0)),IFERROR(INDEX('POSTE (4)'!P:P,MATCH(ROW()-2,'POSTE (4)'!$W:$W,0)),IFERROR(INDEX('POSTE (5)'!P:P,MATCH(ROW()-2,'POSTE (5)'!$W:$W,0)),IFERROR(INDEX('POSTE (6)'!P:P,MATCH(ROW()-2,'POSTE (6)'!$W:$W,0)),IFERROR(INDEX('POSTE (7)'!P:P,MATCH(ROW()-2,'POSTE (7)'!$W:$W,0)),IFERROR(INDEX('POSTE (8)'!P:P,MATCH(ROW()-2,'POSTE (8)'!$W:$W,0)),IFERROR(INDEX('POSTE (9)'!P:P,MATCH(ROW()-2,'POSTE (9)'!$W:$W,0)),\"\")))))))))","v":""},{"$f":"IFERROR(INDEX('POSTE (1)'!Q:Q,MATCH(ROW()-2,'POSTE (1)'!$W:$W,0)),IFERROR(INDEX('POSTE (2)'!Q:Q,MATCH(ROW()-2,'POSTE (2)'!$W:$W,0)),IFERROR(INDEX('POSTE (3)'!Q:Q,MATCH(ROW()-2,'POSTE (3)'!$W:$W,0)),IFERROR(INDEX('POSTE (4)'!Q:Q,MATCH(ROW()-2,'POSTE (4)'!$W:$W,0)),IFERROR(INDEX('POSTE (5)'!Q:Q,MATCH(ROW()-2,'POSTE (5)'!$W:$W,0)),IFERROR(INDEX('POSTE (6)'!Q:Q,MATCH(ROW()-2,'POSTE (6)'!$W:$W,0)),IFERROR(INDEX('POSTE (7)'!Q:Q,MATCH(ROW()-2,'POSTE (7)'!$W:$W,0)),IFERROR(INDEX('POSTE (8)'!Q:Q,MATCH(ROW()-2,'POSTE (8)'!$W:$W,0)),IFERROR(INDEX('POSTE (9)'!Q:Q,MATCH(ROW()-2,'POSTE (9)'!$W:$W,0)),\"\")))))))))","v":""},{"$f":"IFERROR(INDEX('POSTE (1)'!R:R,MATCH(ROW()-2,'POSTE (1)'!$W:$W,0)),IFERROR(INDEX('POSTE (2)'!R:R,MATCH(ROW()-2,'POSTE (2)'!$W:$W,0)),IFERROR(INDEX('POSTE (3)'!R:R,MATCH(ROW()-2,'POSTE (3)'!$W:$W,0)),IFERROR(INDEX('POSTE (4)'!R:R,MATCH(ROW()-2,'POSTE (4)'!$W:$W,0)),IFERROR(INDEX('POSTE (5)'!R:R,MATCH(ROW()-2,'POSTE (5)'!$W:$W,0)),IFERROR(INDEX('POSTE (6)'!R:R,MATCH(ROW()-2,'POSTE (6)'!$W:$W,0)),IFERROR(INDEX('POSTE (7)'!R:R,MATCH(ROW()-2,'POSTE (7)'!$W:$W,0)),IFERROR(INDEX('POSTE (8)'!R:R,MATCH(ROW()-2,'POSTE (8)'!$W:$W,0)),IFERROR(INDEX('POSTE (9)'!R:R,MATCH(ROW()-2,'POSTE (9)'!$W:$W,0)),\"\")))))))))","v":""},{"$f":"IFERROR(INDEX('POSTE (1)'!S:S,MATCH(ROW()-2,'POSTE (1)'!$W:$W,0)),IFERROR(INDEX('POSTE (2)'!S:S,MATCH(ROW()-2,'POSTE (2)'!$W:$W,0)),IFERROR(INDEX('POSTE (3)'!S:S,MATCH(ROW()-2,'POSTE (3)'!$W:$W,0)),IFERROR(INDEX('POSTE (4)'!S:S,MATCH(ROW()-2,'POSTE (4)'!$W:$W,0)),IFERROR(INDEX('POSTE (5)'!S:S,MATCH(ROW()-2,'POSTE (5)'!$W:$W,0)),IFERROR(INDEX('POSTE (6)'!S:S,MATCH(ROW()-2,'POSTE (6)'!$W:$W,0)),IFERROR(INDEX('POSTE (7)'!S:S,MATCH(ROW()-2,'POSTE (7)'!$W:$W,0)),IFERROR(INDEX('POSTE (8)'!S:S,MATCH(ROW()-2,'POSTE (8)'!$W:$W,0)),IFERROR(INDEX('POSTE (9)'!S:S,MATCH(ROW()-2,'POSTE (9)'!$W:$W,0)),\"\")))))))))","v":""},{"$f":"IFERROR(INDEX('POSTE (1)'!T:T,MATCH(ROW()-2,'POSTE (1)'!$W:$W,0)),IFERROR(INDEX('POSTE (2)'!T:T,MATCH(ROW()-2,'POSTE (2)'!$W:$W,0)),IFERROR(INDEX('POSTE (3)'!T:T,MATCH(ROW()-2,'POSTE (3)'!$W:$W,0)),IFERROR(INDEX('POSTE (4)'!T:T,MATCH(ROW()-2,'POSTE (4)'!$W:$W,0)),IFERROR(INDEX('POSTE (5)'!T:T,MATCH(ROW()-2,'POSTE (5)'!$W:$W,0)),IFERROR(INDEX('POSTE (6)'!T:T,MATCH(ROW()-2,'POSTE (6)'!$W:$W,0)),IFERROR(INDEX('POSTE (7)'!T:T,MATCH(ROW()-2,'POSTE (7)'!$W:$W,0)),IFERROR(INDEX('POSTE (8)'!T:T,MATCH(ROW()-2,'POSTE (8)'!$W:$W,0)),IFERROR(INDEX('POSTE (9)'!T:T,MATCH(ROW()-2,'POSTE (9)'!$W:$W,0)),\"\")))))))))","v":""},{"$f":"IFERROR(INDEX('POSTE (1)'!U:U,MATCH(ROW()-2,'POSTE (1)'!$W:$W,0)),IFERROR(INDEX('POSTE (2)'!U:U,MATCH(ROW()-2,'POSTE (2)'!$W:$W,0)),IFERROR(INDEX('POSTE (3)'!U:U,MATCH(ROW()-2,'POSTE (3)'!$W:$W,0)),IFERROR(INDEX('POSTE (4)'!U:U,MATCH(ROW()-2,'POSTE (4)'!$W:$W,0)),IFERROR(INDEX('POSTE (5)'!U:U,MATCH(ROW()-2,'POSTE (5)'!$W:$W,0)),IFERROR(INDEX('POSTE (6)'!U:U,MATCH(ROW()-2,'POSTE (6)'!$W:$W,0)),IFERROR(INDEX('POSTE (7)'!U:U,MATCH(ROW()-2,'POSTE (7)'!$W:$W,0)),IFERROR(INDEX('POSTE (8)'!U:U,MATCH(ROW()-2,'POSTE (8)'!$W:$W,0)),IFERROR(INDEX('POSTE (9)'!U:U,MATCH(ROW()-2,'POSTE (9)'!$W:$W,0)),\"\")))))))))","v":""}]

{"sheet":"POSTE (1)","index":1,"n_rows":92,"n_cols":23,"rows_kept":92,"cut":false,"hidden":false,"merged":[[56,13,56,14],[57,13,57,14],[58,13,58,14],[59,13,59,14],[60,13,60,14],[62,13,62,14],[64,13,64,14],[58,2,58,6],[59,2,59,6],[60,2,60,6],[61,2,61,6],[62,2,62,6],[63,2,63,6],[64,2,64,6],[83,0,83,1],[84,0,84,1],[70,2,70,6],[71,2,71,6],[72,2,72,6],[73,2,73,6],[74,2,74,6],[75,2,75,6],[76,2,76,6],[77,2,77,6],[78,2,78,6],[79,2,79,6],[80,2,80,6],[81,2,81,6],[82,2,82,6],[83,2,83,6],[78,0,78,1],[79,0,79,1],[80,0,80,1],[81,0,81,1],[82,0,82,1],[73,0,73,1],[74,0,74,1],[75,0,75,1],[81,13,81,14],[82,13,82,14],[83,13,83,14],[84,13,84,14],[85,13,86,16],[76,13,76,14],[77,13,77,14],[78,13,78,14],[79,13,79,14],[80,13,80,14],[71,13,71,14],[72,13,72,14],[73,13,73,14],[74,13,74,14],[75,13,75,14],[66,16,66,17],[67,16,67,17],[69,13,69,19],[66,13,67,15],[65,13,65,14],[63,13,63,14],[61,13,61,14],[51,13,52,18],[17,13,17,20],[54,13,54,19],[3,0,3,11],[0,0,0,11],[1,1,1,2],[1,4,1,11],[2,1,2,2],[2,4,2,11],[15,0,15,11],[4,0,4,11],[5,0,5,11],[6,0,6,11],[7,0,7,11],[8,0,8,11],[9,0,9,11],[10,0,10,11],[11,0,11,11],[12,0,12,11],[13,0,13,11],[14,0,14,11],[27,2,27,5],[16,0,16,11],[17,0,17,11],[18,2,18,5],[19,2,19,5],[20,2,20,5],[21,2,21,5],[22,2,22,5],[23,2,23,5],[24,2,24,5],[25,2,25,5],[26,2,26,5],[47,2,47,5],[30,2,30,5],[31,2,31,5],[32,2,32,5],[33,2,33,5],[28,2,28,5],[29,2,29,5],[44,2,44,5],[45,2,45,5],[46,2,46,5],[66,0,67,6],[71,0,71,1],[72,0,72,1],[48,2,48,5],[49,2,49,5],[50,2,50,5],[51,0,52,8],[53,0,53,11],[54,0,54,11],[55,2,55,6],[56,2,56,6],[57,2,57,6],[56,0,56,1],[57,0,57,1],[60,0,60,1],[61,0,61,1],[62,0,62,1],[63,0,63,1],[64,0,64,1],[58,0,58,1],[59,0,59,1],[76,0,76,1],[77,0,77,1],[91,0,91,2],[85,0,86,8],[88,0,88,2],[89,0,89,2],[90,0,90,2],[84,2,84,6],[34,2,34,5],[43,2,43,5],[35,2,35,5],[36,2,36,5],[37,2,37,5],[38,2,38,5],[39,2,39,5],[40,2,40,5],[41,2,41,5],[42,2,42,5],[65,2,65,6],[65,0,65,1],[66,7,66,8],[67,7,67,8],[68,0,68,11],[69,0,69,11]]}
["DEVIS INTERNE"]
["N° DEVIS:",null,null,"CLIENT:"]
["DATE:",null,null,"DESIGNATION:"]
[]
[{"$f":"RIGHT(CELL(\"filename\",A1),LEN(CELL(\"filename\",A1))-SEARCH(\"]\",CELL(\"filename\",A1)))","v":"POSTE (1)"}]
["Comprenant:"]
[]
[]
[]
[]
[]
[]
[]
[]
[]
[]
[]
["FOURNITURES | Prévisionnel",null,null,null,null,null,null,null,null,null,null,null,null,"FOURNITURES | Réel"]
["Fournisseur","Ref","DESIGNATION",null,null,null,"Unité","Qté","P.U. HT","P.T. HT","Coef multi","P.V. Ligne",null,"Fournisseur","Ref","DESIGNATION","Unité","Qté","P.U. HT","P.T. HT","Poste"]
[null,null,null,null,null,null,null,null,null,{"$f":"I20*H20","v":0},null,{"$f":"K20*J20","v":0},null,{"$f":"RIGHT($A$5,3)&N$19&1","v":"(1)Fournisseur1"},{"$f":"RIGHT($A$5,3)&O$19&1","v":"(1)Ref1"},"(1)DESIGNATION1","T",1,1,{"$f":"S20*R20","v":1},{"$f":"A$5","v":"POSTE (1)"},null,{"$f":"COUNTIF(R$20:R20,\">0\")","v":1}]
[null,null,null,null,null,null,null,null,null,{"$f":"I21*H21","v":0},null,{"$f":"K21*J21","v":0},null,null,null,null,null,null,null,null,null,null,{"$f":"COUNTIF(R$20:R21,\">0\")","v":1}]
[null,null,null,null,null,null,null,null,null,0,null,0,null,null,null,null,null,null,null,null,null,null,{"$f":"COUNTIF(R$20:R22,\">0\")","v":1}]
[null,null,null,null,null,null,null,null,null,0,null,0,null,null,null,null,null,null,null,null,null,null,{"$f":"COUNTIF(R$20:R23,\">0\")","v":1}]
[null,null,null,null,null,null,null,null,null,0,null,0,null,null,null,null,null,null,null,null,null,null,{"$f":"COUNTIF(R$20:R24,\">0\")","v":1}]
[null,null,null,null,null,null,null,null,null,0,null,0,null,null,null,null,null,null,null,null,null,null,{"$f":"COUNTIF(R$20:R25,\">0\")","v":1}]
[null,null,null,null,null,null,null,null,null,0,null,0,null,null,null,null,null,null,null,null,null,null,{"$f":"COUNTIF(R$20:R26,\">0\")","v":1}]
[null,null,null,null,null,null,null,null,null,0,null,0,null,null,null,null,null,null,null,null,null,null,{"$f":"COUNTIF(R$20:R27,\">0\")","v":1}]
[null,null,null,null,null,null,null,null,null,0,null,0,null,null,null,null,null,null,null,null,null,null,{"$f":"COUNTIF(R$20:R28,\">0\")","v":1}]
[null,null,null,null,null,null,null,null,null,0,null,0,null,null,null,null,null,null,null,null,null,null,{"$f":"COUNTIF(R$20:R29,\">0\")","v":1}]
[null,null,null,null,null,null,null,null,null,0,null,0,null,null,null,null,null,null,null,null,null,null,{"$f":"COUNTIF(R$20:R30,\">0\")","v":1}]
[null,null,null,null,null,null,null,null,null,{"$f":"I31*H31","v":0},null,{"$f":"K31*J31","v":0},null,null,null,null,null,null,null,null,null,null,{"$f":"COUNTIF(R$20:R31,\">0\")","v":1}]
[null,null,null,null,null,null,null,null,null,0,null,0,null,null,null,null,null,null,null,null,null,null,{"$f":"COUNTIF(R$20:R32,\">0\")","v":1}]
[null,null,null,null,null,null,null,null,null,0,null,0,null,null,null,null,null,null,null,null,null,null,{"$f":"COUNTIF(R$20:R33,\">0\")","v":1}]
[null,null,null,null,null,null,null,null,null,0,null,0,null,null,null,null,null,null,null,null,null,null,{"$f":"COUNTIF(R$20:R34,\">0\")","v":1}]
[null,null,null,null,null,null,null,null,null,0,null,0,null,null,null,null,null,null,null,null,null,null,{"$f":"COUNTIF(R$20:R35,\">0\")","v":1}]
[null,null,null,null,null,null,null,null,null,{"$f":"I36*H36","v":0},null,{"$f":"K36*J36","v":0},null,null,null,null,null,null,null,null,null,null,{"$f":"COUNTIF(R$20:R36,\">0\")","v":1}]
[null,null,null,null,null,null,null,null,null,0,null,0,null,null,null,null,null,null,null,null,null,null,{"$f":"COUNTIF(R$20:R37,\">0\")","v":1}]
[null,null,null,null,null,null,null,null,null,0,null,0,null,null,null,null,null,null,null,null,null,null,{"$f":"COUNTIF(R$20:R38,\">0\")","v":1}]
[null,null,null,null,null,null,null,null,null,0,null,0,null,null,null,null,null,null,null,null,null,null,{"$f":"COUNTIF(R$20:R39,\">0\")","v":1}]
[null,null,null,null,null,null,null,null,null,0,null,0,null,null,null,null,null,null,null,null,null,null,{"$f":"COUNTIF(R$20:R40,\">0\")","v":1}]
[null,null,null,null,null,null,null,null,null,0,null,0,null,null,null,null,null,null,null,null,null,null,{"$f":"COUNTIF(R$20:R41,\">0\")","v":1}]
[null,null,null,null,null,null,null,null,null,0,null,0,null,null,null,null,null,null,null,null,null,null,{"$f":"COUNTIF(R$20:R42,\">0\")","v":1}]
[null,null,null,null,null,null,null,null,null,0,null,0,null,null,null,null,null,null,null,null,null,null,{"$f":"COUNTIF(R$20:R43,\">0\")","v":1}]
[null,null,null,null,null,null,null,null,null,0,null,0,null,null,null,null,null,null,null,null,null,null,{"$f":"COUNTIF(R$20:R44,\">0\")","v":1}]
[null,null,null,null,null,null,null,null,null,0,null,0,null,null,null,null,null,null,null,null,null,null,{"$f":"COUNTIF(R$20:R45,\">0\")","v":1}]
[null,null,null,null,null,null,null,null,null,0,null,0,null,null,null,null,null,null,null,null,null,null,{"$f":"COUNTIF(R$20:R46,\">0\")","v":1}]
[null,null,null,null,null,null,null,null,null,0,null,0,null,null,null,null,null,null,null,null,null,null,{"$f":"COUNTIF(R$20:R47,\">0\")","v":1}]
[null,null,null,null,null,null,null,null,null,0,null,0,null,null,null,null,null,null,null,null,null,null,{"$f":"COUNTIF(R$20:R48,\">0\")","v":1}]
[null,null,null,null,null,null,null,null,null,0,null,0,null,null,null,null,null,null,null,null,null,null,{"$f":"COUNTIF(R$20:R49,\">0\")","v":1}]
[null,null,null,null,null,null,null,null,null,0,null,0,null,null,null,null,null,null,null,null,null,null,{"$f":"COUNTIF(R$20:R50,\">0\")","v":1}]
[null,null,null,null,null,null,null,null,null,0,null,0,null,null,null,null,null,null,null,null,null,null,{"$f":"COUNTIF(R$20:R51,\">0\")","v":1}]
[null,null,null,null,null,null,null,null,null,"Total coût fournitures","Marge","Total vendu fournitures",null,null,null,null,null,null,null,"Total coût fournitures","Marge sur le prix vendu"]
[null,null,null,null,null,null,null,null,null,{"$f":"SUM(J20:J51)","v":0},{"$f":"((L53-J53)/L53)","v":{"$error":"#DIV/0!"}},{"$f":"SUM(L20:L51)","v":0},null,null,null,null,null,null,null,{"$f":"SUM(T20:T51)","v":1},{"$f":"((L53-T53)/L53)","v":{"$error":"#DIV/0!"}}]
[]
["MAIN D'ŒUVRE | Prévisionnel",null,null,null,null,null,null,null,null,null,null,null,null,"MAIN D'ŒUVRE | Réel"]
[null,null,"DESIGNATION",null,null,null,null,"Qté","P.U. HT","P.T. HT","Coef multi","P.V. Ligne",null,null,null,"DESIGNATION","Qté","P.U. HT","P.T. HT","Poste"]
["DEVIS",null,null,null,null,null,null,null,60,{"$f":"+I57*H57","v":0},null,{"$f":"K57*J57","v":0},null,"DEVIS",null,null,null,60,{"$f":"+R57*Q57","v":0},{"$f":"A$5","v":"POSTE (1)"}]
["RELEVES",null,null,null,null,null,null,null,60,{"$f":"+I58*H58","v":0},null,{"$f":"K58*J58","v":0},null,"RELEVES",null,{"$f":"C58","v":0},null,60,{"$f":"+R58*Q58","v":0},"POSTE (1)"]
["ETUDE",null,null,null,null,null,null,null,60,0,null,{"$f":"K59*J59","v":0},null,"ETUDE",null,0,null,60,0,"POSTE (1)"]
["PLASMA",null,null,null,null,null,null,null,50,0,null,0,null,"PLASMA",null,0,null,50,0,"POSTE (1)"]
["DEBIT",null,null,null,null,null,null,null,38,0,null,0,null,"DEBIT",null,0,null,38,0,"POSTE (1)"]
["PLIAGE",null,null,null,null,null,null,null,38,0,null,0,null,"PLIAGE",null,0,null,38,0,"POSTE (1)"]
["ATELIER",null,null,null,null,null,null,null,38,0,null,0,null,"ATELIER",null,0,null,38,0,"POSTE (1)"]
["Heures sur Chantier",null,null,null,null,null,null,null,38,0,null,0,null,"Heures sur Chantier",null,0,null,38,0,"POSTE (1)"]
["AUTRE",null,null,null,null,null,null,null,null,0,null,0,null,"AUTRE",null,0,null,null,0,"POSTE (1)"]
["AUTRE",null,null,null,null,null,null,null,null,0,null,0,null,"AUTRE",null,0,null,null,0,"POSTE (1)"]
[null,null,null,null,null,null,null,"Nbre heures mobilisation technicien",null,"Total coût MO","Marge totale","Total vendu MO",null,null,null,null,"Nbre heures mobilisation technicien",null,"Total coût MO","Marge sur le prix vendu"]
[null,null,null,null,null,null,null,{"$f":"SUM(H61:H64)","v":0},null,{"$f":"SUM(J57:J66)","v":0},{"$f":"((L68-J68)/L68)","v":{"$error":"#DIV/0!"}},{"$f":"SUM(L57:L66)","v":0},null,null,null,null,{"$f":"SUM(Q61:Q64)","v":0},null,{"$f":"SUM(S57:S66)","v":0},{"$f":"((L68-S68)/L68)","v":{"$error":"#DIV/0!"}}]
[]
["FRAIS | Prévisionnel",null,null,null,null,null,null,null,null,null,null,null,null,"FRAIS | Réel"]
[null,null,"DESIGNATION",null,null,null,null,"Qté","P.U.","Coût Ligne","Coef multi","P.V. Ligne",null,null,null,"DESIGNATION","Qté","P.U.","Coût Ligne","Poste"]
["DEPLACEMENT DEVIS",null,null,null,null,null,null,null,null,{"$f":"+I72*H72","v":0},null,{"$f":"K72*J72","v":0},null,"DEPLACEMENT DEVIS",null,{"$f":"C72","v":0},null,null,{"$f":"+R72*Q72","v":0},{"$f":"A$5","v":"POSTE (1)"}]
["DEPLACEMENT RELEVES",null,null,null,null,null,null,null,null,{"$f":"+I73*H73","v":0},null,{"$f":"K73*J73","v":0},null,"DEPLACEMENT RELEVES",null,{"$f":"C73","v":0},null,null,{"$f":"+R73*Q73","v":0},{"$f":"A$5","v":"POSTE (1)"}]
["DEPLACEMENT SUIVI PROJET",null,null,null,null,null,null,null,null,0,null,{"$f":"K74*J74","v":0},null,"DEPLACEMENT SUIVI PROJET",null,0,null,null,0,"POSTE (1)"]
["DEPLACEMENT CHANTIER",null,null,null,null,null,null,null,null,0,null,0,null,"DEPLACEMENT CHANTIER",null,0,null,null,0,"POSTE (1)"]
["DEPLACEMENT LIVRAISON",null,null,null,null,null,null,null,null,0,null,0,null,"DEPLACEMENT LIVRAISON",null,0,null,null,0,"POSTE (1)"]
["FRAIS REPAS COMMERCIAUX",null,null,null,null,null,null,null,16,0,null,0,null,"FRAIS REPAS COMMERCIAUX",null,0,null,16,0,"POSTE (1)"]
["FRAIS REPAS CHANTIER",null,null,null,null,null,null,null,16,0,null,0,null,"FRAIS REPAS CHANTIER",null,0,null,16,0,"POSTE (1)"]
["HOTEL COMMERCIAUX",null,null,null,null,null,null,null,null,0,null,0,null,"HOTEL COMMERCIAUX",null,0,null,null,0,"POSTE (1)"]
["HOTEL CHANTIER",null,null,null,null,null,null,null,null,0,null,0,null,"HOTEL CHANTIER",null,0,null,null,0,"POSTE (1)"]
["LOCATION VEHICULE",null,null,null,null,null,null,null,null,0,null,0,null,"LOCATION VEHICULE",null,0,null,null,0,"POSTE (1)"]
["LOCATION ENGIN LEVAGE 1",null,null,null,null,null,null,null,null,0,null,0,null,"LOCATION ENGIN LEVAGE 1",null,0,null,null,0,"POSTE (1)"]
["LOCATION ENGIN LEVAGE 2",null,null,null,null,null,null,null,null,0,null,0,null,"LOCATION ENGIN LEVAGE 2",null,0,null,null,0,"POSTE (1)"]
["LOCATION ENGIN LEVAGE 3",null,null,null,null,null,null,null,null,0,null,0,null,"LOCATION ENGIN LEVAGE 3",null,0,null,null,0,"POSTE (1)"]
["AUTRE",null,null,null,null,null,null,null,null,0,null,0,null,"AUTRE",null,0,null,null,0,"POSTE (1)"]
[null,null,null,null,null,null,null,null,null,"Total coût frais","Marge Totale","Total vendu frais",null,null,null,null,null,"Total frais","Marge sur le prix vendu"]
[null,null,null,null,null,null,null,null,null,{"$f":"SUM(J72:J85)","v":0},{"$f":"(L87-J87)/L87","v":{"$error":"#DIV/0!"}},{"$f":"SUM(L72:L85)","v":0},null,null,null,null,null,{"$f":"SUM(S72:S85)","v":0},{"$f":"(L87-R87)/L87","v":{"$error":"#DIV/0!"}}]
[]
["COUT TOTAL POSTE:",null,null,{"$f":"+J87+J68+J53","v":0},null,null,null,null,null,null,null,null,null,null,null,{"$f":"\"Cout Total\"&\" \"&RIGHT(CELL(\"filename\",A1),LEN(CELL(\"filename\",A1))-SEARCH(\"]\",CELL(\"filename\",A1)))","v":"Cout Total POSTE (1)"},{"$f":"R87+S68+T53","v":1}]
["MARGE MOYENNE POSTE:",null,null,{"$f":"D92-D89/D92","v":{"$error":"#DIV/0!"}},null,null,null,null,null,null,null,null,null,null,null,{"$f":"\"Marge sur prix de vente initial\"&\" \"&RIGHT(CELL(\"filename\",A1),LEN(CELL(\"filename\",A1))-SEARCH(\"]\",CELL(\"filename\",A1)))","v":"Marge sur prix de vente initial POSTE (1)"},{"$f":"(D92-Q89)/D92","v":{"$error":"#DIV/0!"}}]
["FACTEUR RISQUE:"]
["PRIX DE VENTE DU POSTE:",null,null,{"$f":"(1+D91)*(L87+L68+L53)","v":0}]

{"sheet":"POSTE (2)","index":2,"n_rows":92,"n_cols":23,"rows_kept":92,"cut":false,"hidden":false,"merged":[[0,0,0,11],[1,1,1,2],[1,4,1,11],[2,1,2,2],[2,4,2,11],[3,0,3,11],[10,0,10,11],[11,0,11,11],[12,0,12,11],[13,0,13,11],[14,0,14,11],[15,0,15,11],[4,0,4,11],[5,0,5,11],[6,0,6,11],[7,0,7,11],[8,0,8,11],[9,0,9,11],[21,2,21,5],[22,2,22,5],[23,2,23,5],[24,2,24,5],[25,2,25,5],[26,2,26,5],[16,0,16,11],[17,0,17,11],[17,13,17,20],[18,2,18,5],[19,2,19,5],[20,2,20,5],[33,2,33,5],[34,2,34,5],[35,2,35,5],[36,2,36,5],[37,2,37,5],[38,2,38,5],[27,2,27,5],[28,2,28,5],[29,2,29,5],[30,2,30,5],[31,2,31,5],[32,2,32,5],[45,2,45,5],[46,2,46,5],[47,2,47,5],[48,2,48,5],[49,2,49,5],[50,2,50,5],[39,2,39,5],[40,2,40,5],[41,2,41,5],[42,2,42,5],[43,2,43,5],[44,2,44,5],[56,0,56,1],[56,2,56,6],[56,13,56,14],[57,0,57,1],[57,2,57,6],[57,13,57,14],[51,0,52,8],[51,13,52,18],[53,0,53,11],[54,0,54,11],[54,13,54,19],[55,2,55,6],[60,0,60,1],[60,2,60,6],[60,13,60,14],[61,0,61,1],[61,2,61,6],[61,13,61,14],[58,0,58,1],[58,2,58,6],[58,13,58,14],[59,0,59,1],[59,2,59,6],[59,13,59,14],[64,0,64,1],[64,2,64,6],[64,13,64,14],[65,0,65,1],[65,2,65,6],[65,13,65,14],[62,0,62,1],[62,2,62,6],[62,13,62,14],[63,0,63,1],[63,2,63,6],[63,13,63,14],[68,0,68,11],[69,0,69,11],[69,13,69,19],[70,2,70,6],[71,0,71,1],[71,2,71,6],[71,13,71,14],[66,0,67,6],[66,7,66,8],[66,13,67,15],[66,16,66,17],[67,7,67,8],[67,16,67,17],[74,0,74,1],[74,2,74,6],[74,13,74,14],[75,0,75,1],[75,2,75,6],[75,13,75,14],[72,0,72,1],[72,2,72,6],[72,13,72,14],[73,0,73,1],[73,2,73,6],[73,13,73,14],[78,0,78,1],[78,2,78,6],[78,13,78,14],[79,0,79,1],[79,2,79,6],[79,13,79,14],[76,0,76,1],[76,2,76,6],[76,13,76,14],[77,0,77,1],[77,2,77,6],[77,13,77,14],[82,0,82,1],[82,2,82,6],[82,13,82,14],[83,0,83,1],[83,2,83,6],[83,13,83,14],[80,0,80,1],[80,2,80,6],[80,13,80,14],[81,0,81,1],[81,2,81,6],[81,13,81,14],[89,0,89,2],[90,0,90,2],[91,0,91,2],[84,0,84,1],[84,2,84,6],[84,13,84,14],[85,0,86,8],[85,13,86,16],[88,0,88,2]]}
["DEVIS INTERNE"]
["N° DEVIS:",null,null,"CLIENT:"]
["DATE:",null,null,"DESIGNATION:"]
[]
[{"$f":"RIGHT(CELL(\"filename\",A1),LEN(CELL(\"filename\",A1))-SEARCH(\"]\",CELL(\"filename\",A1)))","v":"POSTE (2)"}]
["Comprenant:"]
[]
[]
[]
[]
[]
[]
[]
[]
[]
[]
[]
["FOURNITURES | Prévisionnel",null,null,null,null,null,null,null,null,null,null,null,null,"FOURNITURES | Réel"]
["Fournisseur","Ref","DESIGNATION",null,null,null,"Unité","Qté","P.U. HT","P.T. HT","Coef multi","P.V. Ligne",null,"Fournisseur","Ref","DESIGNATION","Unité","Qté","P.U. HT","P.T. HT","Poste"]
[null,null,null,null,null,null,null,null,null,{"$f":"I20*H20","v":0},null,{"$f":"K20*J20","v":0},null,{"$f":"RIGHT($A$5,3)&N19","v":"(2)Fournisseur"},{"$f":"RIGHT($A$5,3)&O19","v":"(2)Ref"},"(2)DESIGNATION","Kg",2,1,{"$f":"S20*R20","v":2},{"$f":"A$5","v":"POSTE (2)"},null,{"$f":"COUNTIF(R$20:R20,\">0\")+MAX('POSTE (1)'!W:W)","v":2}]
[null,null,null,null,null,null,null,null,null,{"$f":"I21*H21","v":0},null,{"$f":"K21*J21","v":0},null,"(2)Fournisseur2","(2)Ref2","(2)DESIGNATION2","Kg",2,1,{"$f":"S21*R21","v":2},"POSTE (2)",null,{"$f":"COUNTIF(R$20:R21,\">0\")+MAX('POSTE (1)'!W:W)","v":3}]
[null,null,null,null,null,null,null,null,null,0,null,0,null,null,null,null,null,null,null,null,null,null,{"$f":"COUNTIF(R$20:R22,\">0\")+MAX('POSTE (1)'!W:W)","v":3}]
[null,null,null,null,null,null,null,null,null,0,null,0,null,null,null,null,null,null,null,null,null,null,{"$f":"COUNTIF(R$20:R23,\">0\")+MAX('POSTE (1)'!W:W)","v":3}]
[null,null,null,null,null,null,null,null,null,0,null,0,null,null,null,null,null,null,null,null,null,null,{"$f":"COUNTIF(R$20:R24,\">0\")+MAX('POSTE (1)'!W:W)","v":3}]
[null,null,null,null,null,null,null,null,null,0,null,0,null,null,null,null,null,null,null,null,null,null,{"$f":"COUNTIF(R$20:R25,\">0\")+MAX('POSTE (1)'!W:W)","v":3}]
[null,null,null,null,null,null,null,null,null,0,null,0,null,null,null,null,null,null,null,null,null,null,{"$f":"COUNTIF(R$20:R26,\">0\")+MAX('POSTE (1)'!W:W)","v":3}]
[null,null,null,null,null,null,null,null,null,0,null,0,null,null,null,null,null,null,null,null,null,null,{"$f":"COUNTIF(R$20:R27,\">0\")+MAX('POSTE (1)'!W:W)","v":3}]
[null,null,null,null,null,null,null,null,null,0,null,0,null,null,null,null,null,null,null,null,null,null,{"$f":"COUNTIF(R$20:R28,\">0\")+MAX('POSTE (1)'!W:W)","v":3}]
[null,null,null,null,null,null,null,null,null,0,null,0,null,null,null,null,null,null,null,null,null,null,{"$f":"COUNTIF(R$20:R29,\">0\")+MAX('POSTE (1)'!W:W)","v":3}]
[null,null,null,null,null,null,null,null,null,0,null,0,null,null,null,null,null,null,null,null,null,null,{"$f":"COUNTIF(R$20:R30,\">0\")+MAX('POSTE (1)'!W:W)","v":3}]
[null,null,null,null,null,null,null,null,null,0,null,0,null,null,null,null,null,null,null,null,null,null,{"$f":"COUNTIF(R$20:R31,\">0\")+MAX('POSTE (1)'!W:W)","v":3}]
[null,null,null,null,null,null,null,null,null,0,null,0,null,null,null,null,null,null,null,null,null,null,{"$f":"COUNTIF(R$20:R32,\">0\")+MAX('POSTE (1)'!W:W)","v":3}]
[null,null,null,null,null,null,null,null,null,0,null,0,null,null,null,null,null,null,null,null,null,null,{"$f":"COUNTIF(R$20:R33,\">0\")+MAX('POSTE (1)'!W:W)","v":3}]
[null,null,null,null,null,null,null,null,null,0,null,0,null,null,null,null,null,null,null,null,null,null,{"$f":"COUNTIF(R$20:R34,\">0\")+MAX('POSTE (1)'!W:W)","v":3}]
[null,null,null,null,null,null,null,null,null,0,null,0,null,null,null,null,null,null,null,null,null,null,{"$f":"COUNTIF(R$20:R35,\">0\")+MAX('POSTE (1)'!W:W)","v":3}]
[null,null,null,null,null,null,null,null,null,0,null,0,null,null,null,null,null,null,null,null,null,null,{"$f":"COUNTIF(R$20:R36,\">0\")+MAX('POSTE (1)'!W:W)","v":3}]
[null,null,null,null,null,null,null,null,null,0,null,0,null,null,null,null,null,null,null,null,null,null,{"$f":"COUNTIF(R$20:R37,\">0\")+MAX('POSTE (1)'!W:W)","v":3}]
[null,null,null,null,null,null,null,null,null,0,null,0,null,null,null,null,null,null,null,null,null,null,{"$f":"COUNTIF(R$20:R38,\">0\")+MAX('POSTE (1)'!W:W)","v":3}]
[null,null,null,null,null,null,null,null,null,0,null,0,null,null,null,null,null,null,null,null,null,null,{"$f":"COUNTIF(R$20:R39,\">0\")+MAX('POSTE (1)'!W:W)","v":3}]
[null,null,null,null,null,null,null,null,null,0,null,0,null,null,null,null,null,null,null,null,null,null,{"$f":"COUNTIF(R$20:R40,\">0\")+MAX('POSTE (1)'!W:W)","v":3}]
[null,null,null,null,null,null,null,null,null,0,null,0,null,null,null,null,null,null,null,null,null,null,{"$f":"COUNTIF(R$20:R41,\">0\")+MAX('POSTE (1)'!W:W)","v":3}]
[null,null,null,null,null,null,null,null,null,0,null,0,null,null,null,null,null,null,null,null,null,null,{"$f":"COUNTIF(R$20:R42,\">0\")+MAX('POSTE (1)'!W:W)","v":3}]
[null,null,null,null,null,null,null,null,null,0,null,0,null,null,null,null,null,null,null,null,null,null,{"$f":"COUNTIF(R$20:R43,\">0\")+MAX('POSTE (1)'!W:W)","v":3}]
[null,null,null,null,null,null,null,null,null,0,null,0,null,null,null,null,null,null,null,null,null,null,{"$f":"COUNTIF(R$20:R44,\">0\")+MAX('POSTE (1)'!W:W)","v":3}]
[null,null,null,null,null,null,null,null,null,0,null,0,null,null,null,null,null,null,null,null,null,null,{"$f":"COUNTIF(R$20:R45,\">0\")+MAX('POSTE (1)'!W:W)","v":3}]
[null,null,null,null,null,null,null,null,null,0,null,0,null,null,null,null,null,null,null,null,null,null,{"$f":"COUNTIF(R$20:R46,\">0\")+MAX('POSTE (1)'!W:W)","v":3}]
[null,null,null,null,null,null,null,null,null,0,null,0,null,null,null,null,null,null,null,null,null,null,{"$f":"COUNTIF(R$20:R47,\">0\")+MAX('POSTE (1)'!W:W)","v":3}]
[null,null,null,null,null,null,null,null,null,0,null,0,null,null,null,null,null,null,null,null,null,null,{"$f":"COUNTIF(R$20:R48,\">0\")+MAX('POSTE (1)'!W:W)","v":3}]
[null,null,null,null,null,null,null,null,null,0,null,0,null,null,null,null,null,null,null,null,null,null,{"$f":"COUNTIF(R$20:R49,\">0\")+MAX('POSTE (1)'!W:W)","v":3}]
[null,null,null,null,null,null,null,null,null,0,null,0,null,null,null,null,null,null,null,null,null,null,{"$f":"COUNTIF(R$20:R50,\">0\")+MAX('POSTE (1)'!W:W)","v":3}]
[null,null,null,null,null,null,null,null,null,0,null,0,null,null,null,null,null,null,null,null,null,null,{"$f":"COUNTIF(R$20:R51,\">0\")+MAX('POSTE (1)'!W:W)","v":3}]
[null,null,null,null,null,null,null,null,null,"Total coût fournitures","Marge","Total vendu fournitures",null,null,null,null,null,null,null,"Total coût fournitures","Marge sur le prix vendu"]
[null,null,null,null,null,null,null,null,null,{"$f":"SUM(J20:J51)","v":0},{"$f":"((L53-J53)/L53)","v":{"$error":"#DIV/0!"}},{"$f":"SUM(L20:L51)","v":0},null,null,null,null,null,null,null,{"$f":"SUM(T20:T51)","v":4},{"$f":"((L53-T53)/L53)","v":{"$error":"#DIV/0!"}}]
[]
["MAIN D'ŒUVRE | Prévisionnel",null,null,null,null,null,null,null,null,null,null,null,null,"MAIN D'ŒUVRE | Réel"]
[null,null,"DESIGNATION",null,null,null,null,"Qté","P.U. HT","P.T. HT","Coef multi","P.V. Ligne",null,null,null,"DESIGNATION","Qté","P.U. HT","P.T. HT","Poste"]
["DEVIS",null,null,null,null,null,null,null,60,{"$f":"+I57*H57","v":0},null,{"$f":"K57*J57","v":0},null,"DEVIS",null,null,null,60,{"$f":"+R57*Q57","v":0},{"$f":"A$5","v":"POSTE (2)"}]
["RELEVES",null,null,null,null,null,null,null,60,{"$f":"+I58*H58","v":0},null,{"$f":"K58*J58","v":0},null,"RELEVES",null,{"$f":"C58","v":0},null,60,{"$f":"+R58*Q58","v":0},"POSTE (2)"]
["ETUDE",null,null,null,null,null,null,null,60,0,null,{"$f":"K59*J59","v":0},null,"ETUDE",null,0,null,60,0,"POSTE (2)"]
["PLASMA",null,null,null,null,null,null,null,50,0,null,0,null,"PLASMA",null,0,null,50,0,"POSTE (2)"]
["DEBIT",null,null,null,null,null,null,null,38,0,null,0,null,"DEBIT",null,0,null,38,0,"POSTE (2)"]
["PLIAGE",null,null,null,null,null,null,null,38,0,null,0,null,"PLIAGE",null,0,null,38,0,"POSTE (2)"]
["ATELIER",null,null,null,null,null,null,null,38,0,null,0,null,"ATELIER",null,0,null,38,0,"POSTE (2)"]
["Heures sur Chantier",null,null,null,null,null,null,null,38,0,null,0,null,"Heures sur Chantier",null,0,null,38,0,"POSTE (2)"]
["AUTRE",null,null,null,null,null,null,null,null,0,null,0,null,"AUTRE",null,0,null,null,0,"POSTE (2)"]
["AUTRE",null,null,null,null,null,null,null,null,0,null,0,null,"AUTRE",null,0,null,null,0,"POSTE (2)"]
[null,null,null,null,null,null,null,"Nbre heures mobilisation technicien",null,"Total coût MO","Marge totale","Total vendu MO",null,null,null,null,"Nbre heures mobilisation technicien",null,"Total coût MO","Marge sur le prix vendu"]
[null,null,null,null,null,null,null,{"$f":"SUM(H61:H64)","v":0},null,{"$f":"SUM(J57:J66)","v":0},{"$f":"((L68-J68)/L68)","v":{"$error":"#DIV/0!"}},{"$f":"SUM(L57:L66)","v":0},null,null,null,null,{"$f":"SUM(Q61:Q64)","v":0},null,{"$f":"SUM(S57:S66)","v":0},{"$f":"((L68-S68)/L68)","v":{"$error":"#DIV/0!"}}]
[]
["FRAIS | Prévisionnel",null,null,null,null,null,null,null,null,null,null,null,null,"FRAIS | Réel"]
[null,null,"DESIGNATION",null,null,null,null,"Qté","P.U.","Coût Ligne","Coef multi","P.V. Ligne",null,null,null,"DESIGNATION","Qté","P.U.","Coût Ligne","Poste"]
["DEPLACEMENT DEVIS",null,null,null,null,null,null,null,null,{"$f":"+I72*H72","v":0},null,{"$f":"K72*J72","v":0},null,"DEPLACEMENT DEVIS",null,{"$f":"C72","v":0},null,null,{"$f":"+R72*Q72","v":0},{"$f":"A$5","v":"POSTE (2)"}]
["DEPLACEMENT RELEVES",null,null,null,null,null,null,null,null,{"$f":"+I73*H73","v":0},null,{"$f":"K73*J73","v":0},null,"DEPLACEMENT RELEVES",null,{"$f":"C73","v":0},null,null,{"$f":"+R73*Q73","v":0},{"$f":"A$5","v":"POSTE (2)"}]
["DEPLACEMENT SUIVI PROJET",null,null,null,null,null,null,null,null,0,null,{"$f":"K74*J74","v":0},null,"DEPLACEMENT SUIVI PROJET",null,0,null,null,0,"POSTE (2)"]
["DEPLACEMENT CHANTIER",null,null,null,null,null,null,null,null,0,null,0,null,"DEPLACEMENT CHANTIER",null,0,null,null,0,"POSTE (2)"]
["DEPLACEMENT LIVRAISON",null,null,null,null,null,null,null,null,0,null,0,null,"DEPLACEMENT LIVRAISON",null,0,null,null,0,"POSTE (2)"]
["FRAIS REPAS COMMERCIAUX",null,null,null,null,null,null,null,16,0,null,0,null,"FRAIS REPAS COMMERCIAUX",null,0,null,16,0,"POSTE (2)"]
["FRAIS REPAS CHANTIER",null,null,null,null,null,null,null,16,0,null,0,null,"FRAIS REPAS CHANTIER",null,0,null,16,0,"POSTE (2)"]
["HOTEL COMMERCIAUX",null,null,null,null,null,null,null,null,0,null,0,null,"HOTEL COMMERCIAUX",null,0,null,null,0,"POSTE (2)"]
["HOTEL CHANTIER",null,null,null,null,null,null,null,null,0,null,0,null,"HOTEL CHANTIER",null,0,null,null,0,"POSTE (2)"]
["LOCATION VEHICULE",null,null,null,null,null,null,null,null,0,null,0,null,"LOCATION VEHICULE",null,0,null,null,0,"POSTE (2)"]
["LOCATION ENGIN LEVAGE 1",null,null,null,null,null,null,null,null,0,null,0,null,"LOCATION ENGIN LEVAGE 1",null,0,null,null,0,"POSTE (2)"]
["LOCATION ENGIN LEVAGE 2",null,null,null,null,null,null,null,null,0,null,0,null,"LOCATION ENGIN LEVAGE 2",null,0,null,null,0,"POSTE (2)"]
["LOCATION ENGIN LEVAGE 3",null,null,null,null,null,null,null,null,0,null,0,null,"LOCATION ENGIN LEVAGE 3",null,0,null,null,0,"POSTE (2)"]
["AUTRE",null,null,null,null,null,null,null,null,0,null,0,null,"AUTRE",null,0,null,null,0,"POSTE (2)"]
[null,null,null,null,null,null,null,null,null,"Total coût frais","Marge Totale","Total vendu frais",null,null,null,null,null,"Total frais","Marge sur le prix vendu"]
[null,null,null,null,null,null,null,null,null,{"$f":"SUM(J72:J85)","v":0},{"$f":"(L87-J87)/L87","v":{"$error":"#DIV/0!"}},{"$f":"SUM(L72:L85)","v":0},null,null,null,null,null,{"$f":"SUM(S72:S85)","v":0},{"$f":"(L87-R87)/L87","v":{"$error":"#DIV/0!"}}]
[]
["COUT TOTAL POSTE:",null,null,{"$f":"+J87+J68+J53","v":0},null,null,null,null,null,null,null,null,null,null,null,{"$f":"\"Cout Total\"&\" \"&RIGHT(CELL(\"filename\",A1),LEN(CELL(\"filename\",A1))-SEARCH(\"]\",CELL(\"filename\",A1)))","v":"Cout Total POSTE (2)"},{"$f":"R87+S68+T53","v":4}]
["MARGE MOYENNE POSTE:",null,null,{"$f":"D92-D89/D92","v":{"$error":"#DIV/0!"}},null,null,null,null,null,null,null,null,null,null,null,{"$f":"\"Marge sur prix de vente initial\"&\" \"&RIGHT(CELL(\"filename\",A1),LEN(CELL(\"filename\",A1))-SEARCH(\"]\",CELL(\"filename\",A1)))","v":"Marge sur prix de vente initial POSTE (2)"},{"$f":"(D92-Q89)/D92","v":{"$error":"#DIV/0!"}}]
["FACTEUR RISQUE:",null,null,0.03]
["PRIX DE VENTE DU POSTE:",null,null,{"$f":"(1+D91)*(L87+L68+L53)","v":0}]

{"sheet":"POSTE (3)","index":3,"n_rows":92,"n_cols":23,"rows_kept":92,"cut":false,"hidden":false,"merged":[[0,0,0,11],[1,1,1,2],[1,4,1,11],[2,1,2,2],[2,4,2,11],[3,0,3,11],[10,0,10,11],[11,0,11,11],[12,0,12,11],[13,0,13,11],[14,0,14,11],[15,0,15,11],[4,0,4,11],[5,0,5,11],[6,0,6,11],[7,0,7,11],[8,0,8,11],[9,0,9,11],[21,2,21,5],[22,2,22,5],[23,2,23,5],[24,2,24,5],[25,2,25,5],[26,2,26,5],[16,0,16,11],[17,0,17,11],[17,13,17,20],[18,2,18,5],[19,2,19,5],[20,2,20,5],[33,2,33,5],[34,2,34,5],[35,2,35,5],[36,2,36,5],[37,2,37,5],[38,2,38,5],[27,2,27,5],[28,2,28,5],[29,2,29,5],[30,2,30,5],[31,2,31,5],[32,2,32,5],[45,2,45,5],[46,2,46,5],[47,2,47,5],[48,2,48,5],[49,2,49,5],[50,2,50,5],[39,2,39,5],[40,2,40,5],[41,2,41,5],[42,2,42,5],[43,2,43,5],[44,2,44,5],[56,0,56,1],[56,2,56,6],[56,13,56,14],[57,0,57,1],[57,2,57,6],[57,13,57,14],[51,0,52,8],[51,13,52,18],[53,0,53,11],[54,0,54,11],[54,13,54,19],[55,2,55,6],[60,0,60,1],[60,2,60,6],[60,13,60,14],[61,0,61,1],[61,2,61,6],[61,13,61,14],[58,0,58,1],[58,2,58,6],[58,13,58,14],[59,0,59,1],[59,2,59,6],[59,13,59,14],[64,0,64,1],[64,2,64,6],[64,13,64,14],[65,0,65,1],[65,2,65,6],[65,13,65,14],[62,0,62,1],[62,2,62,6],[62,13,62,14],[63,0,63,1],[63,2,63,6],[63,13,63,14],[68,0,68,11],[69,0,69,11],[69,13,69,19],[70,2,70,6],[71,0,71,1],[71,2,71,6],[71,13,71,14],[66,0,67,6],[66,7,66,8],[66,13,67,15],[66,16,66,17],[67,7,67,8],[67,16,67,17],[74,0,74,1],[74,2,74,6],[74,13,74,14],[75,0,75,1],[75,2,75,6],[75,13,75,14],[72,0,72,1],[72,2,72,6],[72,13,72,14],[73,0,73,1],[73,2,73,6],[73,13,73,14],[78,0,78,1],[78,2,78,6],[78,13,78,14],[79,0,79,1],[79,2,79,6],[79,13,79,14],[76,0,76,1],[76,2,76,6],[76,13,76,14],[77,0,77,1],[77,2,77,6],[77,13,77,14],[82,0,82,1],[82,2,82,6],[82,13,82,14],[83,0,83,1],[83,2,83,6],[83,13,83,14],[80,0,80,1],[80,2,80,6],[80,13,80,14],[81,0,81,1],[81,2,81,6],[81,13,81,14],[89,0,89,2],[90,0,90,2],[91,0,91,2],[84,0,84,1],[84,2,84,6],[84,13,84,14],[85,0,86,8],[85,13,86,16],[88,0,88,2]]}
["DEVIS INTERNE"]
["N° DEVIS:",null,null,"CLIENT:"]
["DATE:",null,null,"DESIGNATION:"]
[]
[{"$f":"RIGHT(CELL(\"filename\",A1),LEN(CELL(\"filename\",A1))-SEARCH(\"]\",CELL(\"filename\",A1)))","v":"POSTE (3)"}]
["Comprenant:"]
[]
[]
[]
[]
[]
[]
[]
[]
[]
[]
[]
["FOURNITURES | Prévisionnel",null,null,null,null,null,null,null,null,null,null,null,null,"FOURNITURES | Réel"]
["Fournisseur","Ref","DESIGNATION",null,null,null,"Unité","Qté","P.U. HT","P.T. HT","Coef multi","P.V. Ligne",null,"Fournisseur","Ref","DESIGNATION","Unité","Qté","P.U. HT","P.T. HT","Poste"]
[null,null,null,null,null,null,null,null,null,{"$f":"I20*H20","v":0},null,{"$f":"K20*J20","v":0},null,{"$f":"RIGHT($A$5,3)&N19","v":"(3)Fournisseur"},{"$f":"RIGHT($A$5,3)&O19","v":"(3)Ref"},"(3)DESIGNATION","L",3,1,{"$f":"S20*R20","v":3},{"$f":"A$5","v":"POSTE (3)"},null,{"$f":"COUNTIF(R$20:R20,\">0\")+MAX('POSTE (2)'!W:W)","v":4}]
[null,null,null,null,null,null,null,null,null,{"$f":"I21*H21","v":0},null,{"$f":"K21*J21","v":0},null,"(3)Fournisseur2","(3)Ref2","(3)DESIGNATION2","L",3,1,{"$f":"S21*R21","v":3},"POSTE (3)",null,{"$f":"COUNTIF(R$20:R21,\">0\")+MAX('POSTE (2)'!W:W)","v":5}]
[null,null,null,null,null,null,null,null,null,0,null,0,null,"(3)Fournisseur3","(3)Ref3","(3)DESIGNATION3","L",3,1,3,"POSTE (3)",null,{"$f":"COUNTIF(R$20:R22,\">0\")+MAX('POSTE (2)'!W:W)","v":6}]
[null,null,null,null,null,null,null,null,null,0,null,0,null,null,null,null,null,null,null,null,null,null,{"$f":"COUNTIF(R$20:R23,\">0\")+MAX('POSTE (2)'!W:W)","v":6}]
[null,null,null,null,null,null,null,null,null,0,null,0,null,null,null,null,null,null,null,null,null,null,{"$f":"COUNTIF(R$20:R24,\">0\")+MAX('POSTE (2)'!W:W)","v":6}]
[null,null,null,null,null,null,null,null,null,0,null,0,null,null,null,null,null,null,null,null,null,null,{"$f":"COUNTIF(R$20:R25,\">0\")+MAX('POSTE (2)'!W:W)","v":6}]
[null,null,null,null,null,null,null,null,null,0,null,0,null,null,null,null,null,null,null,null,null,null,{"$f":"COUNTIF(R$20:R26,\">0\")+MAX('POSTE (2)'!W:W)","v":6}]
[null,null,null,null,null,null,null,null,null,0,null,0,null,null,null,null,null,null,null,null,null,null,{"$f":"COUNTIF(R$20:R27,\">0\")+MAX('POSTE (2)'!W:W)","v":6}]
[null,null,null,null,null,null,null,null,null,0,null,0,null,null,null,null,null,null,null,null,null,null,{"$f":"COUNTIF(R$20:R28,\">0\")+MAX('POSTE (2)'!W:W)","v":6}]
[null,null,null,null,null,null,null,null,null,0,null,0,null,null,null,null,null,null,null,null,null,null,{"$f":"COUNTIF(R$20:R29,\">0\")+MAX('POSTE (2)'!W:W)","v":6}]
[null,null,null,null,null,null,null,null,null,0,null,0,null,null,null,null,null,null,null,null,null,null,{"$f":"COUNTIF(R$20:R30,\">0\")+MAX('POSTE (2)'!W:W)","v":6}]
[null,null,null,null,null,null,null,null,null,0,null,0,null,null,null,null,null,null,null,null,null,null,{"$f":"COUNTIF(R$20:R31,\">0\")+MAX('POSTE (2)'!W:W)","v":6}]
[null,null,null,null,null,null,null,null,null,0,null,0,null,null,null,null,null,null,null,null,null,null,{"$f":"COUNTIF(R$20:R32,\">0\")+MAX('POSTE (2)'!W:W)","v":6}]
[null,null,null,null,null,null,null,null,null,0,null,0,null,null,null,null,null,null,null,null,null,null,{"$f":"COUNTIF(R$20:R33,\">0\")+MAX('POSTE (2)'!W:W)","v":6}]
[null,null,null,null,null,null,null,null,null,0,null,0,null,null,null,null,null,null,null,null,null,null,{"$f":"COUNTIF(R$20:R34,\">0\")+MAX('POSTE (2)'!W:W)","v":6}]
[null,null,null,null,null,null,null,null,null,0,null,0,null,null,null,null,null,null,null,null,null,null,{"$f":"COUNTIF(R$20:R35,\">0\")+MAX('POSTE (2)'!W:W)","v":6}]
[null,null,null,null,null,null,null,null,null,0,null,0,null,null,null,null,null,null,null,null,null,null,{"$f":"COUNTIF(R$20:R36,\">0\")+MAX('POSTE (2)'!W:W)","v":6}]
[null,null,null,null,null,null,null,null,null,0,null,0,null,null,null,null,null,null,null,null,null,null,{"$f":"COUNTIF(R$20:R37,\">0\")+MAX('POSTE (2)'!W:W)","v":6}]
[null,null,null,null,null,null,null,null,null,0,null,0,null,null,null,null,null,null,null,null,null,null,{"$f":"COUNTIF(R$20:R38,\">0\")+MAX('POSTE (2)'!W:W)","v":6}]
[null,null,null,null,null,null,null,null,null,0,null,0,null,null,null,null,null,null,null,null,null,null,{"$f":"COUNTIF(R$20:R39,\">0\")+MAX('POSTE (2)'!W:W)","v":6}]
[null,null,null,null,null,null,null,null,null,0,null,0,null,null,null,null,null,null,null,null,null,null,{"$f":"COUNTIF(R$20:R40,\">0\")+MAX('POSTE (2)'!W:W)","v":6}]
[null,null,null,null,null,null,null,null,null,0,null,0,null,null,null,null,null,null,null,null,null,null,{"$f":"COUNTIF(R$20:R41,\">0\")+MAX('POSTE (2)'!W:W)","v":6}]
[null,null,null,null,null,null,null,null,null,0,null,0,null,null,null,null,null,null,null,null,null,null,{"$f":"COUNTIF(R$20:R42,\">0\")+MAX('POSTE (2)'!W:W)","v":6}]
[null,null,null,null,null,null,null,null,null,0,null,0,null,null,null,null,null,null,null,null,null,null,{"$f":"COUNTIF(R$20:R43,\">0\")+MAX('POSTE (2)'!W:W)","v":6}]
[null,null,null,null,null,null,null,null,null,0,null,0,null,null,null,null,null,null,null,null,null,null,{"$f":"COUNTIF(R$20:R44,\">0\")+MAX('POSTE (2)'!W:W)","v":6}]
[null,null,null,null,null,null,null,null,null,0,null,0,null,null,null,null,null,null,null,null,null,null,{"$f":"COUNTIF(R$20:R45,\">0\")+MAX('POSTE (2)'!W:W)","v":6}]
[null,null,null,null,null,null,null,null,null,0,null,0,null,null,null,null,null,null,null,null,null,null,{"$f":"COUNTIF(R$20:R46,\">0\")+MAX('POSTE (2)'!W:W)","v":6}]
[null,null,null,null,null,null,null,null,null,0,null,0,null,null,null,null,null,null,null,null,null,null,{"$f":"COUNTIF(R$20:R47,\">0\")+MAX('POSTE (2)'!W:W)","v":6}]
[null,null,null,null,null,null,null,null,null,0,null,0,null,null,null,null,null,null,null,null,null,null,{"$f":"COUNTIF(R$20:R48,\">0\")+MAX('POSTE (2)'!W:W)","v":6}]
[null,null,null,null,null,null,null,null,null,0,null,0,null,null,null,null,null,null,null,null,null,null,{"$f":"COUNTIF(R$20:R49,\">0\")+MAX('POSTE (2)'!W:W)","v":6}]
[null,null,null,null,null,null,null,null,null,0,null,0,null,null,null,null,null,null,null,null,null,null,{"$f":"COUNTIF(R$20:R50,\">0\")+MAX('POSTE (2)'!W:W)","v":6}]
[null,null,null,null,null,null,null,null,null,0,null,0,null,null,null,null,null,null,null,null,null,null,{"$f":"COUNTIF(R$20:R51,\">0\")+MAX('POSTE (2)'!W:W)","v":6}]
[null,null,null,null,null,null,null,null,null,"Total coût fournitures","Marge","Total vendu fournitures",null,null,null,null,null,null,null,"Total coût fournitures","Marge sur le prix vendu"]
[null,null,null,null,null,null,null,null,null,{"$f":"SUM(J20:J51)","v":0},{"$f":"((L53-J53)/L53)","v":{"$error":"#DIV/0!"}},{"$f":"SUM(L20:L51)","v":0},null,null,null,null,null,null,null,{"$f":"SUM(T20:T51)","v":9},{"$f":"((L53-T53)/L53)","v":{"$error":"#DIV/0!"}}]
[]
["MAIN D'ŒUVRE | Prévisionnel",null,null,null,null,null,null,null,null,null,null,null,null,"MAIN D'ŒUVRE | Réel"]
[null,null,"DESIGNATION",null,null,null,null,"Qté","P.U. HT","P.T. HT","Coef multi","P.V. Ligne",null,null,null,"DESIGNATION","Qté","P.U. HT","P.T. HT","Poste"]
["DEVIS",null,null,null,null,null,null,null,60,{"$f":"+I57*H57","v":0},null,{"$f":"K57*J57","v":0},null,"DEVIS",null,null,null,60,{"$f":"+R57*Q57","v":0},{"$f":"A$5","v":"POSTE (3)"}]
["RELEVES",null,null,null,null,null,null,null,60,{"$f":"+I58*H58","v":0},null,{"$f":"K58*J58","v":0},null,"RELEVES",null,{"$f":"C58","v":0},null,60,{"$f":"+R58*Q58","v":0},"POSTE (3)"]
["ETUDE",null,null,null,null,null,null,null,60,0,null,{"$f":"K59*J59","v":0},null,"ETUDE",null,0,null,60,0,"POSTE (3)"]
["PLASMA",null,null,null,null,null,null,null,50,0,null,0,null,"PLASMA",null,0,null,50,0,"POSTE (3)"]
["DEBIT",null,null,null,null,null,null,null,38,0,null,0,null,"DEBIT",null,0,null,38,0,"POSTE (3)"]
["PLIAGE",null,null,null,null,null,null,null,38,0,null,0,null,"PLIAGE",null,0,null,38,0,"POSTE (3)"]
["ATELIER",null,null,null,null,null,null,null,38,0,null,0,null,"ATELIER",null,0,null,38,0,"POSTE (3)"]
["Heures sur Chantier",null,null,null,null,null,null,null,38,0,null,0,null,"Heures sur Chantier",null,0,null,38,0,"POSTE (3)"]
["AUTRE",null,null,null,null,null,null,null,null,0,null,0,null,"AUTRE",null,0,null,null,0,"POSTE (3)"]
["AUTRE",null,null,null,null,null,null,null,null,0,null,0,null,"AUTRE",null,0,null,null,0,"POSTE (3)"]
[null,null,null,null,null,null,null,"Nbre heures mobilisation technicien",null,"Total coût MO","Marge totale","Total vendu MO",null,null,null,null,"Nbre heures mobilisation technicien",null,"Total coût MO","Marge sur le prix vendu"]
[null,null,null,null,null,null,null,{"$f":"SUM(H61:H64)","v":0},null,{"$f":"SUM(J57:J66)","v":0},{"$f":"((L68-J68)/L68)","v":{"$error":"#DIV/0!"}},{"$f":"SUM(L57:L66)","v":0},null,null,null,null,{"$f":"SUM(Q61:Q64)","v":0},null,{"$f":"SUM(S57:S66)","v":0},{"$f":"((L68-S68)/L68)","v":{"$error":"#DIV/0!"}}]
[]
["FRAIS | Prévisionnel",null,null,null,null,null,null,null,null,null,null,null,null,"FRAIS | Réel"]
[null,null,"DESIGNATION",null,null,null,null,"Qté","P.U.","Coût Ligne","Coef multi","P.V. Ligne",null,null,null,"DESIGNATION","Qté","P.U.","Coût Ligne","Poste"]
["DEPLACEMENT DEVIS",null,null,null,null,null,null,null,null,{"$f":"+I72*H72","v":0},null,{"$f":"K72*J72","v":0},null,"DEPLACEMENT DEVIS",null,{"$f":"C72","v":0},null,null,{"$f":"+R72*Q72","v":0},{"$f":"A$5","v":"POSTE (3)"}]
["DEPLACEMENT RELEVES",null,null,null,null,null,null,null,null,{"$f":"+I73*H73","v":0},null,{"$f":"K73*J73","v":0},null,"DEPLACEMENT RELEVES",null,{"$f":"C73","v":0},null,null,{"$f":"+R73*Q73","v":0},{"$f":"A$5","v":"POSTE (3)"}]
["DEPLACEMENT SUIVI PROJET",null,null,null,null,null,null,null,null,0,null,{"$f":"K74*J74","v":0},null,"DEPLACEMENT SUIVI PROJET",null,0,null,null,0,"POSTE (3)"]
["DEPLACEMENT CHANTIER",null,null,null,null,null,null,null,null,0,null,0,null,"DEPLACEMENT CHANTIER",null,0,null,null,0,"POSTE (3)"]
["DEPLACEMENT LIVRAISON",null,null,null,null,null,null,null,null,0,null,0,null,"DEPLACEMENT LIVRAISON",null,0,null,null,0,"POSTE (3)"]
["FRAIS REPAS COMMERCIAUX",null,null,null,null,null,null,null,16,0,null,0,null,"FRAIS REPAS COMMERCIAUX",null,0,null,16,0,"POSTE (3)"]
["FRAIS REPAS CHANTIER",null,null,null,null,null,null,null,16,0,null,0,null,"FRAIS REPAS CHANTIER",null,0,null,16,0,"POSTE (3)"]
["HOTEL COMMERCIAUX",null,null,null,null,null,null,null,null,0,null,0,null,"HOTEL COMMERCIAUX",null,0,null,null,0,"POSTE (3)"]
["HOTEL CHANTIER",null,null,null,null,null,null,null,null,0,null,0,null,"HOTEL CHANTIER",null,0,null,null,0,"POSTE (3)"]
["LOCATION VEHICULE",null,null,null,null,null,null,null,null,0,null,0,null,"LOCATION VEHICULE",null,0,null,null,0,"POSTE (3)"]
["LOCATION ENGIN LEVAGE 1",null,null,null,null,null,null,null,null,0,null,0,null,"LOCATION ENGIN LEVAGE 1",null,0,null,null,0,"POSTE (3)"]
["LOCATION ENGIN LEVAGE 2",null,null,null,null,null,null,null,null,0,null,0,null,"LOCATION ENGIN LEVAGE 2",null,0,null,null,0,"POSTE (3)"]
["LOCATION ENGIN LEVAGE 3",null,null,null,null,null,null,null,null,0,null,0,null,"LOCATION ENGIN LEVAGE 3",null,0,null,null,0,"POSTE (3)"]
["AUTRE",null,null,null,null,null,null,null,null,0,null,0,null,"AUTRE",null,0,null,null,0,"POSTE (3)"]
[null,null,null,null,null,null,null,null,null,"Total coût frais","Marge Totale","Total vendu frais",null,null,null,null,null,"Total frais","Marge sur le prix vendu"]
[null,null,null,null,null,null,null,null,null,{"$f":"SUM(J72:J85)","v":0},{"$f":"(L87-J87)/L87","v":{"$error":"#DIV/0!"}},{"$f":"SUM(L72:L85)","v":0},null,null,null,null,null,{"$f":"SUM(S72:S85)","v":0},{"$f":"(L87-R87)/L87","v":{"$error":"#DIV/0!"}}]
[]
["COUT TOTAL POSTE:",null,null,{"$f":"+J87+J68+J53","v":0},null,null,null,null,null,null,null,null,null,null,null,{"$f":"\"Cout Total\"&\" \"&RIGHT(CELL(\"filename\",A1),LEN(CELL(\"filename\",A1))-SEARCH(\"]\",CELL(\"filename\",A1)))","v":"Cout Total POSTE (3)"},{"$f":"R87+S68+T53","v":9}]
["MARGE MOYENNE POSTE:",null,null,{"$f":"D92-D89/D92","v":{"$error":"#DIV/0!"}},null,null,null,null,null,null,null,null,null,null,null,{"$f":"\"Marge sur prix de vente initial\"&\" \"&RIGHT(CELL(\"filename\",A1),LEN(CELL(\"filename\",A1))-SEARCH(\"]\",CELL(\"filename\",A1)))","v":"Marge sur prix de vente initial POSTE (3)"},{"$f":"(D92-Q89)/D92","v":{"$error":"#DIV/0!"}}]
["FACTEUR RISQUE:",null,null,0.03]
["PRIX DE VENTE DU POSTE:",null,null,{"$f":"(1+D91)*(L87+L68+L53)","v":0}]

{"sheet":"POSTE (4)","index":4,"n_rows":92,"n_cols":23,"rows_kept":92,"cut":false,"hidden":false,"merged":[[0,0,0,11],[1,1,1,2],[1,4,1,11],[2,1,2,2],[2,4,2,11],[3,0,3,11],[10,0,10,11],[11,0,11,11],[12,0,12,11],[13,0,13,11],[14,0,14,11],[15,0,15,11],[4,0,4,11],[5,0,5,11],[6,0,6,11],[7,0,7,11],[8,0,8,11],[9,0,9,11],[21,2,21,5],[22,2,22,5],[23,2,23,5],[24,2,24,5],[25,2,25,5],[26,2,26,5],[16,0,16,11],[17,0,17,11],[17,13,17,20],[18,2,18,5],[19,2,19,5],[20,2,20,5],[33,2,33,5],[34,2,34,5],[35,2,35,5],[36,2,36,5],[37,2,37,5],[38,2,38,5],[27,2,27,5],[28,2,28,5],[29,2,29,5],[30,2,30,5],[31,2,31,5],[32,2,32,5],[45,2,45,5],[46,2,46,5],[47,2,47,5],[48,2,48,5],[49,2,49,5],[50,2,50,5],[39,2,39,5],[40,2,40,5],[41,2,41,5],[42,2,42,5],[43,2,43,5],[44,2,44,5],[56,0,56,1],[56,2,56,6],[56,13,56,14],[57,0,57,1],[57,2,57,6],[57,13,57,14],[51,0,52,8],[51,13,52,18],[53,0,53,11],[54,0,54,11],[54,13,54,19],[55,2,55,6],[60,0,60,1],[60,2,60,6],[60,13,60,14],[61,0,61,1],[61,2,61,6],[61,13,61,14],[58,0,58,1],[58,2,58,6],[58,13,58,14],[59,0,59,1],[59,2,59,6],[59,13,59,14],[64,0,64,1],[64,2,64,6],[64,13,64,14],[65,0,65,1],[65,2,65,6],[65,13,65,14],[62,0,62,1],[62,2,62,6],[62,13,62,14],[63,0,63,1],[63,2,63,6],[63,13,63,14],[68,0,68,11],[69,0,69,11],[69,13,69,19],[70,2,70,6],[71,0,71,1],[71,2,71,6],[71,13,71,14],[66,0,67,6],[66,7,66,8],[66,13,67,15],[66,16,66,17],[67,7,67,8],[67,16,67,17],[74,0,74,1],[74,2,74,6],[74,13,74,14],[75,0,75,1],[75,2,75,6],[75,13,75,14],[72,0,72,1],[72,2,72,6],[72,13,72,14],[73,0,73,1],[73,2,73,6],[73,13,73,14],[78,0,78,1],[78,2,78,6],[78,13,78,14],[79,0,79,1],[79,2,79,6],[79,13,79,14],[76,0,76,1],[76,2,76,6],[76,13,76,14],[77,0,77,1],[77,2,77,6],[77,13,77,14],[82,0,82,1],[82,2,82,6],[82,13,82,14],[83,0,83,1],[83,2,83,6],[83,13,83,14],[80,0,80,1],[80,2,80,6],[80,13,80,14],[81,0,81,1],[81,2,81,6],[81,13,81,14],[89,0,89,2],[90,0,90,2],[91,0,91,2],[84,0,84,1],[84,2,84,6],[84,13,84,14],[85,0,86,8],[85,13,86,16],[88,0,88,2]]}
["DEVIS INTERNE"]
["N° DEVIS:",null,null,"CLIENT:"]
["DATE:",null,null,"DESIGNATION:"]
[]
[{"$f":"RIGHT(CELL(\"filename\",A1),LEN(CELL(\"filename\",A1))-SEARCH(\"]\",CELL(\"filename\",A1)))","v":"POSTE (4)"}]
["Comprenant:"]
[]
[]
[]
[]
[]
[]
[]
[]
[]
[]
[]
["FOURNITURES | Prévisionnel",null,null,null,null,null,null,null,null,null,null,null,null,"FOURNITURES | Réel"]
["Fournisseur","Ref","DESIGNATION",null,null,null,"Unité","Qté","P.U. HT","P.T. HT","Coef multi","P.V. Ligne",null,"Fournisseur","Ref","DESIGNATION","Unité","Qté","P.U. HT","P.T. HT","Poste"]
[null,null,null,null,null,null,null,null,null,{"$f":"I20*H20","v":0},null,{"$f":"K20*J20","v":0},null,{"$f":"RIGHT($A$5,3)&N19","v":"(4)Fournisseur"},{"$f":"RIGHT($A$5,3)&O19","v":"(4)Ref"},"(4)DESIGNATION","g",4,1,{"$f":"S20*R20","v":4},{"$f":"A$5","v":"POSTE (4)"},null,{"$f":"COUNTIF(R$20:R20,\">0\")+MAX('POSTE (3)'!W:W)","v":7}]
[null,null,null,null,null,null,null,null,null,{"$f":"I21*H21","v":0},null,{"$f":"K21*J21","v":0},null,"(4)Fournisseur2","(4)Ref2","(4)DESIGNATION2","g",4,1,{"$f":"S21*R21","v":4},"POSTE (4)",null,{"$f":"COUNTIF(R$20:R21,\">0\")+MAX('POSTE (3)'!W:W)","v":8}]
[null,null,null,null,null,null,null,null,null,0,null,0,null,"(4)Fournisseur3","(4)Ref3","(4)DESIGNATION3","g",4,1,4,"POSTE (4)",null,{"$f":"COUNTIF(R$20:R22,\">0\")+MAX('POSTE (3)'!W:W)","v":9}]
[null,null,null,null,null,null,null,null,null,0,null,0,null,"(4)Fournisseur4","(4)Ref4","(4)DESIGNATION4","g",4,1,4,"POSTE (4)",null,{"$f":"COUNTIF(R$20:R23,\">0\")+MAX('POSTE (3)'!W:W)","v":10}]
[null,null,null,null,null,null,null,null,null,0,null,0,null,null,null,null,null,null,null,null,null,null,{"$f":"COUNTIF(R$20:R24,\">0\")+MAX('POSTE (3)'!W:W)","v":10}]
[null,null,null,null,null,null,null,null,null,0,null,0,null,null,null,null,null,null,null,null,null,null,{"$f":"COUNTIF(R$20:R25,\">0\")+MAX('POSTE (3)'!W:W)","v":10}]
[null,null,null,null,null,null,null,null,null,0,null,0,null,null,null,null,null,null,null,null,null,null,{"$f":"COUNTIF(R$20:R26,\">0\")+MAX('POSTE (3)'!W:W)","v":10}]
[null,null,null,null,null,null,null,null,null,0,null,0,null,null,null,null,null,null,null,null,null,null,{"$f":"COUNTIF(R$20:R27,\">0\")+MAX('POSTE (3)'!W:W)","v":10}]
[null,null,null,null,null,null,null,null,null,0,null,0,null,null,null,null,null,null,null,null,null,null,{"$f":"COUNTIF(R$20:R28,\">0\")+MAX('POSTE (3)'!W:W)","v":10}]
[null,null,null,null,null,null,null,null,null,0,null,0,null,null,null,null,null,null,null,null,null,null,{"$f":"COUNTIF(R$20:R29,\">0\")+MAX('POSTE (3)'!W:W)","v":10}]
[null,null,null,null,null,null,null,null,null,0,null,0,null,null,null,null,null,null,null,null,null,null,{"$f":"COUNTIF(R$20:R30,\">0\")+MAX('POSTE (3)'!W:W)","v":10}]
[null,null,null,null,null,null,null,null,null,0,null,0,null,null,null,null,null,null,null,null,null,null,{"$f":"COUNTIF(R$20:R31,\">0\")+MAX('POSTE (3)'!W:W)","v":10}]
[null,null,null,null,null,null,null,null,null,0,null,0,null,null,null,null,null,null,null,null,null,null,{"$f":"COUNTIF(R$20:R32,\">0\")+MAX('POSTE (3)'!W:W)","v":10}]
[null,null,null,null,null,null,null,null,null,0,null,0,null,null,null,null,null,null,null,null,null,null,{"$f":"COUNTIF(R$20:R33,\">0\")+MAX('POSTE (3)'!W:W)","v":10}]
[null,null,null,null,null,null,null,null,null,0,null,0,null,null,null,null,null,null,null,null,null,null,{"$f":"COUNTIF(R$20:R34,\">0\")+MAX('POSTE (3)'!W:W)","v":10}]
[null,null,null,null,null,null,null,null,null,0,null,0,null,null,null,null,null,null,null,null,null,null,{"$f":"COUNTIF(R$20:R35,\">0\")+MAX('POSTE (3)'!W:W)","v":10}]
[null,null,null,null,null,null,null,null,null,0,null,0,null,null,null,null,null,null,null,null,null,null,{"$f":"COUNTIF(R$20:R36,\">0\")+MAX('POSTE (3)'!W:W)","v":10}]
[null,null,null,null,null,null,null,null,null,0,null,0,null,null,null,null,null,null,null,null,null,null,{"$f":"COUNTIF(R$20:R37,\">0\")+MAX('POSTE (3)'!W:W)","v":10}]
[null,null,null,null,null,null,null,null,null,0,null,0,null,null,null,null,null,null,null,null,null,null,{"$f":"COUNTIF(R$20:R38,\">0\")+MAX('POSTE (3)'!W:W)","v":10}]
[null,null,null,null,null,null,null,null,null,0,null,0,null,null,null,null,null,null,null,null,null,null,{"$f":"COUNTIF(R$20:R39,\">0\")+MAX('POSTE (3)'!W:W)","v":10}]
[null,null,null,null,null,null,null,null,null,0,null,0,null,null,null,null,null,null,null,null,null,null,{"$f":"COUNTIF(R$20:R40,\">0\")+MAX('POSTE (3)'!W:W)","v":10}]
[null,null,null,null,null,null,null,null,null,0,null,0,null,null,null,null,null,null,null,null,null,null,{"$f":"COUNTIF(R$20:R41,\">0\")+MAX('POSTE (3)'!W:W)","v":10}]
[null,null,null,null,null,null,null,null,null,0,null,0,null,null,null,null,null,null,null,null,null,null,{"$f":"COUNTIF(R$20:R42,\">0\")+MAX('POSTE (3)'!W:W)","v":10}]
[null,null,null,null,null,null,null,null,null,0,null,0,null,null,null,null,null,null,null,null,null,null,{"$f":"COUNTIF(R$20:R43,\">0\")+MAX('POSTE (3)'!W:W)","v":10}]
[null,null,null,null,null,null,null,null,null,0,null,0,null,null,null,null,null,null,null,null,null,null,{"$f":"COUNTIF(R$20:R44,\">0\")+MAX('POSTE (3)'!W:W)","v":10}]
[null,null,null,null,null,null,null,null,null,0,null,0,null,null,null,null,null,null,null,null,null,null,{"$f":"COUNTIF(R$20:R45,\">0\")+MAX('POSTE (3)'!W:W)","v":10}]
[null,null,null,null,null,null,null,null,null,0,null,0,null,null,null,null,null,null,null,null,null,null,{"$f":"COUNTIF(R$20:R46,\">0\")+MAX('POSTE (3)'!W:W)","v":10}]
[null,null,null,null,null,null,null,null,null,0,null,0,null,null,null,null,null,null,null,null,null,null,{"$f":"COUNTIF(R$20:R47,\">0\")+MAX('POSTE (3)'!W:W)","v":10}]
[null,null,null,null,null,null,null,null,null,0,null,0,null,null,null,null,null,null,null,null,null,null,{"$f":"COUNTIF(R$20:R48,\">0\")+MAX('POSTE (3)'!W:W)","v":10}]
[null,null,null,null,null,null,null,null,null,0,null,0,null,null,null,null,null,null,null,null,null,null,{"$f":"COUNTIF(R$20:R49,\">0\")+MAX('POSTE (3)'!W:W)","v":10}]
[null,null,null,null,null,null,null,null,null,0,null,0,null,null,null,null,null,null,null,null,null,null,{"$f":"COUNTIF(R$20:R50,\">0\")+MAX('POSTE (3)'!W:W)","v":10}]
[null,null,null,null,null,null,null,null,null,0,null,0,null,null,null,null,null,null,null,null,null,null,{"$f":"COUNTIF(R$20:R51,\">0\")+MAX('POSTE (3)'!W:W)","v":10}]
[null,null,null,null,null,null,null,null,null,"Total coût fournitures","Marge","Total vendu fournitures",null,null,null,null,null,null,null,"Total coût fournitures","Marge sur le prix vendu"]
[null,null,null,null,null,null,null,null,null,{"$f":"SUM(J20:J51)","v":0},{"$f":"((L53-J53)/L53)","v":{"$error":"#DIV/0!"}},{"$f":"SUM(L20:L51)","v":0},null,null,null,null,null,null,null,{"$f":"SUM(T20:T51)","v":16},{"$f":"((L53-T53)/L53)","v":{"$error":"#DIV/0!"}}]
[]
["MAIN D'ŒUVRE | Prévisionnel",null,null,null,null,null,null,null,null,null,null,null,null,"MAIN D'ŒUVRE | Réel"]
[null,null,"DESIGNATION",null,null,null,null,"Qté","P.U. HT","P.T. HT","Coef multi","P.V. Ligne",null,null,null,"DESIGNATION","Qté","P.U. HT","P.T. HT","Poste"]
["DEVIS",null,null,null,null,null,null,null,60,{"$f":"+I57*H57","v":0},null,{"$f":"K57*J57","v":0},null,"DEVIS",null,null,null,60,{"$f":"+R57*Q57","v":0},{"$f":"A$5","v":"POSTE (4)"}]
["RELEVES",null,null,null,null,null,null,null,60,{"$f":"+I58*H58","v":0},null,{"$f":"K58*J58","v":0},null,"RELEVES",null,{"$f":"C58","v":0},null,60,{"$f":"+R58*Q58","v":0},"POSTE (4)"]
["ETUDE",null,null,null,null,null,null,null,60,0,null,{"$f":"K59*J59","v":0},null,"ETUDE",null,0,null,60,0,"POSTE (4)"]
["PLASMA",null,null,null,null,null,null,null,50,0,null,0,null,"PLASMA",null,0,null,50,0,"POSTE (4)"]
["DEBIT",null,null,null,null,null,null,null,38,0,null,0,null,"DEBIT",null,0,null,38,0,"POSTE (4)"]
["PLIAGE",null,null,null,null,null,null,null,38,0,null,0,null,"PLIAGE",null,0,null,38,0,"POSTE (4)"]
["ATELIER",null,null,null,null,null,null,null,38,0,null,0,null,"ATELIER",null,0,null,38,0,"POSTE (4)"]
["Heures sur Chantier",null,null,null,null,null,null,null,38,0,null,0,null,"Heures sur Chantier",null,0,null,38,0,"POSTE (4)"]
["AUTRE",null,null,null,null,null,null,null,null,0,null,0,null,"AUTRE",null,0,null,null,0,"POSTE (4)"]
["AUTRE",null,null,null,null,null,null,null,null,0,null,0,null,"AUTRE",null,0,null,null,0,"POSTE (4)"]
[null,null,null,null,null,null,null,"Nbre heures mobilisation technicien",null,"Total coût MO","Marge totale","Total vendu MO",null,null,null,null,"Nbre heures mobilisation technicien",null,"Total coût MO","Marge sur le prix vendu"]
[null,null,null,null,null,null,null,{"$f":"SUM(H61:H64)","v":0},null,{"$f":"SUM(J57:J66)","v":0},{"$f":"((L68-J68)/L68)","v":{"$error":"#DIV/0!"}},{"$f":"SUM(L57:L66)","v":0},null,null,null,null,{"$f":"SUM(Q61:Q64)","v":0},null,{"$f":"SUM(S57:S66)","v":0},{"$f":"((L68-S68)/L68)","v":{"$error":"#DIV/0!"}}]
[]
["FRAIS | Prévisionnel",null,null,null,null,null,null,null,null,null,null,null,null,"FRAIS | Réel"]
[null,null,"DESIGNATION",null,null,null,null,"Qté","P.U.","Coût Ligne","Coef multi","P.V. Ligne",null,null,null,"DESIGNATION","Qté","P.U.","Coût Ligne","Poste"]
["DEPLACEMENT DEVIS",null,null,null,null,null,null,null,null,{"$f":"+I72*H72","v":0},null,{"$f":"K72*J72","v":0},null,"DEPLACEMENT DEVIS",null,{"$f":"C72","v":0},null,null,{"$f":"+R72*Q72","v":0},{"$f":"A$5","v":"POSTE (4)"}]
["DEPLACEMENT RELEVES",null,null,null,null,null,null,null,null,{"$f":"+I73*H73","v":0},null,{"$f":"K73*J73","v":0},null,"DEPLACEMENT RELEVES",null,{"$f":"C73","v":0},null,null,{"$f":"+R73*Q73","v":0},{"$f":"A$5","v":"POSTE (4)"}]
["DEPLACEMENT SUIVI PROJET",null,null,null,null,null,null,null,null,0,null,{"$f":"K74*J74","v":0},null,"DEPLACEMENT SUIVI PROJET",null,0,null,null,0,"POSTE (4)"]
["DEPLACEMENT CHANTIER",null,null,null,null,null,null,null,null,0,null,0,null,"DEPLACEMENT CHANTIER",null,0,null,null,0,"POSTE (4)"]
["DEPLACEMENT LIVRAISON",null,null,null,null,null,null,null,null,0,null,0,null,"DEPLACEMENT LIVRAISON",null,0,null,null,0,"POSTE (4)"]
["FRAIS REPAS COMMERCIAUX",null,null,null,null,null,null,null,16,0,null,0,null,"FRAIS REPAS COMMERCIAUX",null,0,null,16,0,"POSTE (4)"]
["FRAIS REPAS CHANTIER",null,null,null,null,null,null,null,16,0,null,0,null,"FRAIS REPAS CHANTIER",null,0,null,16,0,"POSTE (4)"]
["HOTEL COMMERCIAUX",null,null,null,null,null,null,null,null,0,null,0,null,"HOTEL COMMERCIAUX",null,0,null,null,0,"POSTE (4)"]
["HOTEL CHANTIER",null,null,null,null,null,null,null,null,0,null,0,null,"HOTEL CHANTIER",null,0,null,null,0,"POSTE (4)"]
["LOCATION VEHICULE",null,null,null,null,null,null,null,null,0,null,0,null,"LOCATION VEHICULE",null,0,null,null,0,"POSTE (4)"]
["LOCATION ENGIN LEVAGE 1",null,null,null,null,null,null,null,null,0,null,0,null,"LOCATION ENGIN LEVAGE 1",null,0,null,null,0,"POSTE (4)"]
["LOCATION ENGIN LEVAGE 2",null,null,null,null,null,null,null,null,0,null,0,null,"LOCATION ENGIN LEVAGE 2",null,0,null,null,0,"POSTE (4)"]
["LOCATION ENGIN LEVAGE 3",null,null,null,null,null,null,null,null,0,null,0,null,"LOCATION ENGIN LEVAGE 3",null,0,null,null,0,"POSTE (4)"]
["AUTRE",null,null,null,null,null,null,null,null,0,null,0,null,"AUTRE",null,0,null,null,0,"POSTE (4)"]
[null,null,null,null,null,null,null,null,null,"Total coût frais","Marge Totale","Total vendu frais",null,null,null,null,null,"Total frais","Marge sur le prix vendu"]
[null,null,null,null,null,null,null,null,null,{"$f":"SUM(J72:J85)","v":0},{"$f":"(L87-J87)/L87","v":{"$error":"#DIV/0!"}},{"$f":"SUM(L72:L85)","v":0},null,null,null,null,null,{"$f":"SUM(S72:S85)","v":0},{"$f":"(L87-R87)/L87","v":{"$error":"#DIV/0!"}}]
[]
["COUT TOTAL POSTE:",null,null,{"$f":"+J87+J68+J53","v":0},null,null,null,null,null,null,null,null,null,null,null,{"$f":"\"Cout Total\"&\" \"&RIGHT(CELL(\"filename\",A1),LEN(CELL(\"filename\",A1))-SEARCH(\"]\",CELL(\"filename\",A1)))","v":"Cout Total POSTE (4)"},{"$f":"R87+S68+T53","v":16}]
["MARGE MOYENNE POSTE:",null,null,{"$f":"D92-D89/D92","v":{"$error":"#DIV/0!"}},null,null,null,null,null,null,null,null,null,null,null,{"$f":"\"Marge sur prix de vente initial\"&\" \"&RIGHT(CELL(\"filename\",A1),LEN(CELL(\"filename\",A1))-SEARCH(\"]\",CELL(\"filename\",A1)))","v":"Marge sur prix de vente initial POSTE (4)"},{"$f":"(D92-Q89)/D92","v":{"$error":"#DIV/0!"}}]
["FACTEUR RISQUE:",null,null,0.03]
["PRIX DE VENTE DU POSTE:",null,null,{"$f":"(1+D91)*(L87+L68+L53)","v":0}]

{"sheet":"POSTE (5)","index":5,"n_rows":92,"n_cols":23,"rows_kept":92,"cut":false,"hidden":false,"merged":[[0,0,0,11],[1,1,1,2],[1,4,1,11],[2,1,2,2],[2,4,2,11],[3,0,3,11],[10,0,10,11],[11,0,11,11],[12,0,12,11],[13,0,13,11],[14,0,14,11],[15,0,15,11],[4,0,4,11],[5,0,5,11],[6,0,6,11],[7,0,7,11],[8,0,8,11],[9,0,9,11],[21,2,21,5],[22,2,22,5],[23,2,23,5],[24,2,24,5],[25,2,25,5],[26,2,26,5],[16,0,16,11],[17,0,17,11],[17,13,17,20],[18,2,18,5],[19,2,19,5],[20,2,20,5],[33,2,33,5],[34,2,34,5],[35,2,35,5],[36,2,36,5],[37,2,37,5],[38,2,38,5],[27,2,27,5],[28,2,28,5],[29,2,29,5],[30,2,30,5],[31,2,31,5],[32,2,32,5],[45,2,45,5],[46,2,46,5],[47,2,47,5],[48,2,48,5],[49,2,49,5],[50,2,50,5],[39,2,39,5],[40,2,40,5],[41,2,41,5],[42,2,42,5],[43,2,43,5],[44,2,44,5],[56,0,56,1],[56,2,56,6],[56,13,56,14],[57,0,57,1],[57,2,57,6],[57,13,57,14],[51,0,52,8],[51,13,52,18],[53,0,53,11],[54,0,54,11],[54,13,54,19],[55,2,55,6],[60,0,60,1],[60,2,60,6],[60,13,60,14],[61,0,61,1],[61,2,61,6],[61,13,61,14],[58,0,58,1],[58,2,58,6],[58,13,58,14],[59,0,59,1],[59,2,59,6],[59,13,59,14],[64,0,64,1],[64,2,64,6],[64,13,64,14],[65,0,65,1],[65,2,65,6],[65,13,65,14],[62,0,62,1],[62,2,62,6],[62,13,62,14],[63,0,63,1],[63,2,63,6],[63,13,63,14],[68,0,68,11],[69,0,69,11],[69,13,69,19],[70,2,70,6],[71,0,71,1],[71,2,71,6],[71,13,71,14],[66,0,67,6],[66,7,66,8],[66,13,67,15],[66,16,66,17],[67,7,67,8],[67,16,67,17],[74,0,74,1],[74,2,74,6],[74,13,74,14],[75,0,75,1],[75,2,75,6],[75,13,75,14],[72,0,72,1],[72,2,72,6],[72,13,72,14],[73,0,73,1],[73,2,73,6],[73,13,73,14],[78,0,78,1],[78,2,78,6],[78,13,78,14],[79,0,79,1],[79,2,79,6],[79,13,79,14],[76,0,76,1],[76,2,76,6],[76,13,76,14],[77,0,77,1],[77,2,77,6],[77,13,77,14],[82,0,82,1],[82,2,82,6],[82,13,82,14],[83,0,83,1],[83,2,83,6],[83,13,83,14],[80,0,80,1],[80,2,80,6],[80,13,80,14],[81,0,81,1],[81,2,81,6],[81,13,81,14],[89,0,89,2],[90,0,90,2],[91,0,91,2],[84,0,84,1],[84,2,84,6],[84,13,84,14],[85,0,86,8],[85,13,86,16],[88,0,88,2]]}
["DEVIS INTERNE"]
["N° DEVIS:",null,null,"CLIENT:"]
["DATE:",null,null,"DESIGNATION:"]
[]
[{"$f":"RIGHT(CELL(\"filename\",A1),LEN(CELL(\"filename\",A1))-SEARCH(\"]\",CELL(\"filename\",A1)))","v":"POSTE (5)"}]
["Comprenant:"]
[]
[]
[]
[]
[]
[]
[]
[]
[]
[]
[]
["FOURNITURES | Prévisionnel",null,null,null,null,null,null,null,null,null,null,null,null,"FOURNITURES | Réel"]
["Fournisseur","Ref","DESIGNATION",null,null,null,"Unité","Qté","P.U. HT","P.T. HT","Coef multi","P.V. Ligne",null,"Fournisseur","Ref","DESIGNATION","Unité","Qté","P.U. HT","P.T. HT","Poste"]
[null,null,null,null,null,null,null,null,null,{"$f":"I20*H20","v":0},null,{"$f":"K20*J20","v":0},null,{"$f":"RIGHT($A$5,3)&N19","v":"(5)Fournisseur"},{"$f":"RIGHT($A$5,3)&O19","v":"(5)Ref"},"(5)DESIGNATION","m",5,1,{"$f":"S20*R20","v":5},{"$f":"A$5","v":"POSTE (5)"},null,{"$f":"COUNTIF(R$20:R20,\">0\")+MAX('POSTE (4)'!W:W)","v":11}]
[null,null,null,null,null,null,null,null,null,{"$f":"I21*H21","v":0},null,{"$f":"K21*J21","v":0},null,"(5)Fournisseur2","(5)Ref2","(5)DESIGNATION2","m",5,1,{"$f":"S21*R21","v":5},"POSTE (5)",null,{"$f":"COUNTIF(R$20:R21,\">0\")+MAX('POSTE (4)'!W:W)","v":12}]
[null,null,null,null,null,null,null,null,null,0,null,0,null,"(5)Fournisseur3","(5)Ref3","(5)DESIGNATION3","m",5,1,5,"POSTE (5)",null,{"$f":"COUNTIF(R$20:R22,\">0\")+MAX('POSTE (4)'!W:W)","v":13}]
[null,null,null,null,null,null,null,null,null,0,null,0,null,"(5)Fournisseur4","(5)Ref4","(5)DESIGNATION4","m",5,1,5,"POSTE (5)",null,{"$f":"COUNTIF(R$20:R23,\">0\")+MAX('POSTE (4)'!W:W)","v":14}]
[null,null,null,null,null,null,null,null,null,0,null,0,null,"(5)Fournisseur5","(5)Ref5","(5)DESIGNATION5","m",5,1,5,"POSTE (5)",null,{"$f":"COUNTIF(R$20:R24,\">0\")+MAX('POSTE (4)'!W:W)","v":15}]
[null,null,null,null,null,null,null,null,null,0,null,0,null,null,null,null,null,null,null,null,null,null,{"$f":"COUNTIF(R$20:R25,\">0\")+MAX('POSTE (4)'!W:W)","v":15}]
[null,null,null,null,null,null,null,null,null,0,null,0,null,null,null,null,null,null,null,null,null,null,{"$f":"COUNTIF(R$20:R26,\">0\")+MAX('POSTE (4)'!W:W)","v":15}]
[null,null,null,null,null,null,null,null,null,0,null,0,null,null,null,null,null,null,null,null,null,null,{"$f":"COUNTIF(R$20:R27,\">0\")+MAX('POSTE (4)'!W:W)","v":15}]
[null,null,null,null,null,null,null,null,null,0,null,0,null,null,null,null,null,null,null,null,null,null,{"$f":"COUNTIF(R$20:R28,\">0\")+MAX('POSTE (4)'!W:W)","v":15}]
[null,null,null,null,null,null,null,null,null,0,null,0,null,null,null,null,null,null,null,null,null,null,{"$f":"COUNTIF(R$20:R29,\">0\")+MAX('POSTE (4)'!W:W)","v":15}]
[null,null,null,null,null,null,null,null,null,0,null,0,null,null,null,null,null,null,null,null,null,null,{"$f":"COUNTIF(R$20:R30,\">0\")+MAX('POSTE (4)'!W:W)","v":15}]
[null,null,null,null,null,null,null,null,null,0,null,0,null,null,null,null,null,null,null,null,null,null,{"$f":"COUNTIF(R$20:R31,\">0\")+MAX('POSTE (4)'!W:W)","v":15}]
[null,null,null,null,null,null,null,null,null,0,null,0,null,null,null,null,null,null,null,null,null,null,{"$f":"COUNTIF(R$20:R32,\">0\")+MAX('POSTE (4)'!W:W)","v":15}]
[null,null,null,null,null,null,null,null,null,0,null,0,null,null,null,null,null,null,null,null,null,null,{"$f":"COUNTIF(R$20:R33,\">0\")+MAX('POSTE (4)'!W:W)","v":15}]
[null,null,null,null,null,null,null,null,null,0,null,0,null,null,null,null,null,null,null,null,null,null,{"$f":"COUNTIF(R$20:R34,\">0\")+MAX('POSTE (4)'!W:W)","v":15}]
[null,null,null,null,null,null,null,null,null,0,null,0,null,null,null,null,null,null,null,null,null,null,{"$f":"COUNTIF(R$20:R35,\">0\")+MAX('POSTE (4)'!W:W)","v":15}]
[null,null,null,null,null,null,null,null,null,0,null,0,null,null,null,null,null,null,null,null,null,null,{"$f":"COUNTIF(R$20:R36,\">0\")+MAX('POSTE (4)'!W:W)","v":15}]
[null,null,null,null,null,null,null,null,null,0,null,0,null,null,null,null,null,null,null,null,null,null,{"$f":"COUNTIF(R$20:R37,\">0\")+MAX('POSTE (4)'!W:W)","v":15}]
[null,null,null,null,null,null,null,null,null,0,null,0,null,null,null,null,null,null,null,null,null,null,{"$f":"COUNTIF(R$20:R38,\">0\")+MAX('POSTE (4)'!W:W)","v":15}]
[null,null,null,null,null,null,null,null,null,0,null,0,null,null,null,null,null,null,null,null,null,null,{"$f":"COUNTIF(R$20:R39,\">0\")+MAX('POSTE (4)'!W:W)","v":15}]
[null,null,null,null,null,null,null,null,null,0,null,0,null,null,null,null,null,null,null,null,null,null,{"$f":"COUNTIF(R$20:R40,\">0\")+MAX('POSTE (4)'!W:W)","v":15}]
[null,null,null,null,null,null,null,null,null,0,null,0,null,null,null,null,null,null,null,null,null,null,{"$f":"COUNTIF(R$20:R41,\">0\")+MAX('POSTE (4)'!W:W)","v":15}]
[null,null,null,null,null,null,null,null,null,0,null,0,null,null,null,null,null,null,null,null,null,null,{"$f":"COUNTIF(R$20:R42,\">0\")+MAX('POSTE (4)'!W:W)","v":15}]
[null,null,null,null,null,null,null,null,null,0,null,0,null,null,null,null,null,null,null,null,null,null,{"$f":"COUNTIF(R$20:R43,\">0\")+MAX('POSTE (4)'!W:W)","v":15}]
[null,null,null,null,null,null,null,null,null,0,null,0,null,null,null,null,null,null,null,null,null,null,{"$f":"COUNTIF(R$20:R44,\">0\")+MAX('POSTE (4)'!W:W)","v":15}]
[null,null,null,null,null,null,null,null,null,0,null,0,null,null,null,null,null,null,null,null,null,null,{"$f":"COUNTIF(R$20:R45,\">0\")+MAX('POSTE (4)'!W:W)","v":15}]
[null,null,null,null,null,null,null,null,null,0,null,0,null,null,null,null,null,null,null,null,null,null,{"$f":"COUNTIF(R$20:R46,\">0\")+MAX('POSTE (4)'!W:W)","v":15}]
[null,null,null,null,null,null,null,null,null,0,null,0,null,null,null,null,null,null,null,null,null,null,{"$f":"COUNTIF(R$20:R47,\">0\")+MAX('POSTE (4)'!W:W)","v":15}]
[null,null,null,null,null,null,null,null,null,0,null,0,null,null,null,null,null,null,null,null,null,null,{"$f":"COUNTIF(R$20:R48,\">0\")+MAX('POSTE (4)'!W:W)","v":15}]
[null,null,null,null,null,null,null,null,null,0,null,0,null,null,null,null,null,null,null,null,null,null,{"$f":"COUNTIF(R$20:R49,\">0\")+MAX('POSTE (4)'!W:W)","v":15}]
[null,null,null,null,null,null,null,null,null,0,null,0,null,null,null,null,null,null,null,null,null,null,{"$f":"COUNTIF(R$20:R50,\">0\")+MAX('POSTE (4)'!W:W)","v":15}]
[null,null,null,null,null,null,null,null,null,0,null,0,null,null,null,null,null,null,null,null,null,null,{"$f":"COUNTIF(R$20:R51,\">0\")+MAX('POSTE (4)'!W:W)","v":15}]
[null,null,null,null,null,null,null,null,null,"Total coût fournitures","Marge","Total vendu fournitures",null,null,null,null,null,null,null,"Total coût fournitures","Marge sur le prix vendu"]
[null,null,null,null,null,null,null,null,null,{"$f":"SUM(J20:J51)","v":0},{"$f":"((L53-J53)/L53)","v":{"$error":"#DIV/0!"}},{"$f":"SUM(L20:L51)","v":0},null,null,null,null,null,null,null,{"$f":"SUM(T20:T51)","v":25},{"$f":"((L53-T53)/L53)","v":{"$error":"#DIV/0!"}}]
[]
["MAIN D'ŒUVRE | Prévisionnel",null,null,null,null,null,null,null,null,null,null,null,null,"MAIN D'ŒUVRE | Réel"]
[null,null,"DESIGNATION",null,null,null,null,"Qté","P.U. HT","P.T. HT","Coef multi","P.V. Ligne",null,null,null,"DESIGNATION","Qté","P.U. HT","P.T. HT","Poste"]
["DEVIS",null,null,null,null,null,null,null,60,{"$f":"+I57*H57","v":0},null,{"$f":"K57*J57","v":0},null,"DEVIS",null,null,null,60,{"$f":"+R57*Q57","v":0},{"$f":"A$5","v":"POSTE (5)"}]
["RELEVES",null,null,null,null,null,null,null,60,{"$f":"+I58*H58","v":0},null,{"$f":"K58*J58","v":0},null,"RELEVES",null,{"$f":"C58","v":0},null,60,{"$f":"+R58*Q58","v":0},"POSTE (5)"]
["ETUDE",null,null,null,null,null,null,null,60,0,null,{"$f":"K59*J59","v":0},null,"ETUDE",null,0,null,60,0,"POSTE (5)"]
["PLASMA",null,null,null,null,null,null,null,50,0,null,0,null,"PLASMA",null,0,null,50,0,"POSTE (5)"]
["DEBIT",null,null,null,null,null,null,null,38,0,null,0,null,"DEBIT",null,0,null,38,0,"POSTE (5)"]
["PLIAGE",null,null,null,null,null,null,null,38,0,null,0,null,"PLIAGE",null,0,null,38,0,"POSTE (5)"]
["ATELIER",null,null,null,null,null,null,null,38,0,null,0,null,"ATELIER",null,0,null,38,0,"POSTE (5)"]
["Heures sur Chantier",null,null,null,null,null,null,null,38,0,null,0,null,"Heures sur Chantier",null,0,null,38,0,"POSTE (5)"]
["AUTRE",null,null,null,null,null,null,null,null,0,null,0,null,"AUTRE",null,0,null,null,0,"POSTE (5)"]
["AUTRE",null,null,null,null,null,null,null,null,0,null,0,null,"AUTRE",null,0,null,null,0,"POSTE (5)"]
[null,null,null,null,null,null,null,"Nbre heures mobilisation technicien",null,"Total coût MO","Marge totale","Total vendu MO",null,null,null,null,"Nbre heures mobilisation technicien",null,"Total coût MO","Marge sur le prix vendu"]
[null,null,null,null,null,null,null,{"$f":"SUM(H61:H64)","v":0},null,{"$f":"SUM(J57:J66)","v":0},{"$f":"((L68-J68)/L68)","v":{"$error":"#DIV/0!"}},{"$f":"SUM(L57:L66)","v":0},null,null,null,null,{"$f":"SUM(Q61:Q64)","v":0},null,{"$f":"SUM(S57:S66)","v":0},{"$f":"((L68-S68)/L68)","v":{"$error":"#DIV/0!"}}]
[]
["FRAIS | Prévisionnel",null,null,null,null,null,null,null,null,null,null,null,null,"FRAIS | Réel"]
[null,null,"DESIGNATION",null,null,null,null,"Qté","P.U.","Coût Ligne","Coef multi","P.V. Ligne",null,null,null,"DESIGNATION","Qté","P.U.","Coût Ligne","Poste"]
["DEPLACEMENT DEVIS",null,null,null,null,null,null,null,null,{"$f":"+I72*H72","v":0},null,{"$f":"K72*J72","v":0},null,"DEPLACEMENT DEVIS",null,{"$f":"C72","v":0},null,null,{"$f":"+R72*Q72","v":0},{"$f":"A$5","v":"POSTE (5)"}]
["DEPLACEMENT RELEVES",null,null,null,null,null,null,null,null,{"$f":"+I73*H73","v":0},null,{"$f":"K73*J73","v":0},null,"DEPLACEMENT RELEVES",null,{"$f":"C73","v":0},null,null,{"$f":"+R73*Q73","v":0},{"$f":"A$5","v":"POSTE (5)"}]
["DEPLACEMENT SUIVI PROJET",null,null,null,null,null,null,null,null,0,null,{"$f":"K74*J74","v":0},null,"DEPLACEMENT SUIVI PROJET",null,0,null,null,0,"POSTE (5)"]
["DEPLACEMENT CHANTIER",null,null,null,null,null,null,null,null,0,null,0,null,"DEPLACEMENT CHANTIER",null,0,null,null,0,"POSTE (5)"]
["DEPLACEMENT LIVRAISON",null,null,null,null,null,null,null,null,0,null,0,null,"DEPLACEMENT LIVRAISON",null,0,null,null,0,"POSTE (5)"]
["FRAIS REPAS COMMERCIAUX",null,null,null,null,null,null,null,16,0,null,0,null,"FRAIS REPAS COMMERCIAUX",null,0,null,16,0,"POSTE (5)"]
["FRAIS REPAS CHANTIER",null,null,null,null,null,null,null,16,0,null,0,null,"FRAIS REPAS CHANTIER",null,0,null,16,0,"POSTE (5)"]
["HOTEL COMMERCIAUX",null,null,null,null,null,null,null,null,0,null,0,null,"HOTEL COMMERCIAUX",null,0,null,null,0,"POSTE (5)"]
["HOTEL CHANTIER",null,null,null,null,null,null,null,null,0,null,0,null,"HOTEL CHANTIER",null,0,null,null,0,"POSTE (5)"]
["LOCATION VEHICULE",null,null,null,null,null,null,null,null,0,null,0,null,"LOCATION VEHICULE",null,0,null,null,0,"POSTE (5)"]
["LOCATION ENGIN LEVAGE 1",null,null,null,null,null,null,null,null,0,null,0,null,"LOCATION ENGIN LEVAGE 1",null,0,null,null,0,"POSTE (5)"]
["LOCATION ENGIN LEVAGE 2",null,null,null,null,null,null,null,null,0,null,0,null,"LOCATION ENGIN LEVAGE 2",null,0,null,null,0,"POSTE (5)"]
["LOCATION ENGIN LEVAGE 3",null,null,null,null,null,null,null,null,0,null,0,null,"LOCATION ENGIN LEVAGE 3",null,0,null,null,0,"POSTE (5)"]
["AUTRE",null,null,null,null,null,null,null,null,0,null,0,null,"AUTRE",null,0,null,null,0,"POSTE (5)"]
[null,null,null,null,null,null,null,null,null,"Total coût frais","Marge Totale","Total vendu frais",null,null,null,null,null,"Total frais","Marge sur le prix vendu"]
[null,null,null,null,null,null,null,null,null,{"$f":"SUM(J72:J85)","v":0},{"$f":"(L87-J87)/L87","v":{"$error":"#DIV/0!"}},{"$f":"SUM(L72:L85)","v":0},null,null,null,null,null,{"$f":"SUM(S72:S85)","v":0},{"$f":"(L87-R87)/L87","v":{"$error":"#DIV/0!"}}]
[]
["COUT TOTAL POSTE:",null,null,{"$f":"+J87+J68+J53","v":0},null,null,null,null,null,null,null,null,null,null,null,{"$f":"\"Cout Total\"&\" \"&RIGHT(CELL(\"filename\",A1),LEN(CELL(\"filename\",A1))-SEARCH(\"]\",CELL(\"filename\",A1)))","v":"Cout Total POSTE (5)"},{"$f":"R87+S68+T53","v":25}]
["MARGE MOYENNE POSTE:",null,null,{"$f":"D92-D89/D92","v":{"$error":"#DIV/0!"}},null,null,null,null,null,null,null,null,null,null,null,{"$f":"\"Marge sur prix de vente initial\"&\" \"&RIGHT(CELL(\"filename\",A1),LEN(CELL(\"filename\",A1))-SEARCH(\"]\",CELL(\"filename\",A1)))","v":"Marge sur prix de vente initial POSTE (5)"},{"$f":"(D92-Q89)/D92","v":{"$error":"#DIV/0!"}}]
["FACTEUR RISQUE:",null,null,0.03]
["PRIX DE VENTE DU POSTE:",null,null,{"$f":"(1+D91)*(L87+L68+L53)","v":0}]

{"sheet":"POSTE (6)","index":6,"n_rows":92,"n_cols":23,"rows_kept":92,"cut":false,"hidden":false,"merged":[[0,0,0,11],[1,1,1,2],[1,4,1,11],[2,1,2,2],[2,4,2,11],[3,0,3,11],[10,0,10,11],[11,0,11,11],[12,0,12,11],[13,0,13,11],[14,0,14,11],[15,0,15,11],[4,0,4,11],[5,0,5,11],[6,0,6,11],[7,0,7,11],[8,0,8,11],[9,0,9,11],[21,2,21,5],[22,2,22,5],[23,2,23,5],[24,2,24,5],[25,2,25,5],[26,2,26,5],[16,0,16,11],[17,0,17,11],[17,13,17,20],[18,2,18,5],[19,2,19,5],[20,2,20,5],[33,2,33,5],[34,2,34,5],[35,2,35,5],[36,2,36,5],[37,2,37,5],[38,2,38,5],[27,2,27,5],[28,2,28,5],[29,2,29,5],[30,2,30,5],[31,2,31,5],[32,2,32,5],[45,2,45,5],[46,2,46,5],[47,2,47,5],[48,2,48,5],[49,2,49,5],[50,2,50,5],[39,2,39,5],[40,2,40,5],[41,2,41,5],[42,2,42,5],[43,2,43,5],[44,2,44,5],[56,0,56,1],[56,2,56,6],[56,13,56,14],[57,0,57,1],[57,2,57,6],[57,13,57,14],[51,0,52,8],[51,13,52,18],[53,0,53,11],[54,0,54,11],[54,13,54,19],[55,2,55,6],[60,0,60,1],[60,2,60,6],[60,13,60,14],[61,0,61,1],[61,2,61,6],[61,13,61,14],[58,0,58,1],[58,2,58,6],[58,13,58,14],[59,0,59,1],[59,2,59,6],[59,13,59,14],[64,0,64,1],[64,2,64,6],[64,13,64,14],[65,0,65,1],[65,2,65,6],[65,13,65,14],[62,0,62,1],[62,2,62,6],[62,13,62,14],[63,0,63,1],[63,2,63,6],[63,13,63,14],[68,0,68,11],[69,0,69,11],[69,13,69,19],[70,2,70,6],[71,0,71,1],[71,2,71,6],[71,13,71,14],[66,0,67,6],[66,7,66,8],[66,13,67,15],[66,16,66,17],[67,7,67,8],[67,16,67,17],[74,0,74,1],[74,2,74,6],[74,13,74,14],[75,0,75,1],[75,2,75,6],[75,13,75,14],[72,0,72,1],[72,2,72,6],[72,13,72,14],[73,0,73,1],[73,2,73,6],[73,13,73,14],[78,0,78,1],[78,2,78,6],[78,13,78,14],[79,0,79,1],[79,2,79,6],[79,13,79,14],[76,0,76,1],[76,2,76,6],[76,13,76,14],[77,0,77,1],[77,2,77,6],[77,13,77,14],[82,0,82,1],[82,2,82,6],[82,13,82,14],[83,0,83,1],[83,2,83,6],[83,13,83,14],[80,0,80,1],[80,2,80,6],[80,13,80,14],[81,0,81,1],[81,2,81,6],[81,13,81,14],[89,0,89,2],[90,0,90,2],[91,0,91,2],[84,0,84,1],[84,2,84,6],[84,13,84,14],[85,0,86,8],[85,13,86,16],[88,0,88,2]]}
["DEVIS INTERNE"]
["N° DEVIS:",null,null,"CLIENT:"]
["DATE:",null,null,"DESIGNATION:"]
[]
[{"$f":"RIGHT(CELL(\"filename\",A1),LEN(CELL(\"filename\",A1))-SEARCH(\"]\",CELL(\"filename\",A1)))","v":"POSTE (6)"}]
["Comprenant:"]
[]
[]
[]
[]
[]
[]
[]
[]
[]
[]
[]
["FOURNITURES | Prévisionnel",null,null,null,null,null,null,null,null,null,null,null,null,"FOURNITURES | Réel"]
["Fournisseur","Ref","DESIGNATION",null,null,null,"Unité","Qté","P.U. HT","P.T. HT","Coef multi","P.V. Ligne",null,"Fournisseur","Ref","DESIGNATION","Unité","Qté","P.U. HT","P.T. HT","Poste"]
[null,null,null,null,null,null,null,null,null,{"$f":"I20*H20","v":0},null,{"$f":"K20*J20","v":0},null,{"$f":"RIGHT($A$5,3)&N19","v":"(6)Fournisseur"},{"$f":"RIGHT($A$5,3)&O19","v":"(6)Ref"},"(6)DESIGNATION","cm",6,1,{"$f":"S20*R20","v":6},{"$f":"A$5","v":"POSTE (6)"},null,{"$f":"COUNTIF(R$20:R20,\">0\")+MAX('POSTE (5)'!W:W)","v":16}]
[null,null,null,null,null,null,null,null,null,{"$f":"I21*H21","v":0},null,{"$f":"K21*J21","v":0},null,"(6)Fournisseur2","(6)Ref2","(6)DESIGNATION2","cm",6,1,{"$f":"S21*R21","v":6},"POSTE (6)",null,{"$f":"COUNTIF(R$20:R21,\">0\")+MAX('POSTE (5)'!W:W)","v":17}]
[null,null,null,null,null,null,null,null,null,0,null,0,null,"(6)Fournisseur3","(6)Ref3","(6)DESIGNATION3","cm",6,1,6,"POSTE (6)",null,{"$f":"COUNTIF(R$20:R22,\">0\")+MAX('POSTE (5)'!W:W)","v":18}]
[null,null,null,null,null,null,null,null,null,0,null,0,null,"(6)Fournisseur4","(6)Ref4","(6)DESIGNATION4","cm",6,1,6,"POSTE (6)",null,{"$f":"COUNTIF(R$20:R23,\">0\")+MAX('POSTE (5)'!W:W)","v":19}]
[null,null,null,null,null,null,null,null,null,0,null,0,null,"(6)Fournisseur5","(6)Ref5","(6)DESIGNATION5","cm",6,1,6,"POSTE (6)",null,{"$f":"COUNTIF(R$20:R24,\">0\")+MAX('POSTE (5)'!W:W)","v":20}]
[null,null,null,null,null,null,null,null,null,0,null,0,null,"(6)Fournisseur6","(6)Ref6","(6)DESIGNATION6","cm",6,1,6,"POSTE (6)",null,{"$f":"COUNTIF(R$20:R25,\">0\")+MAX('POSTE (5)'!W:W)","v":21}]
[null,null,null,null,null,null,null,null,null,0,null,0,null,null,null,null,null,null,null,null,null,null,{"$f":"COUNTIF(R$20:R26,\">0\")+MAX('POSTE (5)'!W:W)","v":21}]
[null,null,null,null,null,null,null,null,null,0,null,0,null,null,null,null,null,null,null,null,null,null,{"$f":"COUNTIF(R$20:R27,\">0\")+MAX('POSTE (5)'!W:W)","v":21}]
[null,null,null,null,null,null,null,null,null,0,null,0,null,null,null,null,null,null,null,null,null,null,{"$f":"COUNTIF(R$20:R28,\">0\")+MAX('POSTE (5)'!W:W)","v":21}]
[null,null,null,null,null,null,null,null,null,0,null,0,null,null,null,null,null,null,null,null,null,null,{"$f":"COUNTIF(R$20:R29,\">0\")+MAX('POSTE (5)'!W:W)","v":21}]
[null,null,null,null,null,null,null,null,null,0,null,0,null,null,null,null,null,null,null,null,null,null,{"$f":"COUNTIF(R$20:R30,\">0\")+MAX('POSTE (5)'!W:W)","v":21}]
[null,null,null,null,null,null,null,null,null,0,null,0,null,null,null,null,null,null,null,null,null,null,{"$f":"COUNTIF(R$20:R31,\">0\")+MAX('POSTE (5)'!W:W)","v":21}]
[null,null,null,null,null,null,null,null,null,0,null,0,null,null,null,null,null,null,null,null,null,null,{"$f":"COUNTIF(R$20:R32,\">0\")+MAX('POSTE (5)'!W:W)","v":21}]
[null,null,null,null,null,null,null,null,null,0,null,0,null,null,null,null,null,null,null,null,null,null,{"$f":"COUNTIF(R$20:R33,\">0\")+MAX('POSTE (5)'!W:W)","v":21}]
[null,null,null,null,null,null,null,null,null,0,null,0,null,null,null,null,null,null,null,null,null,null,{"$f":"COUNTIF(R$20:R34,\">0\")+MAX('POSTE (5)'!W:W)","v":21}]
[null,null,null,null,null,null,null,null,null,0,null,0,null,null,null,null,null,null,null,null,null,null,{"$f":"COUNTIF(R$20:R35,\">0\")+MAX('POSTE (5)'!W:W)","v":21}]
[null,null,null,null,null,null,null,null,null,0,null,0,null,null,null,null,null,null,null,null,null,null,{"$f":"COUNTIF(R$20:R36,\">0\")+MAX('POSTE (5)'!W:W)","v":21}]
[null,null,null,null,null,null,null,null,null,0,null,0,null,null,null,null,null,null,null,null,null,null,{"$f":"COUNTIF(R$20:R37,\">0\")+MAX('POSTE (5)'!W:W)","v":21}]
[null,null,null,null,null,null,null,null,null,0,null,0,null,null,null,null,null,null,null,null,null,null,{"$f":"COUNTIF(R$20:R38,\">0\")+MAX('POSTE (5)'!W:W)","v":21}]
[null,null,null,null,null,null,null,null,null,0,null,0,null,null,null,null,null,null,null,null,null,null,{"$f":"COUNTIF(R$20:R39,\">0\")+MAX('POSTE (5)'!W:W)","v":21}]
[null,null,null,null,null,null,null,null,null,0,null,0,null,null,null,null,null,null,null,null,null,null,{"$f":"COUNTIF(R$20:R40,\">0\")+MAX('POSTE (5)'!W:W)","v":21}]
[null,null,null,null,null,null,null,null,null,0,null,0,null,null,null,null,null,null,null,null,null,null,{"$f":"COUNTIF(R$20:R41,\">0\")+MAX('POSTE (5)'!W:W)","v":21}]
[null,null,null,null,null,null,null,null,null,0,null,0,null,null,null,null,null,null,null,null,null,null,{"$f":"COUNTIF(R$20:R42,\">0\")+MAX('POSTE (5)'!W:W)","v":21}]
[null,null,null,null,null,null,null,null,null,0,null,0,null,null,null,null,null,null,null,null,null,null,{"$f":"COUNTIF(R$20:R43,\">0\")+MAX('POSTE (5)'!W:W)","v":21}]
[null,null,null,null,null,null,null,null,null,0,null,0,null,null,null,null,null,null,null,null,null,null,{"$f":"COUNTIF(R$20:R44,\">0\")+MAX('POSTE (5)'!W:W)","v":21}]
[null,null,null,null,null,null,null,null,null,0,null,0,null,null,null,null,null,null,null,null,null,null,{"$f":"COUNTIF(R$20:R45,\">0\")+MAX('POSTE (5)'!W:W)","v":21}]
[null,null,null,null,null,null,null,null,null,0,null,0,null,null,null,null,null,null,null,null,null,null,{"$f":"COUNTIF(R$20:R46,\">0\")+MAX('POSTE (5)'!W:W)","v":21}]
[null,null,null,null,null,null,null,null,null,0,null,0,null,null,null,null,null,null,null,null,null,null,{"$f":"COUNTIF(R$20:R47,\">0\")+MAX('POSTE (5)'!W:W)","v":21}]
[null,null,null,null,null,null,null,null,null,0,null,0,null,null,null,null,null,null,null,null,null,null,{"$f":"COUNTIF(R$20:R48,\">0\")+MAX('POSTE (5)'!W:W)","v":21}]
[null,null,null,null,null,null,null,null,null,0,null,0,null,null,null,null,null,null,null,null,null,null,{"$f":"COUNTIF(R$20:R49,\">0\")+MAX('POSTE (5)'!W:W)","v":21}]
[null,null,null,null,null,null,null,null,null,0,null,0,null,null,null,null,null,null,null,null,null,null,{"$f":"COUNTIF(R$20:R50,\">0\")+MAX('POSTE (5)'!W:W)","v":21}]
[null,null,null,null,null,null,null,null,null,0,null,0,null,null,null,null,null,null,null,null,null,null,{"$f":"COUNTIF(R$20:R51,\">0\")+MAX('POSTE (5)'!W:W)","v":21}]
[null,null,null,null,null,null,null,null,null,"Total coût fournitures","Marge","Total vendu fournitures",null,null,null,null,null,null,null,"Total coût fournitures","Marge sur le prix vendu"]
[null,null,null,null,null,null,null,null,null,{"$f":"SUM(J20:J51)","v":0},{"$f":"((L53-J53)/L53)","v":{"$error":"#DIV/0!"}},{"$f":"SUM(L20:L51)","v":0},null,null,null,null,null,null,null,{"$f":"SUM(T20:T51)","v":36},{"$f":"((L53-T53)/L53)","v":{"$error":"#DIV/0!"}}]
[]
["MAIN D'ŒUVRE | Prévisionnel",null,null,null,null,null,null,null,null,null,null,null,null,"MAIN D'ŒUVRE | Réel"]
[null,null,"DESIGNATION",null,null,null,null,"Qté","P.U. HT","P.T. HT","Coef multi","P.V. Ligne",null,null,null,"DESIGNATION","Qté","P.U. HT","P.T. HT","Poste"]
["DEVIS",null,null,null,null,null,null,null,60,{"$f":"+I57*H57","v":0},null,{"$f":"K57*J57","v":0},null,"DEVIS",null,null,null,60,{"$f":"+R57*Q57","v":0},{"$f":"A$5","v":"POSTE (6)"}]
["RELEVES",null,null,null,null,null,null,null,60,{"$f":"+I58*H58","v":0},null,{"$f":"K58*J58","v":0},null,"RELEVES",null,{"$f":"C58","v":0},null,60,{"$f":"+R58*Q58","v":0},"POSTE (6)"]
["ETUDE",null,null,null,null,null,null,null,60,0,null,{"$f":"K59*J59","v":0},null,"ETUDE",null,0,null,60,0,"POSTE (6)"]
["PLASMA",null,null,null,null,null,null,null,50,0,null,0,null,"PLASMA",null,0,null,50,0,"POSTE (6)"]
["DEBIT",null,null,null,null,null,null,null,38,0,null,0,null,"DEBIT",null,0,null,38,0,"POSTE (6)"]
["PLIAGE",null,null,null,null,null,null,null,38,0,null,0,null,"PLIAGE",null,0,null,38,0,"POSTE (6)"]
["ATELIER",null,null,null,null,null,null,null,38,0,null,0,null,"ATELIER",null,0,null,38,0,"POSTE (6)"]
["Heures sur Chantier",null,null,null,null,null,null,null,38,0,null,0,null,"Heures sur Chantier",null,0,null,38,0,"POSTE (6)"]
["AUTRE",null,null,null,null,null,null,null,null,0,null,0,null,"AUTRE",null,0,null,null,0,"POSTE (6)"]
["AUTRE",null,null,null,null,null,null,null,null,0,null,0,null,"AUTRE",null,0,null,null,0,"POSTE (6)"]
[null,null,null,null,null,null,null,"Nbre heures mobilisation technicien",null,"Total coût MO","Marge totale","Total vendu MO",null,null,null,null,"Nbre heures mobilisation technicien",null,"Total coût MO","Marge sur le prix vendu"]
[null,null,null,null,null,null,null,{"$f":"SUM(H61:H64)","v":0},null,{"$f":"SUM(J57:J66)","v":0},{"$f":"((L68-J68)/L68)","v":{"$error":"#DIV/0!"}},{"$f":"SUM(L57:L66)","v":0},null,null,null,null,{"$f":"SUM(Q61:Q64)","v":0},null,{"$f":"SUM(S57:S66)","v":0},{"$f":"((L68-S68)/L68)","v":{"$error":"#DIV/0!"}}]
[]
["FRAIS | Prévisionnel",null,null,null,null,null,null,null,null,null,null,null,null,"FRAIS | Réel"]
[null,null,"DESIGNATION",null,null,null,null,"Qté","P.U.","Coût Ligne","Coef multi","P.V. Ligne",null,null,null,"DESIGNATION","Qté","P.U.","Coût Ligne","Poste"]
["DEPLACEMENT DEVIS",null,null,null,null,null,null,null,null,{"$f":"+I72*H72","v":0},null,{"$f":"K72*J72","v":0},null,"DEPLACEMENT DEVIS",null,{"$f":"C72","v":0},null,null,{"$f":"+R72*Q72","v":0},{"$f":"A$5","v":"POSTE (6)"}]
["DEPLACEMENT RELEVES",null,null,null,null,null,null,null,null,{"$f":"+I73*H73","v":0},null,{"$f":"K73*J73","v":0},null,"DEPLACEMENT RELEVES",null,{"$f":"C73","v":0},null,null,{"$f":"+R73*Q73","v":0},{"$f":"A$5","v":"POSTE (6)"}]
["DEPLACEMENT SUIVI PROJET",null,null,null,null,null,null,null,null,0,null,{"$f":"K74*J74","v":0},null,"DEPLACEMENT SUIVI PROJET",null,0,null,null,0,"POSTE (6)"]
["DEPLACEMENT CHANTIER",null,null,null,null,null,null,null,null,0,null,0,null,"DEPLACEMENT CHANTIER",null,0,null,null,0,"POSTE (6)"]
["DEPLACEMENT LIVRAISON",null,null,null,null,null,null,null,null,0,null,0,null,"DEPLACEMENT LIVRAISON",null,0,null,null,0,"POSTE (6)"]
["FRAIS REPAS COMMERCIAUX",null,null,null,null,null,null,null,16,0,null,0,null,"FRAIS REPAS COMMERCIAUX",null,0,null,16,0,"POSTE (6)"]
["FRAIS REPAS CHANTIER",null,null,null,null,null,null,null,16,0,null,0,null,"FRAIS REPAS CHANTIER",null,0,null,16,0,"POSTE (6)"]
["HOTEL COMMERCIAUX",null,null,null,null,null,null,null,null,0,null,0,null,"HOTEL COMMERCIAUX",null,0,null,null,0,"POSTE (6)"]
["HOTEL CHANTIER",null,null,null,null,null,null,null,null,0,null,0,null,"HOTEL CHANTIER",null,0,null,null,0,"POSTE (6)"]
["LOCATION VEHICULE",null,null,null,null,null,null,null,null,0,null,0,null,"LOCATION VEHICULE",null,0,null,null,0,"POSTE (6)"]
["LOCATION ENGIN LEVAGE 1",null,null,null,null,null,null,null,null,0,null,0,null,"LOCATION ENGIN LEVAGE 1",null,0,null,null,0,"POSTE (6)"]
["LOCATION ENGIN LEVAGE 2",null,null,null,null,null,null,null,null,0,null,0,null,"LOCATION ENGIN LEVAGE 2",null,0,null,null,0,"POSTE (6)"]
["LOCATION ENGIN LEVAGE 3",null,null,null,null,null,null,null,null,0,null,0,null,"LOCATION ENGIN LEVAGE 3",null,0,null,null,0,"POSTE (6)"]
["AUTRE",null,null,null,null,null,null,null,null,0,null,0,null,"AUTRE",null,0,null,null,0,"POSTE (6)"]
[null,null,null,null,null,null,null,null,null,"Total coût frais","Marge Totale","Total vendu frais",null,null,null,null,null,"Total frais","Marge sur le prix vendu"]
[null,null,null,null,null,null,null,null,null,{"$f":"SUM(J72:J85)","v":0},{"$f":"(L87-J87)/L87","v":{"$error":"#DIV/0!"}},{"$f":"SUM(L72:L85)","v":0},null,null,null,null,null,{"$f":"SUM(S72:S85)","v":0},{"$f":"(L87-R87)/L87","v":{"$error":"#DIV/0!"}}]
[]
["COUT TOTAL POSTE:",null,null,{"$f":"+J87+J68+J53","v":0},null,null,null,null,null,null,null,null,null,null,null,{"$f":"\"Cout Total\"&\" \"&RIGHT(CELL(\"filename\",A1),LEN(CELL(\"filename\",A1))-SEARCH(\"]\",CELL(\"filename\",A1)))","v":"Cout Total POSTE (6)"},{"$f":"R87+S68+T53","v":36}]
["MARGE MOYENNE POSTE:",null,null,{"$f":"D92-D89/D92","v":{"$error":"#DIV/0!"}},null,null,null,null,null,null,null,null,null,null,null,{"$f":"\"Marge sur prix de vente initial\"&\" \"&RIGHT(CELL(\"filename\",A1),LEN(CELL(\"filename\",A1))-SEARCH(\"]\",CELL(\"filename\",A1)))","v":"Marge sur prix de vente initial POSTE (6)"},{"$f":"(D92-Q89)/D92","v":{"$error":"#DIV/0!"}}]
["FACTEUR RISQUE:",null,null,0.03]
["PRIX DE VENTE DU POSTE:",null,null,{"$f":"(1+D91)*(L87+L68+L53)","v":0}]

{"sheet":"POSTE (7)","index":7,"n_rows":92,"n_cols":23,"rows_kept":92,"cut":false,"hidden":false,"merged":[[0,0,0,11],[1,1,1,2],[1,4,1,11],[2,1,2,2],[2,4,2,11],[3,0,3,11],[10,0,10,11],[11,0,11,11],[12,0,12,11],[13,0,13,11],[14,0,14,11],[15,0,15,11],[4,0,4,11],[5,0,5,11],[6,0,6,11],[7,0,7,11],[8,0,8,11],[9,0,9,11],[21,2,21,5],[22,2,22,5],[23,2,23,5],[24,2,24,5],[25,2,25,5],[26,2,26,5],[16,0,16,11],[17,0,17,11],[17,13,17,20],[18,2,18,5],[19,2,19,5],[20,2,20,5],[33,2,33,5],[34,2,34,5],[35,2,35,5],[36,2,36,5],[37,2,37,5],[38,2,38,5],[27,2,27,5],[28,2,28,5],[29,2,29,5],[30,2,30,5],[31,2,31,5],[32,2,32,5],[45,2,45,5],[46,2,46,5],[47,2,47,5],[48,2,48,5],[49,2,49,5],[50,2,50,5],[39,2,39,5],[40,2,40,5],[41,2,41,5],[42,2,42,5],[43,2,43,5],[44,2,44,5],[56,0,56,1],[56,2,56,6],[56,13,56,14],[57,0,57,1],[57,2,57,6],[57,13,57,14],[51,0,52,8],[51,13,52,18],[53,0,53,11],[54,0,54,11],[54,13,54,19],[55,2,55,6],[60,0,60,1],[60,2,60,6],[60,13,60,14],[61,0,61,1],[61,2,61,6],[61,13,61,14],[58,0,58,1],[58,2,58,6],[58,13,58,14],[59,0,59,1],[59,2,59,6],[59,13,59,14],[64,0,64,1],[64,2,64,6],[64,13,64,14],[65,0,65,1],[65,2,65,6],[65,13,65,14],[62,0,62,1],[62,2,62,6],[62,13,62,14],[63,0,63,1],[63,2,63,6],[63,13,63,14],[68,0,68,11],[69,0,69,11],[69,13,69,19],[70,2,70,6],[71,0,71,1],[71,2,71,6],[71,13,71,14],[66,0,67,6],[66,7,66,8],[66,13,67,15],[66,16,66,17],[67,7,67,8],[67,16,67,17],[74,0,74,1],[74,2,74,6],[74,13,74,14],[75,0,75,1],[75,2,75,6],[75,13,75,14],[72,0,72,1],[72,2,72,6],[72,13,72,14],[73,0,73,1],[73,2,73,6],[73,13,73,14],[78,0,78,1],[78,2,78,6],[78,13,78,14],[79,0,79,1],[79,2,79,6],[79,13,79,14],[76,0,76,1],[76,2,76,6],[76,13,76,14],[77,0,77,1],[77,2,77,6],[77,13,77,14],[82,0,82,1],[82,2,82,6],[82,13,82,14],[83,0,83,1],[83,2,83,6],[83,13,83,14],[80,0,80,1],[80,2,80,6],[80,13,80,14],[81,0,81,1],[81,2,81,6],[81,13,81,14],[89,0,89,2],[90,0,90,2],[91,0,91,2],[84,0,84,1],[84,2,84,6],[84,13,84,14],[85,0,86,8],[85,13,86,16],[88,0,88,2]]}
["DEVIS INTERNE"]
["N° DEVIS:",null,null,"CLIENT:"]
["DATE:",null,null,"DESIGNATION:"]
[]
[{"$f":"RIGHT(CELL(\"filename\",A1),LEN(CELL(\"filename\",A1))-SEARCH(\"]\",CELL(\"filename\",A1)))","v":"POSTE (7)"}]
["Comprenant:"]
[]
[]
[]
[]
[]
[]
[]
[]
[]
[]
[]
["FOURNITURES | Prévisionnel",null,null,null,null,null,null,null,null,null,null,null,null,"FOURNITURES | Réel"]
["Fournisseur","Ref","DESIGNATION",null,null,null,"Unité","Qté","P.U. HT","P.T. HT","Coef multi","P.V. Ligne",null,"Fournisseur","Ref","DESIGNATION","Unité","Qté","P.U. HT","P.T. HT","Poste"]
[null,null,null,null,null,null,null,null,null,{"$f":"I20*H20","v":0},null,{"$f":"K20*J20","v":0},null,{"$f":"RIGHT($A$5,3)&N19","v":"(7)Fournisseur"},{"$f":"RIGHT($A$5,3)&O19","v":"(7)Ref"},"(7)DESIGNATION","km",7,1,{"$f":"S20*R20","v":7},{"$f":"A$5","v":"POSTE (7)"},null,{"$f":"COUNTIF(R$20:R20,\">0\")+MAX('POSTE (6)'!W:W)","v":22}]
[null,null,null,null,null,null,null,null,null,{"$f":"I21*H21","v":0},null,{"$f":"K21*J21","v":0},null,"(7)Fournisseur2","(7)Ref2","(7)DESIGNATION2","km",7,1,{"$f":"S21*R21","v":7},"POSTE (7)",null,{"$f":"COUNTIF(R$20:R21,\">0\")+MAX('POSTE (6)'!W:W)","v":23}]
[null,null,null,null,null,null,null,null,null,0,null,0,null,"(7)Fournisseur3","(7)Ref3","(7)DESIGNATION3","km",7,1,7,"POSTE (7)",null,{"$f":"COUNTIF(R$20:R22,\">0\")+MAX('POSTE (6)'!W:W)","v":24}]
[null,null,null,null,null,null,null,null,null,0,null,0,null,"(7)Fournisseur4","(7)Ref4","(7)DESIGNATION4","km",7,1,7,"POSTE (7)",null,{"$f":"COUNTIF(R$20:R23,\">0\")+MAX('POSTE (6)'!W:W)","v":25}]
[null,null,null,null,null,null,null,null,null,0,null,0,null,"(7)Fournisseur5","(7)Ref5","(7)DESIGNATION5","km",7,1,7,"POSTE (7)",null,{"$f":"COUNTIF(R$20:R24,\">0\")+MAX('POSTE (6)'!W:W)","v":26}]
[null,null,null,null,null,null,null,null,null,0,null,0,null,"(7)Fournisseur6","(7)Ref6","(7)DESIGNATION6","km",7,1,7,"POSTE (7)",null,{"$f":"COUNTIF(R$20:R25,\">0\")+MAX('POSTE (6)'!W:W)","v":27}]
[null,null,null,null,null,null,null,null,null,0,null,0,null,"(7)Fournisseur7","(7)Ref7","(7)DESIGNATION7","km",7,1,7,"POSTE (7)",null,{"$f":"COUNTIF(R$20:R26,\">0\")+MAX('POSTE (6)'!W:W)","v":28}]
[null,null,null,null,null,null,null,null,null,0,null,0,null,null,null,null,null,null,null,null,null,null,{"$f":"COUNTIF(R$20:R27,\">0\")+MAX('POSTE (6)'!W:W)","v":28}]
[null,null,null,null,null,null,null,null,null,0,null,0,null,null,null,null,null,null,null,null,null,null,{"$f":"COUNTIF(R$20:R28,\">0\")+MAX('POSTE (6)'!W:W)","v":28}]
[null,null,null,null,null,null,null,null,null,0,null,0,null,null,null,null,null,null,null,null,null,null,{"$f":"COUNTIF(R$20:R29,\">0\")+MAX('POSTE (6)'!W:W)","v":28}]
[null,null,null,null,null,null,null,null,null,0,null,0,null,null,null,null,null,null,null,null,null,null,{"$f":"COUNTIF(R$20:R30,\">0\")+MAX('POSTE (6)'!W:W)","v":28}]
[null,null,null,null,null,null,null,null,null,0,null,0,null,null,null,null,null,null,null,null,null,null,{"$f":"COUNTIF(R$20:R31,\">0\")+MAX('POSTE (6)'!W:W)","v":28}]
[null,null,null,null,null,null,null,null,null,0,null,0,null,null,null,null,null,null,null,null,null,null,{"$f":"COUNTIF(R$20:R32,\">0\")+MAX('POSTE (6)'!W:W)","v":28}]
[null,null,null,null,null,null,null,null,null,0,null,0,null,null,null,null,null,null,null,null,null,null,{"$f":"COUNTIF(R$20:R33,\">0\")+MAX('POSTE (6)'!W:W)","v":28}]
[null,null,null,null,null,null,null,null,null,0,null,0,null,null,null,null,null,null,null,null,null,null,{"$f":"COUNTIF(R$20:R34,\">0\")+MAX('POSTE (6)'!W:W)","v":28}]
[null,null,null,null,null,null,null,null,null,0,null,0,null,null,null,null,null,null,null,null,null,null,{"$f":"COUNTIF(R$20:R35,\">0\")+MAX('POSTE (6)'!W:W)","v":28}]
[null,null,null,null,null,null,null,null,null,0,null,0,null,null,null,null,null,null,null,null,null,null,{"$f":"COUNTIF(R$20:R36,\">0\")+MAX('POSTE (6)'!W:W)","v":28}]
[null,null,null,null,null,null,null,null,null,0,null,0,null,null,null,null,null,null,null,null,null,null,{"$f":"COUNTIF(R$20:R37,\">0\")+MAX('POSTE (6)'!W:W)","v":28}]
[null,null,null,null,null,null,null,null,null,0,null,0,null,null,null,null,null,null,null,null,null,null,{"$f":"COUNTIF(R$20:R38,\">0\")+MAX('POSTE (6)'!W:W)","v":28}]
[null,null,null,null,null,null,null,null,null,0,null,0,null,null,null,null,null,null,null,null,null,null,{"$f":"COUNTIF(R$20:R39,\">0\")+MAX('POSTE (6)'!W:W)","v":28}]
[null,null,null,null,null,null,null,null,null,0,null,0,null,null,null,null,null,null,null,null,null,null,{"$f":"COUNTIF(R$20:R40,\">0\")+MAX('POSTE (6)'!W:W)","v":28}]
[null,null,null,null,null,null,null,null,null,0,null,0,null,null,null,null,null,null,null,null,null,null,{"$f":"COUNTIF(R$20:R41,\">0\")+MAX('POSTE (6)'!W:W)","v":28}]
[null,null,null,null,null,null,null,null,null,0,null,0,null,null,null,null,null,null,null,null,null,null,{"$f":"COUNTIF(R$20:R42,\">0\")+MAX('POSTE (6)'!W:W)","v":28}]
[null,null,null,null,null,null,null,null,null,0,null,0,null,null,null,null,null,null,null,null,null,null,{"$f":"COUNTIF(R$20:R43,\">0\")+MAX('POSTE (6)'!W:W)","v":28}]
[null,null,null,null,null,null,null,null,null,0,null,0,null,null,null,null,null,null,null,null,null,null,{"$f":"COUNTIF(R$20:R44,\">0\")+MAX('POSTE (6)'!W:W)","v":28}]
[null,null,null,null,null,null,null,null,null,0,null,0,null,null,null,null,null,null,null,null,null,null,{"$f":"COUNTIF(R$20:R45,\">0\")+MAX('POSTE (6)'!W:W)","v":28}]
[null,null,null,null,null,null,null,null,null,0,null,0,null,null,null,null,null,null,null,null,null,null,{"$f":"COUNTIF(R$20:R46,\">0\")+MAX('POSTE (6)'!W:W)","v":28}]
[null,null,null,null,null,null,null,null,null,0,null,0,null,null,null,null,null,null,null,null,null,null,{"$f":"COUNTIF(R$20:R47,\">0\")+MAX('POSTE (6)'!W:W)","v":28}]
[null,null,null,null,null,null,null,null,null,0,null,0,null,null,null,null,null,null,null,null,null,null,{"$f":"COUNTIF(R$20:R48,\">0\")+MAX('POSTE (6)'!W:W)","v":28}]
[null,null,null,null,null,null,null,null,null,0,null,0,null,null,null,null,null,null,null,null,null,null,{"$f":"COUNTIF(R$20:R49,\">0\")+MAX('POSTE (6)'!W:W)","v":28}]
[null,null,null,null,null,null,null,null,null,0,null,0,null,null,null,null,null,null,null,null,null,null,{"$f":"COUNTIF(R$20:R50,\">0\")+MAX('POSTE (6)'!W:W)","v":28}]
[null,null,null,null,null,null,null,null,null,0,null,0,null,null,null,null,null,null,null,null,null,null,{"$f":"COUNTIF(R$20:R51,\">0\")+MAX('POSTE (6)'!W:W)","v":28}]
[null,null,null,null,null,null,null,null,null,"Total coût fournitures","Marge","Total vendu fournitures",null,null,null,null,null,null,null,"Total coût fournitures","Marge sur le prix vendu"]
[null,null,null,null,null,null,null,null,null,{"$f":"SUM(J20:J51)","v":0},{"$f":"((L53-J53)/L53)","v":{"$error":"#DIV/0!"}},{"$f":"SUM(L20:L51)","v":0},null,null,null,null,null,null,null,{"$f":"SUM(T20:T51)","v":49},{"$f":"((L53-T53)/L53)","v":{"$error":"#DIV/0!"}}]
[]
["MAIN D'ŒUVRE | Prévisionnel",null,null,null,null,null,null,null,null,null,null,null,null,"MAIN D'ŒUVRE | Réel"]
[null,null,"DESIGNATION",null,null,null,null,"Qté","P.U. HT","P.T. HT","Coef multi","P.V. Ligne",null,null,null,"DESIGNATION","Qté","P.U. HT","P.T. HT","Poste"]
["DEVIS",null,null,null,null,null,null,null,60,{"$f":"+I57*H57","v":0},null,{"$f":"K57*J57","v":0},null,"DEVIS",null,null,null,60,{"$f":"+R57*Q57","v":0},{"$f":"A$5","v":"POSTE (7)"}]
["RELEVES",null,null,null,null,null,null,null,60,{"$f":"+I58*H58","v":0},null,{"$f":"K58*J58","v":0},null,"RELEVES",null,{"$f":"C58","v":0},null,60,{"$f":"+R58*Q58","v":0},"POSTE (7)"]
["ETUDE",null,null,null,null,null,null,null,60,0,null,{"$f":"K59*J59","v":0},null,"ETUDE",null,0,null,60,0,"POSTE (7)"]
["PLASMA",null,null,null,null,null,null,null,50,0,null,0,null,"PLASMA",null,0,null,50,0,"POSTE (7)"]
["DEBIT",null,null,null,null,null,null,null,38,0,null,0,null,"DEBIT",null,0,null,38,0,"POSTE (7)"]
["PLIAGE",null,null,null,null,null,null,null,38,0,null,0,null,"PLIAGE",null,0,null,38,0,"POSTE (7)"]
["ATELIER",null,null,null,null,null,null,null,38,0,null,0,null,"ATELIER",null,0,null,38,0,"POSTE (7)"]
["Heures sur Chantier",null,null,null,null,null,null,null,38,0,null,0,null,"Heures sur Chantier",null,0,null,38,0,"POSTE (7)"]
["AUTRE",null,null,null,null,null,null,null,null,0,null,0,null,"AUTRE",null,0,null,null,0,"POSTE (7)"]
["AUTRE",null,null,null,null,null,null,null,null,0,null,0,null,"AUTRE",null,0,null,null,0,"POSTE (7)"]
[null,null,null,null,null,null,null,"Nbre heures mobilisation technicien",null,"Total coût MO","Marge totale","Total vendu MO",null,null,null,null,"Nbre heures mobilisation technicien",null,"Total coût MO","Marge sur le prix vendu"]
[null,null,null,null,null,null,null,{"$f":"SUM(H61:H64)","v":0},null,{"$f":"SUM(J57:J66)","v":0},{"$f":"((L68-J68)/L68)","v":{"$error":"#DIV/0!"}},{"$f":"SUM(L57:L66)","v":0},null,null,null,null,{"$f":"SUM(Q61:Q64)","v":0},null,{"$f":"SUM(S57:S66)","v":0},{"$f":"((L68-S68)/L68)","v":{"$error":"#DIV/0!"}}]
[]
["FRAIS | Prévisionnel",null,null,null,null,null,null,null,null,null,null,null,null,"FRAIS | Réel"]
[null,null,"DESIGNATION",null,null,null,null,"Qté","P.U.","Coût Ligne","Coef multi","P.V. Ligne",null,null,null,"DESIGNATION","Qté","P.U.","Coût Ligne","Poste"]
["DEPLACEMENT DEVIS",null,null,null,null,null,null,null,null,{"$f":"+I72*H72","v":0},null,{"$f":"K72*J72","v":0},null,"DEPLACEMENT DEVIS",null,{"$f":"C72","v":0},null,null,{"$f":"+R72*Q72","v":0},{"$f":"A$5","v":"POSTE (7)"}]
["DEPLACEMENT RELEVES",null,null,null,null,null,null,null,null,{"$f":"+I73*H73","v":0},null,{"$f":"K73*J73","v":0},null,"DEPLACEMENT RELEVES",null,{"$f":"C73","v":0},null,null,{"$f":"+R73*Q73","v":0},{"$f":"A$5","v":"POSTE (7)"}]
["DEPLACEMENT SUIVI PROJET",null,null,null,null,null,null,null,null,0,null,{"$f":"K74*J74","v":0},null,"DEPLACEMENT SUIVI PROJET",null,0,null,null,0,"POSTE (7)"]
["DEPLACEMENT CHANTIER",null,null,null,null,null,null,null,null,0,null,0,null,"DEPLACEMENT CHANTIER",null,0,null,null,0,"POSTE (7)"]
["DEPLACEMENT LIVRAISON",null,null,null,null,null,null,null,null,0,null,0,null,"DEPLACEMENT LIVRAISON",null,0,null,null,0,"POSTE (7)"]
["FRAIS REPAS COMMERCIAUX",null,null,null,null,null,null,null,16,0,null,0,null,"FRAIS REPAS COMMERCIAUX",null,0,null,16,0,"POSTE (7)"]
["FRAIS REPAS CHANTIER",null,null,null,null,null,null,null,16,0,null,0,null,"FRAIS REPAS CHANTIER",null,0,null,16,0,"POSTE (7)"]
["HOTEL COMMERCIAUX",null,null,null,null,null,null,null,null,0,null,0,null,"HOTEL COMMERCIAUX",null,0,null,null,0,"POSTE (7)"]
["HOTEL CHANTIER",null,null,null,null,null,null,null,null,0,null,0,null,"HOTEL CHANTIER",null,0,null,null,0,"POSTE (7)"]
["LOCATION VEHICULE",null,null,null,null,null,null,null,null,0,null,0,null,"LOCATION VEHICULE",null,0,null,null,0,"POSTE (7)"]
["LOCATION ENGIN LEVAGE 1",null,null,null,null,null,null,null,null,0,null,0,null,"LOCATION ENGIN LEVAGE 1",null,0,null,null,0,"POSTE (7)"]
["LOCATION ENGIN LEVAGE 2",null,null,null,null,null,null,null,null,0,null,0,null,"LOCATION ENGIN LEVAGE 2",null,0,null,null,0,"POSTE (7)"]
["LOCATION ENGIN LEVAGE 3",null,null,null,null,null,null,null,null,0,null,0,null,"LOCATION ENGIN LEVAGE 3",null,0,null,null,0,"POSTE (7)"]
["AUTRE",null,null,null,null,null,null,null,null,0,null,0,null,"AUTRE",null,0,null,null,0,"POSTE (7)"]
[null,null,null,null,null,null,null,null,null,"Total coût frais","Marge Totale","Total vendu frais",null,null,null,null,null,"Total frais","Marge sur le prix vendu"]
[null,null,null,null,null,null,null,null,null,{"$f":"SUM(J72:J85)","v":0},{"$f":"(L87-J87)/L87","v":{"$error":"#DIV/0!"}},{"$f":"SUM(L72:L85)","v":0},null,null,null,null,null,{"$f":"SUM(S72:S85)","v":0},{"$f":"(L87-R87)/L87","v":{"$error":"#DIV/0!"}}]
[]
["COUT TOTAL POSTE:",null,null,{"$f":"+J87+J68+J53","v":0},null,null,null,null,null,null,null,null,null,null,null,{"$f":"\"Cout Total\"&\" \"&RIGHT(CELL(\"filename\",A1),LEN(CELL(\"filename\",A1))-SEARCH(\"]\",CELL(\"filename\",A1)))","v":"Cout Total POSTE (7)"},{"$f":"R87+S68+T53","v":49}]
["MARGE MOYENNE POSTE:",null,null,{"$f":"D92-D89/D92","v":{"$error":"#DIV/0!"}},null,null,null,null,null,null,null,null,null,null,null,{"$f":"\"Marge sur prix de vente initial\"&\" \"&RIGHT(CELL(\"filename\",A1),LEN(CELL(\"filename\",A1))-SEARCH(\"]\",CELL(\"filename\",A1)))","v":"Marge sur prix de vente initial POSTE (7)"},{"$f":"(D92-Q89)/D92","v":{"$error":"#DIV/0!"}}]
["FACTEUR RISQUE:",null,null,0.03]
["PRIX DE VENTE DU POSTE:",null,null,{"$f":"(1+D91)*(L87+L68+L53)","v":0}]

{"sheet":"POSTE (8)","index":8,"n_rows":92,"n_cols":23,"rows_kept":92,"cut":false,"hidden":false,"merged":[[0,0,0,11],[1,1,1,2],[1,4,1,11],[2,1,2,2],[2,4,2,11],[3,0,3,11],[10,0,10,11],[11,0,11,11],[12,0,12,11],[13,0,13,11],[14,0,14,11],[15,0,15,11],[4,0,4,11],[5,0,5,11],[6,0,6,11],[7,0,7,11],[8,0,8,11],[9,0,9,11],[21,2,21,5],[22,2,22,5],[23,2,23,5],[24,2,24,5],[25,2,25,5],[26,2,26,5],[16,0,16,11],[17,0,17,11],[17,13,17,20],[18,2,18,5],[19,2,19,5],[20,2,20,5],[33,2,33,5],[34,2,34,5],[35,2,35,5],[36,2,36,5],[37,2,37,5],[38,2,38,5],[27,2,27,5],[28,2,28,5],[29,2,29,5],[30,2,30,5],[31,2,31,5],[32,2,32,5],[45,2,45,5],[46,2,46,5],[47,2,47,5],[48,2,48,5],[49,2,49,5],[50,2,50,5],[39,2,39,5],[40,2,40,5],[41,2,41,5],[42,2,42,5],[43,2,43,5],[44,2,44,5],[56,0,56,1],[56,2,56,6],[56,13,56,14],[57,0,57,1],[57,2,57,6],[57,13,57,14],[51,0,52,8],[51,13,52,18],[53,0,53,11],[54,0,54,11],[54,13,54,19],[55,2,55,6],[60,0,60,1],[60,2,60,6],[60,13,60,14],[61,0,61,1],[61,2,61,6],[61,13,61,14],[58,0,58,1],[58,2,58,6],[58,13,58,14],[59,0,59,1],[59,2,59,6],[59,13,59,14],[64,0,64,1],[64,2,64,6],[64,13,64,14],[65,0,65,1],[65,2,65,6],[65,13,65,14],[62,0,62,1],[62,2,62,6],[62,13,62,14],[63,0,63,1],[63,2,63,6],[63,13,63,14],[68,0,68,11],[69,0,69,11],[69,13,69,19],[70,2,70,6],[71,0,71,1],[71,2,71,6],[71,13,71,14],[66,0,67,6],[66,7,66,8],[66,13,67,15],[66,16,66,17],[67,7,67,8],[67,16,67,17],[74,0,74,1],[74,2,74,6],[74,13,74,14],[75,0,75,1],[75,2,75,6],[75,13,75,14],[72,0,72,1],[72,2,72,6],[72,13,72,14],[73,0,73,1],[73,2,73,6],[73,13,73,14],[78,0,78,1],[78,2,78,6],[78,13,78,14],[79,0,79,1],[79,2,79,6],[79,13,79,14],[76,0,76,1],[76,2,76,6],[76,13,76,14],[77,0,77,1],[77,2,77,6],[77,13,77,14],[82,0,82,1],[82,2,82,6],[82,13,82,14],[83,0,83,1],[83,2,83,6],[83,13,83,14],[80,0,80,1],[80,2,80,6],[80,13,80,14],[81,0,81,1],[81,2,81,6],[81,13,81,14],[89,0,89,2],[90,0,90,2],[91,0,91,2],[84,0,84,1],[84,2,84,6],[84,13,84,14],[85,0,86,8],[85,13,86,16],[88,0,88,2]]}
["DEVIS INTERNE"]
["N° DEVIS:",null,null,"CLIENT:"]
["DATE:",null,null,"DESIGNATION:"]
[]
[{"$f":"RIGHT(CELL(\"filename\",A1),LEN(CELL(\"filename\",A1))-SEARCH(\"]\",CELL(\"filename\",A1)))","v":"POSTE (8)"}]
["Comprenant:"]
[]
[]
[]
[]
[]
[]
[]
[]
[]
[]
[]
["FOURNITURES | Prévisionnel",null,null,null,null,null,null,null,null,null,null,null,null,"FOURNITURES | Réel"]
["Fournisseur","Ref","DESIGNATION",null,null,null,"Unité","Qté","P.U. HT","P.T. HT","Coef multi","P.V. Ligne",null,"Fournisseur","Ref","DESIGNATION","Unité","Qté","P.U. HT","P.T. HT","Poste"]
[null,null,null,null,null,null,null,null,null,{"$f":"I20*H20","v":0},null,{"$f":"K20*J20","v":0},null,{"$f":"RIGHT($A$5,3)&N19","v":"(8)Fournisseur"},{"$f":"RIGHT($A$5,3)&O19","v":"(8)Ref"},"(8)DESIGNATION","U(8)",8,1,{"$f":"S20*R20","v":8},{"$f":"A$5","v":"POSTE (8)"},null,{"$f":"COUNTIF(R$20:R20,\">0\")+MAX('POSTE (7)'!W:W)","v":29}]
[null,null,null,null,null,null,null,null,null,{"$f":"I21*H21","v":0},null,{"$f":"K21*J21","v":0},null,"(8)Fournisseur2","(8)Ref2","(8)DESIGNATION2","U(8)",8,1,{"$f":"S21*R21","v":8},"POSTE (8)",null,{"$f":"COUNTIF(R$20:R21,\">0\")+MAX('POSTE (7)'!W:W)","v":30}]
[null,null,null,null,null,null,null,null,null,0,null,0,null,"(8)Fournisseur3","(8)Ref3","(8)DESIGNATION3","U(8)",8,1,8,"POSTE (8)",null,{"$f":"COUNTIF(R$20:R22,\">0\")+MAX('POSTE (7)'!W:W)","v":31}]
[null,null,null,null,null,null,null,null,null,0,null,0,null,"(8)Fournisseur4","(8)Ref4","(8)DESIGNATION4","U(8)",8,1,8,"POSTE (8)",null,{"$f":"COUNTIF(R$20:R23,\">0\")+MAX('POSTE (7)'!W:W)","v":32}]
[null,null,null,null,null,null,null,null,null,0,null,0,null,"(8)Fournisseur5","(8)Ref5","(8)DESIGNATION5","U(8)",8,1,8,"POSTE (8)",null,{"$f":"COUNTIF(R$20:R24,\">0\")+MAX('POSTE (7)'!W:W)","v":33}]
[null,null,null,null,null,null,null,null,null,0,null,0,null,"(8)Fournisseur6","(8)Ref6","(8)DESIGNATION6","U(8)",8,1,8,"POSTE (8)",null,{"$f":"COUNTIF(R$20:R25,\">0\")+MAX('POSTE (7)'!W:W)","v":34}]
[null,null,null,null,null,null,null,null,null,0,null,0,null,"(8)Fournisseur7","(8)Ref7","(8)DESIGNATION7","U(8)",8,1,8,"POSTE (8)",null,{"$f":"COUNTIF(R$20:R26,\">0\")+MAX('POSTE (7)'!W:W)","v":35}]
[null,null,null,null,null,null,null,null,null,0,null,0,null,"(8)Fournisseur8","(8)Ref8","(8)DESIGNATION8","U(8)",8,1,8,"POSTE (8)",null,{"$f":"COUNTIF(R$20:R27,\">0\")+MAX('POSTE (7)'!W:W)","v":36}]
[null,null,null,null,null,null,null,null,null,0,null,0,null,null,null,null,null,null,null,null,null,null,{"$f":"COUNTIF(R$20:R28,\">0\")+MAX('POSTE (7)'!W:W)","v":36}]
[null,null,null,null,null,null,null,null,null,0,null,0,null,null,null,null,null,null,null,null,null,null,{"$f":"COUNTIF(R$20:R29,\">0\")+MAX('POSTE (7)'!W:W)","v":36}]
[null,null,null,null,null,null,null,null,null,0,null,0,null,null,null,null,null,null,null,null,null,null,{"$f":"COUNTIF(R$20:R30,\">0\")+MAX('POSTE (7)'!W:W)","v":36}]
[null,null,null,null,null,null,null,null,null,0,null,0,null,null,null,null,null,null,null,null,null,null,{"$f":"COUNTIF(R$20:R31,\">0\")+MAX('POSTE (7)'!W:W)","v":36}]
[null,null,null,null,null,null,null,null,null,0,null,0,null,null,null,null,null,null,null,null,null,null,{"$f":"COUNTIF(R$20:R32,\">0\")+MAX('POSTE (7)'!W:W)","v":36}]
[null,null,null,null,null,null,null,null,null,0,null,0,null,null,null,null,null,null,null,null,null,null,{"$f":"COUNTIF(R$20:R33,\">0\")+MAX('POSTE (7)'!W:W)","v":36}]
[null,null,null,null,null,null,null,null,null,0,null,0,null,null,null,null,null,null,null,null,null,null,{"$f":"COUNTIF(R$20:R34,\">0\")+MAX('POSTE (7)'!W:W)","v":36}]
[null,null,null,null,null,null,null,null,null,0,null,0,null,null,null,null,null,null,null,null,null,null,{"$f":"COUNTIF(R$20:R35,\">0\")+MAX('POSTE (7)'!W:W)","v":36}]
[null,null,null,null,null,null,null,null,null,0,null,0,null,null,null,null,null,null,null,null,null,null,{"$f":"COUNTIF(R$20:R36,\">0\")+MAX('POSTE (7)'!W:W)","v":36}]
[null,null,null,null,null,null,null,null,null,0,null,0,null,null,null,null,null,null,null,null,null,null,{"$f":"COUNTIF(R$20:R37,\">0\")+MAX('POSTE (7)'!W:W)","v":36}]
[null,null,null,null,null,null,null,null,null,0,null,0,null,null,null,null,null,null,null,null,null,null,{"$f":"COUNTIF(R$20:R38,\">0\")+MAX('POSTE (7)'!W:W)","v":36}]
[null,null,null,null,null,null,null,null,null,0,null,0,null,null,null,null,null,null,null,null,null,null,{"$f":"COUNTIF(R$20:R39,\">0\")+MAX('POSTE (7)'!W:W)","v":36}]
[null,null,null,null,null,null,null,null,null,0,null,0,null,null,null,null,null,null,null,null,null,null,{"$f":"COUNTIF(R$20:R40,\">0\")+MAX('POSTE (7)'!W:W)","v":36}]
[null,null,null,null,null,null,null,null,null,0,null,0,null,null,null,null,null,null,null,null,null,null,{"$f":"COUNTIF(R$20:R41,\">0\")+MAX('POSTE (7)'!W:W)","v":36}]
[null,null,null,null,null,null,null,null,null,0,null,0,null,null,null,null,null,null,null,null,null,null,{"$f":"COUNTIF(R$20:R42,\">0\")+MAX('POSTE (7)'!W:W)","v":36}]
[null,null,null,null,null,null,null,null,null,0,null,0,null,null,null,null,null,null,null,null,null,null,{"$f":"COUNTIF(R$20:R43,\">0\")+MAX('POSTE (7)'!W:W)","v":36}]
[null,null,null,null,null,null,null,null,null,0,null,0,null,null,null,null,null,null,null,null,null,null,{"$f":"COUNTIF(R$20:R44,\">0\")+MAX('POSTE (7)'!W:W)","v":36}]
[null,null,null,null,null,null,null,null,null,0,null,0,null,null,null,null,null,null,null,null,null,null,{"$f":"COUNTIF(R$20:R45,\">0\")+MAX('POSTE (7)'!W:W)","v":36}]
[null,null,null,null,null,null,null,null,null,0,null,0,null,null,null,null,null,null,null,null,null,null,{"$f":"COUNTIF(R$20:R46,\">0\")+MAX('POSTE (7)'!W:W)","v":36}]
[null,null,null,null,null,null,null,null,null,0,null,0,null,null,null,null,null,null,null,null,null,null,{"$f":"COUNTIF(R$20:R47,\">0\")+MAX('POSTE (7)'!W:W)","v":36}]
[null,null,null,null,null,null,null,null,null,0,null,0,null,null,null,null,null,null,null,null,null,null,{"$f":"COUNTIF(R$20:R48,\">0\")+MAX('POSTE (7)'!W:W)","v":36}]
[null,null,null,null,null,null,null,null,null,0,null,0,null,null,null,null,null,null,null,null,null,null,{"$f":"COUNTIF(R$20:R49,\">0\")+MAX('POSTE (7)'!W:W)","v":36}]
[null,null,null,null,null,null,null,null,null,0,null,0,null,null,null,null,null,null,null,null,null,null,{"$f":"COUNTIF(R$20:R50,\">0\")+MAX('POSTE (7)'!W:W)","v":36}]
[null,null,null,null,null,null,null,null,null,0,null,0,null,null,null,null,null,null,null,null,null,null,{"$f":"COUNTIF(R$20:R51,\">0\")+MAX('POSTE (7)'!W:W)","v":36}]
[null,null,null,null,null,null,null,null,null,"Total coût fournitures","Marge","Total vendu fournitures",null,null,null,null,null,null,null,"Total coût fournitures","Marge sur le prix vendu"]
[null,null,null,null,null,null,null,null,null,{"$f":"SUM(J20:J51)","v":0},{"$f":"((L53-J53)/L53)","v":{"$error":"#DIV/0!"}},{"$f":"SUM(L20:L51)","v":0},null,null,null,null,null,null,null,{"$f":"SUM(T20:T51)","v":64},{"$f":"((L53-T53)/L53)","v":{"$error":"#DIV/0!"}}]
[]
["MAIN D'ŒUVRE | Prévisionnel",null,null,null,null,null,null,null,null,null,null,null,null,"MAIN D'ŒUVRE | Réel"]
[null,null,"DESIGNATION",null,null,null,null,"Qté","P.U. HT","P.T. HT","Coef multi","P.V. Ligne",null,null,null,"DESIGNATION","Qté","P.U. HT","P.T. HT","Poste"]
["DEVIS",null,null,null,null,null,null,null,60,{"$f":"+I57*H57","v":0},null,{"$f":"K57*J57","v":0},null,"DEVIS",null,null,null,60,{"$f":"+R57*Q57","v":0},{"$f":"A$5","v":"POSTE (8)"}]
["RELEVES",null,null,null,null,null,null,null,60,{"$f":"+I58*H58","v":0},null,{"$f":"K58*J58","v":0},null,"RELEVES",null,{"$f":"C58","v":0},null,60,{"$f":"+R58*Q58","v":0},"POSTE (8)"]
["ETUDE",null,null,null,null,null,null,null,60,0,null,{"$f":"K59*J59","v":0},null,"ETUDE",null,0,null,60,0,"POSTE (8)"]
["PLASMA",null,null,null,null,null,null,null,50,0,null,0,null,"PLASMA",null,0,null,50,0,"POSTE (8)"]
["DEBIT",null,null,null,null,null,null,null,38,0,null,0,null,"DEBIT",null,0,null,38,0,"POSTE (8)"]
["PLIAGE",null,null,null,null,null,null,null,38,0,null,0,null,"PLIAGE",null,0,null,38,0,"POSTE (8)"]
["ATELIER",null,null,null,null,null,null,null,38,0,null,0,null,"ATELIER",null,0,null,38,0,"POSTE (8)"]
["Heures sur Chantier",null,null,null,null,null,null,null,38,0,null,0,null,"Heures sur Chantier",null,0,null,38,0,"POSTE (8)"]
["AUTRE",null,null,null,null,null,null,null,null,0,null,0,null,"AUTRE",null,0,null,null,0,"POSTE (8)"]
["AUTRE",null,null,null,null,null,null,null,null,0,null,0,null,"AUTRE",null,0,null,null,0,"POSTE (8)"]
[null,null,null,null,null,null,null,"Nbre heures mobilisation technicien",null,"Total coût MO","Marge totale","Total vendu MO",null,null,null,null,"Nbre heures mobilisation technicien",null,"Total coût MO","Marge sur le prix vendu"]
[null,null,null,null,null,null,null,{"$f":"SUM(H61:H64)","v":0},null,{"$f":"SUM(J57:J66)","v":0},{"$f":"((L68-J68)/L68)","v":{"$error":"#DIV/0!"}},{"$f":"SUM(L57:L66)","v":0},null,null,null,null,{"$f":"SUM(Q61:Q64)","v":0},null,{"$f":"SUM(S57:S66)","v":0},{"$f":"((L68-S68)/L68)","v":{"$error":"#DIV/0!"}}]
[]
["FRAIS | Prévisionnel",null,null,null,null,null,null,null,null,null,null,null,null,"FRAIS | Réel"]
[null,null,"DESIGNATION",null,null,null,null,"Qté","P.U.","Coût Ligne","Coef multi","P.V. Ligne",null,null,null,"DESIGNATION","Qté","P.U.","Coût Ligne","Poste"]
["DEPLACEMENT DEVIS",null,null,null,null,null,null,null,null,{"$f":"+I72*H72","v":0},null,{"$f":"K72*J72","v":0},null,"DEPLACEMENT DEVIS",null,{"$f":"C72","v":0},null,null,{"$f":"+R72*Q72","v":0},{"$f":"A$5","v":"POSTE (8)"}]
["DEPLACEMENT RELEVES",null,null,null,null,null,null,null,null,{"$f":"+I73*H73","v":0},null,{"$f":"K73*J73","v":0},null,"DEPLACEMENT RELEVES",null,{"$f":"C73","v":0},null,null,{"$f":"+R73*Q73","v":0},{"$f":"A$5","v":"POSTE (8)"}]
["DEPLACEMENT SUIVI PROJET",null,null,null,null,null,null,null,null,0,null,{"$f":"K74*J74","v":0},null,"DEPLACEMENT SUIVI PROJET",null,0,null,null,0,"POSTE (8)"]
["DEPLACEMENT CHANTIER",null,null,null,null,null,null,null,null,0,null,0,null,"DEPLACEMENT CHANTIER",null,0,null,null,0,"POSTE (8)"]
["DEPLACEMENT LIVRAISON",null,null,null,null,null,null,null,null,0,null,0,null,"DEPLACEMENT LIVRAISON",null,0,null,null,0,"POSTE (8)"]
["FRAIS REPAS COMMERCIAUX",null,null,null,null,null,null,null,16,0,null,0,null,"FRAIS REPAS COMMERCIAUX",null,0,null,16,0,"POSTE (8)"]
["FRAIS REPAS CHANTIER",null,null,null,null,null,null,null,16,0,null,0,null,"FRAIS REPAS CHANTIER",null,0,null,16,0,"POSTE (8)"]
["HOTEL COMMERCIAUX",null,null,null,null,null,null,null,null,0,null,0,null,"HOTEL COMMERCIAUX",null,0,null,null,0,"POSTE (8)"]
["HOTEL CHANTIER",null,null,null,null,null,null,null,null,0,null,0,null,"HOTEL CHANTIER",null,0,null,null,0,"POSTE (8)"]
["LOCATION VEHICULE",null,null,null,null,null,null,null,null,0,null,0,null,"LOCATION VEHICULE",null,0,null,null,0,"POSTE (8)"]
["LOCATION ENGIN LEVAGE 1",null,null,null,null,null,null,null,null,0,null,0,null,"LOCATION ENGIN LEVAGE 1",null,0,null,null,0,"POSTE (8)"]
["LOCATION ENGIN LEVAGE 2",null,null,null,null,null,null,null,null,0,null,0,null,"LOCATION ENGIN LEVAGE 2",null,0,null,null,0,"POSTE (8)"]
["LOCATION ENGIN LEVAGE 3",null,null,null,null,null,null,null,null,0,null,0,null,"LOCATION ENGIN LEVAGE 3",null,0,null,null,0,"POSTE (8)"]
["AUTRE",null,null,null,null,null,null,null,null,0,null,0,null,"AUTRE",null,0,null,null,0,"POSTE (8)"]
[null,null,null,null,null,null,null,null,null,"Total coût frais","Marge Totale","Total vendu frais",null,null,null,null,null,"Total frais","Marge sur le prix vendu"]
[null,null,null,null,null,null,null,null,null,{"$f":"SUM(J72:J85)","v":0},{"$f":"(L87-J87)/L87","v":{"$error":"#DIV/0!"}},{"$f":"SUM(L72:L85)","v":0},null,null,null,null,null,{"$f":"SUM(S72:S85)","v":0},{"$f":"(L87-R87)/L87","v":{"$error":"#DIV/0!"}}]
[]
["COUT TOTAL POSTE:",null,null,{"$f":"+J87+J68+J53","v":0},null,null,null,null,null,null,null,null,null,null,null,{"$f":"\"Cout Total\"&\" \"&RIGHT(CELL(\"filename\",A1),LEN(CELL(\"filename\",A1))-SEARCH(\"]\",CELL(\"filename\",A1)))","v":"Cout Total POSTE (8)"},{"$f":"R87+S68+T53","v":64}]
["MARGE MOYENNE POSTE:",null,null,{"$f":"D92-D89/D92","v":{"$error":"#DIV/0!"}},null,null,null,null,null,null,null,null,null,null,null,{"$f":"\"Marge sur prix de vente initial\"&\" \"&RIGHT(CELL(\"filename\",A1),LEN(CELL(\"filename\",A1))-SEARCH(\"]\",CELL(\"filename\",A1)))","v":"Marge sur prix de vente initial POSTE (8)"},{"$f":"(D92-Q89)/D92","v":{"$error":"#DIV/0!"}}]
["FACTEUR RISQUE:",null,null,0.03]
["PRIX DE VENTE DU POSTE:",null,null,{"$f":"(1+D91)*(L87+L68+L53)","v":0}]

{"sheet":"POSTE (9)","index":9,"n_rows":92,"n_cols":23,"rows_kept":92,"cut":false,"hidden":false,"merged":[[0,0,0,11],[1,1,1,2],[1,4,1,11],[2,1,2,2],[2,4,2,11],[3,0,3,11],[10,0,10,11],[11,0,11,11],[12,0,12,11],[13,0,13,11],[14,0,14,11],[15,0,15,11],[4,0,4,11],[5,0,5,11],[6,0,6,11],[7,0,7,11],[8,0,8,11],[9,0,9,11],[21,2,21,5],[22,2,22,5],[23,2,23,5],[24,2,24,5],[25,2,25,5],[26,2,26,5],[16,0,16,11],[17,0,17,11],[17,13,17,20],[18,2,18,5],[19,2,19,5],[20,2,20,5],[33,2,33,5],[34,2,34,5],[35,2,35,5],[36,2,36,5],[37,2,37,5],[38,2,38,5],[27,2,27,5],[28,2,28,5],[29,2,29,5],[30,2,30,5],[31,2,31,5],[32,2,32,5],[45,2,45,5],[46,2,46,5],[47,2,47,5],[48,2,48,5],[49,2,49,5],[50,2,50,5],[39,2,39,5],[40,2,40,5],[41,2,41,5],[42,2,42,5],[43,2,43,5],[44,2,44,5],[56,0,56,1],[56,2,56,6],[56,13,56,14],[57,0,57,1],[57,2,57,6],[57,13,57,14],[51,0,52,8],[51,13,52,18],[53,0,53,11],[54,0,54,11],[54,13,54,19],[55,2,55,6],[60,0,60,1],[60,2,60,6],[60,13,60,14],[61,0,61,1],[61,2,61,6],[61,13,61,14],[58,0,58,1],[58,2,58,6],[58,13,58,14],[59,0,59,1],[59,2,59,6],[59,13,59,14],[64,0,64,1],[64,2,64,6],[64,13,64,14],[65,0,65,1],[65,2,65,6],[65,13,65,14],[62,0,62,1],[62,2,62,6],[62,13,62,14],[63,0,63,1],[63,2,63,6],[63,13,63,14],[68,0,68,11],[69,0,69,11],[69,13,69,19],[70,2,70,6],[71,0,71,1],[71,2,71,6],[71,13,71,14],[66,0,67,6],[66,7,66,8],[66,13,67,15],[66,16,66,17],[67,7,67,8],[67,16,67,17],[74,0,74,1],[74,2,74,6],[74,13,74,14],[75,0,75,1],[75,2,75,6],[75,13,75,14],[72,0,72,1],[72,2,72,6],[72,13,72,14],[73,0,73,1],[73,2,73,6],[73,13,73,14],[78,0,78,1],[78,2,78,6],[78,13,78,14],[79,0,79,1],[79,2,79,6],[79,13,79,14],[76,0,76,1],[76,2,76,6],[76,13,76,14],[77,0,77,1],[77,2,77,6],[77,13,77,14],[82,0,82,1],[82,2,82,6],[82,13,82,14],[83,0,83,1],[83,2,83,6],[83,13,83,14],[80,0,80,1],[80,2,80,6],[80,13,80,14],[81,0,81,1],[81,2,81,6],[81,13,81,14],[89,0,89,2],[90,0,90,2],[91,0,91,2],[84,0,84,1],[84,2,84,6],[84,13,84,14],[85,0,86,8],[85,13,86,16],[88,0,88,2]]}
["DEVIS INTERNE"]
["N° DEVIS:",null,null,"CLIENT:"]
["DATE:",null,null,"DESIGNATION:"]
[]
[{"$f":"RIGHT(CELL(\"filename\",A1),LEN(CELL(\"filename\",A1))-SEARCH(\"]\",CELL(\"filename\",A1)))","v":"POSTE (9)"}]
["Comprenant:"]
[]
[]
[]
[]
[]
[]
[]
[]
[]
[]
[]
["FOURNITURES | Prévisionnel",null,null,null,null,null,null,null,null,null,null,null,null,"FOURNITURES | Réel"]
["Fournisseur","Ref","DESIGNATION",null,null,null,"Unité","Qté","P.U. HT","P.T. HT","Coef multi","P.V. Ligne",null,"Fournisseur","Ref","DESIGNATION","Unité","Qté","P.U. HT","P.T. HT","Poste"]
[null,null,null,null,null,null,null,null,null,{"$f":"I20*H20","v":0},null,{"$f":"K20*J20","v":0},null,{"$f":"RIGHT($A$5,3)&N19","v":"(9)Fournisseur"},{"$f":"RIGHT($A$5,3)&O19","v":"(9)Ref"},"(9)DESIGNATION","U(9)",9,1,{"$f":"S20*R20","v":9},{"$f":"A$5","v":"POSTE (9)"},null,{"$f":"COUNTIF(R$20:R20,\">0\")+MAX('POSTE (8)'!W:W)","v":37}]
[null,null,null,null,null,null,null,null,null,{"$f":"I21*H21","v":0},null,{"$f":"K21*J21","v":0},null,"(9)Fournisseur2","(9)Ref2","(9)DESIGNATION2","U(9)",9,1,{"$f":"S21*R21","v":9},"POSTE (9)",null,{"$f":"COUNTIF(R$20:R21,\">0\")+MAX('POSTE (8)'!W:W)","v":38}]
[null,null,null,null,null,null,null,null,null,0,null,0,null,"(9)Fournisseur3","(9)Ref3","(9)DESIGNATION3","U(9)",9,1,9,"POSTE (9)",null,{"$f":"COUNTIF(R$20:R22,\">0\")+MAX('POSTE (8)'!W:W)","v":39}]
[null,null,null,null,null,null,null,null,null,0,null,0,null,"(9)Fournisseur4","(9)Ref4","(9)DESIGNATION4","U(9)",9,1,9,"POSTE (9)",null,{"$f":"COUNTIF(R$20:R23,\">0\")+MAX('POSTE (8)'!W:W)","v":40}]
[null,null,null,null,null,null,null,null,null,0,null,0,null,"(9)Fournisseur5","(9)Ref5","(9)DESIGNATION5","U(9)",9,1,9,"POSTE (9)",null,{"$f":"COUNTIF(R$20:R24,\">0\")+MAX('POSTE (8)'!W:W)","v":41}]
[null,null,null,null,null,null,null,null,null,0,null,0,null,"(9)Fournisseur6","(9)Ref6","(9)DESIGNATION6","U(9)",9,1,9,"POSTE (9)",null,{"$f":"COUNTIF(R$20:R25,\">0\")+MAX('POSTE (8)'!W:W)","v":42}]
[null,null,null,null,null,null,null,null,null,0,null,0,null,"(9)Fournisseur7","(9)Ref7","(9)DESIGNATION7","U(9)",9,1,9,"POSTE (9)",null,{"$f":"COUNTIF(R$20:R26,\">0\")+MAX('POSTE (8)'!W:W)","v":43}]
[null,null,null,null,null,null,null,null,null,0,null,0,null,"(9)Fournisseur8","(9)Ref8","(9)DESIGNATION8","U(9)",9,1,9,"POSTE (9)",null,{"$f":"COUNTIF(R$20:R27,\">0\")+MAX('POSTE (8)'!W:W)","v":44}]
[null,null,null,null,null,null,null,null,null,0,null,0,null,"(9)Fournisseur9","(9)Ref9","(9)DESIGNATION9","U(9)",9,1,9,"POSTE (9)",null,{"$f":"COUNTIF(R$20:R28,\">0\")+MAX('POSTE (8)'!W:W)","v":45}]
[null,null,null,null,null,null,null,null,null,0,null,0,null,null,null,null,null,null,null,null,null,null,{"$f":"COUNTIF(R$20:R29,\">0\")+MAX('POSTE (8)'!W:W)","v":45}]
[null,null,null,null,null,null,null,null,null,0,null,0,null,null,null,null,null,null,null,null,null,null,{"$f":"COUNTIF(R$20:R30,\">0\")+MAX('POSTE (8)'!W:W)","v":45}]
[null,null,null,null,null,null,null,null,null,0,null,0,null,null,null,null,null,null,null,null,null,null,{"$f":"COUNTIF(R$20:R31,\">0\")+MAX('POSTE (8)'!W:W)","v":45}]
[null,null,null,null,null,null,null,null,null,0,null,0,null,null,null,null,null,null,null,null,null,null,{"$f":"COUNTIF(R$20:R32,\">0\")+MAX('POSTE (8)'!W:W)","v":45}]
[null,null,null,null,null,null,null,null,null,0,null,0,null,null,null,null,null,null,null,null,null,null,{"$f":"COUNTIF(R$20:R33,\">0\")+MAX('POSTE (8)'!W:W)","v":45}]
[null,null,null,null,null,null,null,null,null,0,null,0,null,null,null,null,null,null,null,null,null,null,{"$f":"COUNTIF(R$20:R34,\">0\")+MAX('POSTE (8)'!W:W)","v":45}]
[null,null,null,null,null,null,null,null,null,0,null,0,null,null,null,null,null,null,null,null,null,null,{"$f":"COUNTIF(R$20:R35,\">0\")+MAX('POSTE (8)'!W:W)","v":45}]
[null,null,null,null,null,null,null,null,null,0,null,0,null,null,null,null,null,null,null,null,null,null,{"$f":"COUNTIF(R$20:R36,\">0\")+MAX('POSTE (8)'!W:W)","v":45}]
[null,null,null,null,null,null,null,null,null,0,null,0,null,null,null,null,null,null,null,null,null,null,{"$f":"COUNTIF(R$20:R37,\">0\")+MAX('POSTE (8)'!W:W)","v":45}]
[null,null,null,null,null,null,null,null,null,0,null,0,null,null,null,null,null,null,null,null,null,null,{"$f":"COUNTIF(R$20:R38,\">0\")+MAX('POSTE (8)'!W:W)","v":45}]
[null,null,null,null,null,null,null,null,null,0,null,0,null,null,null,null,null,null,null,null,null,null,{"$f":"COUNTIF(R$20:R39,\">0\")+MAX('POSTE (8)'!W:W)","v":45}]
[null,null,null,null,null,null,null,null,null,0,null,0,null,null,null,null,null,null,null,null,null,null,{"$f":"COUNTIF(R$20:R40,\">0\")+MAX('POSTE (8)'!W:W)","v":45}]
[null,null,null,null,null,null,null,null,null,0,null,0,null,null,null,null,null,null,null,null,null,null,{"$f":"COUNTIF(R$20:R41,\">0\")+MAX('POSTE (8)'!W:W)","v":45}]
[null,null,null,null,null,null,null,null,null,0,null,0,null,null,null,null,null,null,null,null,null,null,{"$f":"COUNTIF(R$20:R42,\">0\")+MAX('POSTE (8)'!W:W)","v":45}]
[null,null,null,null,null,null,null,null,null,0,null,0,null,null,null,null,null,null,null,null,null,null,{"$f":"COUNTIF(R$20:R43,\">0\")+MAX('POSTE (8)'!W:W)","v":45}]
[null,null,null,null,null,null,null,null,null,0,null,0,null,null,null,null,null,null,null,null,null,null,{"$f":"COUNTIF(R$20:R44,\">0\")+MAX('POSTE (8)'!W:W)","v":45}]
[null,null,null,null,null,null,null,null,null,0,null,0,null,null,null,null,null,null,null,null,null,null,{"$f":"COUNTIF(R$20:R45,\">0\")+MAX('POSTE (8)'!W:W)","v":45}]
[null,null,null,null,null,null,null,null,null,0,null,0,null,null,null,null,null,null,null,null,null,null,{"$f":"COUNTIF(R$20:R46,\">0\")+MAX('POSTE (8)'!W:W)","v":45}]
[null,null,null,null,null,null,null,null,null,0,null,0,null,null,null,null,null,null,null,null,null,null,{"$f":"COUNTIF(R$20:R47,\">0\")+MAX('POSTE (8)'!W:W)","v":45}]
[null,null,null,null,null,null,null,null,null,0,null,0,null,null,null,null,null,null,null,null,null,null,{"$f":"COUNTIF(R$20:R48,\">0\")+MAX('POSTE (8)'!W:W)","v":45}]
[null,null,null,null,null,null,null,null,null,0,null,0,null,null,null,null,null,null,null,null,null,null,{"$f":"COUNTIF(R$20:R49,\">0\")+MAX('POSTE (8)'!W:W)","v":45}]
[null,null,null,null,null,null,null,null,null,0,null,0,null,null,null,null,null,null,null,null,null,null,{"$f":"COUNTIF(R$20:R50,\">0\")+MAX('POSTE (8)'!W:W)","v":45}]
[null,null,null,null,null,null,null,null,null,0,null,0,null,null,null,null,null,null,null,null,null,null,{"$f":"COUNTIF(R$20:R51,\">0\")+MAX('POSTE (8)'!W:W)","v":45}]
[null,null,null,null,null,null,null,null,null,"Total coût fournitures","Marge","Total vendu fournitures",null,null,null,null,null,null,null,"Total coût fournitures","Marge sur le prix vendu"]
[null,null,null,null,null,null,null,null,null,{"$f":"SUM(J20:J51)","v":0},{"$f":"((L53-J53)/L53)","v":{"$error":"#DIV/0!"}},{"$f":"SUM(L20:L51)","v":0},null,null,null,null,null,null,null,{"$f":"SUM(T20:T51)","v":81},{"$f":"((L53-T53)/L53)","v":{"$error":"#DIV/0!"}}]
[]
["MAIN D'ŒUVRE | Prévisionnel",null,null,null,null,null,null,null,null,null,null,null,null,"MAIN D'ŒUVRE | Réel"]
[null,null,"DESIGNATION",null,null,null,null,"Qté","P.U. HT","P.T. HT","Coef multi","P.V. Ligne",null,null,null,"DESIGNATION","Qté","P.U. HT","P.T. HT","Poste"]
["DEVIS",null,null,null,null,null,null,null,60,{"$f":"+I57*H57","v":0},null,{"$f":"K57*J57","v":0},null,"DEVIS",null,null,null,60,{"$f":"+R57*Q57","v":0},{"$f":"A$5","v":"POSTE (9)"}]
["RELEVES",null,null,null,null,null,null,null,60,{"$f":"+I58*H58","v":0},null,{"$f":"K58*J58","v":0},null,"RELEVES",null,{"$f":"C58","v":0},null,60,{"$f":"+R58*Q58","v":0},"POSTE (9)"]
["ETUDE",null,null,null,null,null,null,null,60,0,null,{"$f":"K59*J59","v":0},null,"ETUDE",null,0,null,60,0,"POSTE (9)"]
["PLASMA",null,null,null,null,null,null,null,50,0,null,0,null,"PLASMA",null,0,null,50,0,"POSTE (9)"]
["DEBIT",null,null,null,null,null,null,null,38,0,null,0,null,"DEBIT",null,0,null,38,0,"POSTE (9)"]
["PLIAGE",null,null,null,null,null,null,null,38,0,null,0,null,"PLIAGE",null,0,null,38,0,"POSTE (9)"]
["ATELIER",null,null,null,null,null,null,null,38,0,null,0,null,"ATELIER",null,0,null,38,0,"POSTE (9)"]
["Heures sur Chantier",null,null,null,null,null,null,null,38,0,null,0,null,"Heures sur Chantier",null,0,null,38,0,"POSTE (9)"]
["AUTRE",null,null,null,null,null,null,null,null,0,null,0,null,"AUTRE",null,0,null,null,0,"POSTE (9)"]
["AUTRE",null,null,null,null,null,null,null,null,0,null,0,null,"AUTRE",null,0,null,null,0,"POSTE (9)"]
[null,null,null,null,null,null,null,"Nbre heures mobilisation technicien",null,"Total coût MO","Marge totale","Total vendu MO",null,null,null,null,"Nbre heures mobilisation technicien",null,"Total coût MO","Marge sur le prix vendu"]
[null,null,null,null,null,null,null,{"$f":"SUM(H61:H64)","v":0},null,{"$f":"SUM(J57:J66)","v":0},{"$f":"((L68-J68)/L68)","v":{"$error":"#DIV/0!"}},{"$f":"SUM(L57:L66)","v":0},null,null,null,null,{"$f":"SUM(Q61:Q64)","v":0},null,{"$f":"SUM(S57:S66)","v":0},{"$f":"((L68-S68)/L68)","v":{"$error":"#DIV/0!"}}]
[]
["FRAIS | Prévisionnel",null,null,null,null,null,null,null,null,null,null,null,null,"FRAIS | Réel"]
[null,null,"DESIGNATION",null,null,null,null,"Qté","P.U.","Coût Ligne","Coef multi","P.V. Ligne",null,null,null,"DESIGNATION","Qté","P.U.","Coût Ligne","Poste"]
["DEPLACEMENT DEVIS",null,null,null,null,null,null,null,null,{"$f":"+I72*H72","v":0},null,{"$f":"K72*J72","v":0},null,"DEPLACEMENT DEVIS",null,{"$f":"C72","v":0},null,null,{"$f":"+R72*Q72","v":0},{"$f":"A$5","v":"POSTE (9)"}]
["DEPLACEMENT RELEVES",null,null,null,null,null,null,null,null,{"$f":"+I73*H73","v":0},null,{"$f":"K73*J73","v":0},null,"DEPLACEMENT RELEVES",null,{"$f":"C73","v":0},null,null,{"$f":"+R73*Q73","v":0},{"$f":"A$5","v":"POSTE (9)"}]
["DEPLACEMENT SUIVI PROJET",null,null,null,null,null,null,null,null,0,null,{"$f":"K74*J74","v":0},null,"DEPLACEMENT SUIVI PROJET",null,0,null,null,0,"POSTE (9)"]
["DEPLACEMENT CHANTIER",null,null,null,null,null,null,null,null,0,null,0,null,"DEPLACEMENT CHANTIER",null,0,null,null,0,"POSTE (9)"]
["DEPLACEMENT LIVRAISON",null,null,null,null,null,null,null,null,0,null,0,null,"DEPLACEMENT LIVRAISON",null,0,null,null,0,"POSTE (9)"]
["FRAIS REPAS COMMERCIAUX",null,null,null,null,null,null,null,16,0,null,0,null,"FRAIS REPAS COMMERCIAUX",null,0,null,16,0,"POSTE (9)"]
["FRAIS REPAS CHANTIER",null,null,null,null,null,null,null,16,0,null,0,null,"FRAIS REPAS CHANTIER",null,0,null,16,0,"POSTE (9)"]
["HOTEL COMMERCIAUX",null,null,null,null,null,null,null,null,0,null,0,null,"HOTEL COMMERCIAUX",null,0,null,null,0,"POSTE (9)"]
["HOTEL CHANTIER",null,null,null,null,null,null,null,null,0,null,0,null,"HOTEL CHANTIER",null,0,null,null,0,"POSTE (9)"]
["LOCATION VEHICULE",null,null,null,null,null,null,null,null,0,null,0,null,"LOCATION VEHICULE",null,0,null,null,0,"POSTE (9)"]
["LOCATION ENGIN LEVAGE 1",null,null,null,null,null,null,null,null,0,null,0,null,"LOCATION ENGIN LEVAGE 1",null,0,null,null,0,"POSTE (9)"]
["LOCATION ENGIN LEVAGE 2",null,null,null,null,null,null,null,null,0,null,0,null,"LOCATION ENGIN LEVAGE 2",null,0,null,null,0,"POSTE (9)"]
["LOCATION ENGIN LEVAGE 3",null,null,null,null,null,null,null,null,0,null,0,null,"LOCATION ENGIN LEVAGE 3",null,0,null,null,0,"POSTE (9)"]
["AUTRE",null,null,null,null,null,null,null,null,0,null,0,null,"AUTRE",null,0,null,null,0,"POSTE (9)"]
[null,null,null,null,null,null,null,null,null,"Total coût frais","Marge Totale","Total vendu frais",null,null,null,null,null,"Total frais","Marge sur le prix vendu"]
[null,null,null,null,null,null,null,null,null,{"$f":"SUM(J72:J85)","v":0},{"$f":"(L87-J87)/L87","v":{"$error":"#DIV/0!"}},{"$f":"SUM(L72:L85)","v":0},null,null,null,null,null,{"$f":"SUM(S72:S85)","v":0},{"$f":"(L87-R87)/L87","v":{"$error":"#DIV/0!"}}]
[]
["COUT TOTAL POSTE:",null,null,{"$f":"+J87+J68+J53","v":0},null,null,null,null,null,null,null,null,null,null,null,{"$f":"\"Cout Total\"&\" \"&RIGHT(CELL(\"filename\",A1),LEN(CELL(\"filename\",A1))-SEARCH(\"]\",CELL(\"filename\",A1)))","v":"Cout Total POSTE (9)"},{"$f":"R87+S68+T53","v":81}]
["MARGE MOYENNE POSTE:",null,null,{"$f":"D92-D89/D92","v":{"$error":"#DIV/0!"}},null,null,null,null,null,null,null,null,null,null,null,{"$f":"\"Marge sur prix de vente initial\"&\" \"&RIGHT(CELL(\"filename\",A1),LEN(CELL(\"filename\",A1))-SEARCH(\"]\",CELL(\"filename\",A1)))","v":"Marge sur prix de vente initial POSTE (9)"},{"$f":"(D92-Q89)/D92","v":{"$error":"#DIV/0!"}}]
["FACTEUR RISQUE:",null,null,0.03]
["PRIX DE VENTE DU POSTE:",null,null,{"$f":"(1+D91)*(L87+L68+L53)","v":0}]

{"sheet":"POSTE (10)","index":10,"n_rows":92,"n_cols":23,"rows_kept":92,"cut":false,"hidden":false,"merged":[[0,0,0,11],[1,1,1,2],[1,4,1,11],[2,1,2,2],[2,4,2,11],[3,0,3,11],[10,0,10,11],[11,0,11,11],[12,0,12,11],[13,0,13,11],[14,0,14,11],[15,0,15,11],[4,0,4,11],[5,0,5,11],[6,0,6,11],[7,0,7,11],[8,0,8,11],[9,0,9,11],[21,2,21,5],[22,2,22,5],[23,2,23,5],[24,2,24,5],[25,2,25,5],[26,2,26,5],[16,0,16,11],[17,0,17,11],[17,13,17,20],[18,2,18,5],[19,2,19,5],[20,2,20,5],[33,2,33,5],[34,2,34,5],[35,2,35,5],[36,2,36,5],[37,2,37,5],[38,2,38,5],[27,2,27,5],[28,2,28,5],[29,2,29,5],[30,2,30,5],[31,2,31,5],[32,2,32,5],[45,2,45,5],[46,2,46,5],[47,2,47,5],[48,2,48,5],[49,2,49,5],[50,2,50,5],[39,2,39,5],[40,2,40,5],[41,2,41,5],[42,2,42,5],[43,2,43,5],[44,2,44,5],[56,0,56,1],[56,2,56,6],[56,13,56,14],[57,0,57,1],[57,2,57,6],[57,13,57,14],[51,0,52,8],[51,13,52,18],[53,0,53,11],[54,0,54,11],[54,13,54,19],[55,2,55,6],[60,0,60,1],[60,2,60,6],[60,13,60,14],[61,0,61,1],[61,2,61,6],[61,13,61,14],[58,0,58,1],[58,2,58,6],[58,13,58,14],[59,0,59,1],[59,2,59,6],[59,13,59,14],[64,0,64,1],[64,2,64,6],[64,13,64,14],[65,0,65,1],[65,2,65,6],[65,13,65,14],[62,0,62,1],[62,2,62,6],[62,13,62,14],[63,0,63,1],[63,2,63,6],[63,13,63,14],[68,0,68,11],[69,0,69,11],[69,13,69,19],[70,2,70,6],[71,0,71,1],[71,2,71,6],[71,13,71,14],[66,0,67,6],[66,7,66,8],[66,13,67,15],[66,16,66,17],[67,7,67,8],[67,16,67,17],[74,0,74,1],[74,2,74,6],[74,13,74,14],[75,0,75,1],[75,2,75,6],[75,13,75,14],[72,0,72,1],[72,2,72,6],[72,13,72,14],[73,0,73,1],[73,2,73,6],[73,13,73,14],[78,0,78,1],[78,2,78,6],[78,13,78,14],[79,0,79,1],[79,2,79,6],[79,13,79,14],[76,0,76,1],[76,2,76,6],[76,13,76,14],[77,0,77,1],[77,2,77,6],[77,13,77,14],[82,0,82,1],[82,2,82,6],[82,13,82,14],[83,0,83,1],[83,2,83,6],[83,13,83,14],[80,0,80,1],[80,2,80,6],[80,13,80,14],[81,0,81,1],[81,2,81,6],[81,13,81,14],[89,0,89,2],[90,0,90,2],[91,0,91,2],[84,0,84,1],[84,2,84,6],[84,13,84,14],[85,0,86,8],[85,13,86,16],[88,0,88,2]]}
["DEVIS INTERNE"]
["N° DEVIS:",null,null,"CLIENT:"]
["DATE:",null,null,"DESIGNATION:"]
[]
[{"$f":"RIGHT(CELL(\"filename\",A1),LEN(CELL(\"filename\",A1))-SEARCH(\"]\",CELL(\"filename\",A1)))","v":"POSTE (10)"}]
["Comprenant:"]
[]
[]
[]
[]
[]
[]
[]
[]
[]
[]
[]
["FOURNITURES | Prévisionnel",null,null,null,null,null,null,null,null,null,null,null,null,"FOURNITURES | Réel"]
["Fournisseur","Ref","DESIGNATION",null,null,null,"Unité","Qté","P.U. HT","P.T. HT","Coef multi","P.V. Ligne",null,"Fournisseur","Ref","DESIGNATION","Unité","Qté","P.U. HT","P.T. HT","Poste"]
[null,null,null,null,null,null,null,null,null,{"$f":"I20*H20","v":0},null,{"$f":"K20*J20","v":0},null,{"$f":"RIGHT($A$5,3)&N19","v":"10)Fournisseur"},{"$f":"RIGHT($A$5,3)&O19","v":"10)Ref"},"10)DESIGNATION","U(10)",10,1,{"$f":"S20*R20","v":10},{"$f":"A$5","v":"POSTE (10)"},null,{"$f":"COUNTIF(R$20:R20,\">0\")+MAX('POSTE (9)'!W:W)","v":46}]
[null,null,null,null,null,null,null,null,null,{"$f":"I21*H21","v":0},null,{"$f":"K21*J21","v":0},null,"(10)Fournisseur2","(10)Ref2","(10)DESIGNATION2","U(10)",10,1,{"$f":"S21*R21","v":10},"POSTE (10)",null,{"$f":"COUNTIF(R$20:R21,\">0\")+MAX('POSTE (9)'!W:W)","v":47}]
[null,null,null,null,null,null,null,null,null,0,null,0,null,"(10)Fournisseur3","(10)Ref3","(10)DESIGNATION3","U(10)",10,1,10,"POSTE (10)",null,{"$f":"COUNTIF(R$20:R22,\">0\")+MAX('POSTE (9)'!W:W)","v":48}]
[null,null,null,null,null,null,null,null,null,0,null,0,null,"(10)Fournisseur4","(10)Ref4","(10)DESIGNATION4","U(10)",10,1,10,"POSTE (10)",null,{"$f":"COUNTIF(R$20:R23,\">0\")+MAX('POSTE (9)'!W:W)","v":49}]
[null,null,null,null,null,null,null,null,null,0,null,0,null,"(10)Fournisseur5","(10)Ref5","(10)DESIGNATION5","U(10)",10,1,10,"POSTE (10)",null,{"$f":"COUNTIF(R$20:R24,\">0\")+MAX('POSTE (9)'!W:W)","v":50}]
[null,null,null,null,null,null,null,null,null,0,null,0,null,"(10)Fournisseur6","(10)Ref6","(10)DESIGNATION6","U(10)",10,1,10,"POSTE (10)",null,{"$f":"COUNTIF(R$20:R25,\">0\")+MAX('POSTE (9)'!W:W)","v":51}]
[null,null,null,null,null,null,null,null,null,0,null,0,null,"(10)Fournisseur7","(10)Ref7","(10)DESIGNATION7","U(10)",10,1,10,"POSTE (10)",null,{"$f":"COUNTIF(R$20:R26,\">0\")+MAX('POSTE (9)'!W:W)","v":52}]
[null,null,null,null,null,null,null,null,null,0,null,0,null,"(10)Fournisseur8","(10)Ref8","(10)DESIGNATION8","U(10)",10,1,10,"POSTE (10)",null,{"$f":"COUNTIF(R$20:R27,\">0\")+MAX('POSTE (9)'!W:W)","v":53}]
[null,null,null,null,null,null,null,null,null,0,null,0,null,"(10)Fournisseur9","(10)Ref9","(10)DESIGNATION9","U(10)",10,1,10,"POSTE (10)",null,{"$f":"COUNTIF(R$20:R28,\">0\")+MAX('POSTE (9)'!W:W)","v":54}]
[null,null,null,null,null,null,null,null,null,0,null,0,null,"(10)Fournisseur10","(10)Ref10","(10)DESIGNATION10","U(10)",10,1,10,"POSTE (10)",null,{"$f":"COUNTIF(R$20:R29,\">0\")+MAX('POSTE (9)'!W:W)","v":55}]
[null,null,null,null,null,null,null,null,null,0,null,0,null,null,null,null,null,null,null,null,null,null,{"$f":"COUNTIF(R$20:R30,\">0\")+MAX('POSTE (9)'!W:W)","v":55}]
[null,null,null,null,null,null,null,null,null,0,null,0,null,null,null,null,null,null,null,null,null,null,{"$f":"COUNTIF(R$20:R31,\">0\")+MAX('POSTE (9)'!W:W)","v":55}]
[null,null,null,null,null,null,null,null,null,0,null,0,null,null,null,null,null,null,null,null,null,null,{"$f":"COUNTIF(R$20:R32,\">0\")+MAX('POSTE (9)'!W:W)","v":55}]
[null,null,null,null,null,null,null,null,null,0,null,0,null,null,null,null,null,null,null,null,null,null,{"$f":"COUNTIF(R$20:R33,\">0\")+MAX('POSTE (9)'!W:W)","v":55}]
[null,null,null,null,null,null,null,null,null,0,null,0,null,null,null,null,null,null,null,null,null,null,{"$f":"COUNTIF(R$20:R34,\">0\")+MAX('POSTE (9)'!W:W)","v":55}]
[null,null,null,null,null,null,null,null,null,0,null,0,null,null,null,null,null,null,null,null,null,null,{"$f":"COUNTIF(R$20:R35,\">0\")+MAX('POSTE (9)'!W:W)","v":55}]
[null,null,null,null,null,null,null,null,null,0,null,0,null,null,null,null,null,null,null,null,null,null,{"$f":"COUNTIF(R$20:R36,\">0\")+MAX('POSTE (9)'!W:W)","v":55}]
[null,null,null,null,null,null,null,null,null,0,null,0,null,null,null,null,null,null,null,null,null,null,{"$f":"COUNTIF(R$20:R37,\">0\")+MAX('POSTE (9)'!W:W)","v":55}]
[null,null,null,null,null,null,null,null,null,0,null,0,null,null,null,null,null,null,null,null,null,null,{"$f":"COUNTIF(R$20:R38,\">0\")+MAX('POSTE (9)'!W:W)","v":55}]
[null,null,null,null,null,null,null,null,null,0,null,0,null,null,null,null,null,null,null,null,null,null,{"$f":"COUNTIF(R$20:R39,\">0\")+MAX('POSTE (9)'!W:W)","v":55}]
[null,null,null,null,null,null,null,null,null,0,null,0,null,null,null,null,null,null,null,null,null,null,{"$f":"COUNTIF(R$20:R40,\">0\")+MAX('POSTE (9)'!W:W)","v":55}]
[null,null,null,null,null,null,null,null,null,0,null,0,null,null,null,null,null,null,null,null,null,null,{"$f":"COUNTIF(R$20:R41,\">0\")+MAX('POSTE (9)'!W:W)","v":55}]
[null,null,null,null,null,null,null,null,null,0,null,0,null,null,null,null,null,null,null,null,null,null,{"$f":"COUNTIF(R$20:R42,\">0\")+MAX('POSTE (9)'!W:W)","v":55}]
[null,null,null,null,null,null,null,null,null,0,null,0,null,null,null,null,null,null,null,null,null,null,{"$f":"COUNTIF(R$20:R43,\">0\")+MAX('POSTE (9)'!W:W)","v":55}]
[null,null,null,null,null,null,null,null,null,0,null,0,null,null,null,null,null,null,null,null,null,null,{"$f":"COUNTIF(R$20:R44,\">0\")+MAX('POSTE (9)'!W:W)","v":55}]
[null,null,null,null,null,null,null,null,null,0,null,0,null,null,null,null,null,null,null,null,null,null,{"$f":"COUNTIF(R$20:R45,\">0\")+MAX('POSTE (9)'!W:W)","v":55}]
[null,null,null,null,null,null,null,null,null,0,null,0,null,null,null,null,null,null,null,null,null,null,{"$f":"COUNTIF(R$20:R46,\">0\")+MAX('POSTE (9)'!W:W)","v":55}]
[null,null,null,null,null,null,null,null,null,0,null,0,null,null,null,null,null,null,null,null,null,null,{"$f":"COUNTIF(R$20:R47,\">0\")+MAX('POSTE (9)'!W:W)","v":55}]
[null,null,null,null,null,null,null,null,null,0,null,0,null,null,null,null,null,null,null,null,null,null,{"$f":"COUNTIF(R$20:R48,\">0\")+MAX('POSTE (9)'!W:W)","v":55}]
[null,null,null,null,null,null,null,null,null,0,null,0,null,null,null,null,null,null,null,null,null,null,{"$f":"COUNTIF(R$20:R49,\">0\")+MAX('POSTE (9)'!W:W)","v":55}]
[null,null,null,null,null,null,null,null,null,0,null,0,null,null,null,null,null,null,null,null,null,null,{"$f":"COUNTIF(R$20:R50,\">0\")+MAX('POSTE (9)'!W:W)","v":55}]
[null,null,null,null,null,null,null,null,null,0,null,0,null,null,null,null,null,null,null,null,null,null,{"$f":"COUNTIF(R$20:R51,\">0\")+MAX('POSTE (9)'!W:W)","v":55}]
[null,null,null,null,null,null,null,null,null,"Total coût fournitures","Marge","Total vendu fournitures",null,null,null,null,null,null,null,"Total coût fournitures","Marge sur le prix vendu"]
[null,null,null,null,null,null,null,null,null,{"$f":"SUM(J20:J51)","v":0},{"$f":"((L53-J53)/L53)","v":{"$error":"#DIV/0!"}},{"$f":"SUM(L20:L51)","v":0},null,null,null,null,null,null,null,{"$f":"SUM(T20:T51)","v":100},{"$f":"((L53-T53)/L53)","v":{"$error":"#DIV/0!"}}]
[]
["MAIN D'ŒUVRE | Prévisionnel",null,null,null,null,null,null,null,null,null,null,null,null,"MAIN D'ŒUVRE | Réel"]
[null,null,"DESIGNATION",null,null,null,null,"Qté","P.U. HT","P.T. HT","Coef multi","P.V. Ligne",null,null,null,"DESIGNATION","Qté","P.U. HT","P.T. HT","Poste"]
["DEVIS",null,null,null,null,null,null,null,60,{"$f":"+I57*H57","v":0},null,{"$f":"K57*J57","v":0},null,"DEVIS",null,null,null,60,{"$f":"+R57*Q57","v":0},{"$f":"A$5","v":"POSTE (10)"}]
["RELEVES",null,null,null,null,null,null,null,60,{"$f":"+I58*H58","v":0},null,{"$f":"K58*J58","v":0},null,"RELEVES",null,{"$f":"C58","v":0},null,60,{"$f":"+R58*Q58","v":0},"POSTE (10)"]
["ETUDE",null,null,null,null,null,null,null,60,0,null,{"$f":"K59*J59","v":0},null,"ETUDE",null,0,null,60,0,"POSTE (10)"]
["PLASMA",null,null,null,null,null,null,null,50,0,null,0,null,"PLASMA",null,0,null,50,0,"POSTE (10)"]
["DEBIT",null,null,null,null,null,null,null,38,0,null,0,null,"DEBIT",null,0,null,38,0,"POSTE (10)"]
["PLIAGE",null,null,null,null,null,null,null,38,0,null,0,null,"PLIAGE",null,0,null,38,0,"POSTE (10)"]
["ATELIER",null,null,null,null,null,null,null,38,0,null,0,null,"ATELIER",null,0,null,38,0,"POSTE (10)"]
["Heures sur Chantier",null,null,null,null,null,null,null,38,0,null,0,null,"Heures sur Chantier",null,0,null,38,0,"POSTE (10)"]
["AUTRE",null,null,null,null,null,null,null,null,0,null,0,null,"AUTRE",null,0,null,null,0,"POSTE (10)"]
["AUTRE",null,null,null,null,null,null,null,null,0,null,0,null,"AUTRE",null,0,null,null,0,"POSTE (10)"]
[null,null,null,null,null,null,null,"Nbre heures mobilisation technicien",null,"Total coût MO","Marge totale","Total vendu MO",null,null,null,null,"Nbre heures mobilisation technicien",null,"Total coût MO","Marge sur le prix vendu"]
[null,null,null,null,null,null,null,{"$f":"SUM(H61:H64)","v":0},null,{"$f":"SUM(J57:J66)","v":0},{"$f":"((L68-J68)/L68)","v":{"$error":"#DIV/0!"}},{"$f":"SUM(L57:L66)","v":0},null,null,null,null,{"$f":"SUM(Q61:Q64)","v":0},null,{"$f":"SUM(S57:S66)","v":0},{"$f":"((L68-S68)/L68)","v":{"$error":"#DIV/0!"}}]
[]
["FRAIS | Prévisionnel",null,null,null,null,null,null,null,null,null,null,null,null,"FRAIS | Réel"]
[null,null,"DESIGNATION",null,null,null,null,"Qté","P.U.","Coût Ligne","Coef multi","P.V. Ligne",null,null,null,"DESIGNATION","Qté","P.U.","Coût Ligne","Poste"]
["DEPLACEMENT DEVIS",null,null,null,null,null,null,null,null,{"$f":"+I72*H72","v":0},null,{"$f":"K72*J72","v":0},null,"DEPLACEMENT DEVIS",null,{"$f":"C72","v":0},null,null,{"$f":"+R72*Q72","v":0},{"$f":"A$5","v":"POSTE (10)"}]
["DEPLACEMENT RELEVES",null,null,null,null,null,null,null,null,{"$f":"+I73*H73","v":0},null,{"$f":"K73*J73","v":0},null,"DEPLACEMENT RELEVES",null,{"$f":"C73","v":0},null,null,{"$f":"+R73*Q73","v":0},{"$f":"A$5","v":"POSTE (10)"}]
["DEPLACEMENT SUIVI PROJET",null,null,null,null,null,null,null,null,0,null,{"$f":"K74*J74","v":0},null,"DEPLACEMENT SUIVI PROJET",null,0,null,null,0,"POSTE (10)"]
["DEPLACEMENT CHANTIER",null,null,null,null,null,null,null,null,0,null,0,null,"DEPLACEMENT CHANTIER",null,0,null,null,0,"POSTE (10)"]
["DEPLACEMENT LIVRAISON",null,null,null,null,null,null,null,null,0,null,0,null,"DEPLACEMENT LIVRAISON",null,0,null,null,0,"POSTE (10)"]
["FRAIS REPAS COMMERCIAUX",null,null,null,null,null,null,null,16,0,null,0,null,"FRAIS REPAS COMMERCIAUX",null,0,null,16,0,"POSTE (10)"]
["FRAIS REPAS CHANTIER",null,null,null,null,null,null,null,16,0,null,0,null,"FRAIS REPAS CHANTIER",null,0,null,16,0,"POSTE (10)"]
["HOTEL COMMERCIAUX",null,null,null,null,null,null,null,null,0,null,0,null,"HOTEL COMMERCIAUX",null,0,null,null,0,"POSTE (10)"]
["HOTEL CHANTIER",null,null,null,null,null,null,null,null,0,null,0,null,"HOTEL CHANTIER",null,0,null,null,0,"POSTE (10)"]
["LOCATION VEHICULE",null,null,null,null,null,null,null,null,0,null,0,null,"LOCATION VEHICULE",null,0,null,null,0,"POSTE (10)"]
["LOCATION ENGIN LEVAGE 1",null,null,null,null,null,null,null,null,0,null,0,null,"LOCATION ENGIN LEVAGE 1",null,0,null,null,0,"POSTE (10)"]
["LOCATION ENGIN LEVAGE 2",null,null,null,null,null,null,null,null,0,null,0,null,"LOCATION ENGIN LEVAGE 2",null,0,null,null,0,"POSTE (10)"]
["LOCATION ENGIN LEVAGE 3",null,null,null,null,null,null,null,null,0,null,0,null,"LOCATION ENGIN LEVAGE 3",null,0,null,null,0,"POSTE (10)"]
["AUTRE",null,null,null,null,null,null,null,null,0,null,0,null,"AUTRE",null,0,null,null,0,"POSTE (10)"]
[null,null,null,null,null,null,null,null,null,"Total coût frais","Marge Totale","Total vendu frais",null,null,null,null,null,"Total frais","Marge sur le prix vendu"]
[null,null,null,null,null,null,null,null,null,{"$f":"SUM(J72:J85)","v":0},{"$f":"(L87-J87)/L87","v":{"$error":"#DIV/0!"}},{"$f":"SUM(L72:L85)","v":0},null,null,null,null,null,{"$f":"SUM(S72:S85)","v":0},{"$f":"(L87-R87)/L87","v":{"$error":"#DIV/0!"}}]
[]
["COUT TOTAL POSTE:",null,null,{"$f":"+J87+J68+J53","v":0},null,null,null,null,null,null,null,null,null,null,null,{"$f":"\"Cout Total\"&\" \"&RIGHT(CELL(\"filename\",A1),LEN(CELL(\"filename\",A1))-SEARCH(\"]\",CELL(\"filename\",A1)))","v":"Cout Total POSTE (10)"},{"$f":"R87+S68+T53","v":100}]
["MARGE MOYENNE POSTE:",null,null,{"$f":"D92-D89/D92","v":{"$error":"#DIV/0!"}},null,null,null,null,null,null,null,null,null,null,null,{"$f":"\"Marge sur prix de vente initial\"&\" \"&RIGHT(CELL(\"filename\",A1),LEN(CELL(\"filename\",A1))-SEARCH(\"]\",CELL(\"filename\",A1)))","v":"Marge sur prix de vente initial POSTE (10)"},{"$f":"(D92-Q89)/D92","v":{"$error":"#DIV/0!"}}]
["FACTEUR RISQUE:",null,null,0.03]
["PRIX DE VENTE DU POSTE:",null,null,{"$f":"(1+D91)*(L87+L68+L53)","v":0}]