{"text_format":"1","workbook":"xlsx","n_sheets":2,"sheets":["Négoce, Dons & Collecte","FEAD"],"not_rendered":{"charts":0,"images":1,"macros":1,"external_links":0,"defined_names":2,"comments":0,"pivot_tables":0},"unopened":[],"bounds":{"document_bytes":16777216,"sheet_cells":100000,"rows_first":2000,"rows_last":500,"rows_between":2000,"halvings":0,"cell_chars":16384,"cell_head_chars":4096},"cells_cut":0,"cells_raw":0,"read":"whole","date_system":"1900"}

{"sheet":"Négoce, Dons & Collecte","index":0,"n_rows":18,"n_cols":18,"rows_kept":18,"cut":false,"hidden":false,"merged":[[11,9,11,12],[0,0,3,15],[2,17,2,19],[3,17,3,20],[4,17,4,21],[5,0,9,15],[12,9,12,12],[13,9,13,12],[14,9,14,12],[17,0,24,3],[17,4,24,14]]}
[]
[null,null,null,null,null,null,null,null,null,null,null,null,null,null,null,null,null,"Entrer le code article"]
[null,null,null,null,null,null,null,null,null,null,null,null,null,null,null,null,null,"Mettre à jour la feuille\n \"Liste  articles\" régulièrement"]
[null,null,null,null,null,null,null,null,null,null,null,null,null,null,null,null,null,"Fichier articles\nNAVISION"]
[null,null,null,null,null,null,null,null,null,null,null,null,null,null,null,null,null,"Faire un copier-coller du fichiers NAVISION"]
[{"$f":"IF(A1=\"\",\"\",VLOOKUP(A1,#REF!,2,FALSE))","v":""}]
[]
[]
[]
[]
[]
[null,null,null,null,null,"UB","Unité de base",null,null,{"$f":"IF(A1=\"\",\"\",VLOOKUP(A1,#REF!,3,FALSE))","v":""}]
[null,null,null,null,null,"PCB","Nbre UB par Colis",null,null,{"$f":"IF(A1=\"\",\"\",VLOOKUP(A1,#REF!,5,FALSE))","v":""}]
[null,null,null,null,null,"CC","Colis par couche",null,null,{"$f":"IF(A1=\"\",\"\",VLOOKUP(A1,#REF!,6,FALSE))","v":""}]
[null,null,null,null,null,"PAL","Colis par palette",null,null,{"$f":"IF(A1=\"\",\"\",VLOOKUP(A1,#REF!,7,FALSE))","v":""}]
[]
[]
["DLC / \nDLUO"]

{"sheet":"FEAD","index":1,"n_rows":18,"n_cols":18,"rows_kept":18,"cut":false,"hidden":false,"merged":[[17,0,24,3],[17,4,24,14],[0,5,3,15],[5,0,9,15],[11,10,11,13],[12,10,12,13],[13,10,13,13],[14,10,14,13]]}
[]
[null,null,null,null,null,null,null,null,null,null,null,null,null,null,null,null,null,"Entrer le code article"]
[]
[]
[]
[{"$f":"VLOOKUP(F1,#REF!,2,FALSE)","v":{"$error":"#REF!"}}]
[]
[]
[]
[]
[]
[null,null,null,null,null,null,"UB","Unité de base",null,null,{"$f":"VLOOKUP(F1,#REF!,3,FALSE)","v":{"$error":"#REF!"}}]
[null,null,null,null,null,null,"PCB","Nbre UB par Colis",null,null,{"$f":"VLOOKUP(F1,#REF!,4,FALSE)","v":{"$error":"#REF!"}}]
[null,null,null,null,null,null,"CC","Colis par couche",null,null,{"$f":"VLOOKUP(F1,#REF!,5,FALSE)","v":{"$error":"#REF!"}}]
[null,null,null,null,null,null,"PAL","Colis par palette",null,null,{"$f":"VLOOKUP(F1,#REF!,6,FALSE)","v":{"$error":"#REF!"}}]
[]
[]
["DLC / \nDLUO"]