{"text_format":"1","workbook":"xlsx","n_sheets":16,"sheets":["Feuil1","Album Photos","Champions","Écuries","Pilotes","Melbourne","Bahrein","Chine","Azerbaïdjan","Espagne","Monaco","Canada","France","Autriche","GB","Hongrie"],"not_rendered":{"charts":0,"images":22,"macros":1,"external_links":1,"defined_names":7,"comments":0,"pivot_tables":0},"unopened":[],"bounds":{"document_bytes":16777216,"sheet_cells":100000,"rows_first":2000,"rows_last":500,"rows_between":2000,"halvings":0,"cell_chars":16384,"cell_head_chars":4096},"cells_cut":0,"cells_raw":0,"read":"whole","date_system":"1900"}

{"sheet":"Feuil1","index":0,"n_rows":41,"n_cols":3,"rows_kept":41,"cut":false,"hidden":false,"merged":[[31,2,34,5],[35,2,38,5],[39,2,42,5],[1,1,1,5],[2,2,2,5],[3,2,6,5],[7,2,10,5],[11,2,14,5],[15,2,18,5],[19,2,22,5],[23,2,26,5],[27,2,30,5]]}
[]
[null,"Photos F1"]
[null,"Noms","Photos"]
[]
[null,"Mercedes"]
[]
[]
[]
[null,"Ferrari"]
[]
[]
[]
[null,"Red Bull"]
[]
[]
[]
[null,"Racing Point"]
[]
[]
[]
[null,"Williams"]
[]
[]
[]
[null,"Renault"]
[]
[]
[]
[null,"Toro Rosso"]
[]
[]
[]
[null,"Hass"]
[]
[]
[]
[null,"Mac Laren"]
[]
[]
[]
[null,"Alfa Roméo"]

{"sheet":"Album Photos","index":1,"n_rows":23,"n_cols":4,"rows_kept":23,"cut":false,"hidden":false,"merged":[[1,5,1,6]]}
[]
[null,"Photos Pilotes"]
[null,"Noms",null,"Photos"]
[null,"Lewis HAMILTON"]
[null,"Valterii BOTTAS"]
[null,"Charles LECLERC"]
[null,"Sebastian VETTEL"]
[null,"Max VERSTAPPEN"]
[null,"Alexander ALBON"]
[null,"Sergio PEREZ"]
[null,"Lance STROLL"]
[null,"George RUSSEL"]
[null,"Nicolas LATIFI"]
[null,"Daniel RICCIARDO"]
[null,"Nico HULKENBERG"]
[null,"Daniil KVYAT"]
[null,"Pierre GASLY"]
[null,"Romain GROSJEAN"]
[null,"Kevin MAGNUSSEN"]
[null,"Lando NORRIS"]
[null,"Carlos SAINZ"]
[null,"Kimi RAÏKKONEN"]
[null,"Antonio GIOVANIZZI"]

{"sheet":"Champions","index":2,"n_rows":22,"n_cols":10,"rows_kept":22,"cut":false,"hidden":false,"merged":[[1,2,1,10],[14,2,14,10],[16,5,16,7],[17,5,17,7],[3,5,3,7],[4,5,4,7],[6,1,6,3],[7,1,7,3],[6,9,6,11],[7,9,7,11],[8,9,12,11],[8,1,12,3],[5,5,8,7],[21,1,25,3],[18,5,22,7],[21,9,25,11],[19,1,19,3],[20,1,20,3],[19,9,19,11],[20,9,20,11]]}
[]
[null,null,"CHAMPIONNAT PILOTES 2019"]
[]
[null,null,null,null,null,"CHAMPION 2019"]
[null,null,null,null,null,{"$f":"IF(Pilotes!G5=1,Pilotes!B5,\"\")","v":"HAMILTON Lewis"}]
[null,null,null,null,null,{"$f":"MATCH(F5,'Album Photos'!$B$1:$B$23,0)","v":{"$error":"#N/A"}}]
[null,"DEUXIÈME",null,null,null,null,null,null,null,"TROIXIÈME"]
[null,{"$f":"IF(Pilotes!G6=2,Pilotes!B6,\"\")","v":"BOTTAS Valterri"},null,null,null,null,null,null,null,{"$f":"IF(Pilotes!G7=3,Pilotes!B7,\"\")","v":"ALBON Alexander"}]
[null,{"$f":"MATCH(B8,'Album Photos'!$B$1:$B$23,0)","v":{"$error":"#N/A"}},null,null,null,null,null,null,null,{"$f":"MATCH(J8,'Album Photos'!$B$1:$B$23,0)","v":{"$error":"#N/A"}}]
[]
[]
[]
[]
[]
[null,null,"CHAMPIONNAT CONSTRUCTEURS 2019"]
[]
[null,null,null,null,null,"CHAMPION 2019"]
[null,null,null,null,null,{"$f":"IF(Écuries!F4=1,Écuries!B4,\"\")","v":"MERCEDES"}]
[null,null,null,null,null,{"$f":"MATCH(F18,'Album Photos'!$F$1:$F$13,0)","v":{"$error":"#N/A"}}]
[null,"DEUXIÈME",null,null,null,null,null,null,null,"TROIXIÈME"]
[null,{"$f":"IF(Écuries!F5=2,Écuries!B5,\"\")","v":"RENAULT"},null,null,null,null,null,null,null,{"$f":"IF(Écuries!F6=3,Écuries!B6,\"\")","v":"WILLIAMS"}]
[null,{"$f":"MATCH(B21,'Album Photos'!$F$1:$F$13,0)","v":{"$error":"#N/A"}},null,null,null,null,null,null,null,{"$f":"MATCH(J21,'Album Photos'!$F$1:$F$13,0)","v":{"$error":"#N/A"}}]

{"sheet":"Écuries","index":3,"n_rows":13,"n_cols":6,"rows_kept":13,"cut":false,"hidden":false,"merged":[[0,1,0,5]]}
[]
[]
[null,"ÉCURIES","POINTS","Écart/premier","Écart/précédent","RANG"]
[null,"MERCEDES",{"$f":"SUM(Melbourne:Hongrie!J5)","v":173},null,null,{"$f":"IF(C4=\"\",0,(RANK(C4,$C$4:$C$13)))+COUNTIF(C$4:C4,C4)-1","v":1}]
[null,"RENAULT",{"$f":"SUM(Melbourne:Hongrie!J10)","v":50},{"$f":"C5-C4","v":-123},{"$f":"C5-C4","v":-123},{"$f":"IF(C5=\"\",0,(RANK(C5,$C$4:$C$13)))+COUNTIF(C$4:C5,C5)-1","v":2}]
[null,"WILLIAMS",{"$f":"SUM(Melbourne:Hongrie!J9)","v":46},{"$f":"C6-C4","v":-127},{"$f":"C6-C5","v":-4},{"$f":"IF(C6=\"\",0,(RANK(C6,$C$4:$C$13)))+COUNTIF(C$4:C6,C6)-1","v":3}]
[null,"HASS",{"$f":"SUM(Melbourne:Hongrie!J12)","v":44},{"$f":"C7-C4","v":-129},-2,{"$f":"IF(C7=\"\",0,(RANK(C7,$C$4:$C$13)))+COUNTIF(C$4:C7,C7)-1","v":4}]
[null,"TORO ROSSO",{"$f":"SUM(Melbourne:Hongrie!J11)","v":40},{"$f":"C8-C4","v":-133},-4,{"$f":"IF(C8=\"\",0,(RANK(C8,$C$4:$C$13)))+COUNTIF(C$4:C8,C8)-1","v":5}]
[null,"FERRARI",{"$f":"SUM(Melbourne:Hongrie!J6)","v":27},{"$f":"C9-C4","v":-146},-13,{"$f":"IF(C9=\"\",0,(RANK(C9,$C$4:$C$13)))+COUNTIF(C$4:C9,C9)-1","v":6}]
[null,"ALFA ROMÉO",{"$f":"SUM(Melbourne:Hongrie!J14)","v":25},{"$f":"C10-C4","v":-148},-2,{"$f":"IF(C10=\"\",0,(RANK(C10,$C$4:$C$13)))+COUNTIF(C$4:C10,C10)-1","v":7}]
[null,"RACING POINT",{"$f":"SUM(Melbourne:Hongrie!J8)","v":25},{"$f":"C11-C4","v":-148},0,{"$f":"IF(C11=\"\",0,(RANK(C11,$C$4:$C$13)))+COUNTIF(C$4:C11,C11)-1","v":8}]
[null,"RED BULL",{"$f":"SUM(Melbourne:Hongrie!J7)","v":18},{"$f":"C12-C4","v":-155},-7,{"$f":"IF(C12=\"\",0,(RANK(C12,$C$4:$C$13)))+COUNTIF(C$4:C12,C12)-1","v":9}]
[null,"Mc LAREN",{"$f":"SUM(Melbourne:Hongrie!J13)","v":0},{"$f":"C13-C4","v":-173},-18,{"$f":"IF(C13=\"\",0,(RANK(C13,$C$4:$C$13)))+COUNTIF(C$4:C13,C13)-1","v":10}]

{"sheet":"Pilotes","index":4,"n_rows":24,"n_cols":9,"rows_kept":24,"cut":false,"hidden":false,"merged":[[0,0,0,7],[2,1,3,1],[2,2,3,2],[2,6,3,6],[2,3,3,3],[2,4,3,4],[2,5,3,5]]}
[]
[]
[null,"PILOTES","Points","Écart-premier","Écart/précédent","Pôle Position","Place",1]
[null,null,{"$f":"IFERROR(SUM(Melbourne!G33,[1]Bahreïn!F33),\"\")","v":0},null,null,null,{"$f":"IF(C4=0,\"\",(RANK(C4,C1:C4)))","v":""},"Pos.Saison"]
[null,"HAMILTON Lewis",{"$f":"SUM(Melbourne:Hongrie!G5)","v":130},null,null,{"$f":"SUM(Melbourne:Hongrie!E9)","v":0},{"$f":"IF(C5=\"\",0,(RANK(C5,$C$5:$C$24)))+COUNTIF(C$5:C5,C5)-1","v":1},{"$f":"CalculPosition(B5)","v":3},"Syntaxe : =CalculPosition(B5) B5 étant le nom du pilote"]
[null,"BOTTAS Valterri",{"$f":"SUM(Melbourne:Hongrie!G6)","v":43},{"$f":"C6-C5","v":-87},{"$f":"C5-C6","v":87},{"$f":"SUM(Melbourne:Hongrie!E10)","v":0},{"$f":"IF(C6=\"\",0,(RANK(C6,$C$5:$C$24)))+COUNTIF(C$5:C6,C6)-1","v":2},{"$f":"CalculPosition(B6)","v":1}]
[null,"ALBON Alexander",{"$f":"SUM(Melbourne:Hongrie!G24)","v":40},{"$f":"C7-C5","v":-90},{"$f":"C6-C7","v":3},{"$f":"SUM(Melbourne:Hongrie!E11)","v":0},{"$f":"IF(C7=\"\",0,(RANK(C7,$C$5:$C$24)))+COUNTIF(C$5:C7,C7)-1","v":3},{"$f":"CalculPosition(B8)","v":1}]
[null,"MAGNUSSEN Kevin",{"$f":"SUM(Melbourne:Hongrie!G27)","v":29},{"$f":"C8-C5","v":-101},{"$f":"C7-C8","v":11},{"$f":"SUM(Melbourne:Hongrie!E12)","v":0},{"$f":"IF(C8=\"\",0,(RANK(C8,$C$5:$C$24)))+COUNTIF(C$5:C8,C8)-1","v":4},{"$f":"CalculPosition(B11)","v":1}]
[null,"RUSSELL George",{"$f":"SUM(Melbourne:Hongrie!G17)","v":27},{"$f":"C9-C5","v":-103},{"$f":"C8-C9","v":2},{"$f":"SUM(Melbourne:Hongrie!E13)","v":0},{"$f":"IF(C9=\"\",0,(RANK(C9,$C$5:$C$24)))+COUNTIF(C$5:C9,C9)-1","v":5},{"$f":"CalculPosition(B9)","v":1}]
[null,"RAÏKKÖNEN Kimi",{"$f":"SUM(Melbourne:Hongrie!G32)","v":25},{"$f":"C10-C5","v":-105},{"$f":"C9-C10","v":2},{"$f":"SUM(Melbourne:Hongrie!E14)","v":0},{"$f":"IF(C10=\"\",0,(RANK(C10,$C$5:$C$24)))+COUNTIF(C$5:C10,C10)-1","v":6},1]
[null,"HULKENBERG Nico",{"$f":"SUM(Melbourne:Hongrie!G21)","v":25},{"$f":"C11-C5","v":-105},{"$f":"C10-C11","v":0},{"$f":"SUM(Melbourne:Hongrie!E15)","v":0},{"$f":"IF(C11=\"\",0,(RANK(C11,$C$5:$C$24)))+COUNTIF(C$5:C11,C11)-1","v":7},1]
[null,"RICCIARDO Daniel",{"$f":"SUM(Melbourne:Hongrie!G20)","v":25},{"$f":"C12-C5","v":-105},0,{"$f":"SUM(Melbourne:Hongrie!E16)","v":0},{"$f":"IF(C12=\"\",0,(RANK(C12,$C$5:$C$24)))+COUNTIF(C$5:C12,C12)-1","v":8},1]
[null,"PEREZ Sergio",{"$f":"SUM(Melbourne:Hongrie!G14)","v":21},{"$f":"C13-C5","v":-109},4,{"$f":"SUM(Melbourne:Hongrie!E17)","v":0},{"$f":"IF(C13=\"\",0,(RANK(C13,$C$5:$C$24)))+COUNTIF(C$5:C13,C13)-1","v":9},0]
[null,"KUBICA Robert",{"$f":"SUM(Melbourne:Hongrie!G18)","v":19},{"$f":"C14-C5","v":-111},2,{"$f":"SUM(Melbourne:Hongrie!E18)","v":0},{"$f":"IF(C14=\"\",0,(RANK(C14,$C$5:$C$24)))+COUNTIF(C$5:C14,C14)-1","v":10},0]
[null,"VETTEL Sebastian",{"$f":"SUM(Melbourne:Hongrie!G8)","v":15},{"$f":"C15-C5","v":-115},4,{"$f":"SUM(Melbourne:Hongrie!E19)","v":0},{"$f":"IF(C15=\"\",0,(RANK(C15,$C$5:$C$24)))+COUNTIF(C$5:C15,C15)-1","v":11},0]
[null,"GROSJEAN Romain",{"$f":"SUM(Melbourne:Hongrie!G26)","v":15},{"$f":"C16-C5","v":-115},0,{"$f":"SUM(Melbourne:Hongrie!E20)","v":0},{"$f":"IF(C16=\"\",0,(RANK(C16,$C$5:$C$24)))+COUNTIF(C$5:C16,C16)-1","v":12},0]
[null,"LECLERC Charles",{"$f":"SUM(Melbourne:Hongrie!G9)","v":12},{"$f":"C17-C5","v":-118},3,{"$f":"SUM(Melbourne:Hongrie!E21)","v":0},{"$f":"IF(C17=\"\",0,(RANK(C17,$C$5:$C$24)))+COUNTIF(C$5:C17,C17)-1","v":13},0]
[null,"VERSTAPPEN Max",{"$f":"SUM(Melbourne:Hongrie!G11)","v":10},{"$f":"C18-C5","v":-120},2,{"$f":"SUM(Melbourne:Hongrie!E22)","v":0},{"$f":"IF(C18=\"\",0,(RANK(C18,$C$5:$C$24)))+COUNTIF(C$5:C18,C18)-1","v":14},0]
[null,"GASLY Pierre",{"$f":"SUM(Melbourne:Hongrie!G12)","v":8},{"$f":"C19-C5","v":-122},2,{"$f":"SUM(Melbourne:Hongrie!E23)","v":0},{"$f":"IF(C19=\"\",0,(RANK(C19,$C$5:$C$24)))+COUNTIF(C$5:C19,C19)-1","v":15},0]
[null,"STROLL Lance",{"$f":"SUM(Melbourne:Hongrie!G15)","v":4},{"$f":"C20-C5","v":-126},4,{"$f":"SUM(Melbourne:Hongrie!E24)","v":0},{"$f":"IF(C20=\"\",0,(RANK(C20,$C$5:$C$24)))+COUNTIF(C$5:C20,C20)-1","v":16},0]
[null,"SAINZ.Jr Carlos",{"$f":"SUM(Melbourne:Hongrie!G30)","v":0},{"$f":"C21-C5","v":-130},4,{"$f":"SUM(Melbourne:Hongrie!E25)","v":0},{"$f":"IF(C21=\"\",0,(RANK(C21,$C$5:$C$24)))+COUNTIF(C$5:C21,C21)-1","v":17},0]
[null,"NORRIS Lando",{"$f":"SUM(Melbourne:Hongrie!G29)","v":0},{"$f":"C22-C5","v":-130},0,{"$f":"SUM(Melbourne:Hongrie!E26)","v":0},{"$f":"IF(C22=\"\",0,(RANK(C22,$C$5:$C$24)))+COUNTIF(C$5:C22,C22)-1","v":18},0]
[null,"KVYAT Daniil",{"$f":"SUM(Melbourne:Hongrie!G23)","v":0},{"$f":"C23-C5","v":-130},{"$f":"C22-C23","v":0},{"$f":"SUM(Melbourne:Hongrie!E27)","v":0},{"$f":"IF(C23=\"\",0,(RANK(C23,$C$5:$C$24)))+COUNTIF(C$5:C23,C23)-1","v":19},0]
[null,"GIOVANIZZI Antonio",{"$f":"SUM(Melbourne:Hongrie!G33)","v":0},{"$f":"C24-C5","v":-130},0,{"$f":"SUM(Melbourne:Hongrie!E28)","v":0},{"$f":"IF(C24=\"\",0,(RANK(C24,$C$5:$C$24)))+COUNTIF(C$5:C24,C24)-1","v":20},0]

{"sheet":"Melbourne","index":5,"n_rows":34,"n_cols":11,"rows_kept":34,"cut":false,"hidden":false,"merged":[[7,1,9,1],[7,2,9,2],[10,1,12,1],[10,2,12,2],[0,0,1,14],[4,1,6,1],[4,2,6,2],[2,0,3,0],[2,8,2,10],[2,1,3,1],[2,2,3,2],[2,3,3,3],[2,5,3,5],[2,6,3,6],[2,4,3,4],[31,1,33,1],[31,2,33,2],[13,1,15,1],[13,2,15,2],[16,1,18,1],[16,2,18,2],[19,1,21,1],[19,2,21,2],[28,1,30,1],[28,2,30,2],[25,2,27,2],[22,1,24,1],[22,2,24,2],[25,1,27,1]]}
["AUSTRALIE - 17 MARS 2019"]
[]
["PILOTES","ECURIES","VOITURES","Finish","Pôle","Pt tour","Points",null,"CLASSEMENT"]
[null,null,null,null,null,null,null,null,"ÉCURIES","POINTS","RANG"]
["HAMILTON Lewis","MERCEDES",null,1,null,null,{"$f":"IFERROR(CHOOSE(D5,25,18,15,12,10,8,6,4,2,1)+(F5=1),0)","v":25},null,"MERCEDES",{"$f":"SUM(G5:G7)","v":43},{"$f":"IF(J5=\"\",0,(RANK(J5,$J$5:$J$14)))+COUNTIF(J$5:J5,J5)-1","v":1}]
["BOTTAS Valterri",null,null,2,null,null,{"$f":"IFERROR(CHOOSE(D6,25,18,15,12,10,8,6,4,2,1)+(F6=1),0)","v":18},null,"FERRARI",{"$f":"SUM(G8:G10)","v":27},{"$f":"IF(J6=\"\",0,(RANK(J6,$J$5:$J$14)))+COUNTIF(J$5:J6,J6)-1","v":2}]
[null,null,null,null,null,null,{"$f":"IFERROR(CHOOSE(D7,25,18,15,12,10,8,6,4,2,1)+(F7=1),\"\")","v":""},null,"RED BULL",{"$f":"SUM(G11:G13)","v":18},{"$f":"IF(J7=\"\",0,(RANK(J7,$J$5:$J$14)))+COUNTIF(J$5:J7,J7)-1","v":3}]
["VETTEL Sebastian","FERRARI",null,3,null,null,{"$f":"IFERROR(CHOOSE(D8,25,18,15,12,10,8,6,4,2,1)+(F8=1),0)","v":15},null,"RACING POINT",{"$f":"SUM(G14:G16)","v":10},{"$f":"IF(J8=\"\",0,(RANK(J8,$J$5:$J$14)))+COUNTIF(J$5:J8,J8)-1","v":4}]
["LECLERC Charles",null,null,4,null,null,{"$f":"IFERROR(CHOOSE(D9,25,18,15,12,10,8,6,4,2,1)+(F9=1),0)","v":12},null,"WILLIAMS",{"$f":"SUM(G17:G19)","v":3},{"$f":"IF(J9=\"\",0,(RANK(J9,$J$5:$J$14)))+COUNTIF(J$5:J9,J9)-1","v":5}]
[null,null,null,null,null,null,{"$f":"IFERROR(CHOOSE(D10,25,18,15,12,10,8,6,4,2,1)+(F10=1),\"\")","v":""},null,"RENAULT",{"$f":"SUM(G20:G22)","v":0},{"$f":"IF(J10=\"\",0,(RANK(J10,$J$5:$J$14)))+COUNTIF(J$5:J10,J10)-1","v":6}]
["VERSTAPPEN Max","RED BULL",null,5,null,null,{"$f":"IFERROR(CHOOSE(D11,25,18,15,12,10,8,6,4,2,1)+(F11=1),0)","v":10},null,"TORO ROSSO",{"$f":"SUM(G23:G25)","v":0},{"$f":"IF(J11=\"\",0,(RANK(J11,$J$5:$J$14)))+COUNTIF(J$5:J11,J11)-1","v":7}]
["GASLY Pierre",null,null,6,null,null,{"$f":"IFERROR(CHOOSE(D12,25,18,15,12,10,8,6,4,2,1)+(F12=1),0)","v":8},null,"HAAS",{"$f":"SUM(G26:G28)","v":0},{"$f":"IF(J12=\"\",0,(RANK(J12,$J$5:$J$14)))+COUNTIF(J$5:J12,J12)-1","v":8}]
[null,null,null,null,null,null,{"$f":"IFERROR(CHOOSE(D13,25,18,15,12,10,8,6,4,2,1)+(F13=1),\"\")","v":""},null,"Mc LAREN",{"$f":"SUM(G29:G31)","v":0},{"$f":"IF(J13=\"\",0,(RANK(J13,$J$5:$J$14)))+COUNTIF(J$5:J13,J13)-1","v":9}]
["PEREZ Sergio","RACING\nPOINT",null,7,null,null,{"$f":"IFERROR(CHOOSE(D14,25,18,15,12,10,8,6,4,2,1)+(F14=1),0)","v":6},null,"ALFA ROMEO",{"$f":"SUM(G32:G34)","v":0},{"$f":"IF(J14=\"\",0,(RANK(J14,$J$5:$J$14)))+COUNTIF(J$5:J14,J14)-1","v":10}]
["STROLL Lance",null,null,8,null,null,{"$f":"IFERROR(CHOOSE(D15,25,18,15,12,10,8,6,4,2,1)+(F15=1),0)","v":4}]
[null,null,null,null,null,null,{"$f":"IFERROR(CHOOSE(D16,25,18,15,12,10,8,6,4,2,1)+(F16=1),\"\")","v":""}]
["RUSSELL George","WILLIAMS",null,9,null,null,{"$f":"IFERROR(CHOOSE(D17,25,18,15,12,10,8,6,4,2,1)+(F17=1),0)","v":2}]
["KUBICA Robert",null,null,10,null,null,{"$f":"IFERROR(CHOOSE(D18,25,18,15,12,10,8,6,4,2,1)+(F18=1),0)","v":1}]
[null,null,null,null,null,null,{"$f":"IFERROR(CHOOSE(D19,25,18,15,12,10,8,6,4,2,1)+(F19=1),\"\")","v":""}]
["RICCIARDO Daniel","RENAULT",null,11,null,null,{"$f":"IFERROR(CHOOSE(D20,25,18,15,12,10,8,6,4,2,1)+(F20=1),0)","v":0}]
["HULKENBERG Nico",null,null,12,null,null,{"$f":"IFERROR(CHOOSE(D21,25,18,15,12,10,8,6,4,2,1)+(F21=1),0)","v":0}]
[null,null,null,null,null,null,{"$f":"IFERROR(CHOOSE(D22,25,18,15,12,10,8,6,4,2,1)+(F22=1),\"\")","v":""}]
["KVYAT Daniil","TORO ROSSO",null,13,null,null,{"$f":"IFERROR(CHOOSE(D23,25,18,15,12,10,8,6,4,2,1)+(F23=1),0)","v":0}]
["ALBON Alexander",null,null,14,null,null,{"$f":"IFERROR(CHOOSE(D24,25,18,15,12,10,8,6,4,2,1)+(F24=1),0)","v":0}]
[null,null,null,null,null,null,{"$f":"IFERROR(CHOOSE(D25,25,18,15,12,10,8,6,4,2,1)+(F25=1),\"\")","v":""}]
["GROSJEAN Romain","HAAS",null,15,null,null,{"$f":"IFERROR(CHOOSE(D26,25,18,15,12,10,8,6,4,2,1)+(F26=1),0)","v":0}]
["MAGNUSSEN Kevin",null,null,16,null,null,{"$f":"IFERROR(CHOOSE(D27,25,18,15,12,10,8,6,4,2,1)+(F27=1),0)","v":0}]
[null,null,null,null,null,null,{"$f":"IFERROR(CHOOSE(D28,25,18,15,12,10,8,6,4,2,1)+(F28=1),\"\")","v":""}]
["NORRIS Lando","McLAREN",null,17,null,null,{"$f":"IFERROR(CHOOSE(D29,25,18,15,12,10,8,6,4,2,1)+(F29=1),0)","v":0}]
["SAINZ.Jr Carlos",null,null,18,null,null,{"$f":"IFERROR(CHOOSE(D30,25,18,15,12,10,8,6,4,2,1)+(F30=1),0)","v":0}]
[null,null,null,null,null,null,{"$f":"IFERROR(CHOOSE(D31,25,18,15,12,10,8,6,4,2,1)+(F31=1),\"\")","v":""}]
["RAÏKKÖNEN Kimi","ALFA ROMEO",null,19,null,null,{"$f":"IFERROR(CHOOSE(D32,25,18,15,12,10,8,6,4,2,1)+(F32=1),0)","v":0}]
["GIOVANIZZI Antonio",null,null,20,null,null,{"$f":"IFERROR(CHOOSE(D33,25,18,15,12,10,8,6,4,2,1)+(F33=1),0)","v":0}]
[null,null,null,null,null,null,{"$f":"IFERROR(CHOOSE(D34,25,18,15,12,10,8,6,4,2,1)+(F34=1),\"\")","v":""}]

{"sheet":"Bahrein","index":6,"n_rows":33,"n_cols":12,"rows_kept":33,"cut":false,"hidden":false,"merged":[[0,0,1,14],[2,1,3,1],[2,2,3,2],[2,3,3,3],[2,5,3,5],[2,6,3,6],[2,8,2,10],[2,4,3,4],[4,1,6,1],[4,2,6,2],[7,1,9,1],[7,2,9,2],[10,1,12,1],[10,2,12,2],[13,1,15,1],[13,2,15,2],[16,1,18,1],[16,2,18,2],[19,1,21,1],[19,2,21,2],[31,1,33,1],[31,2,33,2],[22,1,24,1],[22,2,24,2],[25,1,27,1],[25,2,27,2],[28,1,30,1],[28,2,30,2]]}
["BAHREÏN - 31 MARS 2019"]
[]
["PILOTES","ECURIES","VOITURES","Finish","Pôle","Pt tour","Points",null,"CLASSEMENT"]
[null,null,null,null,null,null,null,{"$f":"IF(G4=\"\",\"\",(RANK(G4,G4:G23)))","v":""},"ÉCURIES","POINTS","RANG","TOTAL"]
["HAMILTON Lewis","MERCEDES",null,10,null,null,{"$f":"IFERROR(CHOOSE(D5,25,18,15,12,10,8,6,4,2,1)+(F5=1),0)","v":1},null,"MERCEDES",{"$f":"SUM(G5:G7)","v":26},{"$f":"IF(J5=\"\",0,(RANK(J5,$J$5:$J$14)))+COUNTIF(J$5:J5,J5)-1","v":1},{"$f":"IF(J5=0,0,J5+Melbourne!J5)","v":69}]
["BOTTAS Valterri",null,null,1,null,null,{"$f":"IFERROR(CHOOSE(D6,25,18,15,12,10,8,6,4,2,1)+(F6=1),0)","v":25},null,"FERRARI",{"$f":"SUM(G8:G10)","v":0},{"$f":"IF(J6=\"\",0,(RANK(J6,$J$5:$J$14)))+COUNTIF(J$5:J6,J6)-1","v":4},{"$f":"IF(J6=0,0,J6+Melbourne!J6)","v":0}]
[null,null,null,null,null,null,null,null,"RED BULL",{"$f":"SUM(G11:G13)","v":0},{"$f":"IF(J7=\"\",0,(RANK(J7,$J$5:$J$14)))+COUNTIF(J$5:J7,J7)-1","v":5},{"$f":"IF(J7=0,0,J7+Melbourne!J7)","v":0}]
["VETTEL Sebastian","FERRARI",null,null,null,null,{"$f":"IFERROR(CHOOSE(D8,25,18,15,12,10,8,6,4,2,1)+(F8=1),0)","v":0},null,"RACING POINT",{"$f":"SUM(G14:G16)","v":0},{"$f":"IF(J8=\"\",0,(RANK(J8,$J$5:$J$14)))+COUNTIF(J$5:J8,J8)-1","v":6},{"$f":"IF(J8=0,0,J8+Melbourne!J8)","v":0}]
["LECLERC Charles",null,null,null,null,null,{"$f":"IFERROR(CHOOSE(D9,25,18,15,12,10,8,6,4,2,1)+(F9=1),0)","v":0},null,"WILLIAMS",{"$f":"SUM(G17:G19)","v":18},{"$f":"IF(J9=\"\",0,(RANK(J9,$J$5:$J$14)))+COUNTIF(J$5:J9,J9)-1","v":2},{"$f":"IF(J9=0,0,J9+Melbourne!J9)","v":21}]
[null,null,null,null,null,null,{"$f":"IFERROR(CHOOSE(D10,25,18,15,12,10,8,6,4,2,1)+(F10=1),\"\")","v":""},null,"RENAULT",{"$f":"SUM(G20:G22)","v":0},{"$f":"IF(J10=\"\",0,(RANK(J10,$J$5:$J$14)))+COUNTIF(J$5:J10,J10)-1","v":7},{"$f":"IF(J10=0,0,J10+Melbourne!J10)","v":0}]
["VERSTAPPEN Max","RED BULL",null,null,null,null,{"$f":"IFERROR(CHOOSE(D11,25,18,15,12,10,8,6,4,2,1)+(F11=1),0)","v":0},null,"TORO ROSSO",{"$f":"SUM(G23:G25)","v":15},{"$f":"IF(J11=\"\",0,(RANK(J11,$J$5:$J$14)))+COUNTIF(J$5:J11,J11)-1","v":3},{"$f":"IF(J11=0,0,J11+Melbourne!J11)","v":15}]
["GASLY Pierre",null,null,null,null,null,{"$f":"IFERROR(CHOOSE(D12,25,18,15,12,10,8,6,4,2,1)+(F12=1),0)","v":0},null,"HAAS",{"$f":"SUM(G26:G28)","v":0},{"$f":"IF(J12=\"\",0,(RANK(J12,$J$5:$J$14)))+COUNTIF(J$5:J12,J12)-1","v":8},{"$f":"IF(J12=0,0,J12+Melbourne!J12)","v":0}]
[null,null,null,null,null,null,null,null,"Mc LAREN",{"$f":"SUM(G29:G31)","v":0},{"$f":"IF(J13=\"\",0,(RANK(J13,$J$5:$J$14)))+COUNTIF(J$5:J13,J13)-1","v":9},{"$f":"IF(J13=0,0,J13+Melbourne!J13)","v":0}]
["PEREZ Sergio","RACING\nPOINT",null,null,null,null,{"$f":"IFERROR(CHOOSE(D14,25,18,15,12,10,8,6,4,2,1)+(F14=1),0)","v":0},null,"ALFA ROMEO",{"$f":"SUM(G32:G34)","v":0},{"$f":"IF(J14=\"\",0,(RANK(J14,$J$5:$J$14)))+COUNTIF(J$5:J14,J14)-1","v":10},{"$f":"IF(J14=0,0,J14+Melbourne!J14)","v":0}]
["STROLL Lance",null,null,null,null,null,{"$f":"IFERROR(CHOOSE(D15,25,18,15,12,10,8,6,4,2,1)+(F15=1),0)","v":0}]
[]
["RUSSELL George","WILLIAMS",null,null,null,null,{"$f":"IFERROR(CHOOSE(D17,25,18,15,12,10,8,6,4,2,1)+(F17=1),0)","v":0}]
["KUBICA Robert",null,null,2,null,null,{"$f":"IFERROR(CHOOSE(D18,25,18,15,12,10,8,6,4,2,1)+(F18=1),0)","v":18}]
[]
["RICCIARDO Daniel","RENAULT",null,null,null,null,{"$f":"IFERROR(CHOOSE(D20,25,18,15,12,10,8,6,4,2,1)+(F20=1),0)","v":0}]
["HULKENBERG Nico",null,null,null,null,null,{"$f":"IFERROR(CHOOSE(D21,25,18,15,12,10,8,6,4,2,1)+(F21=1),0)","v":0}]
[]
["KVYAT Daniil","TORO ROSSO",null,null,null,null,{"$f":"IFERROR(CHOOSE(D23,25,18,15,12,10,8,6,4,2,1)+(F23=1),0)","v":0}]
["ALBON Alexander",null,null,3,null,null,{"$f":"IFERROR(CHOOSE(D24,25,18,15,12,10,8,6,4,2,1)+(F24=1),0)","v":15}]
[]
["GROSJEAN Romain","HAAS",null,null,null,null,{"$f":"IFERROR(CHOOSE(D26,25,18,15,12,10,8,6,4,2,1)+(F26=1),0)","v":0}]
["MAGNUSSEN Kevin",null,null,null,null,null,{"$f":"IFERROR(CHOOSE(D27,25,18,15,12,10,8,6,4,2,1)+(F27=1),0)","v":0}]
[]
["NORRIS Lando","McLAREN",null,null,null,null,{"$f":"IFERROR(CHOOSE(D29,25,18,15,12,10,8,6,4,2,1)+(F29=1),0)","v":0}]
["SAINZ.Jr Carlos",null,null,null,null,null,{"$f":"IFERROR(CHOOSE(D30,25,18,15,12,10,8,6,4,2,1)+(F30=1),0)","v":0}]
[]
["RAÏKKÖNEN Kimi","ALFA ROMEO",null,null,null,null,{"$f":"IFERROR(CHOOSE(D32,25,18,15,12,10,8,6,4,2,1)+(F32=1),0)","v":0}]
["GIOVANIZZI Antonio",null,null,null,null,null,{"$f":"IFERROR(CHOOSE(D33,25,18,15,12,10,8,6,4,2,1)+(F33=1),0)","v":0}]

{"sheet":"Chine","index":7,"n_rows":34,"n_cols":12,"rows_kept":34,"cut":false,"hidden":false,"merged":[[0,0,1,14],[2,1,3,1],[2,2,3,2],[2,3,3,3],[2,5,3,5],[2,6,3,6],[2,8,2,10],[2,4,3,4],[4,1,6,1],[4,2,6,2],[7,1,9,1],[7,2,9,2],[10,1,12,1],[10,2,12,2],[13,1,15,1],[13,2,15,2],[16,1,18,1],[16,2,18,2],[19,1,21,1],[19,2,21,2],[31,1,33,1],[31,2,33,2],[22,1,24,1],[22,2,24,2],[25,1,27,1],[25,2,27,2],[28,1,30,1],[28,2,30,2]]}
["CHINE - 14 AVRIL 2019"]
[]
["PILOTES","ECURIES","VOITURES","Finish","Pôle","Pt tour","Points",null,"CLASSEMENT"]
[null,null,null,null,null,null,null,{"$f":"IF(G4=\"\",\"\",(RANK(G4,G4:G23)))","v":""},"ÉCURIES","POINTS","RANG","TOTAL"]
["HAMILTON Lewis","MERCEDES",null,2,null,null,{"$f":"IFERROR(CHOOSE(D5,25,18,15,12,10,8,6,4,2,1)+(F5=1),0)","v":18},null,"MERCEDES",{"$f":"SUM(G5:G7)","v":18},{"$f":"IF(J5=\"\",0,(RANK(J5,$J$5:$J$14)))+COUNTIF(J$5:J5,J5)-1","v":2},{"$f":"IF(J5=0,0,J5+Bahrein!L5)","v":87}]
["BOTTAS Valterri",null,null,null,null,null,0,null,"FERRARI",{"$f":"SUM(G8:G10)","v":0},{"$f":"IF(J6=\"\",0,(RANK(J6,$J$5:$J$14)))+COUNTIF(J$5:J6,J6)-1","v":3},{"$f":"IF(J6=0,0,J6+Bahrein!L6)","v":0}]
[null,null,null,null,null,null,0,null,"RED BULL",{"$f":"SUM(G11:G13)","v":0},{"$f":"IF(J7=\"\",0,(RANK(J7,$J$5:$J$14)))+COUNTIF(J$5:J7,J7)-1","v":4},{"$f":"IF(J7=0,0,J7+Bahrein!L7)","v":0}]
["VETTEL Sebastian","FERRARI",null,null,null,null,0,null,"RACING POINT",{"$f":"SUM(G14:G16)","v":0},{"$f":"IF(J8=\"\",0,(RANK(J8,$J$5:$J$14)))+COUNTIF(J$5:J8,J8)-1","v":5},{"$f":"IF(J8=0,0,J8+Bahrein!L8)","v":0}]
["LECLERC Charles",null,null,null,null,null,0,null,"WILLIAMS",{"$f":"SUM(G17:G19)","v":25},{"$f":"IF(J9=\"\",0,(RANK(J9,$J$5:$J$14)))+COUNTIF(J$5:J9,J9)-1","v":1},{"$f":"IF(J9=0,0,J9+Bahrein!L9)","v":46}]
[null,null,null,null,null,null,0,null,"RENAULT",{"$f":"SUM(G20:G22)","v":0},{"$f":"IF(J10=\"\",0,(RANK(J10,$J$5:$J$14)))+COUNTIF(J$5:J10,J10)-1","v":6},{"$f":"IF(J10=0,0,J10+Bahrein!L10)","v":0}]
["VERSTAPPEN Max","RED BULL",null,null,null,null,0,null,"TORO ROSSO",{"$f":"SUM(G23:G25)","v":0},{"$f":"IF(J11=\"\",0,(RANK(J11,$J$5:$J$14)))+COUNTIF(J$5:J11,J11)-1","v":7},{"$f":"IF(J11=0,0,J11+Bahrein!L11)","v":0}]
["GASLY Pierre",null,null,null,null,null,0,null,"HAAS",{"$f":"SUM(G26:G28)","v":0},{"$f":"IF(J12=\"\",0,(RANK(J12,$J$5:$J$14)))+COUNTIF(J$5:J12,J12)-1","v":8},{"$f":"IF(J12=0,0,J12+Bahrein!L12)","v":0}]
[null,null,null,null,null,null,0,null,"Mc LAREN",{"$f":"SUM(G29:G31)","v":0},{"$f":"IF(J13=\"\",0,(RANK(J13,$J$5:$J$14)))+COUNTIF(J$5:J13,J13)-1","v":9},{"$f":"IF(J13=0,0,J13+Bahrein!L13)","v":0}]
["PEREZ Sergio","RACING\nPOINT",null,null,null,null,0,null,"ALFA ROMEO",{"$f":"SUM(G32:G34)","v":0},{"$f":"IF(J14=\"\",0,(RANK(J14,$J$5:$J$14)))+COUNTIF(J$5:J14,J14)-1","v":10},{"$f":"IF(J14=0,0,J14+Bahrein!L14)","v":0}]
["STROLL Lance",null,null,null,null,null,0]
[null,null,null,null,null,null,0]
["RUSSELL George","WILLIAMS",null,1,null,null,25]
["KUBICA Robert",null,null,null,null,null,0]
[null,null,null,null,null,null,0]
["RICCIARDO Daniel","RENAULT",null,null,null,null,0]
["HULKENBERG Nico",null,null,null,null,null,0]
[null,null,null,null,null,null,0]
["KVYAT Daniil","TORO ROSSO",null,null,null,null,0]
["ALBON Alexander",null,null,null,null,null,0]
[null,null,null,null,null,null,0]
["GROSJEAN Romain","HAAS",null,null,null,null,0]
["MAGNUSSEN Kevin",null,null,null,null,null,0]
[null,null,null,null,null,null,0]
["NORRIS Lando","McLAREN",null,"OUT",null,null,0]
["SAINZ.Jr Carlos",null,null,null,null,null,0]
[null,null,null,null,null,null,0]
["RAÏKKÖNEN Kimi","ALFA ROMEO",null,null,null,null,0]
["GIOVANIZZI Antonio",null,null,null,null,null,0]
[null,null,null,null,null,null,0]

{"sheet":"Azerbaïdjan","index":8,"n_rows":34,"n_cols":19,"rows_kept":34,"cut":false,"hidden":false,"merged":[[0,0,1,14],[2,1,3,1],[2,2,3,2],[2,3,3,3],[2,5,3,5],[2,6,3,6],[2,8,2,10],[2,4,3,4],[4,1,6,1],[4,2,6,2],[7,1,9,1],[7,2,9,2],[10,1,12,1],[10,2,12,2],[13,1,15,1],[13,2,15,2],[16,1,18,1],[16,2,18,2],[19,1,21,1],[19,2,21,2],[31,1,33,1],[31,2,33,2],[22,1,24,1],[22,2,24,2],[25,1,27,1],[25,2,27,2],[28,1,30,1],[28,2,30,2]]}
["AZERBAÏDJAN - 28 AVRIL 2019"]
[]
["PILOTES","ECURIES","VOITURES","Finish","Pôle","Pt tour","Points",null,"CLASSEMENT"]
[null,null,null,null,null,null,null,{"$f":"IF(G4=\"\",\"\",(RANK(G4,G4:G23)))","v":""},"ÉCURIES","POINTS","RANG","TOTAL"]
["HAMILTON Lewis","MERCEDES",null,2,null,null,{"$f":"IFERROR(CHOOSE(D5,25,18,15,12,10,8,6,4,2,1)+(F5=1),0)","v":18},null,"MERCEDES",{"$f":"SUM(G5:G7)","v":18},{"$f":"IF(J5=\"\",0,(RANK(J5,$J$5:$J$14)))+COUNTIF(J$5:J5,J5)-1","v":2},{"$f":"IF(J5=0,0,J5+Chine!L5)","v":105}]
["BOTTAS Valterri",null,null,null,null,null,{"$f":"IFERROR(CHOOSE(D6,25,18,15,12,10,8,6,4,2,1)+(F6=1),0)","v":0},null,"FERRARI",{"$f":"SUM(G8:G10)","v":0},{"$f":"IF(J6=\"\",0,(RANK(J6,$J$5:$J$14)))+COUNTIF(J$5:J6,J6)-1","v":3},{"$f":"IF(J6=0,0,J6+Chine!L6)","v":0}]
[null,null,null,null,null,null,{"$f":"IFERROR(CHOOSE(D7,25,18,15,12,10,8,6,4,2,1)+(F7=1),\"\")","v":""},null,"RED BULL",{"$f":"SUM(G11:G13)","v":0},{"$f":"IF(J7=\"\",0,(RANK(J7,$J$5:$J$14)))+COUNTIF(J$5:J7,J7)-1","v":4},{"$f":"IF(J7=0,0,J7+Chine!L7)","v":0}]
["VETTEL Sebastian","FERRARI",null,null,null,null,{"$f":"IFERROR(CHOOSE(D8,25,18,15,12,10,8,6,4,2,1)+(F8=1),0)","v":0},null,"RACING POINT",{"$f":"SUM(G14:G16)","v":0},{"$f":"IF(J8=\"\",0,(RANK(J8,$J$5:$J$14)))+COUNTIF(J$5:J8,J8)-1","v":5},{"$f":"IF(J8=0,0,J8+Chine!L8)","v":0}]
["LECLERC Charles",null,null,null,null,null,{"$f":"IFERROR(CHOOSE(D9,25,18,15,12,10,8,6,4,2,1)+(F9=1),0)","v":0},null,"WILLIAMS",{"$f":"SUM(G17:G19)","v":0},{"$f":"IF(J9=\"\",0,(RANK(J9,$J$5:$J$14)))+COUNTIF(J$5:J9,J9)-1","v":6},{"$f":"IF(J9=0,0,J9+Chine!L9)","v":0}]
[null,null,null,null,null,null,{"$f":"IFERROR(CHOOSE(D10,25,18,15,12,10,8,6,4,2,1)+(F10=1),\"\")","v":""},null,"RENAULT",{"$f":"SUM(G20:G22)","v":0},{"$f":"IF(J10=\"\",0,(RANK(J10,$J$5:$J$14)))+COUNTIF(J$5:J10,J10)-1","v":7},{"$f":"IF(J10=0,0,J10+Chine!L10)","v":0}]
["VERSTAPPEN Max","RED BULL",null,null,null,null,{"$f":"IFERROR(CHOOSE(D11,25,18,15,12,10,8,6,4,2,1)+(F11=1),0)","v":0},null,"TORO ROSSO",{"$f":"SUM(G23:G25)","v":25},{"$f":"IF(J11=\"\",0,(RANK(J11,$J$5:$J$14)))+COUNTIF(J$5:J11,J11)-1","v":1},{"$f":"IF(J11=0,0,J11+Chine!L11)","v":25}]
["GASLY Pierre",null,null,null,null,null,{"$f":"IFERROR(CHOOSE(D12,25,18,15,12,10,8,6,4,2,1)+(F12=1),0)","v":0},null,"HAAS",{"$f":"SUM(G26:G28)","v":0},{"$f":"IF(J12=\"\",0,(RANK(J12,$J$5:$J$14)))+COUNTIF(J$5:J12,J12)-1","v":8},{"$f":"IF(J12=0,0,J12+Chine!L12)","v":0}]
[null,null,null,null,null,null,{"$f":"IFERROR(CHOOSE(D13,25,18,15,12,10,8,6,4,2,1)+(F13=1),\"\")","v":""},null,"Mc LAREN",{"$f":"SUM(G29:G31)","v":0},{"$f":"IF(J13=\"\",0,(RANK(J13,$J$5:$J$14)))+COUNTIF(J$5:J13,J13)-1","v":9},{"$f":"IF(J13=0,0,J13+Chine!L13)","v":0}]
["PEREZ Sergio","RACING\nPOINT",null,null,null,null,{"$f":"IFERROR(CHOOSE(D14,25,18,15,12,10,8,6,4,2,1)+(F14=1),0)","v":0},null,"ALFA ROMEO",{"$f":"SUM(G32:G34)","v":0},{"$f":"IF(J14=\"\",0,(RANK(J14,$J$5:$J$14)))+COUNTIF(J$5:J14,J14)-1","v":10},{"$f":"IF(J14=0,0,J14+Chine!L14)","v":0}]
["STROLL Lance",null,null,null,null,null,{"$f":"IFERROR(CHOOSE(D15,25,18,15,12,10,8,6,4,2,1)+(F15=1),0)","v":0}]
[null,null,null,null,null,null,{"$f":"IFERROR(CHOOSE(D16,25,18,15,12,10,8,6,4,2,1)+(F16=1),\"\")","v":""}]
["RUSSELL George","WILLIAMS",null,null,null,null,{"$f":"IFERROR(CHOOSE(D17,25,18,15,12,10,8,6,4,2,1)+(F17=1),0)","v":0}]
["KUBICA Robert",null,null,null,null,null,{"$f":"IFERROR(CHOOSE(D18,25,18,15,12,10,8,6,4,2,1)+(F18=1),0)","v":0},null,null,null,null,null,null,null,null,null,null,null,{"$f":"IF(R18=\"\",0,(RANK(R18,$J$5:$J$14)))+COUNTIF(R$5:R18,R18)-1","v":-1}]
[null,null,null,null,null,null,{"$f":"IFERROR(CHOOSE(D19,25,18,15,12,10,8,6,4,2,1)+(F19=1),\"\")","v":""}]
["RICCIARDO Daniel","RENAULT",null,null,null,null,{"$f":"IFERROR(CHOOSE(D20,25,18,15,12,10,8,6,4,2,1)+(F20=1),0)","v":0}]
["HULKENBERG Nico",null,null,null,null,null,{"$f":"IFERROR(CHOOSE(D21,25,18,15,12,10,8,6,4,2,1)+(F21=1),0)","v":0}]
[null,null,null,null,null,null,{"$f":"IFERROR(CHOOSE(D22,25,18,15,12,10,8,6,4,2,1)+(F22=1),\"\")","v":""}]
["KVYAT Daniil","TORO ROSSO",null,null,null,null,{"$f":"IFERROR(CHOOSE(D23,25,18,15,12,10,8,6,4,2,1)+(F23=1),0)","v":0}]
["ALBON Alexander",null,null,1,null,null,{"$f":"IFERROR(CHOOSE(D24,25,18,15,12,10,8,6,4,2,1)+(F24=1),0)","v":25}]
[null,null,null,null,null,null,{"$f":"IFERROR(CHOOSE(D25,25,18,15,12,10,8,6,4,2,1)+(F25=1),\"\")","v":""}]
["GROSJEAN Romain","HAAS",null,null,null,null,{"$f":"IFERROR(CHOOSE(D26,25,18,15,12,10,8,6,4,2,1)+(F26=1),0)","v":0}]
["MAGNUSSEN Kevin",null,null,null,null,null,{"$f":"IFERROR(CHOOSE(D27,25,18,15,12,10,8,6,4,2,1)+(F27=1),0)","v":0}]
[null,null,null,null,null,null,{"$f":"IFERROR(CHOOSE(D28,25,18,15,12,10,8,6,4,2,1)+(F28=1),\"\")","v":""}]
["NORRIS Lando","McLAREN",null,null,null,null,{"$f":"IFERROR(CHOOSE(D29,25,18,15,12,10,8,6,4,2,1)+(F29=1),0)","v":0}]
["SAINZ.Jr Carlos",null,null,null,null,null,{"$f":"IFERROR(CHOOSE(D30,25,18,15,12,10,8,6,4,2,1)+(F30=1),0)","v":0}]
[null,null,null,null,null,null,{"$f":"IFERROR(CHOOSE(D31,25,18,15,12,10,8,6,4,2,1)+(F31=1),\"\")","v":""}]
["RAÏKKÖNEN Kimi","ALFA ROMEO",null,null,null,null,{"$f":"IFERROR(CHOOSE(D32,25,18,15,12,10,8,6,4,2,1)+(F32=1),0)","v":0}]
["GIOVANIZZI Antonio",null,null,null,null,null,{"$f":"IFERROR(CHOOSE(D33,25,18,15,12,10,8,6,4,2,1)+(F33=1),0)","v":0}]
[null,null,null,null,null,null,{"$f":"IFERROR(CHOOSE(D34,25,18,15,12,10,8,6,4,2,1)+(F34=1),\"\")","v":""}]

{"sheet":"Espagne","index":9,"n_rows":34,"n_cols":12,"rows_kept":34,"cut":false,"hidden":false,"merged":[[0,0,1,14],[2,1,3,1],[2,2,3,2],[2,3,3,3],[2,5,3,5],[2,6,3,6],[2,8,2,10],[2,4,3,4],[4,1,6,1],[4,2,6,2],[7,1,9,1],[7,2,9,2],[10,1,12,1],[10,2,12,2],[13,1,15,1],[13,2,15,2],[16,1,18,1],[16,2,18,2],[19,1,21,1],[19,2,21,2],[31,1,33,1],[31,2,33,2],[22,1,24,1],[22,2,24,2],[25,1,27,1],[25,2,27,2],[28,1,30,1],[28,2,30,2]]}
["ESPAGNE - 12 MAI 2019"]
[]
["PILOTES","ECURIES","VOITURES","Finish","Pôle","Pt tour","Points",null,"CLASSEMENT"]
[null,null,null,null,null,null,null,{"$f":"IF(G4=\"\",\"\",(RANK(G4,G4:G23)))","v":""},"ÉCURIES","POINTS","RANG","TOTAL"]
["HAMILTON Lewis","MERCEDES",null,1,null,null,{"$f":"IFERROR(CHOOSE(D5,25,18,15,12,10,8,6,4,2,1)+(F5=1),0)","v":25},null,"MERCEDES",{"$f":"SUM(G5:G7)","v":25},{"$f":"IF(J5=\"\",0,(RANK(J5,$J$5:$J$14)))+COUNTIF(J$5:J5,J5)-1","v":1},{"$f":"IF(J5=0,0,J5+Azerbaïdjan!L5)","v":130}]
["BOTTAS Valterri",null,null,null,null,null,{"$f":"IFERROR(CHOOSE(D6,25,18,15,12,10,8,6,4,2,1)+(F6=1),0)","v":0},null,"FERRARI",{"$f":"SUM(G8:G10)","v":0},{"$f":"IF(J6=\"\",0,(RANK(J6,$J$5:$J$14)))+COUNTIF(J$5:J6,J6)-1","v":4},{"$f":"IF(J6=0,0,J6+Azerbaïdjan!L6)","v":0}]
[null,null,null,null,null,null,{"$f":"IFERROR(CHOOSE(D7,25,18,15,12,10,8,6,4,2,1)+(F7=1),\"\")","v":""},null,"RED BULL",{"$f":"SUM(G11:G13)","v":0},{"$f":"IF(J7=\"\",0,(RANK(J7,$J$5:$J$14)))+COUNTIF(J$5:J7,J7)-1","v":5},{"$f":"IF(J7=0,0,J7+Azerbaïdjan!L7)","v":0}]
["VETTEL Sebastian","FERRARI",null,null,null,null,{"$f":"IFERROR(CHOOSE(D8,25,18,15,12,10,8,6,4,2,1)+(F8=1),0)","v":0},null,"RACING POINT",{"$f":"SUM(G14:G16)","v":0},{"$f":"IF(J8=\"\",0,(RANK(J8,$J$5:$J$14)))+COUNTIF(J$5:J8,J8)-1","v":6},{"$f":"IF(J8=0,0,J8+Azerbaïdjan!L8)","v":0}]
["LECLERC Charles",null,null,null,null,null,{"$f":"IFERROR(CHOOSE(D9,25,18,15,12,10,8,6,4,2,1)+(F9=1),0)","v":0},null,"WILLIAMS",{"$f":"SUM(G17:G19)","v":0},{"$f":"IF(J9=\"\",0,(RANK(J9,$J$5:$J$14)))+COUNTIF(J$5:J9,J9)-1","v":7},{"$f":"IF(J9=0,0,J9+Azerbaïdjan!L9)","v":0}]
[null,null,null,null,null,null,{"$f":"IFERROR(CHOOSE(D10,25,18,15,12,10,8,6,4,2,1)+(F10=1),\"\")","v":""},null,"RENAULT",{"$f":"SUM(G20:G22)","v":25},{"$f":"IF(J10=\"\",0,(RANK(J10,$J$5:$J$14)))+COUNTIF(J$5:J10,J10)-1","v":2},{"$f":"IF(J10=0,0,J10+Azerbaïdjan!L10)","v":25}]
["VERSTAPPEN Max","RED BULL",null,null,null,null,{"$f":"IFERROR(CHOOSE(D11,25,18,15,12,10,8,6,4,2,1)+(F11=1),0)","v":0},null,"TORO ROSSO",{"$f":"SUM(G23:G25)","v":0},{"$f":"IF(J11=\"\",0,(RANK(J11,$J$5:$J$14)))+COUNTIF(J$5:J11,J11)-1","v":8},{"$f":"IF(J11=0,0,J11+Azerbaïdjan!L11)","v":0}]
["GASLY Pierre",null,null,null,null,null,{"$f":"IFERROR(CHOOSE(D12,25,18,15,12,10,8,6,4,2,1)+(F12=1),0)","v":0},null,"HAAS",{"$f":"SUM(G26:G28)","v":15},{"$f":"IF(J12=\"\",0,(RANK(J12,$J$5:$J$14)))+COUNTIF(J$5:J12,J12)-1","v":3},{"$f":"IF(J12=0,0,J12+Azerbaïdjan!L12)","v":15}]
[null,null,null,null,null,null,{"$f":"IFERROR(CHOOSE(D13,25,18,15,12,10,8,6,4,2,1)+(F13=1),0)","v":0},null,"Mc LAREN",{"$f":"SUM(G29:G31)","v":0},{"$f":"IF(J13=\"\",0,(RANK(J13,$J$5:$J$14)))+COUNTIF(J$5:J13,J13)-1","v":9},{"$f":"IF(J13=0,0,J13+Azerbaïdjan!L13)","v":0}]
["PEREZ Sergio","RACING\nPOINT",null,"OUT",null,null,{"$f":"IFERROR(CHOOSE(D14,25,18,15,12,10,8,6,4,2,1)+(F14=1),0)","v":0},null,"ALFA ROMEO",{"$f":"SUM(G32:G34)","v":0},{"$f":"IF(J14=\"\",0,(RANK(J14,$J$5:$J$14)))+COUNTIF(J$5:J14,J14)-1","v":10},{"$f":"IF(J14=0,0,J14+Azerbaïdjan!L14)","v":0}]
["STROLL Lance",null,null,null,null,null,{"$f":"IFERROR(CHOOSE(D15,25,18,15,12,10,8,6,4,2,1)+(F15=1),0)","v":0}]
[null,null,null,null,null,null,{"$f":"IFERROR(CHOOSE(D16,25,18,15,12,10,8,6,4,2,1)+(F16=1),\"\")","v":""}]
["RUSSELL George","WILLIAMS",null,null,null,null,{"$f":"IFERROR(CHOOSE(D17,25,18,15,12,10,8,6,4,2,1)+(F17=1),0)","v":0}]
["KUBICA Robert",null,null,null,null,null,{"$f":"IFERROR(CHOOSE(D18,25,18,15,12,10,8,6,4,2,1)+(F18=1),0)","v":0}]
[null,null,null,null,null,null,{"$f":"IFERROR(CHOOSE(D19,25,18,15,12,10,8,6,4,2,1)+(F19=1),\"\")","v":""}]
["RICCIARDO Daniel","RENAULT",null,1,null,null,{"$f":"IFERROR(CHOOSE(D20,25,18,15,12,10,8,6,4,2,1)+(F20=1),0)","v":25}]
["HULKENBERG Nico",null,null,null,null,null,{"$f":"IFERROR(CHOOSE(D21,25,18,15,12,10,8,6,4,2,1)+(F21=1),0)","v":0}]
[null,null,null,null,null,null,{"$f":"IFERROR(CHOOSE(D22,25,18,15,12,10,8,6,4,2,1)+(F22=1),\"\")","v":""}]
["KVYAT Daniil","TORO ROSSO",null,null,null,null,{"$f":"IFERROR(CHOOSE(D23,25,18,15,12,10,8,6,4,2,1)+(F23=1),0)","v":0}]
["ALBON Alexander",null,null,null,null,null,{"$f":"IFERROR(CHOOSE(D24,25,18,15,12,10,8,6,4,2,1)+(F24=1),0)","v":0}]
[null,null,null,null,null,null,{"$f":"IFERROR(CHOOSE(D25,25,18,15,12,10,8,6,4,2,1)+(F25=1),\"\")","v":""}]
["GROSJEAN Romain","HAAS",null,3,null,null,{"$f":"IFERROR(CHOOSE(D26,25,18,15,12,10,8,6,4,2,1)+(F26=1),0)","v":15}]
["MAGNUSSEN Kevin",null,null,null,null,null,{"$f":"IFERROR(CHOOSE(D27,25,18,15,12,10,8,6,4,2,1)+(F27=1),0)","v":0}]
[null,null,null,null,null,null,{"$f":"IFERROR(CHOOSE(D28,25,18,15,12,10,8,6,4,2,1)+(F28=1),\"\")","v":""}]
["NORRIS Lando","McLAREN",null,null,null,null,{"$f":"IFERROR(CHOOSE(D29,25,18,15,12,10,8,6,4,2,1)+(F29=1),0)","v":0}]
["SAINZ.Jr Carlos",null,null,null,null,null,{"$f":"IFERROR(CHOOSE(D30,25,18,15,12,10,8,6,4,2,1)+(F30=1),0)","v":0}]
[null,null,null,null,null,null,{"$f":"IFERROR(CHOOSE(D31,25,18,15,12,10,8,6,4,2,1)+(F31=1),\"\")","v":""}]
["RAÏKKÖNEN Kimi","ALFA ROMEO",null,null,null,null,{"$f":"IFERROR(CHOOSE(D32,25,18,15,12,10,8,6,4,2,1)+(F32=1),0)","v":0}]
["GIOVANIZZI Antonio",null,null,null,null,null,{"$f":"IFERROR(CHOOSE(D33,25,18,15,12,10,8,6,4,2,1)+(F33=1),0)","v":0}]
[null,null,null,null,null,null,{"$f":"IFERROR(CHOOSE(D34,25,18,15,12,10,8,6,4,2,1)+(F34=1),\"\")","v":""}]

{"sheet":"Monaco","index":10,"n_rows":34,"n_cols":12,"rows_kept":34,"cut":false,"hidden":false,"merged":[[0,0,1,14],[2,1,3,1],[2,2,3,2],[2,3,3,3],[2,5,3,5],[2,6,3,6],[2,8,2,10],[2,4,3,4],[4,1,6,1],[4,2,6,2],[7,1,9,1],[7,2,9,2],[10,1,12,1],[10,2,12,2],[13,1,15,1],[13,2,15,2],[16,1,18,1],[16,2,18,2],[19,1,21,1],[19,2,21,2],[31,1,33,1],[31,2,33,2],[22,1,24,1],[22,2,24,2],[25,1,27,1],[25,2,27,2],[28,1,30,1],[28,2,30,2]]}
["MONACO - 26 MAI 2019"]
[]
["PILOTES","ECURIES","VOITURES","Finish","Pôle","Pt tour","Points",null,"CLASSEMENT"]
[null,null,null,null,null,null,null,{"$f":"IF(G4=\"\",\"\",(RANK(G4,G4:G23)))","v":""},"ÉCURIES","POINTS","RANG","TOTAL"]
["HAMILTON Lewis","MERCEDES",null,null,null,null,{"$f":"IFERROR(CHOOSE(D5,25,18,15,12,10,8,6,4,2,1)+(F5=1),0)","v":0},null,"MERCEDES",{"$f":"SUM(G5:G7)","v":0},{"$f":"IF(J5=\"\",0,(RANK(J5,$J$5:$J$14)))+COUNTIF(J$5:J5,J5)-1","v":3},{"$f":"IF(J5=0,0,J5+Espagne!L5)","v":0}]
["BOTTAS Valterri",null,null,null,null,null,{"$f":"IFERROR(CHOOSE(D6,25,18,15,12,10,8,6,4,2,1)+(F6=1),0)","v":0},null,"FERRARI",{"$f":"SUM(G8:G10)","v":0},{"$f":"IF(J6=\"\",0,(RANK(J6,$J$5:$J$14)))+COUNTIF(J$5:J6,J6)-1","v":4},{"$f":"IF(J6=0,0,J6+Espagne!L6)","v":0}]
[null,null,null,null,null,null,{"$f":"IFERROR(CHOOSE(D7,25,18,15,12,10,8,6,4,2,1)+(F7=1),\"\")","v":""},null,"RED BULL",{"$f":"SUM(G11:G13)","v":0},{"$f":"IF(J7=\"\",0,(RANK(J7,$J$5:$J$14)))+COUNTIF(J$5:J7,J7)-1","v":5},{"$f":"IF(J7=0,0,J7+Espagne!L7)","v":0}]
["VETTEL Sebastian","FERRARI",null,20,null,null,{"$f":"IFERROR(CHOOSE(D8,25,18,15,12,10,8,6,4,2,1)+(F8=1),0)","v":0},null,"RACING POINT",{"$f":"SUM(G14:G16)","v":0},{"$f":"IF(J8=\"\",0,(RANK(J8,$J$5:$J$14)))+COUNTIF(J$5:J8,J8)-1","v":6},{"$f":"IF(J8=0,0,J8+Espagne!L8)","v":0}]
["LECLERC Charles",null,null,null,null,null,{"$f":"IFERROR(CHOOSE(D9,25,18,15,12,10,8,6,4,2,1)+(F9=1),0)","v":0},null,"WILLIAMS",{"$f":"SUM(G17:G19)","v":0},{"$f":"IF(J9=\"\",0,(RANK(J9,$J$5:$J$14)))+COUNTIF(J$5:J9,J9)-1","v":7},{"$f":"IF(J9=0,0,J9+Espagne!L9)","v":0}]
[null,null,null,null,null,null,{"$f":"IFERROR(CHOOSE(D10,25,18,15,12,10,8,6,4,2,1)+(F10=1),\"\")","v":""},null,"RENAULT",{"$f":"SUM(G20:G22)","v":0},{"$f":"IF(J10=\"\",0,(RANK(J10,$J$5:$J$14)))+COUNTIF(J$5:J10,J10)-1","v":8},{"$f":"IF(J10=0,0,J10+Espagne!L10)","v":0}]
["VERSTAPPEN Max","RED BULL",null,null,null,null,{"$f":"IFERROR(CHOOSE(D11,25,18,15,12,10,8,6,4,2,1)+(F11=1),0)","v":0},null,"TORO ROSSO",{"$f":"SUM(G23:G25)","v":0},{"$f":"IF(J11=\"\",0,(RANK(J11,$J$5:$J$14)))+COUNTIF(J$5:J11,J11)-1","v":9},{"$f":"IF(J11=0,0,J11+Espagne!L11)","v":0}]
["GASLY Pierre",null,null,null,null,null,{"$f":"IFERROR(CHOOSE(D12,25,18,15,12,10,8,6,4,2,1)+(F12=1),0)","v":0},null,"HAAS",{"$f":"SUM(G26:G28)","v":4},{"$f":"IF(J12=\"\",0,(RANK(J12,$J$5:$J$14)))+COUNTIF(J$5:J12,J12)-1","v":2},{"$f":"IF(J12=0,0,J12+Espagne!L12)","v":19}]
[null,null,null,null,null,null,{"$f":"IFERROR(CHOOSE(D13,25,18,15,12,10,8,6,4,2,1)+(F13=1),\"\")","v":""},null,"Mc LAREN",{"$f":"SUM(G29:G31)","v":0},{"$f":"IF(J13=\"\",0,(RANK(J13,$J$5:$J$14)))+COUNTIF(J$5:J13,J13)-1","v":10},{"$f":"IF(J13=0,0,J13+Espagne!L13)","v":0}]
["PEREZ Sergio","RACING\nPOINT",null,null,null,null,{"$f":"IFERROR(CHOOSE(D14,25,18,15,12,10,8,6,4,2,1)+(F14=1),0)","v":0},null,"ALFA ROMEO",{"$f":"SUM(G32:G34)","v":25},{"$f":"IF(J14=\"\",0,(RANK(J14,$J$5:$J$14)))+COUNTIF(J$5:J14,J14)-1","v":1},{"$f":"IF(J14=0,0,J14+Espagne!L14)","v":25}]
["STROLL Lance",null,null,null,null,null,{"$f":"IFERROR(CHOOSE(D15,25,18,15,12,10,8,6,4,2,1)+(F15=1),0)","v":0}]
[null,null,null,null,null,null,{"$f":"IFERROR(CHOOSE(D16,25,18,15,12,10,8,6,4,2,1)+(F16=1),\"\")","v":""}]
["RUSSELL George","WILLIAMS",null,null,null,null,{"$f":"IFERROR(CHOOSE(D17,25,18,15,12,10,8,6,4,2,1)+(F17=1),0)","v":0}]
["KUBICA Robert",null,null,15,null,null,{"$f":"IFERROR(CHOOSE(D18,25,18,15,12,10,8,6,4,2,1)+(F18=1),0)","v":0}]
[null,null,null,null,null,null,{"$f":"IFERROR(CHOOSE(D19,25,18,15,12,10,8,6,4,2,1)+(F19=1),\"\")","v":""}]
["RICCIARDO Daniel","RENAULT",null,null,null,null,{"$f":"IFERROR(CHOOSE(D20,25,18,15,12,10,8,6,4,2,1)+(F20=1),0)","v":0}]
["HULKENBERG Nico",null,null,null,null,null,{"$f":"IFERROR(CHOOSE(D21,25,18,15,12,10,8,6,4,2,1)+(F21=1),0)","v":0}]
[null,null,null,null,null,null,{"$f":"IFERROR(CHOOSE(D22,25,18,15,12,10,8,6,4,2,1)+(F22=1),\"\")","v":""}]
["KVYAT Daniil","TORO ROSSO",null,null,null,null,{"$f":"IFERROR(CHOOSE(D23,25,18,15,12,10,8,6,4,2,1)+(F23=1),0)","v":0}]
["ALBON Alexander",null,null,null,null,null,{"$f":"IFERROR(CHOOSE(D24,25,18,15,12,10,8,6,4,2,1)+(F24=1),0)","v":0}]
[null,null,null,null,null,null,{"$f":"IFERROR(CHOOSE(D25,25,18,15,12,10,8,6,4,2,1)+(F25=1),\"\")","v":""}]
["GROSJEAN Romain","HAAS",null,null,null,null,{"$f":"IFERROR(CHOOSE(D26,25,18,15,12,10,8,6,4,2,1)+(F26=1),0)","v":0}]
["MAGNUSSEN Kevin",null,null,8,null,null,{"$f":"IFERROR(CHOOSE(D27,25,18,15,12,10,8,6,4,2,1)+(F27=1),0)","v":4}]
[null,null,null,null,null,null,{"$f":"IFERROR(CHOOSE(D28,25,18,15,12,10,8,6,4,2,1)+(F28=1),\"\")","v":""}]
["NORRIS Lando","McLAREN",null,null,null,null,{"$f":"IFERROR(CHOOSE(D29,25,18,15,12,10,8,6,4,2,1)+(F29=1),0)","v":0}]
["SAINZ.Jr Carlos",null,null,null,null,null,{"$f":"IFERROR(CHOOSE(D30,25,18,15,12,10,8,6,4,2,1)+(F30=1),0)","v":0}]
[null,null,null,null,null,null,{"$f":"IFERROR(CHOOSE(D31,25,18,15,12,10,8,6,4,2,1)+(F31=1),\"\")","v":""}]
["RAÏKKÖNEN Kimi","ALFA ROMEO",null,1,null,null,{"$f":"IFERROR(CHOOSE(D32,25,18,15,12,10,8,6,4,2,1)+(F32=1),0)","v":25}]
["GIOVANIZZI Antonio",null,null,null,null,null,{"$f":"IFERROR(CHOOSE(D33,25,18,15,12,10,8,6,4,2,1)+(F33=1),0)","v":0}]
[null,null,null,null,null,null,{"$f":"IFERROR(CHOOSE(D34,25,18,15,12,10,8,6,4,2,1)+(F34=1),\"\")","v":""}]

{"sheet":"Canada","index":11,"n_rows":34,"n_cols":12,"rows_kept":34,"cut":false,"hidden":false,"merged":[[0,0,1,14],[2,1,3,1],[2,2,3,2],[2,3,3,3],[2,5,3,5],[2,6,3,6],[2,8,2,10],[2,4,3,4],[4,1,6,1],[4,2,6,2],[7,1,9,1],[7,2,9,2],[10,1,12,1],[10,2,12,2],[13,1,15,1],[13,2,15,2],[16,1,18,1],[16,2,18,2],[19,1,21,1],[19,2,21,2],[31,1,33,1],[31,2,33,2],[22,1,24,1],[22,2,24,2],[25,1,27,1],[25,2,27,2],[28,1,30,1],[28,2,30,2]]}
["CANADA - 17 MARS 2019"]
[]
["PILOTES","ECURIES","VOITURES","Finish","Pôle","Pt tour","Points",null,"CLASSEMENT"]
[null,null,null,null,null,null,null,{"$f":"IF(G4=\"\",\"\",(RANK(G4,G4:G23)))","v":""},"ÉCURIES","POINTS","RANG","TOTAL"]
["HAMILTON Lewis","MERCEDES",null,2,null,null,{"$f":"IFERROR(CHOOSE(D5,25,18,15,12,10,8,6,4,2,1)+(F5=1),0)","v":18},null,"MERCEDES",{"$f":"SUM(G5:G7)","v":18},{"$f":"IF(J5=\"\",0,(RANK(J5,$J$5:$J$14)))+COUNTIF(J$5:J5,J5)-1","v":2},{"$f":"IF(J5=0,0,J5+Monaco!L5)","v":18}]
["BOTTAS Valterri",null,null,null,null,null,{"$f":"IFERROR(CHOOSE(D6,25,18,15,12,10,8,6,4,2,1)+(F6=1),0)","v":0},null,"FERRARI",{"$f":"SUM(G8:G10)","v":0},{"$f":"IF(J6=\"\",0,(RANK(J6,$J$5:$J$14)))+COUNTIF(J$5:J6,J6)-1","v":4},{"$f":"IF(J6=0,0,J6+Monaco!L6)","v":0}]
[null,null,null,null,null,null,{"$f":"IFERROR(CHOOSE(D7,25,18,15,12,10,8,6,4,2,1)+(F7=1),\"\")","v":""},null,"RED BULL",{"$f":"SUM(G11:G13)","v":0},{"$f":"IF(J7=\"\",0,(RANK(J7,$J$5:$J$14)))+COUNTIF(J$5:J7,J7)-1","v":5},{"$f":"IF(J7=0,0,J7+Monaco!L7)","v":0}]
["VETTEL Sebastian","FERRARI",null,null,null,null,{"$f":"IFERROR(CHOOSE(D8,25,18,15,12,10,8,6,4,2,1)+(F8=1),0)","v":0},null,"RACING POINT",{"$f":"SUM(G14:G16)","v":15},{"$f":"IF(J8=\"\",0,(RANK(J8,$J$5:$J$14)))+COUNTIF(J$5:J8,J8)-1","v":3},{"$f":"IF(J8=0,0,J8+Monaco!L8)","v":15}]
["LECLERC Charles",null,null,null,null,null,{"$f":"IFERROR(CHOOSE(D9,25,18,15,12,10,8,6,4,2,1)+(F9=1),0)","v":0},null,"WILLIAMS",{"$f":"SUM(G17:G19)","v":0},{"$f":"IF(J9=\"\",0,(RANK(J9,$J$5:$J$14)))+COUNTIF(J$5:J9,J9)-1","v":6},{"$f":"IF(J9=0,0,J9+Monaco!L9)","v":0}]
[null,null,null,null,null,null,{"$f":"IFERROR(CHOOSE(D10,25,18,15,12,10,8,6,4,2,1)+(F10=1),\"\")","v":""},null,"RENAULT",{"$f":"SUM(G20:G22)","v":25},{"$f":"IF(J10=\"\",0,(RANK(J10,$J$5:$J$14)))+COUNTIF(J$5:J10,J10)-1","v":1},{"$f":"IF(J10=0,0,J10+Monaco!L10)","v":25}]
["VERSTAPPEN Max","RED BULL",null,null,null,null,{"$f":"IFERROR(CHOOSE(D11,25,18,15,12,10,8,6,4,2,1)+(F11=1),0)","v":0},null,"TORO ROSSO",{"$f":"SUM(G23:G25)","v":0},{"$f":"IF(J11=\"\",0,(RANK(J11,$J$5:$J$14)))+COUNTIF(J$5:J11,J11)-1","v":7},{"$f":"IF(J11=0,0,J11+Monaco!L11)","v":0}]
["GASLY Pierre",null,null,null,null,null,{"$f":"IFERROR(CHOOSE(D12,25,18,15,12,10,8,6,4,2,1)+(F12=1),0)","v":0},null,"HAAS",{"$f":"SUM(G26:G28)","v":0},{"$f":"IF(J12=\"\",0,(RANK(J12,$J$5:$J$14)))+COUNTIF(J$5:J12,J12)-1","v":8},{"$f":"IF(J12=0,0,J12+Monaco!L12)","v":0}]
[null,null,null,null,null,null,{"$f":"IFERROR(CHOOSE(D13,25,18,15,12,10,8,6,4,2,1)+(F13=1),\"\")","v":""},null,"Mc LAREN",{"$f":"SUM(G29:G31)","v":0},{"$f":"IF(J13=\"\",0,(RANK(J13,$J$5:$J$14)))+COUNTIF(J$5:J13,J13)-1","v":9},{"$f":"IF(J13=0,0,J13+Monaco!L13)","v":0}]
["PEREZ Sergio","RACING\nPOINT",null,3,null,null,{"$f":"IFERROR(CHOOSE(D14,25,18,15,12,10,8,6,4,2,1)+(F14=1),0)","v":15},null,"ALFA ROMEO",{"$f":"SUM(G32:G34)","v":0},{"$f":"IF(J14=\"\",0,(RANK(J14,$J$5:$J$14)))+COUNTIF(J$5:J14,J14)-1","v":10},{"$f":"IF(J14=0,0,J14+Monaco!L14)","v":0}]
["STROLL Lance",null,null,null,null,null,{"$f":"IFERROR(CHOOSE(D15,25,18,15,12,10,8,6,4,2,1)+(F15=1),0)","v":0}]
[null,null,null,null,null,null,{"$f":"IFERROR(CHOOSE(D16,25,18,15,12,10,8,6,4,2,1)+(F16=1),\"\")","v":""}]
["RUSSELL George","WILLIAMS",null,null,null,null,{"$f":"IFERROR(CHOOSE(D17,25,18,15,12,10,8,6,4,2,1)+(F17=1),0)","v":0}]
["KUBICA Robert",null,null,null,null,null,{"$f":"IFERROR(CHOOSE(D18,25,18,15,12,10,8,6,4,2,1)+(F18=1),0)","v":0}]
[null,null,null,null,null,null,{"$f":"IFERROR(CHOOSE(D19,25,18,15,12,10,8,6,4,2,1)+(F19=1),\"\")","v":""}]
["RICCIARDO Daniel","RENAULT",null,null,null,null,{"$f":"IFERROR(CHOOSE(D20,25,18,15,12,10,8,6,4,2,1)+(F20=1),0)","v":0}]
["HULKENBERG Nico",null,null,1,null,null,{"$f":"IFERROR(CHOOSE(D21,25,18,15,12,10,8,6,4,2,1)+(F21=1),0)","v":25}]
[null,null,null,null,null,null,{"$f":"IFERROR(CHOOSE(D22,25,18,15,12,10,8,6,4,2,1)+(F22=1),\"\")","v":""}]
["KVYAT Daniil","TORO ROSSO",null,null,null,null,{"$f":"IFERROR(CHOOSE(D23,25,18,15,12,10,8,6,4,2,1)+(F23=1),0)","v":0}]
["ALBON Alexander",null,null,null,null,null,{"$f":"IFERROR(CHOOSE(D24,25,18,15,12,10,8,6,4,2,1)+(F24=1),0)","v":0}]
[null,null,null,null,null,null,{"$f":"IFERROR(CHOOSE(D25,25,18,15,12,10,8,6,4,2,1)+(F25=1),\"\")","v":""}]
["GROSJEAN Romain","HAAS",null,null,null,null,{"$f":"IFERROR(CHOOSE(D26,25,18,15,12,10,8,6,4,2,1)+(F26=1),0)","v":0}]
["MAGNUSSEN Kevin",null,null,null,null,null,{"$f":"IFERROR(CHOOSE(D27,25,18,15,12,10,8,6,4,2,1)+(F27=1),0)","v":0}]
[null,null,null,null,null,null,{"$f":"IFERROR(CHOOSE(D28,25,18,15,12,10,8,6,4,2,1)+(F28=1),\"\")","v":""}]
["NORRIS Lando","McLAREN",null,null,null,null,{"$f":"IFERROR(CHOOSE(D29,25,18,15,12,10,8,6,4,2,1)+(F29=1),0)","v":0}]
["SAINZ.Jr Carlos",null,null,null,null,null,{"$f":"IFERROR(CHOOSE(D30,25,18,15,12,10,8,6,4,2,1)+(F30=1),0)","v":0}]
[null,null,null,null,null,null,{"$f":"IFERROR(CHOOSE(D31,25,18,15,12,10,8,6,4,2,1)+(F31=1),\"\")","v":""}]
["RAÏKKÖNEN Kimi","ALFA ROMEO",null,"OUT",null,null,{"$f":"IFERROR(CHOOSE(D32,25,18,15,12,10,8,6,4,2,1)+(F32=1),0)","v":0}]
["GIOVANIZZI Antonio",null,null,null,null,null,{"$f":"IFERROR(CHOOSE(D33,25,18,15,12,10,8,6,4,2,1)+(F33=1),0)","v":0}]
[null,null,null,null,null,null,{"$f":"IFERROR(CHOOSE(D34,25,18,15,12,10,8,6,4,2,1)+(F34=1),\"\")","v":""}]

{"sheet":"France","index":12,"n_rows":34,"n_cols":12,"rows_kept":34,"cut":false,"hidden":false,"merged":[[0,0,1,14],[2,1,3,1],[2,2,3,2],[2,3,3,3],[2,5,3,5],[2,6,3,6],[2,8,2,10],[2,4,3,4],[4,1,6,1],[4,2,6,2],[7,1,9,1],[7,2,9,2],[10,1,12,1],[10,2,12,2],[13,1,15,1],[13,2,15,2],[16,1,18,1],[16,2,18,2],[19,1,21,1],[19,2,21,2],[31,1,33,1],[31,2,33,2],[22,1,24,1],[22,2,24,2],[25,1,27,1],[25,2,27,2],[28,1,30,1],[28,2,30,2]]}
["FRANCE - 17 MARS 2019"]
[]
["PILOTES","ECURIES","VOITURES","Finish","Pôle","Pt tour","Points",null,"CLASSEMENT"]
[null,null,null,null,null,null,null,{"$f":"IF(G4=\"\",\"\",(RANK(G4,G4:G23)))","v":""},"ÉCURIES","POINTS","RANG","TOTAL"]
["HAMILTON Lewis","MERCEDES",null,null,null,null,{"$f":"IFERROR(CHOOSE(D5,25,18,15,12,10,8,6,4,2,1)+(F5=1),0)","v":0},null,"MERCEDES",{"$f":"SUM(G5:G7)","v":0},{"$f":"IF(J5=\"\",0,(RANK(J5,$J$5:$J$14)))+COUNTIF(J$5:J5,J5)-1","v":2},{"$f":"IF(J5=0,0,J5+Canada!L5)","v":0}]
["BOTTAS Valterri",null,null,null,null,null,{"$f":"IFERROR(CHOOSE(D6,25,18,15,12,10,8,6,4,2,1)+(F6=1),0)","v":0},null,"FERRARI",{"$f":"SUM(G8:G10)","v":0},{"$f":"IF(J6=\"\",0,(RANK(J6,$J$5:$J$14)))+COUNTIF(J$5:J6,J6)-1","v":3},{"$f":"IF(J6=0,0,J6+Canada!L6)","v":0}]
[null,null,null,null,null,null,{"$f":"IFERROR(CHOOSE(D7,25,18,15,12,10,8,6,4,2,1)+(F7=1),\"\")","v":""},null,"RED BULL",{"$f":"SUM(G11:G13)","v":0},{"$f":"IF(J7=\"\",0,(RANK(J7,$J$5:$J$14)))+COUNTIF(J$5:J7,J7)-1","v":4},{"$f":"IF(J7=0,0,J7+Canada!L7)","v":0}]
["VETTEL Sebastian","FERRARI",null,null,null,null,{"$f":"IFERROR(CHOOSE(D8,25,18,15,12,10,8,6,4,2,1)+(F8=1),0)","v":0},null,"RACING POINT",{"$f":"SUM(G14:G16)","v":0},{"$f":"IF(J8=\"\",0,(RANK(J8,$J$5:$J$14)))+COUNTIF(J$5:J8,J8)-1","v":5},{"$f":"IF(J8=0,0,J8+Canada!L8)","v":0}]
["LECLERC Charles",null,null,null,null,null,{"$f":"IFERROR(CHOOSE(D9,25,18,15,12,10,8,6,4,2,1)+(F9=1),0)","v":0},null,"WILLIAMS",{"$f":"SUM(G17:G19)","v":0},{"$f":"IF(J9=\"\",0,(RANK(J9,$J$5:$J$14)))+COUNTIF(J$5:J9,J9)-1","v":6},{"$f":"IF(J9=0,0,J9+Canada!L9)","v":0}]
[null,null,null,null,null,null,{"$f":"IFERROR(CHOOSE(D10,25,18,15,12,10,8,6,4,2,1)+(F10=1),\"\")","v":""},null,"RENAULT",{"$f":"SUM(G20:G22)","v":0},{"$f":"IF(J10=\"\",0,(RANK(J10,$J$5:$J$14)))+COUNTIF(J$5:J10,J10)-1","v":7},{"$f":"IF(J10=0,0,J10+Canada!L10)","v":0}]
["VERSTAPPEN Max","RED BULL",null,null,null,null,{"$f":"IFERROR(CHOOSE(D11,25,18,15,12,10,8,6,4,2,1)+(F11=1),0)","v":0},null,"TORO ROSSO",{"$f":"SUM(G23:G25)","v":0},{"$f":"IF(J11=\"\",0,(RANK(J11,$J$5:$J$14)))+COUNTIF(J$5:J11,J11)-1","v":8},{"$f":"IF(J11=0,0,J11+Canada!L11)","v":0}]
["GASLY Pierre",null,null,null,null,null,{"$f":"IFERROR(CHOOSE(D12,25,18,15,12,10,8,6,4,2,1)+(F12=1),0)","v":0},null,"HAAS",{"$f":"SUM(G26:G28)","v":25},{"$f":"IF(J12=\"\",0,(RANK(J12,$J$5:$J$14)))+COUNTIF(J$5:J12,J12)-1","v":1},{"$f":"IF(J12=0,0,J12+Canada!L12)","v":25}]
[null,null,null,null,null,null,{"$f":"IFERROR(CHOOSE(D13,25,18,15,12,10,8,6,4,2,1)+(F13=1),\"\")","v":""},null,"Mc LAREN",{"$f":"SUM(G29:G31)","v":0},{"$f":"IF(J13=\"\",0,(RANK(J13,$J$5:$J$14)))+COUNTIF(J$5:J13,J13)-1","v":9},{"$f":"IF(J13=0,0,J13+Canada!L13)","v":0}]
["PEREZ Sergio","RACING\nPOINT",null,null,null,null,{"$f":"IFERROR(CHOOSE(D14,25,18,15,12,10,8,6,4,2,1)+(F14=1),0)","v":0},null,"ALFA ROMEO",{"$f":"SUM(G32:G34)","v":0},{"$f":"IF(J14=\"\",0,(RANK(J14,$J$5:$J$14)))+COUNTIF(J$5:J14,J14)-1","v":10},{"$f":"IF(J14=0,0,J14+Canada!L14)","v":0}]
["STROLL Lance",null,null,null,null,null,{"$f":"IFERROR(CHOOSE(D15,25,18,15,12,10,8,6,4,2,1)+(F15=1),0)","v":0}]
[null,null,null,null,null,null,{"$f":"IFERROR(CHOOSE(D16,25,18,15,12,10,8,6,4,2,1)+(F16=1),\"\")","v":""}]
["RUSSELL George","WILLIAMS",null,null,null,null,{"$f":"IFERROR(CHOOSE(D17,25,18,15,12,10,8,6,4,2,1)+(F17=1),0)","v":0}]
["KUBICA Robert",null,null,null,null,null,{"$f":"IFERROR(CHOOSE(D18,25,18,15,12,10,8,6,4,2,1)+(F18=1),0)","v":0}]
[null,null,null,null,null,null,{"$f":"IFERROR(CHOOSE(D19,25,18,15,12,10,8,6,4,2,1)+(F19=1),\"\")","v":""}]
["RICCIARDO Daniel","RENAULT",null,null,null,null,{"$f":"IFERROR(CHOOSE(D20,25,18,15,12,10,8,6,4,2,1)+(F20=1),0)","v":0}]
["HULKENBERG Nico",null,null,null,null,null,{"$f":"IFERROR(CHOOSE(D21,25,18,15,12,10,8,6,4,2,1)+(F21=1),0)","v":0}]
[null,null,null,null,null,null,{"$f":"IFERROR(CHOOSE(D22,25,18,15,12,10,8,6,4,2,1)+(F22=1),\"\")","v":""}]
["KVYAT Daniil","TORO ROSSO",null,null,null,null,{"$f":"IFERROR(CHOOSE(D23,25,18,15,12,10,8,6,4,2,1)+(F23=1),0)","v":0}]
["ALBON Alexander",null,null,null,null,null,{"$f":"IFERROR(CHOOSE(D24,25,18,15,12,10,8,6,4,2,1)+(F24=1),0)","v":0}]
[null,null,null,null,null,null,{"$f":"IFERROR(CHOOSE(D25,25,18,15,12,10,8,6,4,2,1)+(F25=1),\"\")","v":""}]
["GROSJEAN Romain","HAAS",null,null,null,null,{"$f":"IFERROR(CHOOSE(D26,25,18,15,12,10,8,6,4,2,1)+(F26=1),0)","v":0}]
["MAGNUSSEN Kevin",null,null,1,null,null,{"$f":"IFERROR(CHOOSE(D27,25,18,15,12,10,8,6,4,2,1)+(F27=1),0)","v":25}]
[null,null,null,null,null,null,{"$f":"IFERROR(CHOOSE(D28,25,18,15,12,10,8,6,4,2,1)+(F28=1),\"\")","v":""}]
["NORRIS Lando","McLAREN",null,null,null,null,{"$f":"IFERROR(CHOOSE(D29,25,18,15,12,10,8,6,4,2,1)+(F29=1),0)","v":0}]
["SAINZ.Jr Carlos",null,null,null,null,null,{"$f":"IFERROR(CHOOSE(D30,25,18,15,12,10,8,6,4,2,1)+(F30=1),0)","v":0}]
[null,null,null,null,null,null,{"$f":"IFERROR(CHOOSE(D31,25,18,15,12,10,8,6,4,2,1)+(F31=1),\"\")","v":""}]
["RAÏKKÖNEN Kimi","ALFA ROMEO",null,null,null,null,{"$f":"IFERROR(CHOOSE(D32,25,18,15,12,10,8,6,4,2,1)+(F32=1),0)","v":0}]
["GIOVANIZZI Antonio",null,null,null,null,null,{"$f":"IFERROR(CHOOSE(D33,25,18,15,12,10,8,6,4,2,1)+(F33=1),0)","v":0}]
[null,null,null,null,null,null,{"$f":"IFERROR(CHOOSE(D34,25,18,15,12,10,8,6,4,2,1)+(F34=1),\"\")","v":""}]

{"sheet":"Autriche","index":13,"n_rows":34,"n_cols":12,"rows_kept":34,"cut":false,"hidden":false,"merged":[[0,0,1,14],[2,1,3,1],[2,2,3,2],[2,3,3,3],[2,5,3,5],[2,6,3,6],[2,8,2,10],[2,4,3,4],[4,1,6,1],[4,2,6,2],[7,1,9,1],[7,2,9,2],[10,1,12,1],[10,2,12,2],[13,1,15,1],[13,2,15,2],[16,1,18,1],[16,2,18,2],[19,1,21,1],[19,2,21,2],[31,1,33,1],[31,2,33,2],[22,1,24,1],[22,2,24,2],[25,1,27,1],[25,2,27,2],[28,1,30,1],[28,2,30,2]]}
["AUTRICHE - 17 MARS 2019"]
[]
["PILOTES","ECURIES","VOITURES","Finish","Pôle","Pt tour","Points",null,"CLASSEMENT"]
[null,null,null,null,null,null,null,{"$f":"IF(G4=\"\",\"\",(RANK(G4,G4:G23)))","v":""},"ÉCURIES","POINTS","RANG","TOTAL"]
["HAMILTON Lewis","MERCEDES",null,null,null,null,{"$f":"IFERROR(CHOOSE(D5,25,18,15,12,10,8,6,4,2,1)+(F5=1),0)","v":0},null,"MERCEDES",{"$f":"SUM(G5:G7)","v":0},{"$f":"IF(J5=\"\",0,(RANK(J5,$J$5:$J$14)))+COUNTIF(J$5:J5,J5)-1","v":1},{"$f":"IF(J5=0,0,J5+France!L5)","v":0}]
["BOTTAS Valterri",null,null,null,null,null,{"$f":"IFERROR(CHOOSE(D6,25,18,15,12,10,8,6,4,2,1)+(F6=1),0)","v":0},null,"FERRARI",{"$f":"SUM(G8:G10)","v":0},{"$f":"IF(J6=\"\",0,(RANK(J6,$J$5:$J$14)))+COUNTIF(J$5:J6,J6)-1","v":2},{"$f":"IF(J6=0,0,J6+France!L6)","v":0}]
[null,null,null,null,null,null,{"$f":"IFERROR(CHOOSE(D7,25,18,15,12,10,8,6,4,2,1)+(F7=1),\"\")","v":""},null,"RED BULL",{"$f":"SUM(G11:G13)","v":0},{"$f":"IF(J7=\"\",0,(RANK(J7,$J$5:$J$14)))+COUNTIF(J$5:J7,J7)-1","v":3},{"$f":"IF(J7=0,0,J7+France!L7)","v":0}]
["VETTEL Sebastian","FERRARI",null,null,null,null,{"$f":"IFERROR(CHOOSE(D8,25,18,15,12,10,8,6,4,2,1)+(F8=1),0)","v":0},null,"RACING POINT",{"$f":"SUM(G14:G16)","v":0},{"$f":"IF(J8=\"\",0,(RANK(J8,$J$5:$J$14)))+COUNTIF(J$5:J8,J8)-1","v":4},{"$f":"IF(J8=0,0,J8+France!L8)","v":0}]
["LECLERC Charles",null,null,null,null,null,{"$f":"IFERROR(CHOOSE(D9,25,18,15,12,10,8,6,4,2,1)+(F9=1),0)","v":0},null,"WILLIAMS",{"$f":"SUM(G17:G19)","v":0},{"$f":"IF(J9=\"\",0,(RANK(J9,$J$5:$J$14)))+COUNTIF(J$5:J9,J9)-1","v":5},{"$f":"IF(J9=0,0,J9+France!L9)","v":0}]
[null,null,null,null,null,null,{"$f":"IFERROR(CHOOSE(D10,25,18,15,12,10,8,6,4,2,1)+(F10=1),\"\")","v":""},null,"RENAULT",{"$f":"SUM(G20:G22)","v":0},{"$f":"IF(J10=\"\",0,(RANK(J10,$J$5:$J$14)))+COUNTIF(J$5:J10,J10)-1","v":6},{"$f":"IF(J10=0,0,J10+France!L10)","v":0}]
["VERSTAPPEN Max","RED BULL",null,null,null,null,{"$f":"IFERROR(CHOOSE(D11,25,18,15,12,10,8,6,4,2,1)+(F11=1),0)","v":0},null,"TORO ROSSO",{"$f":"SUM(G23:G25)","v":0},{"$f":"IF(J11=\"\",0,(RANK(J11,$J$5:$J$14)))+COUNTIF(J$5:J11,J11)-1","v":7},{"$f":"IF(J11=0,0,J11+France!L11)","v":0}]
["GASLY Pierre",null,null,null,null,null,{"$f":"IFERROR(CHOOSE(D12,25,18,15,12,10,8,6,4,2,1)+(F12=1),0)","v":0},null,"HAAS",{"$f":"SUM(G26:G28)","v":0},{"$f":"IF(J12=\"\",0,(RANK(J12,$J$5:$J$14)))+COUNTIF(J$5:J12,J12)-1","v":8},{"$f":"IF(J12=0,0,J12+France!L12)","v":0}]
[null,null,null,null,null,null,{"$f":"IFERROR(CHOOSE(D13,25,18,15,12,10,8,6,4,2,1)+(F13=1),\"\")","v":""},null,"Mc LAREN",{"$f":"SUM(G29:G31)","v":0},{"$f":"IF(J13=\"\",0,(RANK(J13,$J$5:$J$14)))+COUNTIF(J$5:J13,J13)-1","v":9},{"$f":"IF(J13=0,0,J13+France!L13)","v":0}]
["PEREZ Sergio","RACING\nPOINT",null,null,null,null,{"$f":"IFERROR(CHOOSE(D14,25,18,15,12,10,8,6,4,2,1)+(F14=1),0)","v":0},null,"ALFA ROMEO",{"$f":"SUM(G32:G34)","v":0},{"$f":"IF(J14=\"\",0,(RANK(J14,$J$5:$J$14)))+COUNTIF(J$5:J14,J14)-1","v":10},{"$f":"IF(J14=0,0,J14+France!L14)","v":0}]
["STROLL Lance",null,null,null,null,null,{"$f":"IFERROR(CHOOSE(D15,25,18,15,12,10,8,6,4,2,1)+(F15=1),0)","v":0}]
[null,null,null,null,null,null,{"$f":"IFERROR(CHOOSE(D16,25,18,15,12,10,8,6,4,2,1)+(F16=1),\"\")","v":""}]
["RUSSELL George","WILLIAMS",null,null,null,null,{"$f":"IFERROR(CHOOSE(D17,25,18,15,12,10,8,6,4,2,1)+(F17=1),0)","v":0}]
["KUBICA Robert",null,null,null,null,null,{"$f":"IFERROR(CHOOSE(D18,25,18,15,12,10,8,6,4,2,1)+(F18=1),0)","v":0}]
[null,null,null,null,null,null,{"$f":"IFERROR(CHOOSE(D19,25,18,15,12,10,8,6,4,2,1)+(F19=1),\"\")","v":""}]
["RICCIARDO Daniel","RENAULT",null,null,null,null,{"$f":"IFERROR(CHOOSE(D20,25,18,15,12,10,8,6,4,2,1)+(F20=1),0)","v":0}]
["HULKENBERG Nico",null,null,null,null,null,{"$f":"IFERROR(CHOOSE(D21,25,18,15,12,10,8,6,4,2,1)+(F21=1),0)","v":0}]
[null,null,null,null,null,null,{"$f":"IFERROR(CHOOSE(D22,25,18,15,12,10,8,6,4,2,1)+(F22=1),\"\")","v":""}]
["KVYAT Daniil","TORO ROSSO",null,null,null,null,{"$f":"IFERROR(CHOOSE(D23,25,18,15,12,10,8,6,4,2,1)+(F23=1),0)","v":0}]
["ALBON Alexander",null,null,null,null,null,{"$f":"IFERROR(CHOOSE(D24,25,18,15,12,10,8,6,4,2,1)+(F24=1),0)","v":0}]
[null,null,null,null,null,null,{"$f":"IFERROR(CHOOSE(D25,25,18,15,12,10,8,6,4,2,1)+(F25=1),\"\")","v":""}]
["GROSJEAN Romain","HAAS",null,null,null,null,{"$f":"IFERROR(CHOOSE(D26,25,18,15,12,10,8,6,4,2,1)+(F26=1),0)","v":0}]
["MAGNUSSEN Kevin",null,null,null,null,null,{"$f":"IFERROR(CHOOSE(D27,25,18,15,12,10,8,6,4,2,1)+(F27=1),0)","v":0}]
[null,null,null,null,null,null,{"$f":"IFERROR(CHOOSE(D28,25,18,15,12,10,8,6,4,2,1)+(F28=1),\"\")","v":""}]
["NORRIS Lando","McLAREN",null,null,null,null,{"$f":"IFERROR(CHOOSE(D29,25,18,15,12,10,8,6,4,2,1)+(F29=1),0)","v":0}]
["SAINZ.Jr Carlos",null,null,null,null,null,{"$f":"IFERROR(CHOOSE(D30,25,18,15,12,10,8,6,4,2,1)+(F30=1),0)","v":0}]
[null,null,null,null,null,null,{"$f":"IFERROR(CHOOSE(D31,25,18,15,12,10,8,6,4,2,1)+(F31=1),\"\")","v":""}]
["RAÏKKÖNEN Kimi","ALFA ROMEO",null,null,null,null,{"$f":"IFERROR(CHOOSE(D32,25,18,15,12,10,8,6,4,2,1)+(F32=1),0)","v":0}]
["GIOVANIZZI Antonio",null,null,null,null,null,{"$f":"IFERROR(CHOOSE(D33,25,18,15,12,10,8,6,4,2,1)+(F33=1),0)","v":0}]
[null,null,null,null,null,null,{"$f":"IFERROR(CHOOSE(D34,25,18,15,12,10,8,6,4,2,1)+(F34=1),\"\")","v":""}]

{"sheet":"GB","index":14,"n_rows":34,"n_cols":12,"rows_kept":34,"cut":false,"hidden":false,"merged":[[0,0,1,14],[2,1,3,1],[2,2,3,2],[2,3,3,3],[2,5,3,5],[2,6,3,6],[2,8,2,10],[2,4,3,4],[4,1,6,1],[4,2,6,2],[7,1,9,1],[7,2,9,2],[10,1,12,1],[10,2,12,2],[13,1,15,1],[13,2,15,2],[16,1,18,1],[16,2,18,2],[19,1,21,1],[19,2,21,2],[31,1,33,1],[31,2,33,2],[22,1,24,1],[22,2,24,2],[25,1,27,1],[25,2,27,2],[28,1,30,1],[28,2,30,2]]}
["ANGLETERRE - 17 MARS 2019"]
[]
["PILOTES","ECURIES","VOITURES","Finish","Pôle","Pt tour","Points",null,"CLASSEMENT"]
[null,null,null,null,null,null,null,{"$f":"IF(G4=\"\",\"\",(RANK(G4,G4:G23)))","v":""},"ÉCURIES","POINTS","RANG","TOTAL"]
["HAMILTON Lewis","MERCEDES",null,null,null,null,{"$f":"IFERROR(CHOOSE(D5,25,18,15,12,10,8,6,4,2,1)+(F5=1),0)","v":0},null,"MERCEDES",{"$f":"SUM(G5:G7)","v":0},{"$f":"IF(J5=\"\",0,(RANK(J5,$J$5:$J$14)))+COUNTIF(J$5:J5,J5)-1","v":1},{"$f":"IF(J5=0,0,J5+Autriche!L5)","v":0}]
["BOTTAS Valterri",null,null,null,null,null,{"$f":"IFERROR(CHOOSE(D6,25,18,15,12,10,8,6,4,2,1)+(F6=1),0)","v":0},null,"FERRARI",{"$f":"SUM(G8:G10)","v":0},{"$f":"IF(J6=\"\",0,(RANK(J6,$J$5:$J$14)))+COUNTIF(J$5:J6,J6)-1","v":2},{"$f":"IF(J6=0,0,J6+Autriche!L6)","v":0}]
[null,null,null,null,null,null,{"$f":"IFERROR(CHOOSE(D7,25,18,15,12,10,8,6,4,2,1)+(F7=1),\"\")","v":""},null,"RED BULL",{"$f":"SUM(G11:G13)","v":0},{"$f":"IF(J7=\"\",0,(RANK(J7,$J$5:$J$14)))+COUNTIF(J$5:J7,J7)-1","v":3},{"$f":"IF(J7=0,0,J7+Autriche!L7)","v":0}]
["VETTEL Sebastian","FERRARI",null,null,null,null,{"$f":"IFERROR(CHOOSE(D8,25,18,15,12,10,8,6,4,2,1)+(F8=1),0)","v":0},null,"RACING POINT",{"$f":"SUM(G14:G16)","v":0},{"$f":"IF(J8=\"\",0,(RANK(J8,$J$5:$J$14)))+COUNTIF(J$5:J8,J8)-1","v":4},{"$f":"IF(J8=0,0,J8+Autriche!L8)","v":0}]
["LECLERC Charles",null,null,null,null,null,{"$f":"IFERROR(CHOOSE(D9,25,18,15,12,10,8,6,4,2,1)+(F9=1),0)","v":0},null,"WILLIAMS",{"$f":"SUM(G17:G19)","v":0},{"$f":"IF(J9=\"\",0,(RANK(J9,$J$5:$J$14)))+COUNTIF(J$5:J9,J9)-1","v":5},{"$f":"IF(J9=0,0,J9+Autriche!L9)","v":0}]
[null,null,null,null,null,null,{"$f":"IFERROR(CHOOSE(D10,25,18,15,12,10,8,6,4,2,1)+(F10=1),\"\")","v":""},null,"RENAULT",{"$f":"SUM(G20:G22)","v":0},{"$f":"IF(J10=\"\",0,(RANK(J10,$J$5:$J$14)))+COUNTIF(J$5:J10,J10)-1","v":6},{"$f":"IF(J10=0,0,J10+Autriche!L10)","v":0}]
["VERSTAPPEN Max","RED BULL",null,null,null,null,{"$f":"IFERROR(CHOOSE(D11,25,18,15,12,10,8,6,4,2,1)+(F11=1),0)","v":0},null,"TORO ROSSO",{"$f":"SUM(G23:G25)","v":0},{"$f":"IF(J11=\"\",0,(RANK(J11,$J$5:$J$14)))+COUNTIF(J$5:J11,J11)-1","v":7},{"$f":"IF(J11=0,0,J11+Autriche!L11)","v":0}]
["GASLY Pierre",null,null,null,null,null,{"$f":"IFERROR(CHOOSE(D12,25,18,15,12,10,8,6,4,2,1)+(F12=1),0)","v":0},null,"HAAS",{"$f":"SUM(G26:G28)","v":0},{"$f":"IF(J12=\"\",0,(RANK(J12,$J$5:$J$14)))+COUNTIF(J$5:J12,J12)-1","v":8},{"$f":"IF(J12=0,0,J12+Autriche!L12)","v":0}]
[null,null,null,null,null,null,{"$f":"IFERROR(CHOOSE(D13,25,18,15,12,10,8,6,4,2,1)+(F13=1),\"\")","v":""},null,"Mc LAREN",{"$f":"SUM(G29:G31)","v":0},{"$f":"IF(J13=\"\",0,(RANK(J13,$J$5:$J$14)))+COUNTIF(J$5:J13,J13)-1","v":9},{"$f":"IF(J13=0,0,J13+Autriche!L13)","v":0}]
["PEREZ Sergio","RACING\nPOINT",null,null,null,null,{"$f":"IFERROR(CHOOSE(D14,25,18,15,12,10,8,6,4,2,1)+(F14=1),0)","v":0},null,"ALFA ROMEO",{"$f":"SUM(G32:G34)","v":0},{"$f":"IF(J14=\"\",0,(RANK(J14,$J$5:$J$14)))+COUNTIF(J$5:J14,J14)-1","v":10},{"$f":"IF(J14=0,0,J14+Autriche!L14)","v":0}]
["STROLL Lance",null,null,null,null,null,{"$f":"IFERROR(CHOOSE(D15,25,18,15,12,10,8,6,4,2,1)+(F15=1),0)","v":0}]
[null,null,null,null,null,null,{"$f":"IFERROR(CHOOSE(D16,25,18,15,12,10,8,6,4,2,1)+(F16=1),\"\")","v":""}]
["RUSSELL George","WILLIAMS",null,null,null,null,{"$f":"IFERROR(CHOOSE(D17,25,18,15,12,10,8,6,4,2,1)+(F17=1),0)","v":0}]
["KUBICA Robert",null,null,null,null,null,{"$f":"IFERROR(CHOOSE(D18,25,18,15,12,10,8,6,4,2,1)+(F18=1),0)","v":0}]
[null,null,null,null,null,null,{"$f":"IFERROR(CHOOSE(D19,25,18,15,12,10,8,6,4,2,1)+(F19=1),\"\")","v":""}]
["RICCIARDO Daniel","RENAULT",null,null,null,null,{"$f":"IFERROR(CHOOSE(D20,25,18,15,12,10,8,6,4,2,1)+(F20=1),0)","v":0}]
["HULKENBERG Nico",null,null,null,null,null,{"$f":"IFERROR(CHOOSE(D21,25,18,15,12,10,8,6,4,2,1)+(F21=1),0)","v":0}]
[null,null,null,null,null,null,{"$f":"IFERROR(CHOOSE(D22,25,18,15,12,10,8,6,4,2,1)+(F22=1),\"\")","v":""}]
["KVYAT Daniil","TORO ROSSO",null,null,null,null,{"$f":"IFERROR(CHOOSE(D23,25,18,15,12,10,8,6,4,2,1)+(F23=1),0)","v":0}]
["ALBON Alexander",null,null,null,null,null,{"$f":"IFERROR(CHOOSE(D24,25,18,15,12,10,8,6,4,2,1)+(F24=1),0)","v":0}]
[null,null,null,null,null,null,{"$f":"IFERROR(CHOOSE(D25,25,18,15,12,10,8,6,4,2,1)+(F25=1),\"\")","v":""}]
["GROSJEAN Romain","HAAS",null,null,null,null,{"$f":"IFERROR(CHOOSE(D26,25,18,15,12,10,8,6,4,2,1)+(F26=1),0)","v":0}]
["MAGNUSSEN Kevin",null,null,null,null,null,{"$f":"IFERROR(CHOOSE(D27,25,18,15,12,10,8,6,4,2,1)+(F27=1),0)","v":0}]
[null,null,null,null,null,null,{"$f":"IFERROR(CHOOSE(D28,25,18,15,12,10,8,6,4,2,1)+(F28=1),\"\")","v":""}]
["NORRIS Lando","McLAREN",null,null,null,null,{"$f":"IFERROR(CHOOSE(D29,25,18,15,12,10,8,6,4,2,1)+(F29=1),0)","v":0}]
["SAINZ.Jr Carlos",null,null,null,null,null,{"$f":"IFERROR(CHOOSE(D30,25,18,15,12,10,8,6,4,2,1)+(F30=1),0)","v":0}]
[null,null,null,null,null,null,{"$f":"IFERROR(CHOOSE(D31,25,18,15,12,10,8,6,4,2,1)+(F31=1),\"\")","v":""}]
["RAÏKKÖNEN Kimi","ALFA ROMEO",null,null,null,null,{"$f":"IFERROR(CHOOSE(D32,25,18,15,12,10,8,6,4,2,1)+(F32=1),0)","v":0}]
["GIOVANIZZI Antonio",null,null,null,null,null,{"$f":"IFERROR(CHOOSE(D33,25,18,15,12,10,8,6,4,2,1)+(F33=1),0)","v":0}]
[null,null,null,null,null,null,{"$f":"IFERROR(CHOOSE(D34,25,18,15,12,10,8,6,4,2,1)+(F34=1),\"\")","v":""}]

{"sheet":"Hongrie","index":15,"n_rows":34,"n_cols":12,"rows_kept":34,"cut":false,"hidden":false,"merged":[[0,0,1,14],[2,1,3,1],[2,2,3,2],[2,3,3,3],[2,5,3,5],[2,6,3,6],[2,8,2,10],[2,4,3,4],[4,1,6,1],[4,2,6,2],[7,1,9,1],[7,2,9,2],[10,1,12,1],[10,2,12,2],[13,1,15,1],[13,2,15,2],[16,1,18,1],[16,2,18,2],[19,1,21,1],[19,2,21,2],[31,1,33,1],[31,2,33,2],[22,1,24,1],[22,2,24,2],[25,1,27,1],[25,2,27,2],[28,1,30,1],[28,2,30,2]]}
["HONGRIE - 14 AOUT 2019"]
[]
["PILOTES","ECURIES","VOITURES","Finish","Pôle","Pt tour","Points",null,"CLASSEMENT"]
[null,null,null,null,null,null,null,{"$f":"IF(G4=\"\",\"\",(RANK(G4,G4:G23)))","v":""},"ÉCURIES","POINTS","RANG","TOTAL"]
["HAMILTON Lewis","MERCEDES",null,1,null,null,{"$f":"IFERROR(CHOOSE(D5,25,18,15,12,10,8,6,4,2,1)+(F5=1),0)","v":25},null,"MERCEDES",{"$f":"SUM(G5:G7)","v":25},{"$f":"IF(J5=\"\",0,(RANK(J5,$J$5:$J$14)))+COUNTIF(J$5:J5,J5)-1","v":1},{"$f":"IF(J5=0,0,J5+#REF!)","v":{"$error":"#REF!"}}]
["BOTTAS Valterri",null,null,null,null,null,{"$f":"IFERROR(CHOOSE(D6,25,18,15,12,10,8,6,4,2,1)+(F6=1),0)","v":0},null,"FERRARI",{"$f":"SUM(G8:G10)","v":0},{"$f":"IF(J6=\"\",0,(RANK(J6,$J$5:$J$14)))+COUNTIF(J$5:J6,J6)-1","v":2},{"$f":"IF(J6=0,0,J6+#REF!)","v":0}]
[null,null,null,null,null,null,{"$f":"IFERROR(CHOOSE(D7,25,18,15,12,10,8,6,4,2,1)+(F7=1),\"\")","v":""},null,"RED BULL",{"$f":"SUM(G11:G13)","v":0},{"$f":"IF(J7=\"\",0,(RANK(J7,$J$5:$J$14)))+COUNTIF(J$5:J7,J7)-1","v":3},{"$f":"IF(J7=0,0,J7+#REF!)","v":0}]
["VETTEL Sebastian","FERRARI",null,null,null,null,{"$f":"IFERROR(CHOOSE(D8,25,18,15,12,10,8,6,4,2,1)+(F8=1),0)","v":0},null,"RACING POINT",{"$f":"SUM(G14:G16)","v":0},{"$f":"IF(J8=\"\",0,(RANK(J8,$J$5:$J$14)))+COUNTIF(J$5:J8,J8)-1","v":4},{"$f":"IF(J8=0,0,J8+#REF!)","v":0}]
["LECLERC Charles",null,null,null,null,null,{"$f":"IFERROR(CHOOSE(D9,25,18,15,12,10,8,6,4,2,1)+(F9=1),0)","v":0},null,"WILLIAMS",{"$f":"SUM(G17:G19)","v":0},{"$f":"IF(J9=\"\",0,(RANK(J9,$J$5:$J$14)))+COUNTIF(J$5:J9,J9)-1","v":5},{"$f":"IF(J9=0,0,J9+#REF!)","v":0}]
[null,null,null,null,null,null,{"$f":"IFERROR(CHOOSE(D10,25,18,15,12,10,8,6,4,2,1)+(F10=1),\"\")","v":""},null,"RENAULT",{"$f":"SUM(G20:G22)","v":0},{"$f":"IF(J10=\"\",0,(RANK(J10,$J$5:$J$14)))+COUNTIF(J$5:J10,J10)-1","v":6},{"$f":"IF(J10=0,0,J10+#REF!)","v":0}]
["VERSTAPPEN Max","RED BULL",null,null,null,null,{"$f":"IFERROR(CHOOSE(D11,25,18,15,12,10,8,6,4,2,1)+(F11=1),0)","v":0},null,"TORO ROSSO",{"$f":"SUM(G23:G25)","v":0},{"$f":"IF(J11=\"\",0,(RANK(J11,$J$5:$J$14)))+COUNTIF(J$5:J11,J11)-1","v":7},{"$f":"IF(J11=0,0,J11+#REF!)","v":0}]
["GASLY Pierre",null,null,null,null,null,{"$f":"IFERROR(CHOOSE(D12,25,18,15,12,10,8,6,4,2,1)+(F12=1),0)","v":0},null,"HAAS",{"$f":"SUM(G26:G28)","v":0},{"$f":"IF(J12=\"\",0,(RANK(J12,$J$5:$J$14)))+COUNTIF(J$5:J12,J12)-1","v":8},{"$f":"IF(J12=0,0,J12+#REF!)","v":0}]
[null,null,null,null,null,null,{"$f":"IFERROR(CHOOSE(D13,25,18,15,12,10,8,6,4,2,1)+(F13=1),\"\")","v":""},null,"Mc LAREN",{"$f":"SUM(G29:G31)","v":0},{"$f":"IF(J13=\"\",0,(RANK(J13,$J$5:$J$14)))+COUNTIF(J$5:J13,J13)-1","v":9},{"$f":"IF(J13=0,0,J13+#REF!)","v":0}]
["PEREZ Sergio","RACING\nPOINT",null,null,null,null,{"$f":"IFERROR(CHOOSE(D14,25,18,15,12,10,8,6,4,2,1)+(F14=1),0)","v":0},null,"ALFA ROMEO",{"$f":"SUM(G32:G34)","v":0},{"$f":"IF(J14=\"\",0,(RANK(J14,$J$5:$J$14)))+COUNTIF(J$5:J14,J14)-1","v":10},{"$f":"IF(J14=0,0,J14+#REF!)","v":0}]
["STROLL Lance",null,null,null,null,null,{"$f":"IFERROR(CHOOSE(D15,25,18,15,12,10,8,6,4,2,1)+(F15=1),0)","v":0}]
[null,null,null,null,null,null,{"$f":"IFERROR(CHOOSE(D16,25,18,15,12,10,8,6,4,2,1)+(F16=1),\"\")","v":""}]
["RUSSELL George","WILLIAMS",null,null,null,null,{"$f":"IFERROR(CHOOSE(D17,25,18,15,12,10,8,6,4,2,1)+(F17=1),0)","v":0}]
["KUBICA Robert",null,null,null,null,null,{"$f":"IFERROR(CHOOSE(D18,25,18,15,12,10,8,6,4,2,1)+(F18=1),0)","v":0}]
[null,null,null,null,null,null,{"$f":"IFERROR(CHOOSE(D19,25,18,15,12,10,8,6,4,2,1)+(F19=1),\"\")","v":""}]
["RICCIARDO Daniel","RENAULT",null,null,null,null,{"$f":"IFERROR(CHOOSE(D20,25,18,15,12,10,8,6,4,2,1)+(F20=1),0)","v":0}]
["HULKENBERG Nico",null,null,null,null,null,{"$f":"IFERROR(CHOOSE(D21,25,18,15,12,10,8,6,4,2,1)+(F21=1),0)","v":0}]
[null,null,null,null,null,null,{"$f":"IFERROR(CHOOSE(D22,25,18,15,12,10,8,6,4,2,1)+(F22=1),\"\")","v":""}]
["KVYAT Daniil","TORO ROSSO",null,null,null,null,{"$f":"IFERROR(CHOOSE(D23,25,18,15,12,10,8,6,4,2,1)+(F23=1),0)","v":0}]
["ALBON Alexander",null,null,null,null,null,{"$f":"IFERROR(CHOOSE(D24,25,18,15,12,10,8,6,4,2,1)+(F24=1),0)","v":0}]
[null,null,null,null,null,null,{"$f":"IFERROR(CHOOSE(D25,25,18,15,12,10,8,6,4,2,1)+(F25=1),\"\")","v":""}]
["GROSJEAN Romain","HAAS",null,null,null,null,{"$f":"IFERROR(CHOOSE(D26,25,18,15,12,10,8,6,4,2,1)+(F26=1),0)","v":0}]
["MAGNUSSEN Kevin",null,null,null,null,null,{"$f":"IFERROR(CHOOSE(D27,25,18,15,12,10,8,6,4,2,1)+(F27=1),0)","v":0}]
[null,null,null,null,null,null,{"$f":"IFERROR(CHOOSE(D28,25,18,15,12,10,8,6,4,2,1)+(F28=1),\"\")","v":""}]
["NORRIS Lando","McLAREN",null,null,null,null,{"$f":"IFERROR(CHOOSE(D29,25,18,15,12,10,8,6,4,2,1)+(F29=1),0)","v":0}]
["SAINZ.Jr Carlos",null,null,null,null,null,{"$f":"IFERROR(CHOOSE(D30,25,18,15,12,10,8,6,4,2,1)+(F30=1),0)","v":0}]
[null,null,null,null,null,null,{"$f":"IFERROR(CHOOSE(D31,25,18,15,12,10,8,6,4,2,1)+(F31=1),\"\")","v":""}]
["RAÏKKÖNEN Kimi","ALFA ROMEO",null,null,null,null,{"$f":"IFERROR(CHOOSE(D32,25,18,15,12,10,8,6,4,2,1)+(F32=1),0)","v":0}]
["GIOVANIZZI Antonio",null,null,null,null,null,{"$f":"IFERROR(CHOOSE(D33,25,18,15,12,10,8,6,4,2,1)+(F33=1),0)","v":0}]
[null,null,null,null,null,null,{"$f":"IFERROR(CHOOSE(D34,25,18,15,12,10,8,6,4,2,1)+(F34=1),\"\")","v":""}]