{"text_format":"1","workbook":"xlsx","n_sheets":16,"sheets":["Feuil1","Album Photos","Champions","Écuries","Pilotes","Melbourne","Bahrein","Chine","Azerbaïdjan","Espagne","Monaco","Canada","France","Autriche","GB","Hongrie"],"not_rendered":{"charts":0,"images":22,"macros":1,"external_links":1,"defined_names":7,"comments":0,"pivot_tables":0},"unopened":[],"bounds":{"document_bytes":16777216,"sheet_cells":100000,"rows_first":2000,"rows_last":500,"rows_between":2000,"halvings":0,"cell_chars":16384,"cell_head_chars":4096},"cells_cut":0,"cells_raw":0,"read":"whole","date_system":"1900"}

{"sheet":"Feuil1","index":0,"n_rows":41,"n_cols":3,"rows_kept":41,"cut":false,"hidden":false,"merged":[[31,2,34,5],[35,2,38,5],[39,2,42,5],[1,1,1,5],[2,2,2,5],[3,2,6,5],[7,2,10,5],[11,2,14,5],[15,2,18,5],[19,2,22,5],[23,2,26,5],[27,2,30,5]]}
[]
[null,"Photos F1"]
[null,"Noms","Photos"]
[]
[null,"Mercedes"]
[]
[]
[]
{"$rows_left_out":34}
{"sheet":"Album Photos","index":1,"n_rows":23,"n_cols":4,"rows_kept":23,"cut":false,"hidden":false,"merged":[[1,5,1,6]]}
[]
[null,"Photos Pilotes"]
[null,"Noms",null,"Photos"]
[null,"Lewis HAMILTON"]
[null,"Valterii BOTTAS"]
[null,"Charles LECLERC"]
[null,"Sebastian VETTEL"]
[null,"Max VERSTAPPEN"]
{"$rows_left_out":16}
{"sheet":"Champions","index":2,"n_rows":22,"n_cols":10,"rows_kept":22,"cut":false,"hidden":false,"merged":[[1,2,1,10],[14,2,14,10],[16,5,16,7],[17,5,17,7],[3,5,3,7],[4,5,4,7],[6,1,6,3],[7,1,7,3],[6,9,6,11],[7,9,7,11],[8,9,12,11],[8,1,12,3],[5,5,8,7],[21,1,25,3],[18,5,22,7],[21,9,25,11],[19,1,19,3],[20,1,20,3],[19,9,19,11],[20,9,20,11]]}
[]
[null,null,"CHAMPIONNAT PILOTES 2019"]
[]
[null,null,null,null,null,"CHAMPION 2019"]
[null,null,null,null,null,{"$f":"IF(Pilotes!G5=1,Pilotes!B5,\"\")","v":"HAMILTON Lewis"}]
[null,null,null,null,null,{"$f":"MATCH(F5,'Album Photos'!$B$1:$B$23,0)","v":{"$error":"#N/A"}}]
[null,"DEUXIÈME",null,null,null,null,null,null,null,"TROIXIÈME"]
[null,{"$f":"IF(Pilotes!G6=2,Pilotes!B6,\"\")","v":"BOTTAS Valterri"},null,null,null,null,null,null,null,{"$f":"IF(Pilotes!G7=3,Pilotes!B7,\"\")","v":"ALBON Alexander"}]
{"$rows_left_out":15}
{"sheet":"Écuries","index":3,"n_rows":13,"n_cols":6,"rows_kept":13,"cut":false,"hidden":false,"merged":[[0,1,0,5]]}
[]
[]
[null,"ÉCURIES","POINTS","Écart/premier","Écart/précédent","RANG"]
[null,"MERCEDES",{"$f":"SUM(Melbourne:Hongrie!J5)","v":173},null,null,{"$f":"IF(C4=\"\",0,(RANK(C4,$C$4:$C$13)))+COUNTIF(C$4:C4,C4)-1","v":1}]
[null,"RENAULT",{"$f":"SUM(Melbourne:Hongrie!J10)","v":50},{"$f":"C5-C4","v":-123},{"$f":"C5-C4","v":-123},{"$f":"IF(C5=\"\",0,(RANK(C5,$C$4:$C$13)))+COUNTIF(C$4:C5,C5)-1","v":2}]
[null,"WILLIAMS",{"$f":"SUM(Melbourne:Hongrie!J9)","v":46},{"$f":"C6-C4","v":-127},{"$f":"C6-C5","v":-4},{"$f":"IF(C6=\"\",0,(RANK(C6,$C$4:$C$13)))+COUNTIF(C$4:C6,C6)-1","v":3}]
[null,"HASS",{"$f":"SUM(Melbourne:Hongrie!J12)","v":44},{"$f":"C7-C4","v":-129},-2,{"$f":"IF(C7=\"\",0,(RANK(C7,$C$4:$C$13)))+COUNTIF(C$4:C7,C7)-1","v":4}]
[null,"TORO ROSSO",{"$f":"SUM(Melbourne:Hongrie!J11)","v":40},{"$f":"C8-C4","v":-133},-4,{"$f":"IF(C8=\"\",0,(RANK(C8,$C$4:$C$13)))+COUNTIF(C$4:C8,C8)-1","v":5}]
{"$rows_left_out":6}
{"sheet":"Pilotes","index":4,"n_rows":24,"n_cols":9,"rows_kept":24,"cut":false,"hidden":false,"merged":[[0,0,0,7],[2,1,3,1],[2,2,3,2],[2,6,3,6],[2,3,3,3],[2,4,3,4],[2,5,3,5]]}
[]
[]
[null,"PILOTES","Points","Écart-premier","Écart/précédent","Pôle Position","Place",1]
[null,null,{"$f":"IFERROR(SUM(Melbourne!G33,[1]Bahreïn!F33),\"\")","v":0},null,null,null,{"$f":"IF(C4=0,\"\",(RANK(C4,C1:C4)))","v":""},"Pos.Saison"]
[null,"HAMILTON Lewis",{"$f":"SUM(Melbourne:Hongrie!G5)","v":130},null,null,{"$f":"SUM(Melbourne:Hongrie!E9)","v":0},{"$f":"IF(C5=\"\",0,(RANK(C5,$C$5:$C$24)))+COUNTIF(C$5:C5,C5)-1","v":1},{"$f":"CalculPosition(B5)","v":3},"Syntaxe : =CalculPosition(B5) B5 étant le nom du pilote"]
[null,"BOTTAS Valterri",{"$f":"SUM(Melbourne:Hongrie!G6)","v":43},{"$f":"C6-C5","v":-87},{"$f":"C5-C6","v":87},{"$f":"SUM(Melbourne:Hongrie!E10)","v":0},{"$f":"IF(C6=\"\",0,(RANK(C6,$C$5:$C$24)))+COUNTIF(C$5:C6,C6)-1","v":2},{"$f":"CalculPosition(B6)","v":1}]
[null,"ALBON Alexander",{"$f":"SUM(Melbourne:Hongrie!G24)","v":40},{"$f":"C7-C5","v":-90},{"$f":"C6-C7","v":3},{"$f":"SUM(Melbourne:Hongrie!E11)","v":0},{"$f":"IF(C7=\"\",0,(RANK(C7,$C$5:$C$24)))+COUNTIF(C$5:C7,C7)-1","v":3},{"$f":"CalculPosition(B8)","v":1}]
[null,"MAGNUSSEN Kevin",{"$f":"SUM(Melbourne:Hongrie!G27)","v":29},{"$f":"C8-C5","v":-101},{"$f":"C7-C8","v":11},{"$f":"SUM(Melbourne:Hongrie!E12)","v":0},{"$f":"IF(C8=\"\",0,(RANK(C8,$C$5:$C$24)))+COUNTIF(C$5:C8,C8)-1","v":4},{"$f":"CalculPosition(B11)","v":1}]
{"$rows_left_out":17}
{"sheet":"Melbourne","index":5,"n_rows":34,"n_cols":11,"rows_kept":34,"cut":false,"hidden":false,"merged":[[7,1,9,1],[7,2,9,2],[10,1,12,1],[10,2,12,2],[0,0,1,14],[4,1,6,1],[4,2,6,2],[2,0,3,0],[2,8,2,10],[2,1,3,1],[2,2,3,2],[2,3,3,3],[2,5,3,5],[2,6,3,6],[2,4,3,4],[31,1,33,1],[31,2,33,2],[13,1,15,1],[13,2,15,2],[16,1,18,1],[16,2,18,2],[19,1,21,1],[19,2,21,2],[28,1,30,1],[28,2,30,2],[25,2,27,2],[22,1,24,1],[22,2,24,2],[25,1,27,1]]}
["AUSTRALIE - 17 MARS 2019"]
[]
["PILOTES","ECURIES","VOITURES","Finish","Pôle","Pt tour","Points",null,"CLASSEMENT"]
[null,null,null,null,null,null,null,null,"ÉCURIES","POINTS","RANG"]
["HAMILTON Lewis","MERCEDES",null,1,null,null,{"$f":"IFERROR(CHOOSE(D5,25,18,15,12,10,8,6,4,2,1)+(F5=1),0)","v":25},null,"MERCEDES",{"$f":"SUM(G5:G7)","v":43},{"$f":"IF(J5=\"\",0,(RANK(J5,$J$5:$J$14)))+COUNTIF(J$5:J5,J5)-1","v":1}]
["BOTTAS Valterri",null,null,2,null,null,{"$f":"IFERROR(CHOOSE(D6,25,18,15,12,10,8,6,4,2,1)+(F6=1),0)","v":18},null,"FERRARI",{"$f":"SUM(G8:G10)","v":27},{"$f":"IF(J6=\"\",0,(RANK(J6,$J$5:$J$14)))+COUNTIF(J$5:J6,J6)-1","v":2}]
[null,null,null,null,null,null,{"$f":"IFERROR(CHOOSE(D7,25,18,15,12,10,8,6,4,2,1)+(F7=1),\"\")","v":""},null,"RED BULL",{"$f":"SUM(G11:G13)","v":18},{"$f":"IF(J7=\"\",0,(RANK(J7,$J$5:$J$14)))+COUNTIF(J$5:J7,J7)-1","v":3}]
["VETTEL Sebastian","FERRARI",null,3,null,null,{"$f":"IFERROR(CHOOSE(D8,25,18,15,12,10,8,6,4,2,1)+(F8=1),0)","v":15},null,"RACING POINT",{"$f":"SUM(G14:G16)","v":10},{"$f":"IF(J8=\"\",0,(RANK(J8,$J$5:$J$14)))+COUNTIF(J$5:J8,J8)-1","v":4}]
{"$rows_left_out":27}
{"sheet":"Bahrein","index":6,"n_rows":33,"n_cols":12,"rows_kept":33,"cut":false,"hidden":false,"merged":[[0,0,1,14],[2,1,3,1],[2,2,3,2],[2,3,3,3],[2,5,3,5],[2,6,3,6],[2,8,2,10],[2,4,3,4],[4,1,6,1],[4,2,6,2],[7,1,9,1],[7,2,9,2],[10,1,12,1],[10,2,12,2],[13,1,15,1],[13,2,15,2],[16,1,18,1],[16,2,18,2],[19,1,21,1],[19,2,21,2],[31,1,33,1],[31,2,33,2],[22,1,24,1],[22,2,24,2],[25,1,27,1],[25,2,27,2],[28,1,30,1],[28,2,30,2]]}
["BAHREÏN - 31 MARS 2019"]
[]
["PILOTES","ECURIES","VOITURES","Finish","Pôle","Pt tour","Points",null,"CLASSEMENT"]
[null,null,null,null,null,null,null,{"$f":"IF(G4=\"\",\"\",(RANK(G4,G4:G23)))","v":""},"ÉCURIES","POINTS","RANG","TOTAL"]
["HAMILTON Lewis","MERCEDES",null,10,null,null,{"$f":"IFERROR(CHOOSE(D5,25,18,15,12,10,8,6,4,2,1)+(F5=1),0)","v":1},null,"MERCEDES",{"$f":"SUM(G5:G7)","v":26},{"$f":"IF(J5=\"\",0,(RANK(J5,$J$5:$J$14)))+COUNTIF(J$5:J5,J5)-1","v":1},{"$f":"IF(J5=0,0,J5+Melbourne!J5)","v":69}]
["BOTTAS Valterri",null,null,1,null,null,{"$f":"IFERROR(CHOOSE(D6,25,18,15,12,10,8,6,4,2,1)+(F6=1),0)","v":25},null,"FERRARI",{"$f":"SUM(G8:G10)","v":0},{"$f":"IF(J6=\"\",0,(RANK(J6,$J$5:$J$14)))+COUNTIF(J$5:J6,J6)-1","v":4},{"$f":"IF(J6=0,0,J6+Melbourne!J6)","v":0}]
[null,null,null,null,null,null,null,null,"RED BULL",{"$f":"SUM(G11:G13)","v":0},{"$f":"IF(J7=\"\",0,(RANK(J7,$J$5:$J$14)))+COUNTIF(J$5:J7,J7)-1","v":5},{"$f":"IF(J7=0,0,J7+Melbourne!J7)","v":0}]
["VETTEL Sebastian","FERRARI",null,null,null,null,{"$f":"IFERROR(CHOOSE(D8,25,18,15,12,10,8,6,4,2,1)+(F8=1),0)","v":0},null,"RACING POINT",{"$f":"SUM(G14:G16)","v":0},{"$f":"IF(J8=\"\",0,(RANK(J8,$J$5:$J$14)))+COUNTIF(J$5:J8,J8)-1","v":6},{"$f":"IF(J8=0,0,J8+Melbourne!J8)","v":0}]
{"$rows_left_out":26}
{"sheet":"Chine","index":7,"n_rows":34,"n_cols":12,"rows_kept":34,"cut":false,"hidden":false,"merged":[[0,0,1,14],[2,1,3,1],[2,2,3,2],[2,3,3,3],[2,5,3,5],[2,6,3,6],[2,8,2,10],[2,4,3,4],[4,1,6,1],[4,2,6,2],[7,1,9,1],[7,2,9,2],[10,1,12,1],[10,2,12,2],[13,1,15,1],[13,2,15,2],[16,1,18,1],[16,2,18,2],[19,1,21,1],[19,2,21,2],[31,1,33,1],[31,2,33,2],[22,1,24,1],[22,2,24,2],[25,1,27,1],[25,2,27,2],[28,1,30,1],[28,2,30,2]]}
["CHINE - 14 AVRIL 2019"]
[]
["PILOTES","ECURIES","VOITURES","Finish","Pôle","Pt tour","Points",null,"CLASSEMENT"]
[null,null,null,null,null,null,null,{"$f":"IF(G4=\"\",\"\",(RANK(G4,G4:G23)))","v":""},"ÉCURIES","POINTS","RANG","TOTAL"]
["HAMILTON Lewis","MERCEDES",null,2,null,null,{"$f":"IFERROR(CHOOSE(D5,25,18,15,12,10,8,6,4,2,1)+(F5=1),0)","v":18},null,"MERCEDES",{"$f":"SUM(G5:G7)","v":18},{"$f":"IF(J5=\"\",0,(RANK(J5,$J$5:$J$14)))+COUNTIF(J$5:J5,J5)-1","v":2},{"$f":"IF(J5=0,0,J5+Bahrein!L5)","v":87}]
["BOTTAS Valterri",null,null,null,null,null,0,null,"FERRARI",{"$f":"SUM(G8:G10)","v":0},{"$f":"IF(J6=\"\",0,(RANK(J6,$J$5:$J$14)))+COUNTIF(J$5:J6,J6)-1","v":3},{"$f":"IF(J6=0,0,J6+Bahrein!L6)","v":0}]
[null,null,null,null,null,null,0,null,"RED BULL",{"$f":"SUM(G11:G13)","v":0},{"$f":"IF(J7=\"\",0,(RANK(J7,$J$5:$J$14)))+COUNTIF(J$5:J7,J7)-1","v":4},{"$f":"IF(J7=0,0,J7+Bahrein!L7)","v":0}]
["VETTEL Sebastian","FERRARI",null,null,null,null,0,null,"RACING POINT",{"$f":"SUM(G14:G16)","v":0},{"$f":"IF(J8=\"\",0,(RANK(J8,$J$5:$J$14)))+COUNTIF(J$5:J8,J8)-1","v":5},{"$f":"IF(J8=0,0,J8+Bahrein!L8)","v":0}]
{"$rows_left_out":27}
{"sheet":"Azerbaïdjan","index":8,"n_rows":34,"n_cols":19,"rows_kept":34,"cut":false,"hidden":false,"merged":[[0,0,1,14],[2,1,3,1],[2,2,3,2],[2,3,3,3],[2,5,3,5],[2,6,3,6],[2,8,2,10],[2,4,3,4],[4,1,6,1],[4,2,6,2],[7,1,9,1],[7,2,9,2],[10,1,12,1],[10,2,12,2],[13,1,15,1],[13,2,15,2],[16,1,18,1],[16,2,18,2],[19,1,21,1],[19,2,21,2],[31,1,33,1],[31,2,33,2],[22,1,24,1],[22,2,24,2],[25,1,27,1],[25,2,27,2],[28,1,30,1],[28,2,30,2]]}
["AZERBAÏDJAN - 28 AVRIL 2019"]
[]
["PILOTES","ECURIES","VOITURES","Finish","Pôle","Pt tour","Points",null,"CLASSEMENT"]
[null,null,null,null,null,null,null,{"$f":"IF(G4=\"\",\"\",(RANK(G4,G4:G23)))","v":""},"ÉCURIES","POINTS","RANG","TOTAL"]
["HAMILTON Lewis","MERCEDES",null,2,null,null,{"$f":"IFERROR(CHOOSE(D5,25,18,15,12,10,8,6,4,2,1)+(F5=1),0)","v":18},null,"MERCEDES",{"$f":"SUM(G5:G7)","v":18},{"$f":"IF(J5=\"\",0,(RANK(J5,$J$5:$J$14)))+COUNTIF(J$5:J5,J5)-1","v":2},{"$f":"IF(J5=0,0,J5+Chine!L5)","v":105}]
["BOTTAS Valterri",null,null,null,null,null,{"$f":"IFERROR(CHOOSE(D6,25,18,15,12,10,8,6,4,2,1)+(F6=1),0)","v":0},null,"FERRARI",{"$f":"SUM(G8:G10)","v":0},{"$f":"IF(J6=\"\",0,(RANK(J6,$J$5:$J$14)))+COUNTIF(J$5:J6,J6)-1","v":3},{"$f":"IF(J6=0,0,J6+Chine!L6)","v":0}]
[null,null,null,null,null,null,{"$f":"IFERROR(CHOOSE(D7,25,18,15,12,10,8,6,4,2,1)+(F7=1),\"\")","v":""},null,"RED BULL",{"$f":"SUM(G11:G13)","v":0},{"$f":"IF(J7=\"\",0,(RANK(J7,$J$5:$J$14)))+COUNTIF(J$5:J7,J7)-1","v":4},{"$f":"IF(J7=0,0,J7+Chine!L7)","v":0}]
["VETTEL Sebastian","FERRARI",null,null,null,null,{"$f":"IFERROR(CHOOSE(D8,25,18,15,12,10,8,6,4,2,1)+(F8=1),0)","v":0},null,"RACING POINT",{"$f":"SUM(G14:G16)","v":0},{"$f":"IF(J8=\"\",0,(RANK(J8,$J$5:$J$14)))+COUNTIF(J$5:J8,J8)-1","v":5},{"$f":"IF(J8=0,0,J8+Chine!L8)","v":0}]
{"$rows_left_out":27}
{"sheet":"Espagne","index":9,"n_rows":34,"n_cols":12,"rows_kept":34,"cut":false,"hidden":false,"merged":[[0,0,1,14],[2,1,3,1],[2,2,3,2],[2,3,3,3],[2,5,3,5],[2,6,3,6],[2,8,2,10],[2,4,3,4],[4,1,6,1],[4,2,6,2],[7,1,9,1],[7,2,9,2],[10,1,12,1],[10,2,12,2],[13,1,15,1],[13,2,15,2],[16,1,18,1],[16,2,18,2],[19,1,21,1],[19,2,21,2],[31,1,33,1],[31,2,33,2],[22,1,24,1],[22,2,24,2],[25,1,27,1],[25,2,27,2],[28,1,30,1],[28,2,30,2]]}
["ESPAGNE - 12 MAI 2019"]
[]
["PILOTES","ECURIES","VOITURES","Finish","Pôle","Pt tour","Points",null,"CLASSEMENT"]
[null,null,null,null,null,null,null,{"$f":"IF(G4=\"\",\"\",(RANK(G4,G4:G23)))","v":""},"ÉCURIES","POINTS","RANG","TOTAL"]
["HAMILTON Lewis","MERCEDES",null,1,null,null,{"$f":"IFERROR(CHOOSE(D5,25,18,15,12,10,8,6,4,2,1)+(F5=1),0)","v":25},null,"MERCEDES",{"$f":"SUM(G5:G7)","v":25},{"$f":"IF(J5=\"\",0,(RANK(J5,$J$5:$J$14)))+COUNTIF(J$5:J5,J5)-1","v":1},{"$f":"IF(J5=0,0,J5+Azerbaïdjan!L5)","v":130}]
["BOTTAS Valterri",null,null,null,null,null,{"$f":"IFERROR(CHOOSE(D6,25,18,15,12,10,8,6,4,2,1)+(F6=1),0)","v":0},null,"FERRARI",{"$f":"SUM(G8:G10)","v":0},{"$f":"IF(J6=\"\",0,(RANK(J6,$J$5:$J$14)))+COUNTIF(J$5:J6,J6)-1","v":4},{"$f":"IF(J6=0,0,J6+Azerbaïdjan!L6)","v":0}]
[null,null,null,null,null,null,{"$f":"IFERROR(CHOOSE(D7,25,18,15,12,10,8,6,4,2,1)+(F7=1),\"\")","v":""},null,"RED BULL",{"$f":"SUM(G11:G13)","v":0},{"$f":"IF(J7=\"\",0,(RANK(J7,$J$5:$J$14)))+COUNTIF(J$5:J7,J7)-1","v":5},{"$f":"IF(J7=0,0,J7+Azerbaïdjan!L7)","v":0}]
["VETTEL Sebastian","FERRARI",null,null,null,null,{"$f":"IFERROR(CHOOSE(D8,25,18,15,12,10,8,6,4,2,1)+(F8=1),0)","v":0},null,"RACING POINT",{"$f":"SUM(G14:G16)","v":0},{"$f":"IF(J8=\"\",0,(RANK(J8,$J$5:$J$14)))+COUNTIF(J$5:J8,J8)-1","v":6},{"$f":"IF(J8=0,0,J8+Azerbaïdjan!L8)","v":0}]
{"$rows_left_out":27}
{"sheet":"Monaco","index":10,"n_rows":34,"n_cols":12,"rows_kept":34,"cut":false,"hidden":false,"merged":[[0,0,1,14],[2,1,3,1],[2,2,3,2],[2,3,3,3],[2,5,3,5],[2,6,3,6],[2,8,2,10],[2,4,3,4],[4,1,6,1],[4,2,6,2],[7,1,9,1],[7,2,9,2],[10,1,12,1],[10,2,12,2],[13,1,15,1],[13,2,15,2],[16,1,18,1],[16,2,18,2],[19,1,21,1],[19,2,21,2],[31,1,33,1],[31,2,33,2],[22,1,24,1],[22,2,24,2],[25,1,27,1],[25,2,27,2],[28,1,30,1],[28,2,30,2]]}
["MONACO - 26 MAI 2019"]
[]
["PILOTES","ECURIES","VOITURES","Finish","Pôle","Pt tour","Points",null,"CLASSEMENT"]
[null,null,null,null,null,null,null,{"$f":"IF(G4=\"\",\"\",(RANK(G4,G4:G23)))","v":""},"ÉCURIES","POINTS","RANG","TOTAL"]
["HAMILTON Lewis","MERCEDES",null,null,null,null,{"$f":"IFERROR(CHOOSE(D5,25,18,15,12,10,8,6,4,2,1)+(F5=1),0)","v":0},null,"MERCEDES",{"$f":"SUM(G5:G7)","v":0},{"$f":"IF(J5=\"\",0,(RANK(J5,$J$5:$J$14)))+COUNTIF(J$5:J5,J5)-1","v":3},{"$f":"IF(J5=0,0,J5+Espagne!L5)","v":0}]
["BOTTAS Valterri",null,null,null,null,null,{"$f":"IFERROR(CHOOSE(D6,25,18,15,12,10,8,6,4,2,1)+(F6=1),0)","v":0},null,"FERRARI",{"$f":"SUM(G8:G10)","v":0},{"$f":"IF(J6=\"\",0,(RANK(J6,$J$5:$J$14)))+COUNTIF(J$5:J6,J6)-1","v":4},{"$f":"IF(J6=0,0,J6+Espagne!L6)","v":0}]
[null,null,null,null,null,null,{"$f":"IFERROR(CHOOSE(D7,25,18,15,12,10,8,6,4,2,1)+(F7=1),\"\")","v":""},null,"RED BULL",{"$f":"SUM(G11:G13)","v":0},{"$f":"IF(J7=\"\",0,(RANK(J7,$J$5:$J$14)))+COUNTIF(J$5:J7,J7)-1","v":5},{"$f":"IF(J7=0,0,J7+Espagne!L7)","v":0}]
["VETTEL Sebastian","FERRARI",null,20,null,null,{"$f":"IFERROR(CHOOSE(D8,25,18,15,12,10,8,6,4,2,1)+(F8=1),0)","v":0},null,"RACING POINT",{"$f":"SUM(G14:G16)","v":0},{"$f":"IF(J8=\"\",0,(RANK(J8,$J$5:$J$14)))+COUNTIF(J$5:J8,J8)-1","v":6},{"$f":"IF(J8=0,0,J8+Espagne!L8)","v":0}]
{"$rows_left_out":27}
{"sheet":"Canada","index":11,"n_rows":34,"n_cols":12,"rows_kept":34,"cut":false,"hidden":false,"merged":[[0,0,1,14],[2,1,3,1],[2,2,3,2],[2,3,3,3],[2,5,3,5],[2,6,3,6],[2,8,2,10],[2,4,3,4],[4,1,6,1],[4,2,6,2],[7,1,9,1],[7,2,9,2],[10,1,12,1],[10,2,12,2],[13,1,15,1],[13,2,15,2],[16,1,18,1],[16,2,18,2],[19,1,21,1],[19,2,21,2],[31,1,33,1],[31,2,33,2],[22,1,24,1],[22,2,24,2],[25,1,27,1],[25,2,27,2],[28,1,30,1],[28,2,30,2]]}
["CANADA - 17 MARS 2019"]
[]
["PILOTES","ECURIES","VOITURES","Finish","Pôle","Pt tour","Points",null,"CLASSEMENT"]
[null,null,null,null,null,null,null,{"$f":"IF(G4=\"\",\"\",(RANK(G4,G4:G23)))","v":""},"ÉCURIES","POINTS","RANG","TOTAL"]
["HAMILTON Lewis","MERCEDES",null,2,null,null,{"$f":"IFERROR(CHOOSE(D5,25,18,15,12,10,8,6,4,2,1)+(F5=1),0)","v":18},null,"MERCEDES",{"$f":"SUM(G5:G7)","v":18},{"$f":"IF(J5=\"\",0,(RANK(J5,$J$5:$J$14)))+COUNTIF(J$5:J5,J5)-1","v":2},{"$f":"IF(J5=0,0,J5+Monaco!L5)","v":18}]
["BOTTAS Valterri",null,null,null,null,null,{"$f":"IFERROR(CHOOSE(D6,25,18,15,12,10,8,6,4,2,1)+(F6=1),0)","v":0},null,"FERRARI",{"$f":"SUM(G8:G10)","v":0},{"$f":"IF(J6=\"\",0,(RANK(J6,$J$5:$J$14)))+COUNTIF(J$5:J6,J6)-1","v":4},{"$f":"IF(J6=0,0,J6+Monaco!L6)","v":0}]
[null,null,null,null,null,null,{"$f":"IFERROR(CHOOSE(D7,25,18,15,12,10,8,6,4,2,1)+(F7=1),\"\")","v":""},null,"RED BULL",{"$f":"SUM(G11:G13)","v":0},{"$f":"IF(J7=\"\",0,(RANK(J7,$J$5:$J$14)))+COUNTIF(J$5:J7,J7)-1","v":5},{"$f":"IF(J7=0,0,J7+Monaco!L7)","v":0}]
["VETTEL Sebastian","FERRARI",null,null,null,null,{"$f":"IFERROR(CHOOSE(D8,25,18,15,12,10,8,6,4,2,1)+(F8=1),0)","v":0},null,"RACING POINT",{"$f":"SUM(G14:G16)","v":15},{"$f":"IF(J8=\"\",0,(RANK(J8,$J$5:$J$14)))+COUNTIF(J$5:J8,J8)-1","v":3},{"$f":"IF(J8=0,0,J8+Monaco!L8)","v":15}]
{"$rows_left_out":27}
{"sheet":"France","index":12,"n_rows":34,"n_cols":12,"rows_kept":34,"cut":false,"hidden":false,"merged":[[0,0,1,14],[2,1,3,1],[2,2,3,2],[2,3,3,3],[2,5,3,5],[2,6,3,6],[2,8,2,10],[2,4,3,4],[4,1,6,1],[4,2,6,2],[7,1,9,1],[7,2,9,2],[10,1,12,1],[10,2,12,2],[13,1,15,1],[13,2,15,2],[16,1,18,1],[16,2,18,2],[19,1,21,1],[19,2,21,2],[31,1,33,1],[31,2,33,2],[22,1,24,1],[22,2,24,2],[25,1,27,1],[25,2,27,2],[28,1,30,1],[28,2,30,2]]}
["FRANCE - 17 MARS 2019"]
[]
["PILOTES","ECURIES","VOITURES","Finish","Pôle","Pt tour","Points",null,"CLASSEMENT"]
[null,null,null,null,null,null,null,{"$f":"IF(G4=\"\",\"\",(RANK(G4,G4:G23)))","v":""},"ÉCURIES","POINTS","RANG","TOTAL"]
["HAMILTON Lewis","MERCEDES",null,null,null,null,{"$f":"IFERROR(CHOOSE(D5,25,18,15,12,10,8,6,4,2,1)+(F5=1),0)","v":0},null,"MERCEDES",{"$f":"SUM(G5:G7)","v":0},{"$f":"IF(J5=\"\",0,(RANK(J5,$J$5:$J$14)))+COUNTIF(J$5:J5,J5)-1","v":2},{"$f":"IF(J5=0,0,J5+Canada!L5)","v":0}]
["BOTTAS Valterri",null,null,null,null,null,{"$f":"IFERROR(CHOOSE(D6,25,18,15,12,10,8,6,4,2,1)+(F6=1),0)","v":0},null,"FERRARI",{"$f":"SUM(G8:G10)","v":0},{"$f":"IF(J6=\"\",0,(RANK(J6,$J$5:$J$14)))+COUNTIF(J$5:J6,J6)-1","v":3},{"$f":"IF(J6=0,0,J6+Canada!L6)","v":0}]
[null,null,null,null,null,null,{"$f":"IFERROR(CHOOSE(D7,25,18,15,12,10,8,6,4,2,1)+(F7=1),\"\")","v":""},null,"RED BULL",{"$f":"SUM(G11:G13)","v":0},{"$f":"IF(J7=\"\",0,(RANK(J7,$J$5:$J$14)))+COUNTIF(J$5:J7,J7)-1","v":4},{"$f":"IF(J7=0,0,J7+Canada!L7)","v":0}]
["VETTEL Sebastian","FERRARI",null,null,null,null,{"$f":"IFERROR(CHOOSE(D8,25,18,15,12,10,8,6,4,2,1)+(F8=1),0)","v":0},null,"RACING POINT",{"$f":"SUM(G14:G16)","v":0},{"$f":"IF(J8=\"\",0,(RANK(J8,$J$5:$J$14)))+COUNTIF(J$5:J8,J8)-1","v":5},{"$f":"IF(J8=0,0,J8+Canada!L8)","v":0}]
{"$rows_left_out":27}
{"sheet":"Autriche","index":13,"n_rows":34,"n_cols":12,"rows_kept":34,"cut":false,"hidden":false,"merged":[[0,0,1,14],[2,1,3,1],[2,2,3,2],[2,3,3,3],[2,5,3,5],[2,6,3,6],[2,8,2,10],[2,4,3,4],[4,1,6,1],[4,2,6,2],[7,1,9,1],[7,2,9,2],[10,1,12,1],[10,2,12,2],[13,1,15,1],[13,2,15,2],[16,1,18,1],[16,2,18,2],[19,1,21,1],[19,2,21,2],[31,1,33,1],[31,2,33,2],[22,1,24,1],[22,2,24,2],[25,1,27,1],[25,2,27,2],[28,1,30,1],[28,2,30,2]]}
["AUTRICHE - 17 MARS 2019"]
[]
["PILOTES","ECURIES","VOITURES","Finish","Pôle","Pt tour","Points",null,"CLASSEMENT"]
[null,null,null,null,null,null,null,{"$f":"IF(G4=\"\",\"\",(RANK(G4,G4:G23)))","v":""},"ÉCURIES","POINTS","RANG","TOTAL"]
["HAMILTON Lewis","MERCEDES",null,null,null,null,{"$f":"IFERROR(CHOOSE(D5,25,18,15,12,10,8,6,4,2,1)+(F5=1),0)","v":0},null,"MERCEDES",{"$f":"SUM(G5:G7)","v":0},{"$f":"IF(J5=\"\",0,(RANK(J5,$J$5:$J$14)))+COUNTIF(J$5:J5,J5)-1","v":1},{"$f":"IF(J5=0,0,J5+France!L5)","v":0}]
["BOTTAS Valterri",null,null,null,null,null,{"$f":"IFERROR(CHOOSE(D6,25,18,15,12,10,8,6,4,2,1)+(F6=1),0)","v":0},null,"FERRARI",{"$f":"SUM(G8:G10)","v":0},{"$f":"IF(J6=\"\",0,(RANK(J6,$J$5:$J$14)))+COUNTIF(J$5:J6,J6)-1","v":2},{"$f":"IF(J6=0,0,J6+France!L6)","v":0}]
[null,null,null,null,null,null,{"$f":"IFERROR(CHOOSE(D7,25,18,15,12,10,8,6,4,2,1)+(F7=1),\"\")","v":""},null,"RED BULL",{"$f":"SUM(G11:G13)","v":0},{"$f":"IF(J7=\"\",0,(RANK(J7,$J$5:$J$14)))+COUNTIF(J$5:J7,J7)-1","v":3},{"$f":"IF(J7=0,0,J7+France!L7)","v":0}]
["VETTEL Sebastian","FERRARI",null,null,null,null,{"$f":"IFERROR(CHOOSE(D8,25,18,15,12,10,8,6,4,2,1)+(F8=1),0)","v":0},null,"RACING POINT",{"$f":"SUM(G14:G16)","v":0},{"$f":"IF(J8=\"\",0,(RANK(J8,$J$5:$J$14)))+COUNTIF(J$5:J8,J8)-1","v":4},{"$f":"IF(J8=0,0,J8+France!L8)","v":0}]
{"$rows_left_out":27}
{"sheet":"GB","index":14,"n_rows":34,"n_cols":12,"rows_kept":34,"cut":false,"hidden":false,"merged":[[0,0,1,14],[2,1,3,1],[2,2,3,2],[2,3,3,3],[2,5,3,5],[2,6,3,6],[2,8,2,10],[2,4,3,4],[4,1,6,1],[4,2,6,2],[7,1,9,1],[7,2,9,2],[10,1,12,1],[10,2,12,2],[13,1,15,1],[13,2,15,2],[16,1,18,1],[16,2,18,2],[19,1,21,1],[19,2,21,2],[31,1,33,1],[31,2,33,2],[22,1,24,1],[22,2,24,2],[25,1,27,1],[25,2,27,2],[28,1,30,1],[28,2,30,2]]}
["ANGLETERRE - 17 MARS 2019"]
[]
["PILOTES","ECURIES","VOITURES","Finish","Pôle","Pt tour","Points",null,"CLASSEMENT"]
[null,null,null,null,null,null,null,{"$f":"IF(G4=\"\",\"\",(RANK(G4,G4:G23)))","v":""},"ÉCURIES","POINTS","RANG","TOTAL"]
["HAMILTON Lewis","MERCEDES",null,null,null,null,{"$f":"IFERROR(CHOOSE(D5,25,18,15,12,10,8,6,4,2,1)+(F5=1),0)","v":0},null,"MERCEDES",{"$f":"SUM(G5:G7)","v":0},{"$f":"IF(J5=\"\",0,(RANK(J5,$J$5:$J$14)))+COUNTIF(J$5:J5,J5)-1","v":1},{"$f":"IF(J5=0,0,J5+Autriche!L5)","v":0}]
["BOTTAS Valterri",null,null,null,null,null,{"$f":"IFERROR(CHOOSE(D6,25,18,15,12,10,8,6,4,2,1)+(F6=1),0)","v":0},null,"FERRARI",{"$f":"SUM(G8:G10)","v":0},{"$f":"IF(J6=\"\",0,(RANK(J6,$J$5:$J$14)))+COUNTIF(J$5:J6,J6)-1","v":2},{"$f":"IF(J6=0,0,J6+Autriche!L6)","v":0}]
[null,null,null,null,null,null,{"$f":"IFERROR(CHOOSE(D7,25,18,15,12,10,8,6,4,2,1)+(F7=1),\"\")","v":""},null,"RED BULL",{"$f":"SUM(G11:G13)","v":0},{"$f":"IF(J7=\"\",0,(RANK(J7,$J$5:$J$14)))+COUNTIF(J$5:J7,J7)-1","v":3},{"$f":"IF(J7=0,0,J7+Autriche!L7)","v":0}]
["VETTEL Sebastian","FERRARI",null,null,null,null,{"$f":"IFERROR(CHOOSE(D8,25,18,15,12,10,8,6,4,2,1)+(F8=1),0)","v":0},null,"RACING POINT",{"$f":"SUM(G14:G16)","v":0},{"$f":"IF(J8=\"\",0,(RANK(J8,$J$5:$J$14)))+COUNTIF(J$5:J8,J8)-1","v":4},{"$f":"IF(J8=0,0,J8+Autriche!L8)","v":0}]
{"$rows_left_out":27}
{"sheet":"Hongrie","index":15,"n_rows":34,"n_cols":12,"rows_kept":34,"cut":false,"hidden":false,"merged":[[0,0,1,14],[2,1,3,1],[2,2,3,2],[2,3,3,3],[2,5,3,5],[2,6,3,6],[2,8,2,10],[2,4,3,4],[4,1,6,1],[4,2,6,2],[7,1,9,1],[7,2,9,2],[10,1,12,1],[10,2,12,2],[13,1,15,1],[13,2,15,2],[16,1,18,1],[16,2,18,2],[19,1,21,1],[19,2,21,2],[31,1,33,1],[31,2,33,2],[22,1,24,1],[22,2,24,2],[25,1,27,1],[25,2,27,2],[28,1,30,1],[28,2,30,2]]}
["HONGRIE - 14 AOUT 2019"]
[]
["PILOTES","ECURIES","VOITURES","Finish","Pôle","Pt tour","Points",null,"CLASSEMENT"]
[null,null,null,null,null,null,null,{"$f":"IF(G4=\"\",\"\",(RANK(G4,G4:G23)))","v":""},"ÉCURIES","POINTS","RANG","TOTAL"]
["HAMILTON Lewis","MERCEDES",null,1,null,null,{"$f":"IFERROR(CHOOSE(D5,25,18,15,12,10,8,6,4,2,1)+(F5=1),0)","v":25},null,"MERCEDES",{"$f":"SUM(G5:G7)","v":25},{"$f":"IF(J5=\"\",0,(RANK(J5,$J$5:$J$14)))+COUNTIF(J$5:J5,J5)-1","v":1},{"$f":"IF(J5=0,0,J5+#REF!)","v":{"$error":"#REF!"}}]
["BOTTAS Valterri",null,null,null,null,null,{"$f":"IFERROR(CHOOSE(D6,25,18,15,12,10,8,6,4,2,1)+(F6=1),0)","v":0},null,"FERRARI",{"$f":"SUM(G8:G10)","v":0},{"$f":"IF(J6=\"\",0,(RANK(J6,$J$5:$J$14)))+COUNTIF(J$5:J6,J6)-1","v":2},{"$f":"IF(J6=0,0,J6+#REF!)","v":0}]
[null,null,null,null,null,null,{"$f":"IFERROR(CHOOSE(D7,25,18,15,12,10,8,6,4,2,1)+(F7=1),\"\")","v":""},null,"RED BULL",{"$f":"SUM(G11:G13)","v":0},{"$f":"IF(J7=\"\",0,(RANK(J7,$J$5:$J$14)))+COUNTIF(J$5:J7,J7)-1","v":3},{"$f":"IF(J7=0,0,J7+#REF!)","v":0}]
["VETTEL Sebastian","FERRARI",null,null,null,null,{"$f":"IFERROR(CHOOSE(D8,25,18,15,12,10,8,6,4,2,1)+(F8=1),0)","v":0},null,"RACING POINT",{"$f":"SUM(G14:G16)","v":0},{"$f":"IF(J8=\"\",0,(RANK(J8,$J$5:$J$14)))+COUNTIF(J$5:J8,J8)-1","v":4},{"$f":"IF(J8=0,0,J8+#REF!)","v":0}]
{"$rows_left_out":26}