{"text_format":"1","workbook":"xlsx","n_sheets":9,"sheets":["Feuil1","Album Photos","Champions","Écuries","Pilotes","Melbourne","Bahrein","Chine","Azerbaïdjan"],"not_rendered":{"charts":0,"images":46,"macros":1,"external_links":13,"defined_names":7,"comments":0,"pivot_tables":0},"unopened":[],"bounds":{"document_bytes":16777216,"sheet_cells":100000,"rows_first":2000,"rows_last":500,"rows_between":2000,"halvings":0,"cell_chars":16384,"cell_head_chars":4096},"cells_cut":0,"cells_raw":0,"read":"whole","date_system":"1900"}

{"sheet":"Feuil1","index":0,"n_rows":41,"n_cols":3,"rows_kept":41,"cut":false,"hidden":false,"merged":[[31,2,34,5],[35,2,38,5],[39,2,42,5],[1,1,1,5],[2,2,2,5],[3,2,6,5],[7,2,10,5],[11,2,14,5],[15,2,18,5],[19,2,22,5],[23,2,26,5],[27,2,30,5]]}
[]
[null,"Photos F1"]
[null,"Noms","Photos"]
[]
[null,"Mercedes"]
[]
[]
[]
[null,"Ferrari"]
[]
[]
[]
[null,"Red Bull"]
[]
[]
[]
[null,"Racing Point"]
[]
[]
[]
[null,"Williams"]
[]
[]
[]
[null,"Renault"]
[]
[]
[]
[null,"Toro Rosso"]
[]
[]
[]
[null,"Hass"]
[]
[]
[]
[null,"Mac Laren"]
[]
[]
[]
[null,"Alfa Roméo"]

{"sheet":"Album Photos","index":1,"n_rows":23,"n_cols":4,"rows_kept":23,"cut":false,"hidden":false,"merged":[[1,5,1,6]]}
[]
[null,"Photos Pilotes"]
[null,"Noms",null,"Photos"]
[null,"Lewis HAMILTON"]
[null,"Valterii BOTTAS"]
[null,"Charles LECLERC"]
[null,"Sebastian VETTEL"]
[null,"Max VERSTAPPEN"]
[null,"Alexander ALBON"]
[null,"Sergio PEREZ"]
[null,"Lance STROLL"]
[null,"George RUSSEL"]
[null,"Nicolas LATIFI"]
[null,"Daniel RICCIARDO"]
[null,"Nico HULKENBERG"]
[null,"Daniil KVYAT"]
[null,"Pierre GASLY"]
[null,"Romain GROSJEAN"]
[null,"Kevin MAGNUSSEN"]
[null,"Lando NORRIS"]
[null,"Carlos SAINZ"]
[null,"Kimi RAÏKKONEN"]
[null,"Antonio GIOVANIZZI"]

{"sheet":"Champions","index":2,"n_rows":22,"n_cols":10,"rows_kept":22,"cut":false,"hidden":false,"merged":[[21,1,25,3],[18,5,22,7],[21,9,25,11],[19,1,19,3],[20,1,20,3],[19,9,19,11],[20,9,20,11],[1,2,1,10],[14,2,14,10],[16,5,16,7],[17,5,17,7],[3,5,3,7],[4,5,4,7],[6,1,6,3],[7,1,7,3],[6,9,6,11],[7,9,7,11],[8,9,12,11],[8,1,12,3],[5,5,8,7]]}
[]
[null,null,"CHAMPIONNAT PILOTES 2019"]
[]
[null,null,null,null,null,"CHAMPION 2019"]
[null,null,null,null,null,{"$f":"IF(Pilotes!G5=1,Pilotes!B5,\"\")","v":"Lewis HAMILTON"}]
[null,null,null,null,null,{"$f":"MATCH(F5,'Album Photos'!$B$1:$B$23,0)","v":4}]
[null,"DEUXIÈME",null,null,null,null,null,null,null,"TROIXIÈME"]
[null,{"$f":"IF(Pilotes!G6=2,Pilotes!B6,\"\")","v":"Valterii BOTTAS"},null,null,null,null,null,null,null,{"$f":"IF(Pilotes!G7=3,Pilotes!B7,\"\")","v":"Sebastian VETTEL"}]
[null,{"$f":"MATCH(B8,'Album Photos'!$B$1:$B$23,0)","v":5},null,null,null,null,null,null,null,{"$f":"MATCH(J8,'Album Photos'!$B$1:$B$23,0)","v":7}]
[]
[]
[]
[]
[]
[null,null,"CHAMPIONNAT CONSTRUCTEURS 2019"]
[]
[null,null,null,null,null,"CHAMPION 2019"]
[null,null,null,null,null,{"$f":"IF(Écuries!F4=1,Écuries!B4,\"\")","v":{"$error":"#REF!"}}]
[null,null,null,null,null,{"$f":"MATCH(F18,'Album Photos'!$F$1:$F$13,0)","v":{"$error":"#REF!"}}]
[null,"DEUXIÈME",null,null,null,null,null,null,null,"TROIXIÈME"]
[null,{"$f":"IF(Écuries!F5=2,Écuries!B5,\"\")","v":{"$error":"#REF!"}},null,null,null,null,null,null,null,{"$f":"IF(Écuries!F6=3,Écuries!B6,\"\")","v":{"$error":"#REF!"}}]
[null,{"$f":"MATCH(B21,'Album Photos'!$F$1:$F$13,0)","v":{"$error":"#REF!"}},null,null,null,null,null,null,null,{"$f":"MATCH(J21,'Album Photos'!$F$1:$F$13,0)","v":{"$error":"#REF!"}}]

{"sheet":"Écuries","index":3,"n_rows":13,"n_cols":6,"rows_kept":13,"cut":false,"hidden":false,"merged":[[0,1,0,5]]}
[]
[]
[null,"ÉCURIES","POINTS","Écart/premier","Écart/précédent","RANG"]
[null,"MERCEDES",{"$f":"SUM(Melbourne!J5+Bahrein!J5+Chine!J5+Azerbaïdjan!J5+#REF!+#REF!+#REF!+#REF!+#REF!+#REF!+#REF!+#REF!+#REF!+#REF!+#REF!+#REF!+#REF!+#REF!+#REF!+#REF!+#REF!)","v":{"$error":"#REF!"}},null,null,{"$f":"IF(C4=\"\",0,(RANK(C4,$C$4:$C$13)))+COUNTIF(C$4:C4,C4)-1","v":{"$error":"#REF!"}}]
[null,"FERRARI",{"$f":"SUM(Melbourne:Azerbaïdjan!J6)","v":27},{"$f":"C5-C4","v":{"$error":"#REF!"}},{"$f":"C5-C4","v":{"$error":"#REF!"}},{"$f":"IF(C5=\"\",0,(RANK(C5,$C$4:$C$13)))+COUNTIF(C$4:C5,C5)-1","v":{"$error":"#REF!"}}]
[null,"RED BULL",{"$f":"SUM(Melbourne:Azerbaïdjan!J7)","v":18},{"$f":"C6-C4","v":{"$error":"#REF!"}},{"$f":"C6-C5","v":-9},{"$f":"IF(C6=\"\",0,(RANK(C6,$C$4:$C$13)))+COUNTIF(C$4:C6,C6)-1","v":{"$error":"#REF!"}}]
[null,"RACING POINT",{"$f":"SUM(Melbourne:Azerbaïdjan!J8)","v":10},{"$f":"C7-C4","v":{"$error":"#REF!"}},-8,{"$f":"IF(C7=\"\",0,(RANK(C7,$C$4:$C$13)))+COUNTIF(C$4:C7,C7)-1","v":{"$error":"#REF!"}}]
[null,"WILLIAMS",{"$f":"SUM(Melbourne:Azerbaïdjan!J9)","v":3},{"$f":"C8-C4","v":{"$error":"#REF!"}},-7,{"$f":"IF(C8=\"\",0,(RANK(C8,$C$4:$C$13)))+COUNTIF(C$4:C8,C8)-1","v":{"$error":"#REF!"}}]
[null,"ALFA ROMÉO",{"$f":"SUM(Melbourne:Azerbaïdjan!J14)","v":0},{"$f":"C9-C4","v":{"$error":"#REF!"}},-3,{"$f":"IF(C9=\"\",0,(RANK(C9,$C$4:$C$13)))+COUNTIF(C$4:C9,C9)-1","v":{"$error":"#REF!"}}]
[null,"Mc LAREN",{"$f":"SUM(Melbourne:Azerbaïdjan!J13)","v":0},{"$f":"C10-C4","v":{"$error":"#REF!"}},0,{"$f":"IF(C10=\"\",0,(RANK(C10,$C$4:$C$13)))+COUNTIF(C$4:C10,C10)-1","v":{"$error":"#REF!"}}]
[null,"HASS",{"$f":"SUM(Melbourne:Azerbaïdjan!J12)","v":0},{"$f":"C11-C4","v":{"$error":"#REF!"}},0,{"$f":"IF(C11=\"\",0,(RANK(C11,$C$4:$C$13)))+COUNTIF(C$4:C11,C11)-1","v":{"$error":"#REF!"}}]
[null,"TORO ROSSO",{"$f":"SUM(Melbourne:Azerbaïdjan!J11)","v":0},{"$f":"C12-C4","v":{"$error":"#REF!"}},0,{"$f":"IF(C12=\"\",0,(RANK(C12,$C$4:$C$13)))+COUNTIF(C$4:C12,C12)-1","v":{"$error":"#REF!"}}]
[null,"RENAULT",{"$f":"SUM(Melbourne:Azerbaïdjan!J10)","v":0},{"$f":"C13-C4","v":{"$error":"#REF!"}},0,{"$f":"IF(C13=\"\",0,(RANK(C13,$C$4:$C$13)))+COUNTIF(C$4:C13,C13)-1","v":{"$error":"#REF!"}}]

{"sheet":"Pilotes","index":4,"n_rows":24,"n_cols":18,"rows_kept":24,"cut":false,"hidden":false,"merged":[[0,0,0,7],[2,1,3,1],[2,2,3,2],[2,6,3,6],[2,3,3,3],[2,4,3,4],[2,5,3,5],[8,11,8,13],[7,11,7,13],[11,12,11,14],[12,12,12,14],[3,10,3,12],[4,10,4,12]]}
[]
[null,null,null,null,null,null,null,null,null,null,null,null,null,null,null,null,null,1]
[null,"PILOTES","Points","Écart-premier","Écart/précédent","Pôle Position","Place",1,null,null,null,null,null,null,null,null,null,2]
[null,null,{"$f":"IFERROR(SUM(Melbourne!G33,[1]Bahreïn!F33),\"\")","v":0},null,null,null,{"$f":"IF(C4=0,\"\",(RANK(C4,C1:C4)))","v":""},"Pos.Saison",null,null,null,null,null,null,null,null,null,3]
[null,"Lewis HAMILTON",{"$f":"SUM(Melbourne:Azerbaïdjan!G5)","v":25},null,null,{"$f":"SUM(Melbourne:Azerbaïdjan!E5)","v":1},{"$f":"IF(C5=\"\",0,(RANK(C5,$C$5:$C$24)))+COUNTIF(C$5:C5,C5)-1","v":1},{"$f":"IF(OR(Melbourne!E5=$H$3,Bahrein!E5=$H$3,Chine!E5=$H$3,Azerbaïdjan!E5=$H$3,I5),I5)","v":{"$error":"#REF!"}},{"$f":"IF(OR([2]Autriche!E5=$H$3,[3]GB!E5=$H$3,[4]Hongrie!E5=$H$3,[5]Belgique!E5=$H$3,[6]Italie!E5=$H$3,[7]Singapour!E5=$H$3,[8]Russie!E5=$H$3,[9]Japon!E5=$H$3,[10]Mexique!E5=$H$3,[11]USA!E5=$H$3,[12]Brésil!E5=$H$3,'[13]Abu Dabi'!E5=$H$3),SUM([2]Autriche!E5=$H$3,[3]GB!E5=$H$3,[4]Hongrie!E5=$H$3,[5]Belgique!E5=$H$3,[6]Italie!E5=$H$3,[7]Singapour!E5=$H$3,[8]Russie!E5=$H$3,[9]Japon!E5=$H$3,[10]Mexique!E5=$H$3,[11]USA!E5=$H$3,[12]Brésil!E5=$H$3,'[13]Abu Dabi'!E5=$H$3),\"\")","v":{"$error":"#REF!"}},null,null,null,null,null,null,null,null,4]
[null,"Valterii BOTTAS",{"$f":"SUM(Melbourne:Azerbaïdjan!G6)","v":18},{"$f":"C6-C5","v":-7},{"$f":"C5-C6","v":7},{"$f":"SUM(Melbourne:Azerbaïdjan!E9)","v":1},{"$f":"IF(C6=\"\",0,(RANK(C6,$C$5:$C$24)))+COUNTIF(C$5:C6,C6)-1","v":2},{"$f":"IF(OR(Melbourne!E6=$H$3,Bahrein!E6=$H$3,Chine!E6=$H$3,Azerbaïdjan!E6=$H$3,I6),I6)","v":{"$error":"#REF!"}},{"$f":"IF(OR([2]Autriche!E6=$H$3,[3]GB!E6=$H$3,[4]Hongrie!E6=$H$3,[5]Belgique!E6=$H$3,[6]Italie!E6=$H$3,[7]Singapour!E6=$H$3,[8]Russie!E6=$H$3,[9]Japon!E6=$H$3,[10]Mexique!E6=$H$3,[11]USA!E6=$H$3,[12]Brésil!E6=$H$3,'[13]Abu Dabi'!E6=$H$3),SUM([2]Autriche!E6=$H$3,[3]GB!E6=$H$3,[4]Hongrie!E6=$H$3,[5]Belgique!E6=$H$3,[6]Italie!E6=$H$3,[7]Singapour!E6=$H$3,[8]Russie!E6=$H$3,[9]Japon!E6=$H$3,[10]Mexique!E6=$H$3,[11]USA!E6=$H$3,[12]Brésil!E6=$H$3,'[13]Abu Dabi'!E6=$H$3),\"\")","v":{"$error":"#REF!"}},null,null,null,null,null,null,null,null,5]
[null,"Sebastian VETTEL",{"$f":"SUM(Melbourne:Azerbaïdjan!G8)","v":15},{"$f":"C7-C5","v":-10},{"$f":"C6-C7","v":3},{"$f":"SUM(Melbourne:Azerbaïdjan!E11)","v":0},{"$f":"IF(C7=\"\",0,(RANK(C7,$C$5:$C$24)))+COUNTIF(C$5:C7,C7)-1","v":3},{"$f":"IF(OR(Melbourne!E7=$H$3,Bahrein!E7=$H$3,Chine!E7=$H$3,Azerbaïdjan!E7=$H$3,I7),I7)","v":{"$error":"#REF!"}},{"$f":"IF(OR([2]Autriche!E7=$H$3,[3]GB!E7=$H$3,[4]Hongrie!E7=$H$3,[5]Belgique!E7=$H$3,[6]Italie!E7=$H$3,[7]Singapour!E7=$H$3,[8]Russie!E7=$H$3,[9]Japon!E7=$H$3,[10]Mexique!E7=$H$3,[11]USA!E7=$H$3,[12]Brésil!E7=$H$3,'[13]Abu Dabi'!E7=$H$3),SUM([2]Autriche!E7=$H$3,[3]GB!E7=$H$3,[4]Hongrie!E7=$H$3,[5]Belgique!E7=$H$3,[6]Italie!E7=$H$3,[7]Singapour!E7=$H$3,[8]Russie!E7=$H$3,[9]Japon!E7=$H$3,[10]Mexique!E7=$H$3,[11]USA!E7=$H$3,[12]Brésil!E7=$H$3,'[13]Abu Dabi'!E7=$H$3),\"\")","v":{"$error":"#REF!"}},null,null,null,null,null,null,null,null,6]
[null,"Max VERSTAPPEN",{"$f":"SUM(Melbourne:Azerbaïdjan!G11)","v":10},{"$f":"C8-C5","v":-15},{"$f":"C7-C8","v":5},{"$f":"SUM(Melbourne:Azerbaïdjan!E6)","v":1},{"$f":"IF(C8=\"\",0,(RANK(C8,$C$5:$C$24)))+COUNTIF(C$5:C8,C8)-1","v":4},{"$f":"IF(OR(Melbourne!E8=$H$3,Bahrein!E8=$H$3,Chine!E8=$H$3,Azerbaïdjan!E8=$H$3,I8),I8)","v":{"$error":"#REF!"}},{"$f":"IF(OR([2]Autriche!E8=$H$3,[3]GB!E8=$H$3,[4]Hongrie!E8=$H$3,[5]Belgique!E8=$H$3,[6]Italie!E8=$H$3,[7]Singapour!E8=$H$3,[8]Russie!E8=$H$3,[9]Japon!E8=$H$3,[10]Mexique!E8=$H$3,[11]USA!E8=$H$3,[12]Brésil!E8=$H$3,'[13]Abu Dabi'!E8=$H$3),SUM([2]Autriche!E8=$H$3,[3]GB!E8=$H$3,[4]Hongrie!E8=$H$3,[5]Belgique!E8=$H$3,[6]Italie!E8=$H$3,[7]Singapour!E8=$H$3,[8]Russie!E8=$H$3,[9]Japon!E8=$H$3,[10]Mexique!E8=$H$3,[11]USA!E8=$H$3,[12]Brésil!E8=$H$3,'[13]Abu Dabi'!E8=$H$3),\"\")","v":{"$error":"#REF!"}},null,null,"DEUXIÈME",null,null,null,null,null,7]
[null,"Pierre GASLY",{"$f":"SUM(Melbourne:Azerbaïdjan!G12)","v":8},{"$f":"C9-C5","v":-17},{"$f":"C8-C9","v":2},{"$f":"SUM(Melbourne:Azerbaïdjan!E8)","v":1},{"$f":"IF(C9=\"\",0,(RANK(C9,$C$5:$C$24)))+COUNTIF(C$5:C9,C9)-1","v":5},{"$f":"IF(OR(Melbourne!E9=$H$3,Bahrein!E9=$H$3,Chine!E9=$H$3,Azerbaïdjan!E9=$H$3,I9),I9)","v":{"$error":"#REF!"}},{"$f":"IF(OR([2]Autriche!E9=$H$3,[3]GB!E9=$H$3,[4]Hongrie!E9=$H$3,[5]Belgique!E9=$H$3,[6]Italie!E9=$H$3,[7]Singapour!E9=$H$3,[8]Russie!E9=$H$3,[9]Japon!E9=$H$3,[10]Mexique!E9=$H$3,[11]USA!E9=$H$3,[12]Brésil!E9=$H$3,'[13]Abu Dabi'!E9=$H$3),SUM([2]Autriche!E9=$H$3,[3]GB!E9=$H$3,[4]Hongrie!E9=$H$3,[5]Belgique!E9=$H$3,[6]Italie!E9=$H$3,[7]Singapour!E9=$H$3,[8]Russie!E9=$H$3,[9]Japon!E9=$H$3,[10]Mexique!E9=$H$3,[11]USA!E9=$H$3,[12]Brésil!E9=$H$3,'[13]Abu Dabi'!E9=$H$3),\"\")","v":{"$error":"#REF!"}},null,null,{"$f":"IF(G6=2,B6,\"\")","v":"Valterii BOTTAS"},null,null,null,null,null,8]
[null,"Sergio PEREZ",{"$f":"SUM(Melbourne:Azerbaïdjan!G14)","v":6},{"$f":"C10-C5","v":-19},{"$f":"C9-C10","v":2},{"$f":"SUM(Melbourne:Azerbaïdjan!E12)","v":0},{"$f":"IF(C10=\"\",0,(RANK(C10,$C$5:$C$24)))+COUNTIF(C$5:C10,C10)-1","v":6},{"$f":"IF(OR(Melbourne!E10=$H$3,Bahrein!E10=$H$3,Chine!E10=$H$3,Azerbaïdjan!E10=$H$3,I10),I10)","v":{"$error":"#REF!"}},{"$f":"IF(OR([2]Autriche!E10=$H$3,[3]GB!E10=$H$3,[4]Hongrie!E10=$H$3,[5]Belgique!E10=$H$3,[6]Italie!E10=$H$3,[7]Singapour!E10=$H$3,[8]Russie!E10=$H$3,[9]Japon!E10=$H$3,[10]Mexique!E10=$H$3,[11]USA!E10=$H$3,[12]Brésil!E10=$H$3,'[13]Abu Dabi'!E10=$H$3),SUM([2]Autriche!E10=$H$3,[3]GB!E10=$H$3,[4]Hongrie!E10=$H$3,[5]Belgique!E10=$H$3,[6]Italie!E10=$H$3,[7]Singapour!E10=$H$3,[8]Russie!E10=$H$3,[9]Japon!E10=$H$3,[10]Mexique!E10=$H$3,[11]USA!E10=$H$3,[12]Brésil!E10=$H$3,'[13]Abu Dabi'!E10=$H$3),\"\")","v":{"$error":"#REF!"}},null,null,null,null,null,null,null,null,9]
[null,"Lance STROLL",{"$f":"SUM(Melbourne:Azerbaïdjan!G15)","v":4},{"$f":"C11-C5","v":-21},{"$f":"C10-C11","v":2},{"$f":"SUM(Melbourne:Azerbaïdjan!E24)","v":0},{"$f":"IF(C11=\"\",0,(RANK(C11,$C$5:$C$24)))+COUNTIF(C$5:C11,C11)-1","v":7},{"$f":"IF(OR(Melbourne!E11=$H$3,Bahrein!E11=$H$3,Chine!E11=$H$3,Azerbaïdjan!E11=$H$3,I11),I11)","v":{"$error":"#REF!"}},{"$f":"IF(OR([2]Autriche!E11=$H$3,[3]GB!E11=$H$3,[4]Hongrie!E11=$H$3,[5]Belgique!E11=$H$3,[6]Italie!E11=$H$3,[7]Singapour!E11=$H$3,[8]Russie!E11=$H$3,[9]Japon!E11=$H$3,[10]Mexique!E11=$H$3,[11]USA!E11=$H$3,[12]Brésil!E11=$H$3,'[13]Abu Dabi'!E11=$H$3),SUM([2]Autriche!E11=$H$3,[3]GB!E11=$H$3,[4]Hongrie!E11=$H$3,[5]Belgique!E11=$H$3,[6]Italie!E11=$H$3,[7]Singapour!E11=$H$3,[8]Russie!E11=$H$3,[9]Japon!E11=$H$3,[10]Mexique!E11=$H$3,[11]USA!E11=$H$3,[12]Brésil!E11=$H$3,'[13]Abu Dabi'!E11=$H$3),\"\")","v":{"$error":"#REF!"}},null,null,null,null,null,null,null,null,10]
[null,"George RUSSEL",{"$f":"SUM(Melbourne:Azerbaïdjan!G17)","v":2},{"$f":"C12-C5","v":-23},2,{"$f":"SUM(Melbourne:Azerbaïdjan!E20)","v":0},{"$f":"IF(C12=\"\",0,(RANK(C12,$C$5:$C$24)))+COUNTIF(C$5:C12,C12)-1","v":8},{"$f":"IF(OR(Melbourne!E12=$H$3,Bahrein!E12=$H$3,Chine!E12=$H$3,Azerbaïdjan!E12=$H$3,I12),I12)","v":{"$error":"#REF!"}},{"$f":"IF(OR([2]Autriche!E12=$H$3,[3]GB!E12=$H$3,[4]Hongrie!E12=$H$3,[5]Belgique!E12=$H$3,[6]Italie!E12=$H$3,[7]Singapour!E12=$H$3,[8]Russie!E12=$H$3,[9]Japon!E12=$H$3,[10]Mexique!E12=$H$3,[11]USA!E12=$H$3,[12]Brésil!E12=$H$3,'[13]Abu Dabi'!E12=$H$3),SUM([2]Autriche!E12=$H$3,[3]GB!E12=$H$3,[4]Hongrie!E12=$H$3,[5]Belgique!E12=$H$3,[6]Italie!E12=$H$3,[7]Singapour!E12=$H$3,[8]Russie!E12=$H$3,[9]Japon!E12=$H$3,[10]Mexique!E12=$H$3,[11]USA!E12=$H$3,[12]Brésil!E12=$H$3,'[13]Abu Dabi'!E12=$H$3),\"\")","v":{"$error":"#REF!"}},null,null,null,"TROIXIÈME",null,null,null,null,11]
[null,"Robert KUBICA",{"$f":"SUM(Melbourne:Azerbaïdjan!G18)","v":1},{"$f":"C13-C5","v":-24},1,{"$f":"SUM(Melbourne:Azerbaïdjan!E29)","v":0},{"$f":"IF(C13=\"\",0,(RANK(C13,$C$5:$C$24)))+COUNTIF(C$5:C13,C13)-1","v":9},{"$f":"IF(OR(Melbourne!E13=$H$3,Bahrein!E13=$H$3,Chine!E13=$H$3,Azerbaïdjan!E13=$H$3,I13),I13)","v":{"$error":"#REF!"}},{"$f":"IF(OR([2]Autriche!E13=$H$3,[3]GB!E13=$H$3,[4]Hongrie!E13=$H$3,[5]Belgique!E13=$H$3,[6]Italie!E13=$H$3,[7]Singapour!E13=$H$3,[8]Russie!E13=$H$3,[9]Japon!E13=$H$3,[10]Mexique!E13=$H$3,[11]USA!E13=$H$3,[12]Brésil!E13=$H$3,'[13]Abu Dabi'!E13=$H$3),SUM([2]Autriche!E13=$H$3,[3]GB!E13=$H$3,[4]Hongrie!E13=$H$3,[5]Belgique!E13=$H$3,[6]Italie!E13=$H$3,[7]Singapour!E13=$H$3,[8]Russie!E13=$H$3,[9]Japon!E13=$H$3,[10]Mexique!E13=$H$3,[11]USA!E13=$H$3,[12]Brésil!E13=$H$3,'[13]Abu Dabi'!E13=$H$3),\"\")","v":{"$error":"#REF!"}},null,null,null,{"$f":"IF(G7=3,B7,\"\")","v":"Sebastian VETTEL"},null,null,null,null,12]
[null,"Kimi RAÏKKONEN",{"$f":"SUM(Melbourne:Azerbaïdjan!G32)","v":0},{"$f":"C14-C5","v":-25},1,{"$f":"SUM(Melbourne:Azerbaïdjan!E30)","v":1},{"$f":"IF(C14=\"\",0,(RANK(C14,$C$5:$C$24)))+COUNTIF(C$5:C14,C14)-1","v":10},{"$f":"IF(OR(Melbourne!E14=$H$3,Bahrein!E14=$H$3,Chine!E14=$H$3,Azerbaïdjan!E14=$H$3,I14),I14)","v":{"$error":"#REF!"}},{"$f":"IF(OR([2]Autriche!E14=$H$3,[3]GB!E14=$H$3,[4]Hongrie!E14=$H$3,[5]Belgique!E14=$H$3,[6]Italie!E14=$H$3,[7]Singapour!E14=$H$3,[8]Russie!E14=$H$3,[9]Japon!E14=$H$3,[10]Mexique!E14=$H$3,[11]USA!E14=$H$3,[12]Brésil!E14=$H$3,'[13]Abu Dabi'!E14=$H$3),SUM([2]Autriche!E14=$H$3,[3]GB!E14=$H$3,[4]Hongrie!E14=$H$3,[5]Belgique!E14=$H$3,[6]Italie!E14=$H$3,[7]Singapour!E14=$H$3,[8]Russie!E14=$H$3,[9]Japon!E14=$H$3,[10]Mexique!E14=$H$3,[11]USA!E14=$H$3,[12]Brésil!E14=$H$3,'[13]Abu Dabi'!E14=$H$3),\"\")","v":{"$error":"#REF!"}},null,null,null,null,null,null,null,null,13]
[null,"Charles LECLERC",{"$f":"SUM(Melbourne:Azerbaïdjan!G32)","v":0},{"$f":"C15-C5","v":-25},0,{"$f":"SUM(Melbourne:Azerbaïdjan!E21)","v":0},{"$f":"IF(C15=\"\",0,(RANK(C15,$C$5:$C$24)))+COUNTIF(C$5:C15,C15)-1","v":11},{"$f":"IF(OR(Melbourne!E15=$H$3,Bahrein!E15=$H$3,Chine!E15=$H$3,Azerbaïdjan!E15=$H$3,I15),I15)","v":{"$error":"#REF!"}},{"$f":"IF(OR([2]Autriche!E15=$H$3,[3]GB!E15=$H$3,[4]Hongrie!E15=$H$3,[5]Belgique!E15=$H$3,[6]Italie!E15=$H$3,[7]Singapour!E15=$H$3,[8]Russie!E15=$H$3,[9]Japon!E15=$H$3,[10]Mexique!E15=$H$3,[11]USA!E15=$H$3,[12]Brésil!E15=$H$3,'[13]Abu Dabi'!E15=$H$3),SUM([2]Autriche!E15=$H$3,[3]GB!E15=$H$3,[4]Hongrie!E15=$H$3,[5]Belgique!E15=$H$3,[6]Italie!E15=$H$3,[7]Singapour!E15=$H$3,[8]Russie!E15=$H$3,[9]Japon!E15=$H$3,[10]Mexique!E15=$H$3,[11]USA!E15=$H$3,[12]Brésil!E15=$H$3,'[13]Abu Dabi'!E15=$H$3),\"\")","v":{"$error":"#REF!"}},null,null,null,null,null,null,null,null,14]
[null,"Lando NORRIS",{"$f":"SUM(Melbourne:Azerbaïdjan!G29)","v":0},{"$f":"C16-C5","v":-25},0,{"$f":"SUM(Melbourne:Azerbaïdjan!E14)","v":0},{"$f":"IF(C16=\"\",0,(RANK(C16,$C$5:$C$24)))+COUNTIF(C$5:C16,C16)-1","v":12},{"$f":"IF(OR(Melbourne!E16=$H$3,Bahrein!E16=$H$3,Chine!E16=$H$3,Azerbaïdjan!E16=$H$3,I16),I16)","v":{"$error":"#REF!"}},{"$f":"IF(OR([2]Autriche!E16=$H$3,[3]GB!E16=$H$3,[4]Hongrie!E16=$H$3,[5]Belgique!E16=$H$3,[6]Italie!E16=$H$3,[7]Singapour!E16=$H$3,[8]Russie!E16=$H$3,[9]Japon!E16=$H$3,[10]Mexique!E16=$H$3,[11]USA!E16=$H$3,[12]Brésil!E16=$H$3,'[13]Abu Dabi'!E16=$H$3),SUM([2]Autriche!E16=$H$3,[3]GB!E16=$H$3,[4]Hongrie!E16=$H$3,[5]Belgique!E16=$H$3,[6]Italie!E16=$H$3,[7]Singapour!E16=$H$3,[8]Russie!E16=$H$3,[9]Japon!E16=$H$3,[10]Mexique!E16=$H$3,[11]USA!E16=$H$3,[12]Brésil!E16=$H$3,'[13]Abu Dabi'!E16=$H$3),\"\")","v":{"$error":"#REF!"}},null,null,null,null,null,null,null,null,15]
[null,"Romain GROSJEAN",{"$f":"SUM(Melbourne:Azerbaïdjan!G26)","v":0},{"$f":"C17-C5","v":-25},0,{"$f":"SUM(Melbourne:Azerbaïdjan!E15)","v":0},{"$f":"IF(C17=\"\",0,(RANK(C17,$C$5:$C$24)))+COUNTIF(C$5:C17,C17)-1","v":13},{"$f":"IF(OR(Melbourne!E17=$H$3,Bahrein!E17=$H$3,Chine!E17=$H$3,Azerbaïdjan!E17=$H$3,I17),I17)","v":{"$error":"#REF!"}},{"$f":"IF(OR([2]Autriche!E17=$H$3,[3]GB!E17=$H$3,[4]Hongrie!E17=$H$3,[5]Belgique!E17=$H$3,[6]Italie!E17=$H$3,[7]Singapour!E17=$H$3,[8]Russie!E17=$H$3,[9]Japon!E17=$H$3,[10]Mexique!E17=$H$3,[11]USA!E17=$H$3,[12]Brésil!E17=$H$3,'[13]Abu Dabi'!E17=$H$3),SUM([2]Autriche!E17=$H$3,[3]GB!E17=$H$3,[4]Hongrie!E17=$H$3,[5]Belgique!E17=$H$3,[6]Italie!E17=$H$3,[7]Singapour!E17=$H$3,[8]Russie!E17=$H$3,[9]Japon!E17=$H$3,[10]Mexique!E17=$H$3,[11]USA!E17=$H$3,[12]Brésil!E17=$H$3,'[13]Abu Dabi'!E17=$H$3),\"\")","v":{"$error":"#REF!"}},null,null,null,null,null,null,null,null,16]
[null,"Daniil KVYAT",{"$f":"SUM(Melbourne:Azerbaïdjan!G23)","v":0},{"$f":"C18-C5","v":-25},0,{"$f":"SUM(Melbourne:Azerbaïdjan!E23)","v":0},{"$f":"IF(C18=\"\",0,(RANK(C18,$C$5:$C$24)))+COUNTIF(C$5:C18,C18)-1","v":14},{"$f":"IF(OR(Melbourne!E18=$H$3,Bahrein!E18=$H$3,Chine!E18=$H$3,Azerbaïdjan!E18=$H$3,I18),I18)","v":{"$error":"#REF!"}},{"$f":"IF(OR([2]Autriche!E18=$H$3,[3]GB!E18=$H$3,[4]Hongrie!E18=$H$3,[5]Belgique!E18=$H$3,[6]Italie!E18=$H$3,[7]Singapour!E18=$H$3,[8]Russie!E18=$H$3,[9]Japon!E18=$H$3,[10]Mexique!E18=$H$3,[11]USA!E18=$H$3,[12]Brésil!E18=$H$3,'[13]Abu Dabi'!E18=$H$3),SUM([2]Autriche!E18=$H$3,[3]GB!E18=$H$3,[4]Hongrie!E18=$H$3,[5]Belgique!E18=$H$3,[6]Italie!E18=$H$3,[7]Singapour!E18=$H$3,[8]Russie!E18=$H$3,[9]Japon!E18=$H$3,[10]Mexique!E18=$H$3,[11]USA!E18=$H$3,[12]Brésil!E18=$H$3,'[13]Abu Dabi'!E18=$H$3),\"\")","v":{"$error":"#REF!"}},null,null,null,null,null,null,null,null,17]
[null,"Daniel RICCIARDO",{"$f":"SUM(Melbourne:Azerbaïdjan!G20)","v":0},{"$f":"C19-C5","v":-25},0,{"$f":"SUM(Melbourne:Azerbaïdjan!E27)","v":0},{"$f":"IF(C19=\"\",0,(RANK(C19,$C$5:$C$24)))+COUNTIF(C$5:C19,C19)-1","v":15},{"$f":"IF(OR(Melbourne!E19=$H$3,Bahrein!E19=$H$3,Chine!E19=$H$3,Azerbaïdjan!E19=$H$3,I19),I19)","v":{"$error":"#REF!"}},{"$f":"IF(OR([2]Autriche!E19=$H$3,[3]GB!E19=$H$3,[4]Hongrie!E19=$H$3,[5]Belgique!E19=$H$3,[6]Italie!E19=$H$3,[7]Singapour!E19=$H$3,[8]Russie!E19=$H$3,[9]Japon!E19=$H$3,[10]Mexique!E19=$H$3,[11]USA!E19=$H$3,[12]Brésil!E19=$H$3,'[13]Abu Dabi'!E19=$H$3),SUM([2]Autriche!E19=$H$3,[3]GB!E19=$H$3,[4]Hongrie!E19=$H$3,[5]Belgique!E19=$H$3,[6]Italie!E19=$H$3,[7]Singapour!E19=$H$3,[8]Russie!E19=$H$3,[9]Japon!E19=$H$3,[10]Mexique!E19=$H$3,[11]USA!E19=$H$3,[12]Brésil!E19=$H$3,'[13]Abu Dabi'!E19=$H$3),\"\")","v":{"$error":"#REF!"}},null,null,null,null,null,null,null,null,18]
[null,"Antonio GIOVANIZZI",{"$f":"SUM(Melbourne:Azerbaïdjan!G33)","v":0},{"$f":"C20-C5","v":-25},0,{"$f":"SUM(Melbourne:Azerbaïdjan!E33)","v":0},{"$f":"IF(C20=\"\",0,(RANK(C20,$C$5:$C$24)))+COUNTIF(C$5:C20,C20)-1","v":16},{"$f":"IF(OR(Melbourne!E20=$H$3,Bahrein!E20=$H$3,Chine!E20=$H$3,Azerbaïdjan!E20=$H$3,I20),I20)","v":{"$error":"#REF!"}},{"$f":"IF(OR([2]Autriche!E20=$H$3,[3]GB!E20=$H$3,[4]Hongrie!E20=$H$3,[5]Belgique!E20=$H$3,[6]Italie!E20=$H$3,[7]Singapour!E20=$H$3,[8]Russie!E20=$H$3,[9]Japon!E20=$H$3,[10]Mexique!E20=$H$3,[11]USA!E20=$H$3,[12]Brésil!E20=$H$3,'[13]Abu Dabi'!E20=$H$3),SUM([2]Autriche!E20=$H$3,[3]GB!E20=$H$3,[4]Hongrie!E20=$H$3,[5]Belgique!E20=$H$3,[6]Italie!E20=$H$3,[7]Singapour!E20=$H$3,[8]Russie!E20=$H$3,[9]Japon!E20=$H$3,[10]Mexique!E20=$H$3,[11]USA!E20=$H$3,[12]Brésil!E20=$H$3,'[13]Abu Dabi'!E20=$H$3),\"\")","v":{"$error":"#REF!"}},null,null,null,null,null,null,null,null,19]
[null,"Kevin MAGNUSSEN",{"$f":"SUM(Melbourne:Azerbaïdjan!G27)","v":0},{"$f":"C21-C5","v":-25},0,{"$f":"SUM(Melbourne:Azerbaïdjan!E32)","v":0},{"$f":"IF(C21=\"\",0,(RANK(C21,$C$5:$C$24)))+COUNTIF(C$5:C21,C21)-1","v":17},{"$f":"IF(OR(Melbourne!E21=$H$3,Bahrein!E21=$H$3,Chine!E21=$H$3,Azerbaïdjan!E21=$H$3,I21),I21)","v":{"$error":"#REF!"}},{"$f":"IF(OR([2]Autriche!E21=$H$3,[3]GB!E21=$H$3,[4]Hongrie!E21=$H$3,[5]Belgique!E21=$H$3,[6]Italie!E21=$H$3,[7]Singapour!E21=$H$3,[8]Russie!E21=$H$3,[9]Japon!E21=$H$3,[10]Mexique!E21=$H$3,[11]USA!E21=$H$3,[12]Brésil!E21=$H$3,'[13]Abu Dabi'!E21=$H$3),SUM([2]Autriche!E21=$H$3,[3]GB!E21=$H$3,[4]Hongrie!E21=$H$3,[5]Belgique!E21=$H$3,[6]Italie!E21=$H$3,[7]Singapour!E21=$H$3,[8]Russie!E21=$H$3,[9]Japon!E21=$H$3,[10]Mexique!E21=$H$3,[11]USA!E21=$H$3,[12]Brésil!E21=$H$3,'[13]Abu Dabi'!E21=$H$3),\"\")","v":{"$error":"#REF!"}},null,null,null,null,null,null,null,null,20]
[null,"Nico HULKENBERG",{"$f":"SUM(Melbourne:Azerbaïdjan!G21)","v":0},{"$f":"C22-C5","v":-25},0,{"$f":"SUM(Melbourne:Azerbaïdjan!E26)","v":0},{"$f":"IF(C22=\"\",0,(RANK(C22,$C$5:$C$24)))+COUNTIF(C$5:C22,C22)-1","v":18},{"$f":"IF(OR(Melbourne!E22=$H$3,Bahrein!E22=$H$3,Chine!E22=$H$3,Azerbaïdjan!E22=$H$3,I22),I22)","v":{"$error":"#REF!"}},{"$f":"IF(OR([2]Autriche!E22=$H$3,[3]GB!E22=$H$3,[4]Hongrie!E22=$H$3,[5]Belgique!E22=$H$3,[6]Italie!E22=$H$3,[7]Singapour!E22=$H$3,[8]Russie!E22=$H$3,[9]Japon!E22=$H$3,[10]Mexique!E22=$H$3,[11]USA!E22=$H$3,[12]Brésil!E22=$H$3,'[13]Abu Dabi'!E22=$H$3),SUM([2]Autriche!E22=$H$3,[3]GB!E22=$H$3,[4]Hongrie!E22=$H$3,[5]Belgique!E22=$H$3,[6]Italie!E22=$H$3,[7]Singapour!E22=$H$3,[8]Russie!E22=$H$3,[9]Japon!E22=$H$3,[10]Mexique!E22=$H$3,[11]USA!E22=$H$3,[12]Brésil!E22=$H$3,'[13]Abu Dabi'!E22=$H$3),\"\")","v":{"$error":"#REF!"}},null,null,null,null,null,null,null,null,"OUT"]
[null,"Alexander ALBON",{"$f":"SUM(Melbourne:Azerbaïdjan!G24)","v":0},{"$f":"C23-C5","v":-25},{"$f":"C22-C23","v":0},{"$f":"SUM(Melbourne:Azerbaïdjan!E18)","v":0},{"$f":"IF(C23=\"\",0,(RANK(C23,$C$5:$C$24)))+COUNTIF(C$5:C23,C23)-1","v":19},{"$f":"IF(OR(Melbourne!E23=$H$3,Bahrein!E23=$H$3,Chine!E23=$H$3,Azerbaïdjan!E23=$H$3,I23),I23)","v":{"$error":"#REF!"}},{"$f":"IF(OR([2]Autriche!E23=$H$3,[3]GB!E23=$H$3,[4]Hongrie!E23=$H$3,[5]Belgique!E23=$H$3,[6]Italie!E23=$H$3,[7]Singapour!E23=$H$3,[8]Russie!E23=$H$3,[9]Japon!E23=$H$3,[10]Mexique!E23=$H$3,[11]USA!E23=$H$3,[12]Brésil!E23=$H$3,'[13]Abu Dabi'!E23=$H$3),SUM([2]Autriche!E23=$H$3,[3]GB!E23=$H$3,[4]Hongrie!E23=$H$3,[5]Belgique!E23=$H$3,[6]Italie!E23=$H$3,[7]Singapour!E23=$H$3,[8]Russie!E23=$H$3,[9]Japon!E23=$H$3,[10]Mexique!E23=$H$3,[11]USA!E23=$H$3,[12]Brésil!E23=$H$3,'[13]Abu Dabi'!E23=$H$3),\"\")","v":{"$error":"#REF!"}}]
[null,"Carlos SAINZ",{"$f":"SUM(Melbourne:Azerbaïdjan!G30)","v":0},{"$f":"C24-C5","v":-25},0,{"$f":"SUM(Melbourne:Azerbaïdjan!E17)","v":0},{"$f":"IF(C24=\"\",0,(RANK(C24,$C$5:$C$24)))+COUNTIF(C$5:C24,C24)-1","v":20},{"$f":"IF(OR(Melbourne!E24=$H$3,Bahrein!E24=$H$3,Chine!E24=$H$3,Azerbaïdjan!E24=$H$3,I24),I24)","v":{"$error":"#REF!"}},{"$f":"IF(OR([2]Autriche!E24=$H$3,[3]GB!E24=$H$3,[4]Hongrie!E24=$H$3,[5]Belgique!E24=$H$3,[6]Italie!E24=$H$3,[7]Singapour!E24=$H$3,[8]Russie!E24=$H$3,[9]Japon!E24=$H$3,[10]Mexique!E24=$H$3,[11]USA!E24=$H$3,[12]Brésil!E24=$H$3,'[13]Abu Dabi'!E24=$H$3),SUM([2]Autriche!E24=$H$3,[3]GB!E24=$H$3,[4]Hongrie!E24=$H$3,[5]Belgique!E24=$H$3,[6]Italie!E24=$H$3,[7]Singapour!E24=$H$3,[8]Russie!E24=$H$3,[9]Japon!E24=$H$3,[10]Mexique!E24=$H$3,[11]USA!E24=$H$3,[12]Brésil!E24=$H$3,'[13]Abu Dabi'!E24=$H$3),\"\")","v":{"$error":"#REF!"}}]

{"sheet":"Melbourne","index":5,"n_rows":34,"n_cols":11,"rows_kept":34,"cut":false,"hidden":false,"merged":[[31,1,33,1],[31,2,33,2],[13,1,15,1],[13,2,15,2],[16,1,18,1],[16,2,18,2],[19,1,21,1],[19,2,21,2],[28,1,30,1],[28,2,30,2],[25,2,27,2],[22,1,24,1],[22,2,24,2],[25,1,27,1],[7,1,9,1],[7,2,9,2],[10,1,12,1],[10,2,12,2],[0,0,1,14],[4,1,6,1],[4,2,6,2],[2,0,3,0],[2,8,2,10],[2,1,3,1],[2,2,3,2],[2,3,3,3],[2,5,3,5],[2,6,3,6],[2,4,3,4]]}
["AUSTRALIE - 17 MARS 2019"]
[]
["PILOTES","ECURIES","VOITURES","Finish","Pôle","Pt tour","Points",null,"CLASSEMENT"]
[null,null,null,null,null,null,null,null,"ÉCURIES","POINTS","RANG"]
["HAMILTON Lewis","MERCEDES",null,1,1,null,{"$f":"IFERROR(CHOOSE(D5,25,18,15,12,10,8,6,4,2,1)+(F5=1),0)","v":25},null,"MERCEDES",{"$f":"SUM(G5:G7)","v":43},{"$f":"IF(J5=\"\",0,(RANK(J5,$J$5:$J$14)))+COUNTIF(J$5:J5,J5)-1","v":1}]
["BOTTAS Valterri",null,null,2,null,null,{"$f":"IFERROR(CHOOSE(D6,25,18,15,12,10,8,6,4,2,1)+(F6=1),0)","v":18},null,"FERRARI",{"$f":"SUM(G8:G10)","v":27},{"$f":"IF(J6=\"\",0,(RANK(J6,$J$5:$J$14)))+COUNTIF(J$5:J6,J6)-1","v":2}]
[null,null,null,null,null,null,{"$f":"IFERROR(CHOOSE(D7,25,18,15,12,10,8,6,4,2,1)+(F7=1),\"\")","v":""},null,"RED BULL",{"$f":"SUM(G11:G13)","v":18},{"$f":"IF(J7=\"\",0,(RANK(J7,$J$5:$J$14)))+COUNTIF(J$5:J7,J7)-1","v":3}]
["VETTEL Sebastian","FERRARI",null,3,null,null,{"$f":"IFERROR(CHOOSE(D8,25,18,15,12,10,8,6,4,2,1)+(F8=1),0)","v":15},null,"RACING POINT",{"$f":"SUM(G14:G16)","v":10},{"$f":"IF(J8=\"\",0,(RANK(J8,$J$5:$J$14)))+COUNTIF(J$5:J8,J8)-1","v":4}]
["LECLERC Charles",null,null,4,null,null,{"$f":"IFERROR(CHOOSE(D9,25,18,15,12,10,8,6,4,2,1)+(F9=1),0)","v":12},null,"WILLIAMS",{"$f":"SUM(G17:G19)","v":3},{"$f":"IF(J9=\"\",0,(RANK(J9,$J$5:$J$14)))+COUNTIF(J$5:J9,J9)-1","v":5}]
[null,null,null,null,null,null,{"$f":"IFERROR(CHOOSE(D10,25,18,15,12,10,8,6,4,2,1)+(F10=1),\"\")","v":""},null,"RENAULT",{"$f":"SUM(G20:G22)","v":0},{"$f":"IF(J10=\"\",0,(RANK(J10,$J$5:$J$14)))+COUNTIF(J$5:J10,J10)-1","v":6}]
["VERSTAPPEN Max","RED BULL",null,5,null,null,{"$f":"IFERROR(CHOOSE(D11,25,18,15,12,10,8,6,4,2,1)+(F11=1),0)","v":10},null,"TORO ROSSO",{"$f":"SUM(G23:G25)","v":0},{"$f":"IF(J11=\"\",0,(RANK(J11,$J$5:$J$14)))+COUNTIF(J$5:J11,J11)-1","v":7}]
["GASLY Pierre",null,null,6,null,null,{"$f":"IFERROR(CHOOSE(D12,25,18,15,12,10,8,6,4,2,1)+(F12=1),0)","v":8},null,"HAAS",{"$f":"SUM(G26:G28)","v":0},{"$f":"IF(J12=\"\",0,(RANK(J12,$J$5:$J$14)))+COUNTIF(J$5:J12,J12)-1","v":8}]
[null,null,null,null,null,null,{"$f":"IFERROR(CHOOSE(D13,25,18,15,12,10,8,6,4,2,1)+(F13=1),\"\")","v":""},null,"Mc LAREN",{"$f":"SUM(G29:G31)","v":0},{"$f":"IF(J13=\"\",0,(RANK(J13,$J$5:$J$14)))+COUNTIF(J$5:J13,J13)-1","v":9}]
["PEREZ Sergio","RACING\nPOINT",null,7,null,null,{"$f":"IFERROR(CHOOSE(D14,25,18,15,12,10,8,6,4,2,1)+(F14=1),0)","v":6},null,"ALFA ROMEO",{"$f":"SUM(G32:G34)","v":0},{"$f":"IF(J14=\"\",0,(RANK(J14,$J$5:$J$14)))+COUNTIF(J$5:J14,J14)-1","v":10}]
["STROLL Lance",null,null,8,null,null,{"$f":"IFERROR(CHOOSE(D15,25,18,15,12,10,8,6,4,2,1)+(F15=1),0)","v":4}]
[null,null,null,null,null,null,{"$f":"IFERROR(CHOOSE(D16,25,18,15,12,10,8,6,4,2,1)+(F16=1),\"\")","v":""}]
["RUSSELL George","WILLIAMS",null,9,null,null,{"$f":"IFERROR(CHOOSE(D17,25,18,15,12,10,8,6,4,2,1)+(F17=1),0)","v":2}]
["KUBICA Robert",null,null,10,null,null,{"$f":"IFERROR(CHOOSE(D18,25,18,15,12,10,8,6,4,2,1)+(F18=1),0)","v":1}]
[null,null,null,null,null,null,{"$f":"IFERROR(CHOOSE(D19,25,18,15,12,10,8,6,4,2,1)+(F19=1),\"\")","v":""}]
["RICCIARDO Daniel","RENAULT",null,11,null,null,{"$f":"IFERROR(CHOOSE(D20,25,18,15,12,10,8,6,4,2,1)+(F20=1),0)","v":0}]
["HULKENBERG Nico",null,null,12,null,null,{"$f":"IFERROR(CHOOSE(D21,25,18,15,12,10,8,6,4,2,1)+(F21=1),0)","v":0}]
[null,null,null,null,null,null,{"$f":"IFERROR(CHOOSE(D22,25,18,15,12,10,8,6,4,2,1)+(F22=1),\"\")","v":""}]
["KVYAT Daniil","TORO ROSSO",null,13,null,null,{"$f":"IFERROR(CHOOSE(D23,25,18,15,12,10,8,6,4,2,1)+(F23=1),0)","v":0}]
["ALBON Alexander",null,null,14,null,null,{"$f":"IFERROR(CHOOSE(D24,25,18,15,12,10,8,6,4,2,1)+(F24=1),0)","v":0}]
[null,null,null,null,null,null,{"$f":"IFERROR(CHOOSE(D25,25,18,15,12,10,8,6,4,2,1)+(F25=1),\"\")","v":""}]
["GROSJEAN Romain","HAAS",null,15,null,null,{"$f":"IFERROR(CHOOSE(D26,25,18,15,12,10,8,6,4,2,1)+(F26=1),0)","v":0}]
["MAGNUSSEN Kevin",null,null,16,null,null,{"$f":"IFERROR(CHOOSE(D27,25,18,15,12,10,8,6,4,2,1)+(F27=1),0)","v":0}]
[null,null,null,null,null,null,{"$f":"IFERROR(CHOOSE(D28,25,18,15,12,10,8,6,4,2,1)+(F28=1),\"\")","v":""}]
["NORRIS Lando","McLAREN",null,17,null,null,{"$f":"IFERROR(CHOOSE(D29,25,18,15,12,10,8,6,4,2,1)+(F29=1),0)","v":0}]
["SAINZ.Jr Carlos",null,null,18,1,null,{"$f":"IFERROR(CHOOSE(D30,25,18,15,12,10,8,6,4,2,1)+(F30=1),0)","v":0}]
[null,null,null,null,null,null,{"$f":"IFERROR(CHOOSE(D31,25,18,15,12,10,8,6,4,2,1)+(F31=1),\"\")","v":""}]
["RAÏKKÖNEN Kimi","ALFA ROMEO",null,19,null,null,{"$f":"IFERROR(CHOOSE(D32,25,18,15,12,10,8,6,4,2,1)+(F32=1),0)","v":0}]
["GIOVANIZZI Antonio",null,null,20,null,null,{"$f":"IFERROR(CHOOSE(D33,25,18,15,12,10,8,6,4,2,1)+(F33=1),0)","v":0}]
[null,null,null,null,null,null,{"$f":"IFERROR(CHOOSE(D34,25,18,15,12,10,8,6,4,2,1)+(F34=1),\"\")","v":""}]

{"sheet":"Bahrein","index":6,"n_rows":33,"n_cols":12,"rows_kept":33,"cut":false,"hidden":false,"merged":[[31,1,33,1],[31,2,33,2],[22,1,24,1],[22,2,24,2],[25,1,27,1],[25,2,27,2],[28,1,30,1],[28,2,30,2],[13,1,15,1],[13,2,15,2],[16,1,18,1],[16,2,18,2],[19,1,21,1],[19,2,21,2],[4,1,6,1],[4,2,6,2],[7,1,9,1],[7,2,9,2],[10,1,12,1],[10,2,12,2],[0,0,1,14],[2,1,3,1],[2,2,3,2],[2,3,3,3],[2,5,3,5],[2,6,3,6],[2,8,2,10],[2,4,3,4]]}
["BAHREÏN - 31 MARS 2019"]
[]
["PILOTES","ECURIES","VOITURES","Finish","Pôle","Pt tour","Points",null,"CLASSEMENT"]
[null,null,null,null,null,null,null,{"$f":"IF(G4=\"\",\"\",(RANK(G4,G4:G23)))","v":""},"ÉCURIES","POINTS","RANG","TOTAL"]
["HAMILTON Lewis","MERCEDES",null,null,null,null,{"$f":"IFERROR(CHOOSE(D5,25,18,15,12,10,8,6,4,2,1)+(F5=1),0)","v":0},null,"MERCEDES",{"$f":"SUM(G5:G7)","v":0},{"$f":"IF(J5=\"\",0,(RANK(J5,$J$5:$J$14)))+COUNTIF(J$5:J5,J5)-1","v":1},{"$f":"IF(J5=0,0,J5+Melbourne!J5)","v":0}]
["BOTTAS Valterri",null,null,null,1,null,{"$f":"IFERROR(CHOOSE(D6,25,18,15,12,10,8,6,4,2,1)+(F6=1),0)","v":0},null,"FERRARI",{"$f":"SUM(G8:G10)","v":0},{"$f":"IF(J6=\"\",0,(RANK(J6,$J$5:$J$14)))+COUNTIF(J$5:J6,J6)-1","v":2},{"$f":"IF(J6=0,0,J6+Melbourne!J6)","v":0}]
[null,null,null,null,null,null,null,null,"RED BULL",{"$f":"SUM(G11:G13)","v":0},{"$f":"IF(J7=\"\",0,(RANK(J7,$J$5:$J$14)))+COUNTIF(J$5:J7,J7)-1","v":3},{"$f":"IF(J7=0,0,J7+Melbourne!J7)","v":0}]
["VETTEL Sebastian","FERRARI",null,null,null,null,{"$f":"IFERROR(CHOOSE(D8,25,18,15,12,10,8,6,4,2,1)+(F8=1),0)","v":0},null,"RACING POINT",{"$f":"SUM(G14:G16)","v":0},{"$f":"IF(J8=\"\",0,(RANK(J8,$J$5:$J$14)))+COUNTIF(J$5:J8,J8)-1","v":4},{"$f":"IF(J8=0,0,J8+Melbourne!J8)","v":0}]
["LECLERC Charles",null,null,null,null,null,{"$f":"IFERROR(CHOOSE(D9,25,18,15,12,10,8,6,4,2,1)+(F9=1),0)","v":0},null,"WILLIAMS",{"$f":"SUM(G17:G19)","v":0},{"$f":"IF(J9=\"\",0,(RANK(J9,$J$5:$J$14)))+COUNTIF(J$5:J9,J9)-1","v":5},{"$f":"IF(J9=0,0,J9+Melbourne!J9)","v":0}]
[null,null,null,null,null,null,{"$f":"IFERROR(CHOOSE(D10,25,18,15,12,10,8,6,4,2,1)+(F10=1),\"\")","v":""},null,"RENAULT",{"$f":"SUM(G20:G22)","v":0},{"$f":"IF(J10=\"\",0,(RANK(J10,$J$5:$J$14)))+COUNTIF(J$5:J10,J10)-1","v":6},{"$f":"IF(J10=0,0,J10+Melbourne!J10)","v":0}]
["VERSTAPPEN Max","RED BULL",null,null,null,null,{"$f":"IFERROR(CHOOSE(D11,25,18,15,12,10,8,6,4,2,1)+(F11=1),0)","v":0},null,"TORO ROSSO",{"$f":"SUM(G23:G25)","v":0},{"$f":"IF(J11=\"\",0,(RANK(J11,$J$5:$J$14)))+COUNTIF(J$5:J11,J11)-1","v":7},{"$f":"IF(J11=0,0,J11+Melbourne!J11)","v":0}]
["GASLY Pierre",null,null,null,null,null,{"$f":"IFERROR(CHOOSE(D12,25,18,15,12,10,8,6,4,2,1)+(F12=1),0)","v":0},null,"HAAS",{"$f":"SUM(G26:G28)","v":0},{"$f":"IF(J12=\"\",0,(RANK(J12,$J$5:$J$14)))+COUNTIF(J$5:J12,J12)-1","v":8},{"$f":"IF(J12=0,0,J12+Melbourne!J12)","v":0}]
[null,null,null,null,null,null,null,null,"Mc LAREN",{"$f":"SUM(G29:G31)","v":0},{"$f":"IF(J13=\"\",0,(RANK(J13,$J$5:$J$14)))+COUNTIF(J$5:J13,J13)-1","v":9},{"$f":"IF(J13=0,0,J13+Melbourne!J13)","v":0}]
["PEREZ Sergio","RACING\nPOINT",null,null,null,null,{"$f":"IFERROR(CHOOSE(D14,25,18,15,12,10,8,6,4,2,1)+(F14=1),0)","v":0},null,"ALFA ROMEO",{"$f":"SUM(G32:G34)","v":0},{"$f":"IF(J14=\"\",0,(RANK(J14,$J$5:$J$14)))+COUNTIF(J$5:J14,J14)-1","v":10},{"$f":"IF(J14=0,0,J14+Melbourne!J14)","v":0}]
["STROLL Lance",null,null,null,null,null,{"$f":"IFERROR(CHOOSE(D15,25,18,15,12,10,8,6,4,2,1)+(F15=1),0)","v":0}]
[]
["RUSSELL George","WILLIAMS",null,null,null,null,{"$f":"IFERROR(CHOOSE(D17,25,18,15,12,10,8,6,4,2,1)+(F17=1),0)","v":0}]
["KUBICA Robert",null,null,null,null,null,{"$f":"IFERROR(CHOOSE(D18,25,18,15,12,10,8,6,4,2,1)+(F18=1),0)","v":0}]
[]
["RICCIARDO Daniel","RENAULT",null,null,null,null,{"$f":"IFERROR(CHOOSE(D20,25,18,15,12,10,8,6,4,2,1)+(F20=1),0)","v":0}]
["HULKENBERG Nico",null,null,null,null,null,{"$f":"IFERROR(CHOOSE(D21,25,18,15,12,10,8,6,4,2,1)+(F21=1),0)","v":0}]
[]
["KVYAT Daniil","TORO ROSSO",null,null,null,null,{"$f":"IFERROR(CHOOSE(D23,25,18,15,12,10,8,6,4,2,1)+(F23=1),0)","v":0}]
["ALBON Alexander",null,null,null,null,null,{"$f":"IFERROR(CHOOSE(D24,25,18,15,12,10,8,6,4,2,1)+(F24=1),0)","v":0}]
[]
["GROSJEAN Romain","HAAS",null,null,null,null,{"$f":"IFERROR(CHOOSE(D26,25,18,15,12,10,8,6,4,2,1)+(F26=1),0)","v":0}]
["MAGNUSSEN Kevin",null,null,null,null,null,{"$f":"IFERROR(CHOOSE(D27,25,18,15,12,10,8,6,4,2,1)+(F27=1),0)","v":0}]
[]
["NORRIS Lando","McLAREN",null,null,null,null,{"$f":"IFERROR(CHOOSE(D29,25,18,15,12,10,8,6,4,2,1)+(F29=1),0)","v":0}]
["SAINZ.Jr Carlos",null,null,null,null,null,{"$f":"IFERROR(CHOOSE(D30,25,18,15,12,10,8,6,4,2,1)+(F30=1),0)","v":0}]
[]
["RAÏKKÖNEN Kimi","ALFA ROMEO",null,null,null,null,{"$f":"IFERROR(CHOOSE(D32,25,18,15,12,10,8,6,4,2,1)+(F32=1),0)","v":0}]
["GIOVANIZZI Antonio",null,null,null,null,null,{"$f":"IFERROR(CHOOSE(D33,25,18,15,12,10,8,6,4,2,1)+(F33=1),0)","v":0}]

{"sheet":"Chine","index":7,"n_rows":34,"n_cols":12,"rows_kept":34,"cut":false,"hidden":false,"merged":[[31,1,33,1],[31,2,33,2],[22,1,24,1],[22,2,24,2],[25,1,27,1],[25,2,27,2],[28,1,30,1],[28,2,30,2],[13,1,15,1],[13,2,15,2],[16,1,18,1],[16,2,18,2],[19,1,21,1],[19,2,21,2],[4,1,6,1],[4,2,6,2],[7,1,9,1],[7,2,9,2],[10,1,12,1],[10,2,12,2],[0,0,1,14],[2,1,3,1],[2,2,3,2],[2,3,3,3],[2,5,3,5],[2,6,3,6],[2,8,2,10],[2,4,3,4]]}
["CHINE - 14 AVRIL 2019"]
[]
["PILOTES","ECURIES","VOITURES","Finish","Pôle","Pt tour","Points",null,"CLASSEMENT"]
[null,null,null,null,null,null,null,{"$f":"IF(G4=\"\",\"\",(RANK(G4,G4:G23)))","v":""},"ÉCURIES","POINTS","RANG","TOTAL"]
["HAMILTON Lewis","MERCEDES",null,null,null,null,{"$f":"IFERROR(CHOOSE(D5,25,18,15,12,10,8,6,4,2,1)+(F5=1),0)","v":0},null,"MERCEDES",{"$f":"SUM(G5:G7)","v":0},{"$f":"IF(J5=\"\",0,(RANK(J5,$J$5:$J$14)))+COUNTIF(J$5:J5,J5)-1","v":1},{"$f":"IF(J5=0,0,J5+Bahrein!L5)","v":0}]
["BOTTAS Valterri",null,null,null,null,null,0,null,"FERRARI",{"$f":"SUM(G8:G10)","v":0},{"$f":"IF(J6=\"\",0,(RANK(J6,$J$5:$J$14)))+COUNTIF(J$5:J6,J6)-1","v":2},{"$f":"IF(J6=0,0,J6+Bahrein!L6)","v":0}]
[null,null,null,null,null,null,0,null,"RED BULL",{"$f":"SUM(G11:G13)","v":0},{"$f":"IF(J7=\"\",0,(RANK(J7,$J$5:$J$14)))+COUNTIF(J$5:J7,J7)-1","v":3},{"$f":"IF(J7=0,0,J7+Bahrein!L7)","v":0}]
["VETTEL Sebastian","FERRARI",null,null,1,null,0,null,"RACING POINT",{"$f":"SUM(G14:G16)","v":0},{"$f":"IF(J8=\"\",0,(RANK(J8,$J$5:$J$14)))+COUNTIF(J$5:J8,J8)-1","v":4},{"$f":"IF(J8=0,0,J8+Bahrein!L8)","v":0}]
["LECLERC Charles",null,null,null,null,null,0,null,"WILLIAMS",{"$f":"SUM(G17:G19)","v":0},{"$f":"IF(J9=\"\",0,(RANK(J9,$J$5:$J$14)))+COUNTIF(J$5:J9,J9)-1","v":5},{"$f":"IF(J9=0,0,J9+Bahrein!L9)","v":0}]
[null,null,null,null,null,null,0,null,"RENAULT",{"$f":"SUM(G20:G22)","v":0},{"$f":"IF(J10=\"\",0,(RANK(J10,$J$5:$J$14)))+COUNTIF(J$5:J10,J10)-1","v":6},{"$f":"IF(J10=0,0,J10+Bahrein!L10)","v":0}]
["VERSTAPPEN Max","RED BULL",null,null,null,null,0,null,"TORO ROSSO",{"$f":"SUM(G23:G25)","v":0},{"$f":"IF(J11=\"\",0,(RANK(J11,$J$5:$J$14)))+COUNTIF(J$5:J11,J11)-1","v":7},{"$f":"IF(J11=0,0,J11+Bahrein!L11)","v":0}]
["GASLY Pierre",null,null,null,null,null,0,null,"HAAS",{"$f":"SUM(G26:G28)","v":0},{"$f":"IF(J12=\"\",0,(RANK(J12,$J$5:$J$14)))+COUNTIF(J$5:J12,J12)-1","v":8},{"$f":"IF(J12=0,0,J12+Bahrein!L12)","v":0}]
[null,null,null,null,null,null,0,null,"Mc LAREN",{"$f":"SUM(G29:G31)","v":0},{"$f":"IF(J13=\"\",0,(RANK(J13,$J$5:$J$14)))+COUNTIF(J$5:J13,J13)-1","v":9},{"$f":"IF(J13=0,0,J13+Bahrein!L13)","v":0}]
["PEREZ Sergio","RACING\nPOINT",null,null,null,null,0,null,"ALFA ROMEO",{"$f":"SUM(G32:G34)","v":0},{"$f":"IF(J14=\"\",0,(RANK(J14,$J$5:$J$14)))+COUNTIF(J$5:J14,J14)-1","v":10},{"$f":"IF(J14=0,0,J14+Bahrein!L14)","v":0}]
["STROLL Lance",null,null,null,null,null,0]
[null,null,null,null,null,null,0]
["RUSSELL George","WILLIAMS",null,null,null,null,0]
["KUBICA Robert",null,null,null,null,null,0]
[null,null,null,null,null,null,0]
["RICCIARDO Daniel","RENAULT",null,null,null,null,0]
["HULKENBERG Nico",null,null,null,null,null,0]
[null,null,null,null,null,null,0]
["KVYAT Daniil","TORO ROSSO",null,null,null,null,0]
["ALBON Alexander",null,null,null,null,null,0]
[null,null,null,null,null,null,0]
["GROSJEAN Romain","HAAS",null,null,null,null,0]
["MAGNUSSEN Kevin",null,null,null,null,null,0]
[null,null,null,null,null,null,0]
["NORRIS Lando","McLAREN",null,null,null,null,0]
["SAINZ.Jr Carlos",null,null,null,null,null,0]
[null,null,null,null,null,null,0]
["RAÏKKÖNEN Kimi","ALFA ROMEO",null,null,null,null,0]
["GIOVANIZZI Antonio",null,null,null,null,null,0]
[null,null,null,null,null,null,0]

{"sheet":"Azerbaïdjan","index":8,"n_rows":34,"n_cols":19,"rows_kept":34,"cut":false,"hidden":false,"merged":[[31,1,33,1],[31,2,33,2],[22,1,24,1],[22,2,24,2],[25,1,27,1],[25,2,27,2],[28,1,30,1],[28,2,30,2],[13,1,15,1],[13,2,15,2],[16,1,18,1],[16,2,18,2],[19,1,21,1],[19,2,21,2],[4,1,6,1],[4,2,6,2],[7,1,9,1],[7,2,9,2],[10,1,12,1],[10,2,12,2],[0,0,1,14],[2,1,3,1],[2,2,3,2],[2,3,3,3],[2,5,3,5],[2,6,3,6],[2,8,2,10],[2,4,3,4]]}
["AZERBAÏDJAN - 28 AVRIL 2019"]
[]
["PILOTES","ECURIES","VOITURES","Finish","Pôle","Pt tour","Points",null,"CLASSEMENT"]
[null,null,null,null,null,null,null,{"$f":"IF(G4=\"\",\"\",(RANK(G4,G4:G23)))","v":""},"ÉCURIES","POINTS","RANG","TOTAL"]
["HAMILTON Lewis","MERCEDES",null,null,null,null,{"$f":"IFERROR(CHOOSE(D5,25,18,15,12,10,8,6,4,2,1)+(F5=1),0)","v":0},null,"MERCEDES",{"$f":"SUM(G5:G7)","v":0},{"$f":"IF(J5=\"\",0,(RANK(J5,$J$5:$J$14)))+COUNTIF(J$5:J5,J5)-1","v":1},{"$f":"IF(J5=0,0,J5+Chine!L5)","v":0}]
["BOTTAS Valterri",null,null,null,null,null,{"$f":"IFERROR(CHOOSE(D6,25,18,15,12,10,8,6,4,2,1)+(F6=1),0)","v":0},null,"FERRARI",{"$f":"SUM(G8:G10)","v":0},{"$f":"IF(J6=\"\",0,(RANK(J6,$J$5:$J$14)))+COUNTIF(J$5:J6,J6)-1","v":2},{"$f":"IF(J6=0,0,J6+Chine!L6)","v":0}]
[null,null,null,null,null,null,{"$f":"IFERROR(CHOOSE(D7,25,18,15,12,10,8,6,4,2,1)+(F7=1),\"\")","v":""},null,"RED BULL",{"$f":"SUM(G11:G13)","v":0},{"$f":"IF(J7=\"\",0,(RANK(J7,$J$5:$J$14)))+COUNTIF(J$5:J7,J7)-1","v":3},{"$f":"IF(J7=0,0,J7+Chine!L7)","v":0}]
["VETTEL Sebastian","FERRARI",null,null,null,null,{"$f":"IFERROR(CHOOSE(D8,25,18,15,12,10,8,6,4,2,1)+(F8=1),0)","v":0},null,"RACING POINT",{"$f":"SUM(G14:G16)","v":0},{"$f":"IF(J8=\"\",0,(RANK(J8,$J$5:$J$14)))+COUNTIF(J$5:J8,J8)-1","v":4},{"$f":"IF(J8=0,0,J8+Chine!L8)","v":0}]
["LECLERC Charles",null,null,null,1,null,{"$f":"IFERROR(CHOOSE(D9,25,18,15,12,10,8,6,4,2,1)+(F9=1),0)","v":0},null,"WILLIAMS",{"$f":"SUM(G17:G19)","v":0},{"$f":"IF(J9=\"\",0,(RANK(J9,$J$5:$J$14)))+COUNTIF(J$5:J9,J9)-1","v":5},{"$f":"IF(J9=0,0,J9+Chine!L9)","v":0}]
[null,null,null,null,null,null,{"$f":"IFERROR(CHOOSE(D10,25,18,15,12,10,8,6,4,2,1)+(F10=1),\"\")","v":""},null,"RENAULT",{"$f":"SUM(G20:G22)","v":0},{"$f":"IF(J10=\"\",0,(RANK(J10,$J$5:$J$14)))+COUNTIF(J$5:J10,J10)-1","v":6},{"$f":"IF(J10=0,0,J10+Chine!L10)","v":0}]
["VERSTAPPEN Max","RED BULL",null,null,null,null,{"$f":"IFERROR(CHOOSE(D11,25,18,15,12,10,8,6,4,2,1)+(F11=1),0)","v":0},null,"TORO ROSSO",{"$f":"SUM(G23:G25)","v":0},{"$f":"IF(J11=\"\",0,(RANK(J11,$J$5:$J$14)))+COUNTIF(J$5:J11,J11)-1","v":7},{"$f":"IF(J11=0,0,J11+Chine!L11)","v":0}]
["GASLY Pierre",null,null,null,null,null,{"$f":"IFERROR(CHOOSE(D12,25,18,15,12,10,8,6,4,2,1)+(F12=1),0)","v":0},null,"HAAS",{"$f":"SUM(G26:G28)","v":0},{"$f":"IF(J12=\"\",0,(RANK(J12,$J$5:$J$14)))+COUNTIF(J$5:J12,J12)-1","v":8},{"$f":"IF(J12=0,0,J12+Chine!L12)","v":0}]
[null,null,null,null,null,null,{"$f":"IFERROR(CHOOSE(D13,25,18,15,12,10,8,6,4,2,1)+(F13=1),\"\")","v":""},null,"Mc LAREN",{"$f":"SUM(G29:G31)","v":0},{"$f":"IF(J13=\"\",0,(RANK(J13,$J$5:$J$14)))+COUNTIF(J$5:J13,J13)-1","v":9},{"$f":"IF(J13=0,0,J13+Chine!L13)","v":0}]
["PEREZ Sergio","RACING\nPOINT",null,null,null,null,{"$f":"IFERROR(CHOOSE(D14,25,18,15,12,10,8,6,4,2,1)+(F14=1),0)","v":0},null,"ALFA ROMEO",{"$f":"SUM(G32:G34)","v":0},{"$f":"IF(J14=\"\",0,(RANK(J14,$J$5:$J$14)))+COUNTIF(J$5:J14,J14)-1","v":10},{"$f":"IF(J14=0,0,J14+Chine!L14)","v":0}]
["STROLL Lance",null,null,null,null,null,{"$f":"IFERROR(CHOOSE(D15,25,18,15,12,10,8,6,4,2,1)+(F15=1),0)","v":0}]
[null,null,null,null,null,null,{"$f":"IFERROR(CHOOSE(D16,25,18,15,12,10,8,6,4,2,1)+(F16=1),\"\")","v":""}]
["RUSSELL George","WILLIAMS",null,null,null,null,{"$f":"IFERROR(CHOOSE(D17,25,18,15,12,10,8,6,4,2,1)+(F17=1),0)","v":0}]
["KUBICA Robert",null,null,null,null,null,{"$f":"IFERROR(CHOOSE(D18,25,18,15,12,10,8,6,4,2,1)+(F18=1),0)","v":0},null,null,null,null,null,null,null,null,null,null,null,{"$f":"IF(R18=\"\",0,(RANK(R18,$J$5:$J$14)))+COUNTIF(R$5:R18,R18)-1","v":-1}]
[null,null,null,null,null,null,{"$f":"IFERROR(CHOOSE(D19,25,18,15,12,10,8,6,4,2,1)+(F19=1),\"\")","v":""}]
["RICCIARDO Daniel","RENAULT",null,null,null,null,{"$f":"IFERROR(CHOOSE(D20,25,18,15,12,10,8,6,4,2,1)+(F20=1),0)","v":0}]
["HULKENBERG Nico",null,null,null,null,null,{"$f":"IFERROR(CHOOSE(D21,25,18,15,12,10,8,6,4,2,1)+(F21=1),0)","v":0}]
[null,null,null,null,null,null,{"$f":"IFERROR(CHOOSE(D22,25,18,15,12,10,8,6,4,2,1)+(F22=1),\"\")","v":""}]
["KVYAT Daniil","TORO ROSSO",null,null,null,null,{"$f":"IFERROR(CHOOSE(D23,25,18,15,12,10,8,6,4,2,1)+(F23=1),0)","v":0}]
["ALBON Alexander",null,null,null,null,null,{"$f":"IFERROR(CHOOSE(D24,25,18,15,12,10,8,6,4,2,1)+(F24=1),0)","v":0}]
[null,null,null,null,null,null,{"$f":"IFERROR(CHOOSE(D25,25,18,15,12,10,8,6,4,2,1)+(F25=1),\"\")","v":""}]
["GROSJEAN Romain","HAAS",null,null,null,null,{"$f":"IFERROR(CHOOSE(D26,25,18,15,12,10,8,6,4,2,1)+(F26=1),0)","v":0}]
["MAGNUSSEN Kevin",null,null,null,null,null,{"$f":"IFERROR(CHOOSE(D27,25,18,15,12,10,8,6,4,2,1)+(F27=1),0)","v":0}]
[null,null,null,null,null,null,{"$f":"IFERROR(CHOOSE(D28,25,18,15,12,10,8,6,4,2,1)+(F28=1),\"\")","v":""}]
["NORRIS Lando","McLAREN",null,null,null,null,{"$f":"IFERROR(CHOOSE(D29,25,18,15,12,10,8,6,4,2,1)+(F29=1),0)","v":0}]
["SAINZ.Jr Carlos",null,null,null,null,null,{"$f":"IFERROR(CHOOSE(D30,25,18,15,12,10,8,6,4,2,1)+(F30=1),0)","v":0}]
[null,null,null,null,null,null,{"$f":"IFERROR(CHOOSE(D31,25,18,15,12,10,8,6,4,2,1)+(F31=1),\"\")","v":""}]
["RAÏKKÖNEN Kimi","ALFA ROMEO",null,null,null,null,{"$f":"IFERROR(CHOOSE(D32,25,18,15,12,10,8,6,4,2,1)+(F32=1),0)","v":0}]
["GIOVANIZZI Antonio",null,null,null,null,null,{"$f":"IFERROR(CHOOSE(D33,25,18,15,12,10,8,6,4,2,1)+(F33=1),0)","v":0}]
[null,null,null,null,null,null,{"$f":"IFERROR(CHOOSE(D34,25,18,15,12,10,8,6,4,2,1)+(F34=1),\"\")","v":""}]