{"text_format":"1","workbook":"xlsx","n_sheets":9,"sheets":["Feuil1","Album Photos","Champions","Écuries","Pilotes","Melbourne","Bahrein","Chine","Azerbaïdjan"],"not_rendered":{"charts":0,"images":46,"macros":1,"external_links":13,"defined_names":7,"comments":0,"pivot_tables":0},"unopened":[],"bounds":{"document_bytes":16777216,"sheet_cells":100000,"rows_first":2000,"rows_last":500,"rows_between":2000,"halvings":0,"cell_chars":16384,"cell_head_chars":4096},"cells_cut":0,"cells_raw":0,"read":"whole","date_system":"1900"}

{"sheet":"Feuil1","index":0,"n_rows":41,"n_cols":3,"rows_kept":41,"cut":false,"hidden":false,"merged":[[31,2,34,5],[35,2,38,5],[39,2,42,5],[1,1,1,5],[2,2,2,5],[3,2,6,5],[7,2,10,5],[11,2,14,5],[15,2,18,5],[19,2,22,5],[23,2,26,5],[27,2,30,5]]}
[]
[null,"Photos F1"]
[null,"Noms","Photos"]
[]
[null,"Mercedes"]
[]
[]
[]
[null,"Ferrari"]
[]
{"$rows_left_out":32}
{"sheet":"Album Photos","index":1,"n_rows":23,"n_cols":4,"rows_kept":23,"cut":false,"hidden":false,"merged":[[1,5,1,6]]}
[]
[null,"Photos Pilotes"]
[null,"Noms",null,"Photos"]
[null,"Lewis HAMILTON"]
[null,"Valterii BOTTAS"]
[null,"Charles LECLERC"]
[null,"Sebastian VETTEL"]
[null,"Max VERSTAPPEN"]
[null,"Alexander ALBON"]
[null,"Sergio PEREZ"]
{"$rows_left_out":14}
{"sheet":"Champions","index":2,"n_rows":22,"n_cols":10,"rows_kept":22,"cut":false,"hidden":false,"merged":[[21,1,25,3],[18,5,22,7],[21,9,25,11],[19,1,19,3],[20,1,20,3],[19,9,19,11],[20,9,20,11],[1,2,1,10],[14,2,14,10],[16,5,16,7],[17,5,17,7],[3,5,3,7],[4,5,4,7],[6,1,6,3],[7,1,7,3],[6,9,6,11],[7,9,7,11],[8,9,12,11],[8,1,12,3],[5,5,8,7]]}
[]
[null,null,"CHAMPIONNAT PILOTES 2019"]
[]
[null,null,null,null,null,"CHAMPION 2019"]
[null,null,null,null,null,{"$f":"IF(Pilotes!G5=1,Pilotes!B5,\"\")","v":"Lewis HAMILTON"}]
[null,null,null,null,null,{"$f":"MATCH(F5,'Album Photos'!$B$1:$B$23,0)","v":4}]
[null,"DEUXIÈME",null,null,null,null,null,null,null,"TROIXIÈME"]
[null,{"$f":"IF(Pilotes!G6=2,Pilotes!B6,\"\")","v":"Valterii BOTTAS"},null,null,null,null,null,null,null,{"$f":"IF(Pilotes!G7=3,Pilotes!B7,\"\")","v":"Sebastian VETTEL"}]
[null,{"$f":"MATCH(B8,'Album Photos'!$B$1:$B$23,0)","v":5},null,null,null,null,null,null,null,{"$f":"MATCH(J8,'Album Photos'!$B$1:$B$23,0)","v":7}]
[]
{"$rows_left_out":13}
{"sheet":"Écuries","index":3,"n_rows":13,"n_cols":6,"rows_kept":13,"cut":false,"hidden":false,"merged":[[0,1,0,5]]}
[]
[]
[null,"ÉCURIES","POINTS","Écart/premier","Écart/précédent","RANG"]
[null,"MERCEDES",{"$f":"SUM(Melbourne!J5+Bahrein!J5+Chine!J5+Azerbaïdjan!J5+#REF!+#REF!+#REF!+#REF!+#REF!+#REF!+#REF!+#REF!+#REF!+#REF!+#REF!+#REF!+#REF!+#REF!+#REF!+#REF!+#REF!)","v":{"$error":"#REF!"}},null,null,{"$f":"IF(C4=\"\",0,(RANK(C4,$C$4:$C$13)))+COUNTIF(C$4:C4,C4)-1","v":{"$error":"#REF!"}}]
[null,"FERRARI",{"$f":"SUM(Melbourne:Azerbaïdjan!J6)","v":27},{"$f":"C5-C4","v":{"$error":"#REF!"}},{"$f":"C5-C4","v":{"$error":"#REF!"}},{"$f":"IF(C5=\"\",0,(RANK(C5,$C$4:$C$13)))+COUNTIF(C$4:C5,C5)-1","v":{"$error":"#REF!"}}]
[null,"RED BULL",{"$f":"SUM(Melbourne:Azerbaïdjan!J7)","v":18},{"$f":"C6-C4","v":{"$error":"#REF!"}},{"$f":"C6-C5","v":-9},{"$f":"IF(C6=\"\",0,(RANK(C6,$C$4:$C$13)))+COUNTIF(C$4:C6,C6)-1","v":{"$error":"#REF!"}}]
[null,"RACING POINT",{"$f":"SUM(Melbourne:Azerbaïdjan!J8)","v":10},{"$f":"C7-C4","v":{"$error":"#REF!"}},-8,{"$f":"IF(C7=\"\",0,(RANK(C7,$C$4:$C$13)))+COUNTIF(C$4:C7,C7)-1","v":{"$error":"#REF!"}}]
[null,"WILLIAMS",{"$f":"SUM(Melbourne:Azerbaïdjan!J9)","v":3},{"$f":"C8-C4","v":{"$error":"#REF!"}},-7,{"$f":"IF(C8=\"\",0,(RANK(C8,$C$4:$C$13)))+COUNTIF(C$4:C8,C8)-1","v":{"$error":"#REF!"}}]
[null,"ALFA ROMÉO",{"$f":"SUM(Melbourne:Azerbaïdjan!J14)","v":0},{"$f":"C9-C4","v":{"$error":"#REF!"}},-3,{"$f":"IF(C9=\"\",0,(RANK(C9,$C$4:$C$13)))+COUNTIF(C$4:C9,C9)-1","v":{"$error":"#REF!"}}]
[null,"Mc LAREN",{"$f":"SUM(Melbourne:Azerbaïdjan!J13)","v":0},{"$f":"C10-C4","v":{"$error":"#REF!"}},0,{"$f":"IF(C10=\"\",0,(RANK(C10,$C$4:$C$13)))+COUNTIF(C$4:C10,C10)-1","v":{"$error":"#REF!"}}]
{"$rows_left_out":4}
{"sheet":"Pilotes","index":4,"n_rows":24,"n_cols":18,"rows_kept":24,"cut":false,"hidden":false,"merged":[[0,0,0,7],[2,1,3,1],[2,2,3,2],[2,6,3,6],[2,3,3,3],[2,4,3,4],[2,5,3,5],[8,11,8,13],[7,11,7,13],[11,12,11,14],[12,12,12,14],[3,10,3,12],[4,10,4,12]]}
[]
[null,null,null,null,null,null,null,null,null,null,null,null,null,null,null,null,null,1]
[null,"PILOTES","Points","Écart-premier","Écart/précédent","Pôle Position","Place",1,null,null,null,null,null,null,null,null,null,2]
[null,null,{"$f":"IFERROR(SUM(Melbourne!G33,[1]Bahreïn!F33),\"\")","v":0},null,null,null,{"$f":"IF(C4=0,\"\",(RANK(C4,C1:C4)))","v":""},"Pos.Saison",null,null,null,null,null,null,null,null,null,3]
[null,"Lewis HAMILTON",{"$f":"SUM(Melbourne:Azerbaïdjan!G5)","v":25},null,null,{"$f":"SUM(Melbourne:Azerbaïdjan!E5)","v":1},{"$f":"IF(C5=\"\",0,(RANK(C5,$C$5:$C$24)))+COUNTIF(C$5:C5,C5)-1","v":1},{"$f":"IF(OR(Melbourne!E5=$H$3,Bahrein!E5=$H$3,Chine!E5=$H$3,Azerbaïdjan!E5=$H$3,I5),I5)","v":{"$error":"#REF!"}},{"$f":"IF(OR([2]Autriche!E5=$H$3,[3]GB!E5=$H$3,[4]Hongrie!E5=$H$3,[5]Belgique!E5=$H$3,[6]Italie!E5=$H$3,[7]Singapour!E5=$H$3,[8]Russie!E5=$H$3,[9]Japon!E5=$H$3,[10]Mexique!E5=$H$3,[11]USA!E5=$H$3,[12]Brésil!E5=$H$3,'[13]Abu Dabi'!E5=$H$3),SUM([2]Autriche!E5=$H$3,[3]GB!E5=$H$3,[4]Hongrie!E5=$H$3,[5]Belgique!E5=$H$3,[6]Italie!E5=$H$3,[7]Singapour!E5=$H$3,[8]Russie!E5=$H$3,[9]Japon!E5=$H$3,[10]Mexique!E5=$H$3,[11]USA!E5=$H$3,[12]Brésil!E5=$H$3,'[13]Abu Dabi'!E5=$H$3),\"\")","v":{"$error":"#REF!"}},null,null,null,null,null,null,null,null,4]
[null,"Valterii BOTTAS",{"$f":"SUM(Melbourne:Azerbaïdjan!G6)","v":18},{"$f":"C6-C5","v":-7},{"$f":"C5-C6","v":7},{"$f":"SUM(Melbourne:Azerbaïdjan!E9)","v":1},{"$f":"IF(C6=\"\",0,(RANK(C6,$C$5:$C$24)))+COUNTIF(C$5:C6,C6)-1","v":2},{"$f":"IF(OR(Melbourne!E6=$H$3,Bahrein!E6=$H$3,Chine!E6=$H$3,Azerbaïdjan!E6=$H$3,I6),I6)","v":{"$error":"#REF!"}},{"$f":"IF(OR([2]Autriche!E6=$H$3,[3]GB!E6=$H$3,[4]Hongrie!E6=$H$3,[5]Belgique!E6=$H$3,[6]Italie!E6=$H$3,[7]Singapour!E6=$H$3,[8]Russie!E6=$H$3,[9]Japon!E6=$H$3,[10]Mexique!E6=$H$3,[11]USA!E6=$H$3,[12]Brésil!E6=$H$3,'[13]Abu Dabi'!E6=$H$3),SUM([2]Autriche!E6=$H$3,[3]GB!E6=$H$3,[4]Hongrie!E6=$H$3,[5]Belgique!E6=$H$3,[6]Italie!E6=$H$3,[7]Singapour!E6=$H$3,[8]Russie!E6=$H$3,[9]Japon!E6=$H$3,[10]Mexique!E6=$H$3,[11]USA!E6=$H$3,[12]Brésil!E6=$H$3,'[13]Abu Dabi'!E6=$H$3),\"\")","v":{"$error":"#REF!"}},null,null,null,null,null,null,null,null,5]
[null,"Sebastian VETTEL",{"$f":"SUM(Melbourne:Azerbaïdjan!G8)","v":15},{"$f":"C7-C5","v":-10},{"$f":"C6-C7","v":3},{"$f":"SUM(Melbourne:Azerbaïdjan!E11)","v":0},{"$f":"IF(C7=\"\",0,(RANK(C7,$C$5:$C$24)))+COUNTIF(C$5:C7,C7)-1","v":3},{"$f":"IF(OR(Melbourne!E7=$H$3,Bahrein!E7=$H$3,Chine!E7=$H$3,Azerbaïdjan!E7=$H$3,I7),I7)","v":{"$error":"#REF!"}},{"$f":"IF(OR([2]Autriche!E7=$H$3,[3]GB!E7=$H$3,[4]Hongrie!E7=$H$3,[5]Belgique!E7=$H$3,[6]Italie!E7=$H$3,[7]Singapour!E7=$H$3,[8]Russie!E7=$H$3,[9]Japon!E7=$H$3,[10]Mexique!E7=$H$3,[11]USA!E7=$H$3,[12]Brésil!E7=$H$3,'[13]Abu Dabi'!E7=$H$3),SUM([2]Autriche!E7=$H$3,[3]GB!E7=$H$3,[4]Hongrie!E7=$H$3,[5]Belgique!E7=$H$3,[6]Italie!E7=$H$3,[7]Singapour!E7=$H$3,[8]Russie!E7=$H$3,[9]Japon!E7=$H$3,[10]Mexique!E7=$H$3,[11]USA!E7=$H$3,[12]Brésil!E7=$H$3,'[13]Abu Dabi'!E7=$H$3),\"\")","v":{"$error":"#REF!"}},null,null,null,null,null,null,null,null,6]
[null,"Max VERSTAPPEN",{"$f":"SUM(Melbourne:Azerbaïdjan!G11)","v":10},{"$f":"C8-C5","v":-15},{"$f":"C7-C8","v":5},{"$f":"SUM(Melbourne:Azerbaïdjan!E6)","v":1},{"$f":"IF(C8=\"\",0,(RANK(C8,$C$5:$C$24)))+COUNTIF(C$5:C8,C8)-1","v":4},{"$f":"IF(OR(Melbourne!E8=$H$3,Bahrein!E8=$H$3,Chine!E8=$H$3,Azerbaïdjan!E8=$H$3,I8),I8)","v":{"$error":"#REF!"}},{"$f":"IF(OR([2]Autriche!E8=$H$3,[3]GB!E8=$H$3,[4]Hongrie!E8=$H$3,[5]Belgique!E8=$H$3,[6]Italie!E8=$H$3,[7]Singapour!E8=$H$3,[8]Russie!E8=$H$3,[9]Japon!E8=$H$3,[10]Mexique!E8=$H$3,[11]USA!E8=$H$3,[12]Brésil!E8=$H$3,'[13]Abu Dabi'!E8=$H$3),SUM([2]Autriche!E8=$H$3,[3]GB!E8=$H$3,[4]Hongrie!E8=$H$3,[5]Belgique!E8=$H$3,[6]Italie!E8=$H$3,[7]Singapour!E8=$H$3,[8]Russie!E8=$H$3,[9]Japon!E8=$H$3,[10]Mexique!E8=$H$3,[11]USA!E8=$H$3,[12]Brésil!E8=$H$3,'[13]Abu Dabi'!E8=$H$3),\"\")","v":{"$error":"#REF!"}},null,null,"DEUXIÈME",null,null,null,null,null,7]
[null,"Pierre GASLY",{"$f":"SUM(Melbourne:Azerbaïdjan!G12)","v":8},{"$f":"C9-C5","v":-17},{"$f":"C8-C9","v":2},{"$f":"SUM(Melbourne:Azerbaïdjan!E8)","v":1},{"$f":"IF(C9=\"\",0,(RANK(C9,$C$5:$C$24)))+COUNTIF(C$5:C9,C9)-1","v":5},{"$f":"IF(OR(Melbourne!E9=$H$3,Bahrein!E9=$H$3,Chine!E9=$H$3,Azerbaïdjan!E9=$H$3,I9),I9)","v":{"$error":"#REF!"}},{"$f":"IF(OR([2]Autriche!E9=$H$3,[3]GB!E9=$H$3,[4]Hongrie!E9=$H$3,[5]Belgique!E9=$H$3,[6]Italie!E9=$H$3,[7]Singapour!E9=$H$3,[8]Russie!E9=$H$3,[9]Japon!E9=$H$3,[10]Mexique!E9=$H$3,[11]USA!E9=$H$3,[12]Brésil!E9=$H$3,'[13]Abu Dabi'!E9=$H$3),SUM([2]Autriche!E9=$H$3,[3]GB!E9=$H$3,[4]Hongrie!E9=$H$3,[5]Belgique!E9=$H$3,[6]Italie!E9=$H$3,[7]Singapour!E9=$H$3,[8]Russie!E9=$H$3,[9]Japon!E9=$H$3,[10]Mexique!E9=$H$3,[11]USA!E9=$H$3,[12]Brésil!E9=$H$3,'[13]Abu Dabi'!E9=$H$3),\"\")","v":{"$error":"#REF!"}},null,null,{"$f":"IF(G6=2,B6,\"\")","v":"Valterii BOTTAS"},null,null,null,null,null,8]
[null,"Sergio PEREZ",{"$f":"SUM(Melbourne:Azerbaïdjan!G14)","v":6},{"$f":"C10-C5","v":-19},{"$f":"C9-C10","v":2},{"$f":"SUM(Melbourne:Azerbaïdjan!E12)","v":0},{"$f":"IF(C10=\"\",0,(RANK(C10,$C$5:$C$24)))+COUNTIF(C$5:C10,C10)-1","v":6},{"$f":"IF(OR(Melbourne!E10=$H$3,Bahrein!E10=$H$3,Chine!E10=$H$3,Azerbaïdjan!E10=$H$3,I10),I10)","v":{"$error":"#REF!"}},{"$f":"IF(OR([2]Autriche!E10=$H$3,[3]GB!E10=$H$3,[4]Hongrie!E10=$H$3,[5]Belgique!E10=$H$3,[6]Italie!E10=$H$3,[7]Singapour!E10=$H$3,[8]Russie!E10=$H$3,[9]Japon!E10=$H$3,[10]Mexique!E10=$H$3,[11]USA!E10=$H$3,[12]Brésil!E10=$H$3,'[13]Abu Dabi'!E10=$H$3),SUM([2]Autriche!E10=$H$3,[3]GB!E10=$H$3,[4]Hongrie!E10=$H$3,[5]Belgique!E10=$H$3,[6]Italie!E10=$H$3,[7]Singapour!E10=$H$3,[8]Russie!E10=$H$3,[9]Japon!E10=$H$3,[10]Mexique!E10=$H$3,[11]USA!E10=$H$3,[12]Brésil!E10=$H$3,'[13]Abu Dabi'!E10=$H$3),\"\")","v":{"$error":"#REF!"}},null,null,null,null,null,null,null,null,9]
{"$rows_left_out":15}
{"sheet":"Melbourne","index":5,"n_rows":34,"n_cols":11,"rows_kept":34,"cut":false,"hidden":false,"merged":[[31,1,33,1],[31,2,33,2],[13,1,15,1],[13,2,15,2],[16,1,18,1],[16,2,18,2],[19,1,21,1],[19,2,21,2],[28,1,30,1],[28,2,30,2],[25,2,27,2],[22,1,24,1],[22,2,24,2],[25,1,27,1],[7,1,9,1],[7,2,9,2],[10,1,12,1],[10,2,12,2],[0,0,1,14],[4,1,6,1],[4,2,6,2],[2,0,3,0],[2,8,2,10],[2,1,3,1],[2,2,3,2],[2,3,3,3],[2,5,3,5],[2,6,3,6],[2,4,3,4]]}
["AUSTRALIE - 17 MARS 2019"]
[]
["PILOTES","ECURIES","VOITURES","Finish","Pôle","Pt tour","Points",null,"CLASSEMENT"]
[null,null,null,null,null,null,null,null,"ÉCURIES","POINTS","RANG"]
["HAMILTON Lewis","MERCEDES",null,1,1,null,{"$f":"IFERROR(CHOOSE(D5,25,18,15,12,10,8,6,4,2,1)+(F5=1),0)","v":25},null,"MERCEDES",{"$f":"SUM(G5:G7)","v":43},{"$f":"IF(J5=\"\",0,(RANK(J5,$J$5:$J$14)))+COUNTIF(J$5:J5,J5)-1","v":1}]
["BOTTAS Valterri",null,null,2,null,null,{"$f":"IFERROR(CHOOSE(D6,25,18,15,12,10,8,6,4,2,1)+(F6=1),0)","v":18},null,"FERRARI",{"$f":"SUM(G8:G10)","v":27},{"$f":"IF(J6=\"\",0,(RANK(J6,$J$5:$J$14)))+COUNTIF(J$5:J6,J6)-1","v":2}]
[null,null,null,null,null,null,{"$f":"IFERROR(CHOOSE(D7,25,18,15,12,10,8,6,4,2,1)+(F7=1),\"\")","v":""},null,"RED BULL",{"$f":"SUM(G11:G13)","v":18},{"$f":"IF(J7=\"\",0,(RANK(J7,$J$5:$J$14)))+COUNTIF(J$5:J7,J7)-1","v":3}]
["VETTEL Sebastian","FERRARI",null,3,null,null,{"$f":"IFERROR(CHOOSE(D8,25,18,15,12,10,8,6,4,2,1)+(F8=1),0)","v":15},null,"RACING POINT",{"$f":"SUM(G14:G16)","v":10},{"$f":"IF(J8=\"\",0,(RANK(J8,$J$5:$J$14)))+COUNTIF(J$5:J8,J8)-1","v":4}]
["LECLERC Charles",null,null,4,null,null,{"$f":"IFERROR(CHOOSE(D9,25,18,15,12,10,8,6,4,2,1)+(F9=1),0)","v":12},null,"WILLIAMS",{"$f":"SUM(G17:G19)","v":3},{"$f":"IF(J9=\"\",0,(RANK(J9,$J$5:$J$14)))+COUNTIF(J$5:J9,J9)-1","v":5}]
[null,null,null,null,null,null,{"$f":"IFERROR(CHOOSE(D10,25,18,15,12,10,8,6,4,2,1)+(F10=1),\"\")","v":""},null,"RENAULT",{"$f":"SUM(G20:G22)","v":0},{"$f":"IF(J10=\"\",0,(RANK(J10,$J$5:$J$14)))+COUNTIF(J$5:J10,J10)-1","v":6}]
{"$rows_left_out":25}
{"sheet":"Bahrein","index":6,"n_rows":33,"n_cols":12,"rows_kept":33,"cut":false,"hidden":false,"merged":[[31,1,33,1],[31,2,33,2],[22,1,24,1],[22,2,24,2],[25,1,27,1],[25,2,27,2],[28,1,30,1],[28,2,30,2],[13,1,15,1],[13,2,15,2],[16,1,18,1],[16,2,18,2],[19,1,21,1],[19,2,21,2],[4,1,6,1],[4,2,6,2],[7,1,9,1],[7,2,9,2],[10,1,12,1],[10,2,12,2],[0,0,1,14],[2,1,3,1],[2,2,3,2],[2,3,3,3],[2,5,3,5],[2,6,3,6],[2,8,2,10],[2,4,3,4]]}
["BAHREÏN - 31 MARS 2019"]
[]
["PILOTES","ECURIES","VOITURES","Finish","Pôle","Pt tour","Points",null,"CLASSEMENT"]
[null,null,null,null,null,null,null,{"$f":"IF(G4=\"\",\"\",(RANK(G4,G4:G23)))","v":""},"ÉCURIES","POINTS","RANG","TOTAL"]
["HAMILTON Lewis","MERCEDES",null,null,null,null,{"$f":"IFERROR(CHOOSE(D5,25,18,15,12,10,8,6,4,2,1)+(F5=1),0)","v":0},null,"MERCEDES",{"$f":"SUM(G5:G7)","v":0},{"$f":"IF(J5=\"\",0,(RANK(J5,$J$5:$J$14)))+COUNTIF(J$5:J5,J5)-1","v":1},{"$f":"IF(J5=0,0,J5+Melbourne!J5)","v":0}]
["BOTTAS Valterri",null,null,null,1,null,{"$f":"IFERROR(CHOOSE(D6,25,18,15,12,10,8,6,4,2,1)+(F6=1),0)","v":0},null,"FERRARI",{"$f":"SUM(G8:G10)","v":0},{"$f":"IF(J6=\"\",0,(RANK(J6,$J$5:$J$14)))+COUNTIF(J$5:J6,J6)-1","v":2},{"$f":"IF(J6=0,0,J6+Melbourne!J6)","v":0}]
[null,null,null,null,null,null,null,null,"RED BULL",{"$f":"SUM(G11:G13)","v":0},{"$f":"IF(J7=\"\",0,(RANK(J7,$J$5:$J$14)))+COUNTIF(J$5:J7,J7)-1","v":3},{"$f":"IF(J7=0,0,J7+Melbourne!J7)","v":0}]
["VETTEL Sebastian","FERRARI",null,null,null,null,{"$f":"IFERROR(CHOOSE(D8,25,18,15,12,10,8,6,4,2,1)+(F8=1),0)","v":0},null,"RACING POINT",{"$f":"SUM(G14:G16)","v":0},{"$f":"IF(J8=\"\",0,(RANK(J8,$J$5:$J$14)))+COUNTIF(J$5:J8,J8)-1","v":4},{"$f":"IF(J8=0,0,J8+Melbourne!J8)","v":0}]
["LECLERC Charles",null,null,null,null,null,{"$f":"IFERROR(CHOOSE(D9,25,18,15,12,10,8,6,4,2,1)+(F9=1),0)","v":0},null,"WILLIAMS",{"$f":"SUM(G17:G19)","v":0},{"$f":"IF(J9=\"\",0,(RANK(J9,$J$5:$J$14)))+COUNTIF(J$5:J9,J9)-1","v":5},{"$f":"IF(J9=0,0,J9+Melbourne!J9)","v":0}]
[null,null,null,null,null,null,{"$f":"IFERROR(CHOOSE(D10,25,18,15,12,10,8,6,4,2,1)+(F10=1),\"\")","v":""},null,"RENAULT",{"$f":"SUM(G20:G22)","v":0},{"$f":"IF(J10=\"\",0,(RANK(J10,$J$5:$J$14)))+COUNTIF(J$5:J10,J10)-1","v":6},{"$f":"IF(J10=0,0,J10+Melbourne!J10)","v":0}]
{"$rows_left_out":24}
{"sheet":"Chine","index":7,"n_rows":34,"n_cols":12,"rows_kept":34,"cut":false,"hidden":false,"merged":[[31,1,33,1],[31,2,33,2],[22,1,24,1],[22,2,24,2],[25,1,27,1],[25,2,27,2],[28,1,30,1],[28,2,30,2],[13,1,15,1],[13,2,15,2],[16,1,18,1],[16,2,18,2],[19,1,21,1],[19,2,21,2],[4,1,6,1],[4,2,6,2],[7,1,9,1],[7,2,9,2],[10,1,12,1],[10,2,12,2],[0,0,1,14],[2,1,3,1],[2,2,3,2],[2,3,3,3],[2,5,3,5],[2,6,3,6],[2,8,2,10],[2,4,3,4]]}
["CHINE - 14 AVRIL 2019"]
[]
["PILOTES","ECURIES","VOITURES","Finish","Pôle","Pt tour","Points",null,"CLASSEMENT"]
[null,null,null,null,null,null,null,{"$f":"IF(G4=\"\",\"\",(RANK(G4,G4:G23)))","v":""},"ÉCURIES","POINTS","RANG","TOTAL"]
["HAMILTON Lewis","MERCEDES",null,null,null,null,{"$f":"IFERROR(CHOOSE(D5,25,18,15,12,10,8,6,4,2,1)+(F5=1),0)","v":0},null,"MERCEDES",{"$f":"SUM(G5:G7)","v":0},{"$f":"IF(J5=\"\",0,(RANK(J5,$J$5:$J$14)))+COUNTIF(J$5:J5,J5)-1","v":1},{"$f":"IF(J5=0,0,J5+Bahrein!L5)","v":0}]
["BOTTAS Valterri",null,null,null,null,null,0,null,"FERRARI",{"$f":"SUM(G8:G10)","v":0},{"$f":"IF(J6=\"\",0,(RANK(J6,$J$5:$J$14)))+COUNTIF(J$5:J6,J6)-1","v":2},{"$f":"IF(J6=0,0,J6+Bahrein!L6)","v":0}]
[null,null,null,null,null,null,0,null,"RED BULL",{"$f":"SUM(G11:G13)","v":0},{"$f":"IF(J7=\"\",0,(RANK(J7,$J$5:$J$14)))+COUNTIF(J$5:J7,J7)-1","v":3},{"$f":"IF(J7=0,0,J7+Bahrein!L7)","v":0}]
["VETTEL Sebastian","FERRARI",null,null,1,null,0,null,"RACING POINT",{"$f":"SUM(G14:G16)","v":0},{"$f":"IF(J8=\"\",0,(RANK(J8,$J$5:$J$14)))+COUNTIF(J$5:J8,J8)-1","v":4},{"$f":"IF(J8=0,0,J8+Bahrein!L8)","v":0}]
["LECLERC Charles",null,null,null,null,null,0,null,"WILLIAMS",{"$f":"SUM(G17:G19)","v":0},{"$f":"IF(J9=\"\",0,(RANK(J9,$J$5:$J$14)))+COUNTIF(J$5:J9,J9)-1","v":5},{"$f":"IF(J9=0,0,J9+Bahrein!L9)","v":0}]
[null,null,null,null,null,null,0,null,"RENAULT",{"$f":"SUM(G20:G22)","v":0},{"$f":"IF(J10=\"\",0,(RANK(J10,$J$5:$J$14)))+COUNTIF(J$5:J10,J10)-1","v":6},{"$f":"IF(J10=0,0,J10+Bahrein!L10)","v":0}]
{"$rows_left_out":25}
{"sheet":"Azerbaïdjan","index":8,"n_rows":34,"n_cols":19,"rows_kept":34,"cut":false,"hidden":false,"merged":[[31,1,33,1],[31,2,33,2],[22,1,24,1],[22,2,24,2],[25,1,27,1],[25,2,27,2],[28,1,30,1],[28,2,30,2],[13,1,15,1],[13,2,15,2],[16,1,18,1],[16,2,18,2],[19,1,21,1],[19,2,21,2],[4,1,6,1],[4,2,6,2],[7,1,9,1],[7,2,9,2],[10,1,12,1],[10,2,12,2],[0,0,1,14],[2,1,3,1],[2,2,3,2],[2,3,3,3],[2,5,3,5],[2,6,3,6],[2,8,2,10],[2,4,3,4]]}
["AZERBAÏDJAN - 28 AVRIL 2019"]
[]
["PILOTES","ECURIES","VOITURES","Finish","Pôle","Pt tour","Points",null,"CLASSEMENT"]
[null,null,null,null,null,null,null,{"$f":"IF(G4=\"\",\"\",(RANK(G4,G4:G23)))","v":""},"ÉCURIES","POINTS","RANG","TOTAL"]
["HAMILTON Lewis","MERCEDES",null,null,null,null,{"$f":"IFERROR(CHOOSE(D5,25,18,15,12,10,8,6,4,2,1)+(F5=1),0)","v":0},null,"MERCEDES",{"$f":"SUM(G5:G7)","v":0},{"$f":"IF(J5=\"\",0,(RANK(J5,$J$5:$J$14)))+COUNTIF(J$5:J5,J5)-1","v":1},{"$f":"IF(J5=0,0,J5+Chine!L5)","v":0}]
["BOTTAS Valterri",null,null,null,null,null,{"$f":"IFERROR(CHOOSE(D6,25,18,15,12,10,8,6,4,2,1)+(F6=1),0)","v":0},null,"FERRARI",{"$f":"SUM(G8:G10)","v":0},{"$f":"IF(J6=\"\",0,(RANK(J6,$J$5:$J$14)))+COUNTIF(J$5:J6,J6)-1","v":2},{"$f":"IF(J6=0,0,J6+Chine!L6)","v":0}]
[null,null,null,null,null,null,{"$f":"IFERROR(CHOOSE(D7,25,18,15,12,10,8,6,4,2,1)+(F7=1),\"\")","v":""},null,"RED BULL",{"$f":"SUM(G11:G13)","v":0},{"$f":"IF(J7=\"\",0,(RANK(J7,$J$5:$J$14)))+COUNTIF(J$5:J7,J7)-1","v":3},{"$f":"IF(J7=0,0,J7+Chine!L7)","v":0}]
["VETTEL Sebastian","FERRARI",null,null,null,null,{"$f":"IFERROR(CHOOSE(D8,25,18,15,12,10,8,6,4,2,1)+(F8=1),0)","v":0},null,"RACING POINT",{"$f":"SUM(G14:G16)","v":0},{"$f":"IF(J8=\"\",0,(RANK(J8,$J$5:$J$14)))+COUNTIF(J$5:J8,J8)-1","v":4},{"$f":"IF(J8=0,0,J8+Chine!L8)","v":0}]
["LECLERC Charles",null,null,null,1,null,{"$f":"IFERROR(CHOOSE(D9,25,18,15,12,10,8,6,4,2,1)+(F9=1),0)","v":0},null,"WILLIAMS",{"$f":"SUM(G17:G19)","v":0},{"$f":"IF(J9=\"\",0,(RANK(J9,$J$5:$J$14)))+COUNTIF(J$5:J9,J9)-1","v":5},{"$f":"IF(J9=0,0,J9+Chine!L9)","v":0}]
[null,null,null,null,null,null,{"$f":"IFERROR(CHOOSE(D10,25,18,15,12,10,8,6,4,2,1)+(F10=1),\"\")","v":""},null,"RENAULT",{"$f":"SUM(G20:G22)","v":0},{"$f":"IF(J10=\"\",0,(RANK(J10,$J$5:$J$14)))+COUNTIF(J$5:J10,J10)-1","v":6},{"$f":"IF(J10=0,0,J10+Chine!L10)","v":0}]
{"$rows_left_out":24}