{"text_format":"1","workbook":"xlsx","n_sheets":3,"sheets":["Devis","Archive","Feuil1"],"not_rendered":{"charts":0,"images":1,"macros":1,"external_links":0,"defined_names":2,"comments":0,"pivot_tables":0},"unopened":[],"bounds":{"document_bytes":16777216,"sheet_cells":100000,"rows_first":2000,"rows_last":500,"rows_between":2000,"halvings":0,"cell_chars":16384,"cell_head_chars":4096},"cells_cut":0,"cells_raw":0,"read":"whole","date_system":"1900"}

{"sheet":"Devis","index":0,"n_rows":29,"n_cols":6,"rows_kept":29,"cut":false,"hidden":false,"merged":[[32,1,33,5],[13,3,13,4],[14,3,14,4]]}
[]
[]
[null,"Vos contacts :",null,null,"NOM Client"]
[null,"HEYER Denis, Responsable d'exploitation"]
[null,"06.69.00.16.76 / 03.88.82.47.45",null,null,"Rue "]
[null,"LOUMA Moussa, Responsable commercial",null,null,"CP VILLE"]
[null,"06.23.52.71.51 / 03.88.82.47.45"]
[]
[]
[]
[null,null,null,null,"Date :",{"$f":"TODAY()","v":"2020-03-03"}]
[null,null,null,null,"N° de Devis : ",{"$f":"inc(Feuil1!H1)","v":"2020-0001-ML"}]
[null,"Contact Client : "]
[null,"Nom du contact",null,"Validité de l'offre :",null,"1 mois"]
[null,"Tel : ",null,"Auteur de la proposition :",null,"Moussa LOUMA"]
[null,"Mail : "]
[]
[]
[null,"Référence","Description","Quantité","Prix Unitaire","Montant H.T."]
[null,"TE"]
[]
[]
[null,null,null,null,"TOTAL H.T.",{"$f":"SUM(Tableau_Articles[Montant H.T.])","v":0}]
[null,null,null,null,"TVA 20%",{"$f":"F23*20/100","v":0}]
[null,null,null,null,"TOTAL TTC",{"$f":"SUM(F23:F24)","v":0}]
[]
[]
[null,{"$f":"F15","v":"Moussa LOUMA"},null,"Nom du Signataire et Cachet de la Société"]
[null,{"$f":"VLOOKUP(B28,Feuil1!A1:B2,2,FALSE)","v":"Responsable Commercial"},null,"Mention \"Bon pour Accord\" obligatoire"]

{"sheet":"Archive","index":1,"n_rows":6,"n_cols":8,"rows_kept":6,"cut":false,"hidden":false,"merged":[]}
["N° de Devis : ","Date :","NOM Client",null,"Rue ","CP VILLE","TOTAL H.T.","TOTAL TTC"]
[0]
[1]
["2020-0001-ML","2020-03-02","NOM Client",null,"Rue ","CP VILLE",0,0]
["2020-0001-ML","2020-03-02","NOM Client",null,"Rue ","CP VILLE",0,0]
["2020-0001-ML","2020-03-03","NOM Client",null,"Rue ","CP VILLE",0,0]

{"sheet":"Feuil1","index":2,"n_rows":2,"n_cols":8,"rows_kept":2,"cut":false,"hidden":false,"merged":[]}
["Moussa LOUMA","Responsable Commercial",null,null,"2020-","0000-",{"$f":"MID(Devis!B28,1,1)&LEFT(RIGHT(Devis!B28,5),1)","v":"ML"},{"$f":"E1&F1&G1","v":"2020-0000-ML"}]
["Denis HEYER","Responsable Exploitation"]