{"text_format":"1","workbook":"xlsx","n_sheets":5,"sheets":["Interface","CHIFFRAGE","BDD","Paramètres","Facteurs de corrections"],"not_rendered":{"charts":0,"images":1,"macros":1,"external_links":1,"defined_names":4,"comments":0,"pivot_tables":0},"unopened":[],"bounds":{"document_bytes":16777216,"sheet_cells":100000,"rows_first":2000,"rows_last":500,"rows_between":2000,"halvings":0,"cell_chars":16384,"cell_head_chars":4096},"cells_cut":0,"cells_raw":0,"read":"whole","date_system":"1900"}

{"sheet":"Interface","index":0,"n_rows":14,"n_cols":16,"rows_kept":14,"cut":false,"hidden":false,"merged":[[5,15,6,15],[1,14,1,15]]}
[]
[null,null,null,null,null,null,null,null,null,null,null,null,null,null,"Légende"]
[null,null,null,null,null,null,null,null,null,null,null,null,null,null,"Modèle","selection d'un modèle dans la BDD"]
[null,null,null,null,null,null,null,null,null,null,null,null,null,null,"T1/T2/Tr","change T1/T2/Tr dans la BDD"]
[null,null,null,null,null,null,null,null,null,null,null,null,null,null,"Type","selection eventuelle d'un type dans la BDD"]
[null,null,null,null,null,null,null,null,null,null,null,null,null,null,"Hauteur","délimitation eventuelle des dimensions"]
[null,null,null,null,null,null,null,null,null,null,null,null,null,null,"Longueur"]
[null,null,null,null,null,null,null,null,null,null,null,null,null,null,"Puissance","correspond à la puissance corrigée recherchée dans la BDD"]
[null,null,null,null,null,null,null,null,null,null,null,null,null,null,"+/- x %","correspond à la puissance corrigée recherchée à +/- \"x\"% prêt"]
[]
[null,null,null,null,null,null,null,null,null,null,null,null,null,null,"Local","correspond à une zone de saisie libre"]
[null,null,null,null,null,null,null,null,null,null,null,null,null,null,"Quantité","correspond à une zone de saisie libre"]
[]
[null,null,null,null,null,null,null,null,null,null,null,null,null,null,"Valider","insert la reference, le local et la quantité dans le tableau chiffrage"]

{"sheet":"CHIFFRAGE","index":1,"n_rows":39,"n_cols":16,"rows_kept":39,"cut":false,"hidden":false,"merged":[[16,4,16,7],[7,1,7,3],[12,4,12,7],[13,4,13,7],[14,4,14,7],[15,4,15,7],[28,4,28,7],[17,4,17,7],[18,4,18,7],[19,4,19,7],[20,4,20,7],[21,4,21,7],[22,4,22,7],[23,4,23,7],[24,4,24,7],[25,4,25,7],[26,4,26,7],[27,4,27,7],[38,0,38,1],[29,4,29,7],[30,4,30,7],[31,4,31,7],[32,4,32,7],[33,4,33,7],[34,4,34,7],[35,4,35,7],[36,4,36,7],[37,4,37,7]]}
[]
[null,null,null,null,null,null,null,null,"T1",65]
[null,null,null,null,null,null,null,null,"T2",55]
[null,null,null,null,null,null,null,null,"Tr",22]
[]
[]
["Date:"]
["Numéro"]
["Emetteur","Sacha"]
["Destinataire"]
[]
[]
["pos.","local","Qté","référence","désignation",null,null,null,{"$f":"\"T1\"&CHAR(176)&\"C\"","v":"T1°C"},{"$f":"\"T2\"&CHAR(176)&\"C\"","v":"T2°C"},{"$f":"\"Tr\"&CHAR(176)&\"C\"","v":"Tr°C"},"Watt","prix unit\nEUR HT","prix net unit.\nEUR HT","prix net total\nEUR HT","Remise.\n[%]"]
["001"]
["002","chambre",1,"RRN2005000622MA",{"$f":"VLOOKUP(D15,BDD!B:C,2,0)","v":"Tubulaire 2 col. 0500x270x65 234W Blanc"},null,null,null,{"$f":"$J$2","v":65},{"$f":"$J$3","v":55},{"$f":"$J$4","v":22},{"$f":"VLOOKUP(D15,BDD!B:M,11,0)","v":164.0574},{"$f":"VLOOKUP(D15,BDD!B:K,10,0)","v":5},{"$f":"+M15-M15*P15","v":5},{"$f":"+N15*C15","v":5}]
["003",null,null,null,{"$f":"VLOOKUP(D16,BDD!B:C,2,0)","v":{"$error":"#N/A"}},null,null,null,65,55,22,{"$f":"VLOOKUP(D16,BDD!B:M,11,0)","v":{"$error":"#N/A"}},{"$f":"VLOOKUP(D16,BDD!B:K,10,0)","v":{"$error":"#N/A"}},{"$f":"+M16-M16*P16","v":{"$error":"#N/A"}},{"$f":"+N16*C16","v":{"$error":"#N/A"}}]
["004",null,null,null,{"$f":"VLOOKUP(D17,BDD!B:C,2,0)","v":{"$error":"#N/A"}},null,null,null,65,55,22,{"$f":"VLOOKUP(D17,BDD!B:M,11,0)","v":{"$error":"#N/A"}},{"$f":"VLOOKUP(D17,BDD!B:K,10,0)","v":{"$error":"#N/A"}},{"$error":"#N/A"},{"$error":"#N/A"}]
["005",null,null,null,{"$f":"VLOOKUP(D18,BDD!B:C,2,0)","v":{"$error":"#N/A"}},null,null,null,65,55,22,{"$f":"VLOOKUP(D18,BDD!B:M,11,0)","v":{"$error":"#N/A"}},{"$f":"VLOOKUP(D18,BDD!B:K,10,0)","v":{"$error":"#N/A"}},{"$error":"#N/A"},{"$error":"#N/A"}]
["006",null,null,null,{"$f":"VLOOKUP(D19,BDD!B:C,2,0)","v":{"$error":"#N/A"}},null,null,null,65,55,22,{"$f":"VLOOKUP(D19,BDD!B:M,11,0)","v":{"$error":"#N/A"}},{"$f":"VLOOKUP(D19,BDD!B:K,10,0)","v":{"$error":"#N/A"}},{"$error":"#N/A"},{"$error":"#N/A"}]
["007",null,null,null,{"$f":"VLOOKUP(D20,BDD!B:C,2,0)","v":{"$error":"#N/A"}},null,null,null,65,55,22,{"$f":"VLOOKUP(D20,BDD!B:M,11,0)","v":{"$error":"#N/A"}},{"$f":"VLOOKUP(D20,BDD!B:K,10,0)","v":{"$error":"#N/A"}},{"$error":"#N/A"},{"$error":"#N/A"}]
["008",null,null,null,{"$f":"VLOOKUP(D21,BDD!B:C,2,0)","v":{"$error":"#N/A"}},null,null,null,65,55,22,{"$f":"VLOOKUP(D21,BDD!B:M,11,0)","v":{"$error":"#N/A"}},{"$f":"VLOOKUP(D21,BDD!B:K,10,0)","v":{"$error":"#N/A"}},{"$error":"#N/A"},{"$error":"#N/A"}]
["009",null,null,null,{"$f":"VLOOKUP(D22,BDD!B:C,2,0)","v":{"$error":"#N/A"}},null,null,null,65,55,22,{"$f":"VLOOKUP(D22,BDD!B:M,11,0)","v":{"$error":"#N/A"}},{"$f":"VLOOKUP(D22,BDD!B:K,10,0)","v":{"$error":"#N/A"}},{"$error":"#N/A"},{"$error":"#N/A"}]
["010",null,null,null,{"$f":"VLOOKUP(D23,BDD!B:C,2,0)","v":{"$error":"#N/A"}},null,null,null,65,55,22,{"$f":"VLOOKUP(D23,BDD!B:M,11,0)","v":{"$error":"#N/A"}},{"$f":"VLOOKUP(D23,BDD!B:K,10,0)","v":{"$error":"#N/A"}},{"$error":"#N/A"},{"$error":"#N/A"}]
["011",null,null,null,{"$f":"VLOOKUP(D24,BDD!B:C,2,0)","v":{"$error":"#N/A"}},null,null,null,65,55,22,{"$f":"VLOOKUP(D24,BDD!B:M,11,0)","v":{"$error":"#N/A"}},{"$f":"VLOOKUP(D24,BDD!B:K,10,0)","v":{"$error":"#N/A"}},{"$error":"#N/A"},{"$error":"#N/A"}]
["012",null,null,null,{"$f":"VLOOKUP(D25,BDD!B:C,2,0)","v":{"$error":"#N/A"}},null,null,null,65,55,22,{"$f":"VLOOKUP(D25,BDD!B:M,11,0)","v":{"$error":"#N/A"}},{"$f":"VLOOKUP(D25,BDD!B:K,10,0)","v":{"$error":"#N/A"}},{"$error":"#N/A"},{"$error":"#N/A"}]
["013",null,null,null,{"$f":"VLOOKUP(D26,BDD!B:C,2,0)","v":{"$error":"#N/A"}},null,null,null,65,55,22,{"$f":"VLOOKUP(D26,BDD!B:M,11,0)","v":{"$error":"#N/A"}},{"$f":"VLOOKUP(D26,BDD!B:K,10,0)","v":{"$error":"#N/A"}},{"$error":"#N/A"},{"$error":"#N/A"}]
["014",null,null,null,{"$f":"VLOOKUP(D27,BDD!B:C,2,0)","v":{"$error":"#N/A"}},null,null,null,65,55,22,{"$f":"VLOOKUP(D27,BDD!B:M,11,0)","v":{"$error":"#N/A"}},{"$f":"VLOOKUP(D27,BDD!B:K,10,0)","v":{"$error":"#N/A"}},{"$error":"#N/A"},{"$error":"#N/A"}]
["015",null,null,null,{"$f":"VLOOKUP(D28,BDD!B:C,2,0)","v":{"$error":"#N/A"}},null,null,null,65,55,22,{"$f":"VLOOKUP(D28,BDD!B:M,11,0)","v":{"$error":"#N/A"}},{"$f":"VLOOKUP(D28,BDD!B:K,10,0)","v":{"$error":"#N/A"}},{"$error":"#N/A"},{"$error":"#N/A"}]
["016",null,null,null,{"$f":"VLOOKUP(D29,BDD!B:C,2,0)","v":{"$error":"#N/A"}},null,null,null,65,55,22,{"$f":"VLOOKUP(D29,BDD!B:M,11,0)","v":{"$error":"#N/A"}},{"$f":"VLOOKUP(D29,BDD!B:K,10,0)","v":{"$error":"#N/A"}},{"$error":"#N/A"},{"$error":"#N/A"}]
["017",null,null,null,{"$f":"VLOOKUP(D30,BDD!B:C,2,0)","v":{"$error":"#N/A"}},null,null,null,65,55,22,{"$f":"VLOOKUP(D30,BDD!B:M,11,0)","v":{"$error":"#N/A"}},{"$f":"VLOOKUP(D30,BDD!B:K,10,0)","v":{"$error":"#N/A"}},{"$error":"#N/A"},{"$error":"#N/A"}]
{"$rows_left_out":10}
{"sheet":"BDD","index":2,"n_rows":12,"n_cols":13,"rows_kept":12,"cut":false,"hidden":false,"merged":[[1,9,3,9]]}
[]
[null,null,null,null,null,null,null,"T1",{"$f":"+CHIFFRAGE!J2","v":65},{"$f":"(I2+I3)/2-I4","v":38}]
[null,null,null,null,null,null,null,"T2",{"$f":"+CHIFFRAGE!J3","v":55}]
[null,null,null,null,null,null,null,"Tr",{"$f":"+CHIFFRAGE!J4","v":22}]
[]
[]
[]
["MODELE","REFERENCE","DESIGNATION TEXTE","TYPE","HAUTEUR EN MM","LONGUEUR EN MM","PROF. EN MM","Exposant","PUISSANCE EN WATT","COULEUR","Prix","PUISSANCE CORRIGEE","COEFFICIENT"]
["Tubulaire","RRN2005000622MA","Tubulaire 2 col. 0500x270x65 234W Blanc","RRN20",500,270,65,1.31,234,"RAL9016",5,{"$f":"+I9*M9","v":164.0574},{"$f":"VLOOKUP(ROUND($J$2,0),'Facteurs de corrections'!$A$6:$AA$73,HLOOKUP(ROUND(H9,2),'Facteurs de corrections'!$A$6:$AA$73,68,FALSE),FALSE)","v":0.70109999999999995}]
["Tubulaire","RRN2005000722MA","Tubulaire 2 col. 0500x315x65 273W Blanc","RRN20",500,315,65,1.31,273,"RAL9016",10,{"$f":"+I10*M10","v":191.40029999999999},{"$f":"VLOOKUP(ROUND($J$2,0),'Facteurs de corrections'!$A$6:$AA$73,HLOOKUP(ROUND(H10,2),'Facteurs de corrections'!$A$6:$AA$73,68,FALSE),FALSE)","v":0.70109999999999995}]
["FK0","FK0220610W02","Panneaux type 22 600x1000x100 998W blanc","FK022",600,1000,100,1.28,998,"RAL9016",15,{"$f":"+I11*M11","v":705.38639999999998},{"$f":"VLOOKUP(ROUND($J$2,0),'Facteurs de corrections'!$A$6:$AA$73,HLOOKUP(ROUND(H11,2),'Facteurs de corrections'!$A$6:$AA$73,68,FALSE),FALSE)","v":0.70679999999999998}]
["FTP","FTP120750601R2K","panneaux type 12 750x600x64 625W blanc","FTP12",750,600,64,1.26,625,"RAL9016",20,444.1875,{"$f":"VLOOKUP(ROUND($J$2,0),'Facteurs de corrections'!$A$6:$AA$73,HLOOKUP(ROUND(H12,2),'Facteurs de corrections'!$A$6:$AA$73,68,FALSE),FALSE)","v":0.7107}]

{"sheet":"Paramètres","index":3,"n_rows":4,"n_cols":7,"rows_kept":4,"cut":false,"hidden":false,"merged":[]}
["Modèle","Type","Hauteur","Longueur","Puissance","Couple","Type filtré"]
["Tubulaire","RRN20",500,270,234,"TubulaireRRN20","RRN20"]
["FK0","FK022",600,1000,998,"FK0FK022"]
["FTP","FTP12",750,600,625,"FTPFTP12"]

{"sheet":"Facteurs de corrections","index":4,"n_rows":73,"n_cols":28,"rows_kept":73,"cut":false,"hidden":false,"merged":[[4,0,5,0],[4,27,5,27],[4,1,4,26]]}
[]
[]
[]
[]
["T [K]","Exponent n",null,null,null,null,null,null,null,null,null,null,null,null,null,null,null,null,null,null,null,null,null,null,null,null,null,"T [K]"]
[null,1.17,1.18,1.19,1.2,1.21,1.22,1.23,1.24,1.25,1.26,1.27,1.28,1.29,1.3,1.31,1.32,1.33,1.34,1.35,1.36,1.37,1.38,1.39,1.4,1.41,1.46]
[15,0.24540000000000001,0.24249999999999999,0.23960000000000001,0.23680000000000001,0.2339,0.2311,0.22839999999999999,0.22570000000000001,0.223,0.2203,0.2177,0.21510000000000001,0.21249999999999999,0.21,0.20749999999999999,0.20499999999999999,0.2026,0.2001,0.19769999999999999,0.19539999999999999,0.19309999999999999,0.1908,0.1885,0.1862,0.184,0.17330000000000001,15]
[16,0.26469999999999999,0.26169999999999999,0.25879999999999997,0.25580000000000003,0.25290000000000001,0.25009999999999999,0.24729999999999999,0.2445,0.2417,0.23899999999999999,0.23630000000000001,0.2336,0.23100000000000001,0.22839999999999999,0.2258,0.22320000000000001,0.22070000000000001,0.21820000000000001,0.2157,0.21329999999999999,0.2109,0.20849999999999999,0.20619999999999999,0.20380000000000001,0.20150000000000001,0.19040000000000001,16]
[17,0.28420000000000001,0.28110000000000002,0.27810000000000001,0.27510000000000001,0.2722,0.26929999999999998,0.26640000000000003,0.2636,0.26069999999999999,0.25790000000000002,0.25519999999999998,0.2525,0.24979999999999999,0.24709999999999999,0.24440000000000001,0.24179999999999999,0.2392,0.23669999999999999,0.2341,0.2316,0.22919999999999999,0.22670000000000001,0.2243,0.22189999999999999,0.2195,0.20799999999999999,17]
[18,0.30380000000000001,0.30070000000000002,0.29770000000000002,0.29470000000000002,0.29170000000000001,0.28870000000000001,0.2858,0.28289999999999998,0.28000000000000003,0.2772,0.27439999999999998,0.27160000000000001,0.26889999999999997,0.2661,0.26340000000000002,0.26079999999999998,0.2581,0.2555,0.25290000000000001,0.25040000000000001,0.24779999999999999,0.24529999999999999,0.24279999999999999,0.2404,0.2379,0.2261,18]
[19,0.32369999999999999,0.32050000000000001,0.3175,0.31440000000000001,0.31140000000000001,0.30840000000000001,0.30549999999999999,0.30249999999999999,0.29959999999999998,0.29680000000000001,0.29389999999999999,0.29110000000000003,0.2883,0.28549999999999998,0.2828,0.28010000000000002,0.27739999999999998,0.2747,0.27210000000000001,0.26950000000000002,0.26690000000000003,0.26429999999999998,0.26179999999999998,0.25929999999999997,0.25679999999999997,0.2447,19]
[20,0.34360000000000002,0.34050000000000002,0.33739999999999998,0.33439999999999998,0.33129999999999998,0.32829999999999998,0.32529999999999998,0.32240000000000002,0.31940000000000002,0.3165,0.31369999999999998,0.31080000000000002,0.308,0.30520000000000003,0.3024,0.29970000000000002,0.2969,0.29420000000000002,0.29160000000000003,0.28889999999999999,0.2863,0.28370000000000001,0.28110000000000002,0.27860000000000001,0.27600000000000002,0.26369999999999999,20]
[21,0.36380000000000001,0.36070000000000002,0.35759999999999997,0.35449999999999998,0.35149999999999998,0.34839999999999999,0.34539999999999998,0.34250000000000003,0.33950000000000002,0.33660000000000001,0.3337,0.33079999999999998,0.32800000000000001,0.32519999999999999,0.32240000000000002,0.3196,0.31690000000000002,0.31409999999999999,0.31140000000000001,0.30869999999999997,0.30609999999999998,0.30349999999999999,0.3009,0.29830000000000001,0.29570000000000002,0.28320000000000001,21]
[22,0.38419999999999999,0.38109999999999999,0.378,0.37490000000000001,0.37180000000000002,0.36880000000000002,0.36580000000000001,0.36280000000000001,0.3599,0.3569,0.35399999999999998,0.35110000000000002,0.3483,0.34539999999999998,0.34260000000000002,0.33979999999999999,0.33710000000000001,0.33429999999999999,0.33160000000000001,0.32890000000000003,0.32619999999999999,0.3236,0.32100000000000001,0.31830000000000003,0.31569999999999998,0.30309999999999998,22]
[23,0.4047,0.40160000000000001,0.39850000000000002,0.39539999999999997,0.39240000000000003,0.38929999999999998,0.38629999999999998,0.38340000000000002,0.38040000000000002,0.3775,0.37459999999999999,0.37169999999999997,0.36880000000000002,0.36599999999999999,0.36320000000000002,0.3604,0.35759999999999997,0.3548,0.35210000000000002,0.34939999999999999,0.34670000000000001,0.34399999999999997,0.34139999999999998,0.33879999999999999,0.3362,0.32340000000000002,23]
[24,0.4254,0.42230000000000001,0.41920000000000002,0.41610000000000003,0.41310000000000002,0.41010000000000002,0.40710000000000002,0.40410000000000001,0.4012,0.39829999999999999,0.39539999999999997,0.39250000000000002,0.38969999999999999,0.38679999999999998,0.38400000000000001,0.38119999999999998,0.37840000000000001,0.37569999999999998,0.37290000000000001,0.37019999999999997,0.36749999999999999,0.3649,0.36220000000000002,0.35959999999999998,0.3569,0.34410000000000002,24]
[25,0.44619999999999999,0.44309999999999999,0.44009999999999999,0.437,0.434,0.43099999999999999,0.42809999999999998,0.42509999999999998,0.42220000000000002,0.41930000000000001,0.41639999999999999,0.41360000000000002,0.41070000000000001,0.40789999999999998,0.40510000000000002,0.40229999999999999,0.39950000000000002,0.39679999999999999,0.39410000000000001,0.39140000000000003,0.38869999999999999,0.38600000000000001,0.38340000000000002,0.38069999999999998,0.37809999999999999,0.36530000000000001,25]
[26,0.46710000000000002,0.46410000000000001,0.46110000000000001,0.45810000000000001,0.4551,0.45219999999999999,0.44919999999999999,0.44629999999999997,0.44340000000000002,0.44059999999999999,0.43769999999999998,0.43490000000000001,0.432,0.42920000000000003,0.42649999999999999,0.42370000000000002,0.4209,0.41820000000000002,0.41549999999999998,0.4128,0.41010000000000002,0.40749999999999997,0.40489999999999998,0.4022,0.39960000000000001,0.38679999999999998,26]
[27,0.48820000000000002,0.48520000000000002,0.48230000000000001,0.4793,0.47639999999999999,0.47349999999999998,0.47060000000000002,0.4677,0.46479999999999999,0.46200000000000002,0.4592,0.45639999999999997,0.4536,0.45079999999999998,0.4481,0.44529999999999997,0.44259999999999999,0.43990000000000001,0.43719999999999998,0.4345,0.43190000000000001,0.42920000000000003,0.42670000000000002,0.42409999999999998,0.4214,0.40870000000000001,27]
[28,0.50939999999999996,0.50649999999999995,0.50360000000000005,0.50070000000000003,0.49780000000000002,0.495,0.49209999999999998,0.48930000000000001,0.48649999999999999,0.48370000000000002,0.48089999999999999,0.47810000000000002,0.47539999999999999,0.47260000000000002,0.46989999999999998,0.4672,0.46450000000000002,0.46189999999999998,0.4592,0.45660000000000001,0.45400000000000001,0.45129999999999998,0.44879999999999998,0.44619999999999999,0.44359999999999999,0.43099999999999999,28]
[29,0.53080000000000005,0.52790000000000004,0.52510000000000001,0.5222,0.51939999999999997,0.51659999999999995,0.51380000000000003,0.51100000000000001,0.50829999999999997,0.50549999999999995,0.50280000000000002,0.50009999999999999,0.49740000000000001,0.49469999999999997,0.49199999999999999,0.4894,0.48670000000000002,0.48409999999999997,0.48149999999999998,0.47889999999999999,0.4763,0.47370000000000001,0.47120000000000001,0.46870000000000001,0.46610000000000001,0.45369999999999999,29]
[30,0.55230000000000001,0.54949999999999999,0.54669999999999996,0.54390000000000005,0.54120000000000001,0.53839999999999999,0.53569999999999995,0.53300000000000003,0.53029999999999999,0.52759999999999996,0.52490000000000003,0.52229999999999999,0.51959999999999995,0.51700000000000002,0.51439999999999997,0.51180000000000003,0.50919999999999999,0.50660000000000005,0.504,0.50149999999999995,0.499,0.49640000000000001,0.49399999999999999,0.49149999999999999,0.4889,0.47670000000000001,30]
[31,0.57389999999999997,0.57110000000000005,0.56840000000000002,0.56569999999999998,0.56310000000000004,0.56040000000000001,0.55769999999999997,0.55510000000000004,0.55249999999999999,0.54990000000000006,0.54720000000000002,0.54469999999999996,0.54210000000000003,0.53949999999999998,0.53700000000000003,0.53439999999999999,0.53190000000000004,0.52939999999999998,0.52690000000000003,0.52439999999999998,0.52190000000000003,0.51939999999999997,0.51700000000000002,0.51449999999999996,0.5121,0.50009999999999999,31]
[32,0.59560000000000002,0.59289999999999998,0.59030000000000005,0.5877,0.58509999999999995,0.58250000000000002,0.57989999999999997,0.57740000000000002,0.57479999999999998,0.57230000000000003,0.56979999999999997,0.56720000000000004,0.56469999999999998,0.56220000000000003,0.55979999999999996,0.55730000000000002,0.55479999999999996,0.5524,0.54990000000000006,0.54749999999999999,0.54510000000000003,0.54269999999999996,0.5403,0.53790000000000004,0.53549999999999998,0.52380000000000004,32]
[33,0.61739999999999995,0.6149,0.61229999999999996,0.60980000000000001,0.60729999999999995,0.6048,0.60229999999999995,0.5998,0.59740000000000004,0.59489999999999998,0.59250000000000003,0.59,0.58760000000000001,0.58520000000000005,0.58279999999999998,0.58040000000000003,0.57799999999999996,0.5756,0.57330000000000003,0.57089999999999996,0.56850000000000001,0.56620000000000004,0.56389999999999996,0.56159999999999999,0.55930000000000002,0.54779999999999995,33]
[34,0.63929999999999998,0.63690000000000002,0.63449999999999995,0.6321,0.62960000000000005,0.62719999999999998,0.62480000000000002,0.62250000000000005,0.62009999999999998,0.61770000000000003,0.61539999999999995,0.61299999999999999,0.61070000000000002,0.60829999999999995,0.60599999999999998,0.60370000000000001,0.60140000000000005,0.59909999999999997,0.5968,0.59460000000000002,0.59230000000000005,0.59,0.58779999999999999,0.58560000000000001,0.58330000000000004,0.57220000000000004,34]
[35,0.66139999999999999,0.65910000000000002,0.65669999999999995,0.65439999999999998,0.65210000000000001,0.64980000000000004,0.64749999999999996,0.6452,0.64300000000000002,0.64070000000000005,0.63839999999999997,0.63619999999999999,0.63390000000000002,0.63170000000000004,0.62949999999999995,0.62729999999999997,0.625,0.62280000000000002,0.62060000000000004,0.61850000000000005,0.61629999999999996,0.61409999999999998,0.61199999999999999,0.60980000000000001,0.60760000000000003,0.59699999999999998,35]
[36,0.68359999999999999,0.68130000000000002,0.67910000000000004,0.67689999999999995,0.67469999999999997,0.67249999999999999,0.6704,0.66820000000000002,0.66600000000000004,0.66390000000000005,0.66169999999999995,0.65949999999999998,0.65739999999999998,0.65529999999999999,0.65310000000000001,0.65100000000000002,0.64890000000000003,0.64680000000000004,0.64470000000000005,0.64259999999999995,0.64049999999999996,0.63839999999999997,0.63639999999999997,0.63439999999999996,0.63219999999999998,0.62209999999999999,36]
[37,0.70579999999999998,0.70369999999999999,0.7016,0.6996,0.69750000000000001,0.69540000000000002,0.69330000000000003,0.69130000000000003,0.68920000000000003,0.68720000000000003,0.68510000000000004,0.68310000000000004,0.68110000000000004,0.67900000000000005,0.67700000000000005,0.67500000000000004,0.67300000000000004,0.67100000000000004,0.66900000000000004,0.66700000000000004,0.66500000000000004,0.66300000000000003,0.66110000000000002,0.65920000000000001,0.65720000000000001,0.64739999999999998,37]
[38,0.72819999999999996,0.72619999999999996,0.72430000000000005,0.72230000000000005,0.72030000000000005,0.71840000000000004,0.71650000000000003,0.71450000000000002,0.71260000000000001,0.7107,0.7087,0.70679999999999998,0.70489999999999997,0.70299999999999996,0.70109999999999995,0.69920000000000004,0.69730000000000003,0.69540000000000002,0.69350000000000001,0.69159999999999999,0.68979999999999997,0.68789999999999996,0.68610000000000004,0.68420000000000003,0.68230000000000002,0.67310000000000003,38]
{"$rows_left_out":43}