{"text_format":"1","workbook":"xlsx","n_sheets":24,"sheets":["Album Photos","Champions","Écuries","Pilotes","Melbourne","Bahrein","Vietnam","Chine","Azerbaïdjan","Espagne","Monaco","Canada","France","Autriche","GB","Hongrie","Belgique","Italie","Singapour","Russie","Japon","USA","Mexique","Abu Dhabi"],"not_rendered":{"charts":0,"images":17,"macros":1,"external_links":1,"defined_names":8,"comments":0,"pivot_tables":0},"unopened":[],"bounds":{"document_bytes":16777216,"sheet_cells":100000,"rows_first":2000,"rows_last":500,"rows_between":2000,"halvings":0,"cell_chars":16384,"cell_head_chars":4096},"cells_cut":0,"cells_raw":0,"read":"whole","date_system":"1900"}

{"sheet":"Album Photos","index":0,"n_rows":23,"n_cols":7,"rows_kept":23,"cut":false,"hidden":false,"merged":[[1,5,1,6]]}
[]
[null,"Photos Pilotes",null,null,null,"Photos F1"]
[null,"Noms",null,"Photos",null,"Noms","Photos"]
[null," HAMILTON Lewis",null,null,null,"Mercedes",{"$f":"Image1","v":{"$error":"#NAME?"}}]
[null," BOTTAS Valterii",null,null,null,"Ferrari"]
[null," LECLERC Charles",null,null,null,"Red Bull"]
[null," VETTEL Sebastian",null,null,null,"Racing Point"]
[null," VERSTAPPEN Max",null,null,null,"Williams"]
[null," ALBON Alexander",null,null,null,"Renault"]
[null," PEREZ Sergio",null,null,null,"Alpha Tauri"]
[null," STROLL Lance",null,null,null,"Hass"]
[null," RUSSEL George",null,null,null,"Mac Laren"]
[null," LATIFI Nicholas",null,null,null,"Alfa Roméo"]
[null," RICCIARDO Daniel"]
[null," OCON Esteban"]
[null," KVYAT Daniil"]
[null," GASLY Pierre"]
[null," GROSJEAN Romain"]
[null,"MAGNUSSEN Kevin "]
[null,"NORRIS Lando "]
[null," SAINZ Carlos"]
[null,"RAÏKKONEN Kimi "]
[null,"GIOVANIZZI Antonio "]

{"sheet":"Champions","index":1,"n_rows":22,"n_cols":10,"rows_kept":22,"cut":false,"hidden":false,"merged":[[21,1,25,3],[18,5,22,7],[21,9,25,11],[19,1,19,3],[20,1,20,3],[19,9,19,11],[20,9,20,11],[1,2,1,10],[14,2,14,10],[16,5,16,7],[17,5,17,7],[3,5,3,7],[4,5,4,7],[6,1,6,3],[7,1,7,3],[6,9,6,11],[7,9,7,11],[8,9,12,11],[8,1,12,3],[5,5,8,7]]}
[]
[null,null,"CHAMPIONNAT PILOTES 2019"]
[]
[null,null,null,null,null,"CHAMPION 2019"]
[null,null,null,null,null,{"$f":"IF(Pilotes!G5=1,Pilotes!B5,\"\")","v":"VETTEL Sebastian"}]
[null,null,null,null,null,{"$f":"MATCH(F5,'Album Photos'!$B$1:$B$23,0)","v":{"$error":"#N/A"}}]
[null,"DEUXIÈME",null,null,null,null,null,null,null,"TROIXIÈME"]
[null,{"$f":"IF(Pilotes!G6=2,Pilotes!B6,\"\")","v":"LECLERC Charles"},null,null,null,null,null,null,null,{"$f":"IF(Pilotes!G7=3,Pilotes!B7,\"\")","v":"HAMILTON Lewis"}]
[null,{"$f":"MATCH(B8,'Album Photos'!$B$1:$B$23,0)","v":{"$error":"#N/A"}},null,null,null,null,null,null,null,{"$f":"MATCH(J8,'Album Photos'!$B$1:$B$23,0)","v":{"$error":"#N/A"}}]
[]
[]
[]
[]
[]
[null,null,"CHAMPIONNAT CONSTRUCTEURS 2019"]
[]
[null,null,null,null,null,"CHAMPION 2019"]
[null,null,null,null,null,{"$f":"IF(Écuries!F4=1,Écuries!B4,\"\")","v":"FERRARI"}]
[null,null,null,null,null,{"$f":"MATCH(F18,'Album Photos'!$F$3:$F$13,0)","v":3}]
[null,"DEUXIÈME",null,null,null,null,null,null,null,"TROIXIÈME"]
[null,{"$f":"IF(Écuries!F5=2,Écuries!B5,\"\")","v":"MERCEDES"},null,null,null,null,null,null,null,{"$f":"IF(Écuries!F6=3,Écuries!B6,\"\")","v":"ALFA ROMÉO"}]
[null,{"$f":"MATCH(B21,'Album Photos'!$F$3:$F$13,0)","v":2},null,null,null,null,null,null,null,{"$f":"MATCH(J21,'Album Photos'!$F$3:$F$13,0)","v":11}]

{"sheet":"Écuries","index":2,"n_rows":13,"n_cols":6,"rows_kept":13,"cut":false,"hidden":false,"merged":[[0,1,0,5]]}
[]
[]
[null,"ÉCURIES","POINTS","Écart/premier","Écart/précédent","RANG"]
[null,"FERRARI",{"$f":"SUM(Melbourne:Hongrie!J6)","v":116},null,null,{"$f":"IF(C4=\"\",0,(RANK(C4,$C$4:$C$13)))+COUNTIF(C$4:C4,C4)-1","v":1}]
[null,"MERCEDES",{"$f":"SUM(Melbourne:Hongrie!J5)","v":50},{"$f":"C5-C4","v":-66},{"$f":"C5-C4","v":-66},{"$f":"IF(C5=\"\",0,(RANK(C5,$C$4:$C$13)))+COUNTIF(C$4:C5,C5)-1","v":2}]
[null,"ALFA ROMÉO",{"$f":"SUM(Melbourne:Hongrie!J14)","v":40},{"$f":"C6-C4","v":-76},{"$f":"C6-C5","v":-10},{"$f":"IF(C6=\"\",0,(RANK(C6,$C$4:$C$13)))+COUNTIF(C$4:C6,C6)-1","v":3}]
[null,"Mc LAREN",{"$f":"SUM(Melbourne:Hongrie!J13)","v":25},{"$f":"C7-C4","v":-91},-15,{"$f":"IF(C7=\"\",0,(RANK(C7,$C$4:$C$13)))+COUNTIF(C$4:C7,C7)-1","v":4}]
[null,"TORO ROSSO",{"$f":"SUM(Melbourne:Hongrie!J11)","v":18},{"$f":"C8-C4","v":-98},-7,{"$f":"IF(C8=\"\",0,(RANK(C8,$C$4:$C$13)))+COUNTIF(C$4:C8,C8)-1","v":5}]
[null,"RACING POINT",{"$f":"SUM(Melbourne:Hongrie!J8)","v":0},{"$f":"C9-C4","v":-116},-18,{"$f":"IF(C9=\"\",0,(RANK(C9,$C$4:$C$13)))+COUNTIF(C$4:C9,C9)-1","v":6}]
[null,"RED BULL",{"$f":"SUM(Melbourne:Hongrie!J7)","v":0},{"$f":"C10-C4","v":-116},0,{"$f":"IF(C10=\"\",0,(RANK(C10,$C$4:$C$13)))+COUNTIF(C$4:C10,C10)-1","v":7}]
[null,"RENAULT",{"$f":"SUM(Melbourne:Hongrie!J10)","v":0},{"$f":"C11-C4","v":-116},0,{"$f":"IF(C11=\"\",0,(RANK(C11,$C$4:$C$13)))+COUNTIF(C$4:C11,C11)-1","v":8}]
[null,"HASS",{"$f":"SUM(Melbourne:Hongrie!J12)","v":0},{"$f":"C12-C4","v":-116},0,{"$f":"IF(C12=\"\",0,(RANK(C12,$C$4:$C$13)))+COUNTIF(C$4:C12,C12)-1","v":9}]
[null,"WILLIAMS",{"$f":"SUM(Melbourne:Hongrie!J9)","v":0},{"$f":"C13-C4","v":-116},0,{"$f":"IF(C13=\"\",0,(RANK(C13,$C$4:$C$13)))+COUNTIF(C$4:C13,C13)-1","v":10}]

{"sheet":"Pilotes","index":3,"n_rows":32,"n_cols":10,"rows_kept":32,"cut":false,"hidden":false,"merged":[[2,9,3,9],[0,0,0,7],[2,1,3,1],[2,2,3,2],[2,6,3,6],[2,3,3,3],[2,4,3,4],[2,5,3,5]]}
[]
[]
[null,"PILOTES","Points","Écart-premier","Écart/précédent","Pôle Position","Place","OUT",null,"Courses"]
[null,null,{"$f":"IFERROR(SUM(Melbourne!G33,[1]Bahreïn!F33),\"\")","v":0},null,null,null,{"$f":"IF(C4=0,\"\",(RANK(C4,C1:C4)))","v":""},"Pos.Saison",null,{"$f":"IF(F4=0,\"\",(RANK(F4,F1:F4)))","v":""}]
[null,"VETTEL Sebastian",{"$f":"SUM('Melbourne:Abu Dhabi'!G8)","v":58},null,null,{"$f":"CalculPool(B5)","v":0},{"$f":"IF(C5=\"\",0,(RANK(C5,$C$5:$C$24)))+COUNTIF(C$5:C5,C5)-1","v":1},{"$f":"CalculPosition(B5)","v":0},null,"Melbourne"]
[null,"LECLERC Charles",{"$f":"SUM('Melbourne:Abu Dhabi'!G9)","v":58},{"$f":"C6-C5","v":0},{"$f":"C5-C6","v":0},{"$f":"CalculPool(B6)","v":0},{"$f":"IF(C6=\"\",0,(RANK(C6,$C$5:$C$24)))+COUNTIF(C$5:C6,C6)-1","v":2},{"$f":"CalculPosition(B6)","v":0},null,"Bahrein"]
[null,"HAMILTON Lewis",{"$f":"SUM('Melbourne:Abu Dhabi'!G5)","v":50},{"$f":"C7-C5","v":-8},{"$f":"C6-C7","v":8},0,{"$f":"IF(C7=\"\",0,(RANK(C7,$C$5:$C$24)))+COUNTIF(C$5:C7,C7)-1","v":3},{"$f":"CalculPosition(B8)","v":1},null,"Chine"]
[null,"RAÏKKÖNEN Kimi",{"$f":"SUM('Melbourne:Abu Dhabi'!G32)","v":40},{"$f":"C8-C5","v":-18},{"$f":"C7-C8","v":10},{"$f":"CalculPool(B8)","v":1},{"$f":"IF(C8=\"\",0,(RANK(C8,$C$5:$C$24)))+COUNTIF(C$5:C8,C8)-1","v":4},{"$f":"CalculPosition(B11)","v":1},null,"Azerbaïdjan"]
[null,"NORRIS Lando",{"$f":"SUM('Melbourne:Abu Dhabi'!G29)","v":25},{"$f":"C9-C5","v":-33},{"$f":"C8-C9","v":15},3,{"$f":"IF(C9=\"\",0,(RANK(C9,$C$5:$C$24)))+COUNTIF(C$5:C9,C9)-1","v":5},{"$f":"CalculPosition(B9)","v":0},null,"Espagne"]
[null,"GASLY Pierre",{"$f":"SUM('Melbourne:Abu Dhabi'!G24)","v":18},{"$f":"C10-C5","v":-40},{"$f":"C9-C10","v":7},1,{"$f":"IF(C10=\"\",0,(RANK(C10,$C$5:$C$24)))+COUNTIF(C$5:C10,C10)-1","v":6},0,null,"Monaco"]
[null,"PEREZ Sergio",{"$f":"SUM('Melbourne:Abu Dhabi'!G14)","v":0},{"$f":"C11-C5","v":-58},{"$f":"C10-C11","v":18},1,{"$f":"IF(C11=\"\",0,(RANK(C11,$C$5:$C$24)))+COUNTIF(C$5:C11,C11)-1","v":7},1,null,"Canada"]
[null,"VERSTAPPEN Max",{"$f":"SUM('Melbourne:Abu Dhabi'!G11)","v":0},{"$f":"C12-C5","v":-58},0,0,{"$f":"IF(C12=\"\",0,(RANK(C12,$C$5:$C$24)))+COUNTIF(C$5:C12,C12)-1","v":8},1,null,"France"]
[null,"SAINZ.Jr Carlos",{"$f":"SUM('Melbourne:Abu Dhabi'!G30)","v":0},{"$f":"C13-C5","v":-58},0,0,{"$f":"IF(C13=\"\",0,(RANK(C13,$C$5:$C$24)))+COUNTIF(C$5:C13,C13)-1","v":9},0,null,"Autriche"]
[null,"MAGNUSSEN Kevin",{"$f":"SUM('Melbourne:Abu Dhabi'!G27)","v":0},{"$f":"C14-C5","v":-58},0,0,{"$f":"IF(C14=\"\",0,(RANK(C14,$C$5:$C$24)))+COUNTIF(C$5:C14,C14)-1","v":10},0,null,"GB"]
[null,"GROSJEAN Romain",{"$f":"SUM('Melbourne:Abu Dhabi'!G26)","v":0},{"$f":"C15-C5","v":-58},0,0,{"$f":"IF(C15=\"\",0,(RANK(C15,$C$5:$C$24)))+COUNTIF(C$5:C15,C15)-1","v":11},0,null,"Hongrie"]
[null,"KVYAT Daniil",{"$f":"SUM('Melbourne:Abu Dhabi'!G23)","v":0},{"$f":"C16-C5","v":-58},0,0,{"$f":"IF(C16=\"\",0,(RANK(C16,$C$5:$C$24)))+COUNTIF(C$5:C16,C16)-1","v":12},0,null,"Belgique"]
[null,"OCON Sebastian",{"$f":"SUM('Melbourne:Abu Dhabi'!G21)","v":0},{"$f":"C17-C5","v":-58},0,1,{"$f":"IF(C17=\"\",0,(RANK(C17,$C$5:$C$24)))+COUNTIF(C$5:C17,C17)-1","v":13},0,null,"Italie"]
[null,"RICCIARDO Daniel",{"$f":"SUM('Melbourne:Abu Dhabi'!G20)","v":0},{"$f":"C18-C5","v":-58},0,4,{"$f":"IF(C18=\"\",0,(RANK(C18,$C$5:$C$24)))+COUNTIF(C$5:C18,C18)-1","v":14},0,null,"Singapour"]
[null,"GIOVANIZZI Antonio",{"$f":"SUM('Melbourne:Abu Dhabi'!G33)","v":0},{"$f":"C19-C5","v":-58},0,0,{"$f":"IF(C19=\"\",0,(RANK(C19,$C$5:$C$24)))+COUNTIF(C$5:C19,C19)-1","v":15},0,null,"Russie"]
[null,"ALBON Alexander",{"$f":"SUM('Melbourne:Abu Dhabi'!G12)","v":0},{"$f":"C20-C5","v":-58},0,2,{"$f":"IF(C20=\"\",0,(RANK(C20,$C$5:$C$24)))+COUNTIF(C$5:C20,C20)-1","v":16},0,null,"Japon"]
[null,"RUSSELL George",{"$f":"SUM('Melbourne:Abu Dhabi'!G17)","v":0},{"$f":"C21-C5","v":-58},0,0,{"$f":"IF(C21=\"\",0,(RANK(C21,$C$5:$C$24)))+COUNTIF(C$5:C21,C21)-1","v":17},0,null,"USA"]
[null,"BOTTAS Valterri",{"$f":"SUM('Melbourne:Abu Dhabi'!G6)","v":0},{"$f":"C22-C5","v":-58},0,0,{"$f":"IF(C22=\"\",0,(RANK(C22,$C$5:$C$24)))+COUNTIF(C$5:C22,C22)-1","v":18},0,null,"Mexique"]
[null,"LATIFI Nichola",{"$f":"SUM('Melbourne:Abu Dhabi'!G18)","v":0},{"$f":"C23-C5","v":-58},{"$f":"C22-C23","v":0},0,{"$f":"IF(C23=\"\",0,(RANK(C23,$C$5:$C$24)))+COUNTIF(C$5:C23,C23)-1","v":19},0,null,"Abu Dhabi"]
[null,"STROLL Lance",{"$f":"SUM('Melbourne:Abu Dhabi'!G15)","v":0},{"$f":"C24-C5","v":-58},0,1,{"$f":"IF(C24=\"\",0,(RANK(C24,$C$5:$C$24)))+COUNTIF(C$5:C24,C24)-1","v":20},0,null,"Vietnam"]
[]
[]
[null,"Pour rajouter une course :"]
[null,null,1,"créer une feuille"]
[null,null,2,"La nommer du nom de la course"]
[null,null,3,"Mettre ce nom à la fin du tableau Courses"]
[null,"La nouvelle feuille doit avoir la même structure que les autres feuilles de courses."]
[null,"( pilote en colonne A,  résultat en colonne D )"]

{"sheet":"Melbourne","index":4,"n_rows":34,"n_cols":11,"rows_kept":34,"cut":false,"hidden":false,"merged":[[31,1,33,1],[31,2,33,2],[13,1,15,1],[13,2,15,2],[16,1,18,1],[16,2,18,2],[19,1,21,1],[19,2,21,2],[28,1,30,1],[28,2,30,2],[25,2,27,2],[22,1,24,1],[22,2,24,2],[25,1,27,1],[7,1,9,1],[7,2,9,2],[10,1,12,1],[10,2,12,2],[0,0,1,14],[4,1,6,1],[4,2,6,2],[2,0,3,0],[2,8,2,10],[2,1,3,1],[2,2,3,2],[2,3,3,3],[2,5,3,5],[2,6,3,6],[2,4,3,4]]}
["AUSTRALIE - 17 MARS 2019"]
[]
["PILOTES","ECURIES","VOITURES","Finish","Pôle","Pt tour","Points",null,"CLASSEMENT"]
[null,null,null,null,null,null,null,null,"ÉCURIES","POINTS","RANG"]
["HAMILTON Lewis","MERCEDES",null,"OUT",null,null,{"$f":"IFERROR(CHOOSE(D5,25,18,15,12,10,8,6,4,2,1)+(F5=1),0)","v":0},null,"MERCEDES",{"$f":"SUM(G5:G7)","v":0},{"$f":"IF(J5=\"\",0,(RANK(J5,$J$5:$J$14)))+COUNTIF(J$5:J5,J5)-1","v":3}]
["BOTTAS Valterri",null,null,null,null,null,{"$f":"IFERROR(CHOOSE(D6,25,18,15,12,10,8,6,4,2,1)+(F6=1),0)","v":0},null,"FERRARI",{"$f":"SUM(G8:G10)","v":33},{"$f":"IF(J6=\"\",0,(RANK(J6,$J$5:$J$14)))+COUNTIF(J$5:J6,J6)-1","v":1}]
[null,null,null,null,null,null,{"$f":"IFERROR(CHOOSE(D7,25,18,15,12,10,8,6,4,2,1)+(F7=1),\"\")","v":""},null,"RED BULL",{"$f":"SUM(G11:G13)","v":0},{"$f":"IF(J7=\"\",0,(RANK(J7,$J$5:$J$14)))+COUNTIF(J$5:J7,J7)-1","v":4}]
["VETTEL Sebastian","FERRARI",null,2,null,null,{"$f":"IFERROR(CHOOSE(D8,25,18,15,12,10,8,6,4,2,1)+(F8=1),0)","v":18},null,"RACING POINT",{"$f":"SUM(G14:G16)","v":0},{"$f":"IF(J8=\"\",0,(RANK(J8,$J$5:$J$14)))+COUNTIF(J$5:J8,J8)-1","v":5}]
["LECLERC Charles",null,null,3,null,null,{"$f":"IFERROR(CHOOSE(D9,25,18,15,12,10,8,6,4,2,1)+(F9=1),0)","v":15},null,"WILLIAMS",{"$f":"SUM(G17:G19)","v":0},{"$f":"IF(J9=\"\",0,(RANK(J9,$J$5:$J$14)))+COUNTIF(J$5:J9,J9)-1","v":6}]
[null,null,null,null,null,null,{"$f":"IFERROR(CHOOSE(D10,25,18,15,12,10,8,6,4,2,1)+(F10=1),\"\")","v":""},null,"RENAULT",{"$f":"SUM(G20:G22)","v":0},{"$f":"IF(J10=\"\",0,(RANK(J10,$J$5:$J$14)))+COUNTIF(J$5:J10,J10)-1","v":7}]
["VERSTAPPEN Max","RED BULL",null,"OUT",null,null,{"$f":"IFERROR(CHOOSE(D11,25,18,15,12,10,8,6,4,2,1)+(F11=1),0)","v":0},null,"TORO ROSSO",{"$f":"SUM(G23:G25)","v":0},{"$f":"IF(J11=\"\",0,(RANK(J11,$J$5:$J$14)))+COUNTIF(J$5:J11,J11)-1","v":8}]
["ALBON Alexander",null,null,null,1,null,{"$f":"IFERROR(CHOOSE(D12,25,18,15,12,10,8,6,4,2,1)+(F12=1),0)","v":0},null,"HAAS",{"$f":"SUM(G26:G28)","v":0},{"$f":"IF(J12=\"\",0,(RANK(J12,$J$5:$J$14)))+COUNTIF(J$5:J12,J12)-1","v":9}]
[null,null,null,null,null,null,{"$f":"IFERROR(CHOOSE(D13,25,18,15,12,10,8,6,4,2,1)+(F13=1),\"\")","v":""},null,"Mc LAREN",{"$f":"SUM(G29:G31)","v":0},{"$f":"IF(J13=\"\",0,(RANK(J13,$J$5:$J$14)))+COUNTIF(J$5:J13,J13)-1","v":10}]
["PEREZ Sergio","RACING\nPOINT",null,null,null,null,{"$f":"IFERROR(CHOOSE(D14,25,18,15,12,10,8,6,4,2,1)+(F14=1),0)","v":0},null,"ALFA ROMEO",{"$f":"SUM(G32:G34)","v":25},{"$f":"IF(J14=\"\",0,(RANK(J14,$J$5:$J$14)))+COUNTIF(J$5:J14,J14)-1","v":2}]
["STROLL Lance",null,null,null,null,null,{"$f":"IFERROR(CHOOSE(D15,25,18,15,12,10,8,6,4,2,1)+(F15=1),0)","v":0}]
[null,null,null,null,null,null,{"$f":"IFERROR(CHOOSE(D16,25,18,15,12,10,8,6,4,2,1)+(F16=1),\"\")","v":""}]
["RUSSELL George","WILLIAMS",null,null,null,null,{"$f":"IFERROR(CHOOSE(D17,25,18,15,12,10,8,6,4,2,1)+(F17=1),0)","v":0}]
["LATIFI Nichola",null,null,null,null,null,{"$f":"IFERROR(CHOOSE(D18,25,18,15,12,10,8,6,4,2,1)+(F18=1),0)","v":0}]
[null,null,null,null,null,null,{"$f":"IFERROR(CHOOSE(D19,25,18,15,12,10,8,6,4,2,1)+(F19=1),\"\")","v":""}]
["RICCIARDO Daniel","RENAULT",null,null,null,null,{"$f":"IFERROR(CHOOSE(D20,25,18,15,12,10,8,6,4,2,1)+(F20=1),0)","v":0}]
["OCON Sebastian",null,null,null,null,null,{"$f":"IFERROR(CHOOSE(D21,25,18,15,12,10,8,6,4,2,1)+(F21=1),0)","v":0}]
[null,null,null,null,null,null,{"$f":"IFERROR(CHOOSE(D22,25,18,15,12,10,8,6,4,2,1)+(F22=1),\"\")","v":""}]
["KVYAT Daniil","ALPHA TAURI",null,null,null,null,{"$f":"IFERROR(CHOOSE(D23,25,18,15,12,10,8,6,4,2,1)+(F23=1),0)","v":0}]
["GASLY Pierre",null,null,null,null,null,{"$f":"IFERROR(CHOOSE(D24,25,18,15,12,10,8,6,4,2,1)+(F24=1),0)","v":0}]
[null,null,null,null,null,null,{"$f":"IFERROR(CHOOSE(D25,25,18,15,12,10,8,6,4,2,1)+(F25=1),\"\")","v":""}]
["GROSJEAN Romain","HAAS",null,null,null,null,{"$f":"IFERROR(CHOOSE(D26,25,18,15,12,10,8,6,4,2,1)+(F26=1),0)","v":0}]
["MAGNUSSEN Kevin",null,null,null,null,null,{"$f":"IFERROR(CHOOSE(D27,25,18,15,12,10,8,6,4,2,1)+(F27=1),0)","v":0}]
[null,null,null,null,null,null,{"$f":"IFERROR(CHOOSE(D28,25,18,15,12,10,8,6,4,2,1)+(F28=1),\"\")","v":""}]
["NORRIS Lando","McLAREN",null,null,null,null,{"$f":"IFERROR(CHOOSE(D29,25,18,15,12,10,8,6,4,2,1)+(F29=1),0)","v":0}]
["SAINZ.Jr Carlos",null,null,null,null,null,{"$f":"IFERROR(CHOOSE(D30,25,18,15,12,10,8,6,4,2,1)+(F30=1),0)","v":0}]
[null,null,null,null,null,null,{"$f":"IFERROR(CHOOSE(D31,25,18,15,12,10,8,6,4,2,1)+(F31=1),\"\")","v":""}]
["RAÏKKÖNEN Kimi","ALFA ROMEO",null,1,null,null,{"$f":"IFERROR(CHOOSE(D32,25,18,15,12,10,8,6,4,2,1)+(F32=1),0)","v":25}]
["GIOVANIZZI Antonio",null,null,null,null,null,{"$f":"IFERROR(CHOOSE(D33,25,18,15,12,10,8,6,4,2,1)+(F33=1),0)","v":0}]
[null,null,null,null,null,null,{"$f":"IFERROR(CHOOSE(D34,25,18,15,12,10,8,6,4,2,1)+(F34=1),\"\")","v":""}]

{"sheet":"Bahrein","index":5,"n_rows":33,"n_cols":12,"rows_kept":33,"cut":false,"hidden":false,"merged":[[31,1,33,1],[31,2,33,2],[22,1,24,1],[22,2,24,2],[25,1,27,1],[25,2,27,2],[28,1,30,1],[28,2,30,2],[13,1,15,1],[13,2,15,2],[16,1,18,1],[16,2,18,2],[19,1,21,1],[19,2,21,2],[4,1,6,1],[4,2,6,2],[7,1,9,1],[7,2,9,2],[10,1,12,1],[10,2,12,2],[0,0,1,14],[2,1,3,1],[2,2,3,2],[2,3,3,3],[2,5,3,5],[2,6,3,6],[2,8,2,10],[2,4,3,4],[2,0,3,0]]}
["BAHREÏN - 31 MARS 2019"]
[]
["PILOTES","ECURIES","VOITURES","Finish","Pôle","Pt tour","Points",null,"CLASSEMENT"]
[null,null,null,null,null,null,null,{"$f":"IF(G4=\"\",\"\",(RANK(G4,G4:G23)))","v":""},"ÉCURIES","POINTS","RANG","TOTAL"]
["HAMILTON Lewis","MERCEDES",null,1,null,null,{"$f":"IFERROR(CHOOSE(D5,25,18,15,12,10,8,6,4,2,1)+(F5=1),0)","v":25},null,"MERCEDES",{"$f":"SUM(G5:G7)","v":25},{"$f":"IF(J5=\"\",0,(RANK(J5,$J$5:$J$14)))+COUNTIF(J$5:J5,J5)-1","v":1},{"$f":"IF(J5=0,0,J5+Melbourne!J5)","v":25}]
["BOTTAS Valterri",null,null,null,null,null,{"$f":"IFERROR(CHOOSE(D6,25,18,15,12,10,8,6,4,2,1)+(F6=1),0)","v":0},null,"FERRARI",{"$f":"SUM(G8:G10)","v":15},{"$f":"IF(J6=\"\",0,(RANK(J6,$J$5:$J$14)))+COUNTIF(J$5:J6,J6)-1","v":3},{"$f":"IF(J6=0,0,J6+Melbourne!J6)","v":48}]
[null,null,null,null,null,null,null,null,"RED BULL",{"$f":"SUM(G11:G13)","v":0},{"$f":"IF(J7=\"\",0,(RANK(J7,$J$5:$J$14)))+COUNTIF(J$5:J7,J7)-1","v":4},{"$f":"IF(J7=0,0,J7+Melbourne!J7)","v":0}]
["VETTEL Sebastian","FERRARI",null,3,null,null,{"$f":"IFERROR(CHOOSE(D8,25,18,15,12,10,8,6,4,2,1)+(F8=1),0)","v":15},null,"RACING POINT",{"$f":"SUM(G14:G16)","v":0},{"$f":"IF(J8=\"\",0,(RANK(J8,$J$5:$J$14)))+COUNTIF(J$5:J8,J8)-1","v":5},{"$f":"IF(J8=0,0,J8+Melbourne!J8)","v":0}]
["LECLERC Charles",null,null,null,null,null,{"$f":"IFERROR(CHOOSE(D9,25,18,15,12,10,8,6,4,2,1)+(F9=1),0)","v":0},null,"WILLIAMS",{"$f":"SUM(G17:G19)","v":0},{"$f":"IF(J9=\"\",0,(RANK(J9,$J$5:$J$14)))+COUNTIF(J$5:J9,J9)-1","v":6},{"$f":"IF(J9=0,0,J9+Melbourne!J9)","v":0}]
[null,null,null,null,null,null,{"$f":"IFERROR(CHOOSE(D10,25,18,15,12,10,8,6,4,2,1)+(F10=1),\"\")","v":""},null,"RENAULT",{"$f":"SUM(G20:G22)","v":0},{"$f":"IF(J10=\"\",0,(RANK(J10,$J$5:$J$14)))+COUNTIF(J$5:J10,J10)-1","v":7},{"$f":"IF(J10=0,0,J10+Melbourne!J10)","v":0}]
["VERSTAPPEN Max","RED BULL",null,null,null,null,{"$f":"IFERROR(CHOOSE(D11,25,18,15,12,10,8,6,4,2,1)+(F11=1),0)","v":0},null,"TORO ROSSO",{"$f":"SUM(G23:G25)","v":18},{"$f":"IF(J11=\"\",0,(RANK(J11,$J$5:$J$14)))+COUNTIF(J$5:J11,J11)-1","v":2},{"$f":"IF(J11=0,0,J11+Melbourne!J11)","v":18}]
["ALBON Alexander",null,null,null,null,null,{"$f":"IFERROR(CHOOSE(D12,25,18,15,12,10,8,6,4,2,1)+(F12=1),0)","v":0},null,"HAAS",{"$f":"SUM(G26:G28)","v":0},{"$f":"IF(J12=\"\",0,(RANK(J12,$J$5:$J$14)))+COUNTIF(J$5:J12,J12)-1","v":8},{"$f":"IF(J12=0,0,J12+Melbourne!J12)","v":0}]
[null,null,null,null,null,null,null,null,"Mc LAREN",{"$f":"SUM(G29:G31)","v":0},{"$f":"IF(J13=\"\",0,(RANK(J13,$J$5:$J$14)))+COUNTIF(J$5:J13,J13)-1","v":9},{"$f":"IF(J13=0,0,J13+Melbourne!J13)","v":0}]
["PEREZ Sergio","RACING\nPOINT",null,null,null,null,{"$f":"IFERROR(CHOOSE(D14,25,18,15,12,10,8,6,4,2,1)+(F14=1),0)","v":0},null,"ALFA ROMEO",{"$f":"SUM(G32:G34)","v":0},{"$f":"IF(J14=\"\",0,(RANK(J14,$J$5:$J$14)))+COUNTIF(J$5:J14,J14)-1","v":10},{"$f":"IF(J14=0,0,J14+Melbourne!J14)","v":0}]
["STROLL Lance",null,null,null,null,null,{"$f":"IFERROR(CHOOSE(D15,25,18,15,12,10,8,6,4,2,1)+(F15=1),0)","v":0}]
[]
["RUSSELL George","WILLIAMS",null,null,null,null,{"$f":"IFERROR(CHOOSE(D17,25,18,15,12,10,8,6,4,2,1)+(F17=1),0)","v":0}]
["LATIFI Nichola",null,null,null,null,null,{"$f":"IFERROR(CHOOSE(D18,25,18,15,12,10,8,6,4,2,1)+(F18=1),0)","v":0}]
[]
["RICCIARDO Daniel","RENAULT",null,null,1,null,{"$f":"IFERROR(CHOOSE(D20,25,18,15,12,10,8,6,4,2,1)+(F20=1),0)","v":0}]
["OCON Sebastian",null,null,null,null,null,{"$f":"IFERROR(CHOOSE(D21,25,18,15,12,10,8,6,4,2,1)+(F21=1),0)","v":0}]
[]
["KVYAT Daniil","ALPHA TAURI",null,null,null,null,{"$f":"IFERROR(CHOOSE(D23,25,18,15,12,10,8,6,4,2,1)+(F23=1),0)","v":0}]
["GASLY Pierre",null,null,2,null,null,{"$f":"IFERROR(CHOOSE(D24,25,18,15,12,10,8,6,4,2,1)+(F24=1),0)","v":18}]
[]
["GROSJEAN Romain","HAAS",null,null,null,null,{"$f":"IFERROR(CHOOSE(D26,25,18,15,12,10,8,6,4,2,1)+(F26=1),0)","v":0}]
["MAGNUSSEN Kevin",null,null,null,null,null,{"$f":"IFERROR(CHOOSE(D27,25,18,15,12,10,8,6,4,2,1)+(F27=1),0)","v":0}]
[]
["NORRIS Lando","McLAREN",null,null,null,null,{"$f":"IFERROR(CHOOSE(D29,25,18,15,12,10,8,6,4,2,1)+(F29=1),0)","v":0}]
["SAINZ.Jr Carlos",null,null,null,null,null,{"$f":"IFERROR(CHOOSE(D30,25,18,15,12,10,8,6,4,2,1)+(F30=1),0)","v":0}]
[]
["RAÏKKÖNEN Kimi","ALFA ROMEO",null,null,null,null,{"$f":"IFERROR(CHOOSE(D32,25,18,15,12,10,8,6,4,2,1)+(F32=1),0)","v":0}]
["GIOVANIZZI Antonio",null,null,null,null,null,{"$f":"IFERROR(CHOOSE(D33,25,18,15,12,10,8,6,4,2,1)+(F33=1),0)","v":0}]

{"sheet":"Vietnam","index":6,"n_rows":34,"n_cols":12,"rows_kept":34,"cut":false,"hidden":false,"merged":[[31,1,33,1],[31,2,33,2],[2,0,3,0],[22,1,24,1],[22,2,24,2],[25,1,27,1],[25,2,27,2],[28,1,30,1],[28,2,30,2],[13,1,15,1],[13,2,15,2],[16,1,18,1],[16,2,18,2],[19,1,21,1],[19,2,21,2],[4,1,6,1],[4,2,6,2],[7,1,9,1],[7,2,9,2],[10,1,12,1],[10,2,12,2],[0,0,1,14],[2,1,3,1],[2,2,3,2],[2,3,3,3],[2,4,3,4],[2,5,3,5],[2,6,3,6],[2,8,2,10]]}
["VIETNAM - 14 AVRIL 2019"]
[]
["PILOTES","ECURIES","VOITURES","Finish","Pôle","Pt tour","Points",null,"CLASSEMENT"]
[null,null,null,null,null,null,null,{"$f":"IF(G4=\"\",\"\",(RANK(G4,G4:G23)))","v":""},"ÉCURIES","POINTS","RANG","TOTAL"]
["HAMILTON Lewis","MERCEDES",null,1,null,null,{"$f":"IFERROR(CHOOSE(D5,25,18,15,12,10,8,6,4,2,1)+(F5=1),0)","v":25},null,"MERCEDES",{"$f":"SUM(G5:G7)","v":25},{"$f":"IF(J5=\"\",0,(RANK(J5,$J$5:$J$14)))+COUNTIF(J$5:J5,J5)-1","v":1},{"$f":"IF(J5=0,0,J5+Bahrein!J5)","v":50}]
["BOTTAS Valterri",null,null,null,null,null,0,null,"FERRARI",{"$f":"SUM(G8:G10)","v":0},{"$f":"IF(J6=\"\",0,(RANK(J6,$J$5:$J$14)))+COUNTIF(J$5:J6,J6)-1","v":4},{"$f":"IF(J6=0,0,J6+Bahrein!J6)","v":0}]
[null,null,null,null,null,null,0,null,"RED BULL",{"$f":"SUM(G11:G13)","v":0},{"$f":"IF(J7=\"\",0,(RANK(J7,$J$5:$J$14)))+COUNTIF(J$5:J7,J7)-1","v":5},{"$f":"IF(J7=0,0,J7+Bahrein!J7)","v":0}]
["VETTEL Sebastian","FERRARI",null,null,null,null,0,null,"RACING POINT",{"$f":"SUM(G14:G16)","v":0},{"$f":"IF(J8=\"\",0,(RANK(J8,$J$5:$J$14)))+COUNTIF(J$5:J8,J8)-1","v":6},{"$f":"IF(J8=0,0,J8+Bahrein!J8)","v":0}]
["LECLERC Charles",null,null,null,null,null,0,null,"WILLIAMS",{"$f":"SUM(G17:G19)","v":0},{"$f":"IF(J9=\"\",0,(RANK(J9,$J$5:$J$14)))+COUNTIF(J$5:J9,J9)-1","v":7},{"$f":"IF(J9=0,0,J9+Bahrein!J9)","v":0}]
[null,null,null,null,null,null,0,null,"RENAULT",{"$f":"SUM(G20:G22)","v":0},{"$f":"IF(J10=\"\",0,(RANK(J10,$J$5:$J$14)))+COUNTIF(J$5:J10,J10)-1","v":8},{"$f":"IF(J10=0,0,J10+Bahrein!J10)","v":0}]
["VERSTAPPEN Max","RED BULL",null,null,null,null,0,null,"TORO ROSSO",{"$f":"SUM(G23:G25)","v":0},{"$f":"IF(J11=\"\",0,(RANK(J11,$J$5:$J$14)))+COUNTIF(J$5:J11,J11)-1","v":9},{"$f":"IF(J11=0,0,J11+Bahrein!J11)","v":0}]
["ALBON Alexander",null,null,null,null,null,0,null,"HAAS",{"$f":"SUM(G26:G28)","v":0},{"$f":"IF(J12=\"\",0,(RANK(J12,$J$5:$J$14)))+COUNTIF(J$5:J12,J12)-1","v":10},{"$f":"IF(J12=0,0,J12+Bahrein!J12)","v":0}]
[null,null,null,null,null,null,0,null,"Mc LAREN",{"$f":"SUM(G29:G31)","v":25},{"$f":"IF(J13=\"\",0,(RANK(J13,$J$5:$J$14)))+COUNTIF(J$5:J13,J13)-1","v":2},{"$f":"IF(J13=0,0,J13+Bahrein!J13)","v":25}]
["PEREZ Sergio","RACING\nPOINT",null,"OUT",null,null,0,null,"ALFA ROMEO",{"$f":"SUM(G32:G34)","v":15},{"$f":"IF(J14=\"\",0,(RANK(J14,$J$5:$J$14)))+COUNTIF(J$5:J14,J14)-1","v":3},{"$f":"IF(J14=0,0,J14+Bahrein!J14)","v":15}]
["STROLL Lance",null,null,null,null,null,0]
[null,null,null,null,null,null,0]
["RUSSELL George","WILLIAMS",null,null,null,null,0]
["LATIFI Nichola",null,null,null,null,null,0]
[null,null,null,null,null,null,0]
["RICCIARDO Daniel","RENAULT",null,null,1,null,0]
["OCON Sebastian",null,null,null,null,null,0]
[null,null,null,null,null,null,0]
["KVYAT Daniil","ALPHA TAURI",null,null,null,null,0]
["GASLY Pierre",null,null,null,null,null,0]
[null,null,null,null,null,null,0]
["GROSJEAN Romain","HAAS",null,null,null,null,0]
["MAGNUSSEN Kevin",null,null,null,null,null,0]
[null,null,null,null,null,null,0]
["NORRIS Lando","McLAREN",null,1,null,null,25]
["SAINZ.Jr Carlos",null,null,null,null,null,0]
[null,null,null,null,null,null,0]
["RAÏKKÖNEN Kimi","ALFA ROMEO",null,3,null,null,15]
["GIOVANIZZI Antonio",null,null,null,null,null,0]
[null,null,null,null,null,null,0]

{"sheet":"Chine","index":7,"n_rows":34,"n_cols":12,"rows_kept":34,"cut":false,"hidden":false,"merged":[[31,1,33,1],[31,2,33,2],[22,1,24,1],[22,2,24,2],[25,1,27,1],[25,2,27,2],[28,1,30,1],[28,2,30,2],[13,1,15,1],[13,2,15,2],[16,1,18,1],[16,2,18,2],[19,1,21,1],[19,2,21,2],[4,1,6,1],[4,2,6,2],[7,1,9,1],[7,2,9,2],[10,1,12,1],[10,2,12,2],[0,0,1,14],[2,1,3,1],[2,2,3,2],[2,3,3,3],[2,5,3,5],[2,6,3,6],[2,8,2,10],[2,4,3,4],[2,0,3,0]]}
["CHINE - 14 AVRIL 2019"]
[]
["PILOTES","ECURIES","VOITURES","Finish","Pôle","Pt tour","Points",null,"CLASSEMENT"]
[null,null,null,null,null,null,null,{"$f":"IF(G4=\"\",\"\",(RANK(G4,G4:G23)))","v":""},"ÉCURIES","POINTS","RANG","TOTAL"]
["HAMILTON Lewis","MERCEDES",null,null,null,null,{"$f":"IFERROR(CHOOSE(D5,25,18,15,12,10,8,6,4,2,1)+(F5=1),0)","v":0},null,"MERCEDES",{"$f":"SUM(G5:G7)","v":0},{"$f":"IF(J5=\"\",0,(RANK(J5,$J$5:$J$14)))+COUNTIF(J$5:J5,J5)-1","v":2},{"$f":"IF(J5=0,0,J5+Vietnam!J5)","v":0}]
["BOTTAS Valterri",null,null,null,null,null,0,null,"FERRARI",{"$f":"SUM(G8:G10)","v":43},{"$f":"IF(J6=\"\",0,(RANK(J6,$J$5:$J$14)))+COUNTIF(J$5:J6,J6)-1","v":1},{"$f":"IF(J6=0,0,J6+Vietnam!J6)","v":43}]
[null,null,null,null,null,null,0,null,"RED BULL",{"$f":"SUM(G11:G13)","v":0},{"$f":"IF(J7=\"\",0,(RANK(J7,$J$5:$J$14)))+COUNTIF(J$5:J7,J7)-1","v":3},{"$f":"IF(J7=0,0,J7+Vietnam!J7)","v":0}]
["VETTEL Sebastian","FERRARI",null,1,null,null,25,null,"RACING POINT",{"$f":"SUM(G14:G16)","v":0},{"$f":"IF(J8=\"\",0,(RANK(J8,$J$5:$J$14)))+COUNTIF(J$5:J8,J8)-1","v":4},{"$f":"IF(J8=0,0,J8+Vietnam!J8)","v":0}]
["LECLERC Charles",null,null,2,null,null,18,null,"WILLIAMS",{"$f":"SUM(G17:G19)","v":0},{"$f":"IF(J9=\"\",0,(RANK(J9,$J$5:$J$14)))+COUNTIF(J$5:J9,J9)-1","v":5},{"$f":"IF(J9=0,0,J9+Vietnam!J9)","v":0}]
[null,null,null,null,null,null,0,null,"RENAULT",{"$f":"SUM(G20:G22)","v":0},{"$f":"IF(J10=\"\",0,(RANK(J10,$J$5:$J$14)))+COUNTIF(J$5:J10,J10)-1","v":6},{"$f":"IF(J10=0,0,J10+Vietnam!J10)","v":0}]
["VERSTAPPEN Max","RED BULL",null,null,null,null,0,null,"TORO ROSSO",{"$f":"SUM(G23:G25)","v":0},{"$f":"IF(J11=\"\",0,(RANK(J11,$J$5:$J$14)))+COUNTIF(J$5:J11,J11)-1","v":7},{"$f":"IF(J11=0,0,J11+Vietnam!J11)","v":0}]
["ALBON Alexander",null,null,null,1,null,0,null,"HAAS",{"$f":"SUM(G26:G28)","v":0},{"$f":"IF(J12=\"\",0,(RANK(J12,$J$5:$J$14)))+COUNTIF(J$5:J12,J12)-1","v":8},{"$f":"IF(J12=0,0,J12+Vietnam!J12)","v":0}]
[null,null,null,null,null,null,0,null,"Mc LAREN",{"$f":"SUM(G29:G31)","v":0},{"$f":"IF(J13=\"\",0,(RANK(J13,$J$5:$J$14)))+COUNTIF(J$5:J13,J13)-1","v":9},{"$f":"IF(J13=0,0,J13+Vietnam!J13)","v":0}]
["PEREZ Sergio","RACING\nPOINT",null,null,null,null,0,null,"ALFA ROMEO",{"$f":"SUM(G32:G34)","v":0},{"$f":"IF(J14=\"\",0,(RANK(J14,$J$5:$J$14)))+COUNTIF(J$5:J14,J14)-1","v":10},{"$f":"IF(J14=0,0,J14+Vietnam!J14)","v":0}]
["STROLL Lance",null,null,null,null,null,0]
[null,null,null,null,null,null,0]
["RUSSELL George","WILLIAMS",null,null,null,null,0]
["LATIFI Nichola",null,null,null,null,null,0]
[null,null,null,null,null,null,0]
["RICCIARDO Daniel","RENAULT",null,null,null,null,0]
["OCON Sebastian",null,null,null,null,null,0]
[null,null,null,null,null,null,0]
["KVYAT Daniil","ALPHA TAURI",null,null,null,null,0]
["GASLY Pierre",null,null,null,null,null,0]
[null,null,null,null,null,null,0]
["GROSJEAN Romain","HAAS",null,null,null,null,0]
["MAGNUSSEN Kevin",null,null,null,null,null,0]
[null,null,null,null,null,null,0]
["NORRIS Lando","McLAREN",null,null,null,null,0]
["SAINZ.Jr Carlos",null,null,null,null,null,0]
[null,null,null,null,null,null,0]
["RAÏKKÖNEN Kimi","ALFA ROMEO",null,"OUT",null,null,0]
["GIOVANIZZI Antonio",null,null,null,null,null,0]
[null,null,null,null,null,null,0]

{"sheet":"Azerbaïdjan","index":8,"n_rows":34,"n_cols":19,"rows_kept":34,"cut":false,"hidden":false,"merged":[[31,1,33,1],[31,2,33,2],[22,1,24,1],[22,2,24,2],[25,1,27,1],[25,2,27,2],[28,1,30,1],[28,2,30,2],[13,1,15,1],[13,2,15,2],[16,1,18,1],[16,2,18,2],[19,1,21,1],[19,2,21,2],[4,1,6,1],[4,2,6,2],[7,1,9,1],[7,2,9,2],[10,1,12,1],[10,2,12,2],[0,0,1,14],[2,1,3,1],[2,2,3,2],[2,3,3,3],[2,5,3,5],[2,6,3,6],[2,8,2,10],[2,4,3,4],[2,0,3,0]]}
["AZERBAÏDJAN - 28 AVRIL 2019"]
[]
["PILOTES","ECURIES","VOITURES","Finish","Pôle","Pt tour","Points",null,"CLASSEMENT"]
[null,null,null,null,null,null,null,{"$f":"IF(G4=\"\",\"\",(RANK(G4,G4:G23)))","v":""},"ÉCURIES","POINTS","RANG","TOTAL"]
["HAMILTON Lewis","MERCEDES",null,null,null,null,{"$f":"IFERROR(CHOOSE(D5,25,18,15,12,10,8,6,4,2,1)+(F5=1),0)","v":0},null,"MERCEDES",{"$f":"SUM(G5:G7)","v":0},{"$f":"IF(J5=\"\",0,(RANK(J5,$J$5:$J$14)))+COUNTIF(J$5:J5,J5)-1","v":2},{"$f":"IF(J5=0,0,J5+Chine!J5)","v":0}]
["BOTTAS Valterri",null,null,null,null,null,{"$f":"IFERROR(CHOOSE(D6,25,18,15,12,10,8,6,4,2,1)+(F6=1),0)","v":0},null,"FERRARI",{"$f":"SUM(G8:G10)","v":25},{"$f":"IF(J6=\"\",0,(RANK(J6,$J$5:$J$14)))+COUNTIF(J$5:J6,J6)-1","v":1},{"$f":"IF(J6=0,0,J6+Chine!J6)","v":68}]
[null,null,null,null,null,null,{"$f":"IFERROR(CHOOSE(D7,25,18,15,12,10,8,6,4,2,1)+(F7=1),\"\")","v":""},null,"RED BULL",{"$f":"SUM(G11:G13)","v":0},{"$f":"IF(J7=\"\",0,(RANK(J7,$J$5:$J$14)))+COUNTIF(J$5:J7,J7)-1","v":3},{"$f":"IF(J7=0,0,J7+Chine!J7)","v":0}]
["VETTEL Sebastian","FERRARI",null,null,null,null,{"$f":"IFERROR(CHOOSE(D8,25,18,15,12,10,8,6,4,2,1)+(F8=1),0)","v":0},null,"RACING POINT",{"$f":"SUM(G14:G16)","v":0},{"$f":"IF(J8=\"\",0,(RANK(J8,$J$5:$J$14)))+COUNTIF(J$5:J8,J8)-1","v":4},{"$f":"IF(J8=0,0,J8+Chine!J8)","v":0}]
["LECLERC Charles",null,null,1,null,null,{"$f":"IFERROR(CHOOSE(D9,25,18,15,12,10,8,6,4,2,1)+(F9=1),0)","v":25},null,"WILLIAMS",{"$f":"SUM(G17:G19)","v":0},{"$f":"IF(J9=\"\",0,(RANK(J9,$J$5:$J$14)))+COUNTIF(J$5:J9,J9)-1","v":5},{"$f":"IF(J9=0,0,J9+Chine!J9)","v":0}]
[null,null,null,null,null,null,{"$f":"IFERROR(CHOOSE(D10,25,18,15,12,10,8,6,4,2,1)+(F10=1),\"\")","v":""},null,"RENAULT",{"$f":"SUM(G20:G22)","v":0},{"$f":"IF(J10=\"\",0,(RANK(J10,$J$5:$J$14)))+COUNTIF(J$5:J10,J10)-1","v":6},{"$f":"IF(J10=0,0,J10+Chine!J10)","v":0}]
["VERSTAPPEN Max","RED BULL",null,null,null,null,{"$f":"IFERROR(CHOOSE(D11,25,18,15,12,10,8,6,4,2,1)+(F11=1),0)","v":0},null,"TORO ROSSO",{"$f":"SUM(G23:G25)","v":0},{"$f":"IF(J11=\"\",0,(RANK(J11,$J$5:$J$14)))+COUNTIF(J$5:J11,J11)-1","v":7},{"$f":"IF(J11=0,0,J11+Chine!J11)","v":0}]
["ALBON Alexander",null,null,null,null,null,{"$f":"IFERROR(CHOOSE(D12,25,18,15,12,10,8,6,4,2,1)+(F12=1),0)","v":0},null,"HAAS",{"$f":"SUM(G26:G28)","v":0},{"$f":"IF(J12=\"\",0,(RANK(J12,$J$5:$J$14)))+COUNTIF(J$5:J12,J12)-1","v":8},{"$f":"IF(J12=0,0,J12+Chine!J12)","v":0}]
[null,null,null,null,null,null,{"$f":"IFERROR(CHOOSE(D13,25,18,15,12,10,8,6,4,2,1)+(F13=1),\"\")","v":""},null,"Mc LAREN",{"$f":"SUM(G29:G31)","v":0},{"$f":"IF(J13=\"\",0,(RANK(J13,$J$5:$J$14)))+COUNTIF(J$5:J13,J13)-1","v":9},{"$f":"IF(J13=0,0,J13+Chine!J13)","v":0}]
["PEREZ Sergio","RACING\nPOINT",null,null,null,null,{"$f":"IFERROR(CHOOSE(D14,25,18,15,12,10,8,6,4,2,1)+(F14=1),0)","v":0},null,"ALFA ROMEO",{"$f":"SUM(G32:G34)","v":0},{"$f":"IF(J14=\"\",0,(RANK(J14,$J$5:$J$14)))+COUNTIF(J$5:J14,J14)-1","v":10},{"$f":"IF(J14=0,0,J14+Chine!J14)","v":0}]
["STROLL Lance",null,null,null,null,null,{"$f":"IFERROR(CHOOSE(D15,25,18,15,12,10,8,6,4,2,1)+(F15=1),0)","v":0}]
[null,null,null,null,null,null,{"$f":"IFERROR(CHOOSE(D16,25,18,15,12,10,8,6,4,2,1)+(F16=1),\"\")","v":""}]
["RUSSELL George","WILLIAMS",null,null,null,null,{"$f":"IFERROR(CHOOSE(D17,25,18,15,12,10,8,6,4,2,1)+(F17=1),0)","v":0}]
["LATIFI Nichola",null,null,null,null,null,{"$f":"IFERROR(CHOOSE(D18,25,18,15,12,10,8,6,4,2,1)+(F18=1),0)","v":0},null,null,null,null,null,null,null,null,null,null,null,{"$f":"IF(R18=\"\",0,(RANK(R18,$J$5:$J$14)))+COUNTIF(R$5:R18,R18)-1","v":-1}]
[null,null,null,null,null,null,{"$f":"IFERROR(CHOOSE(D19,25,18,15,12,10,8,6,4,2,1)+(F19=1),\"\")","v":""}]
["RICCIARDO Daniel","RENAULT",null,null,1,null,{"$f":"IFERROR(CHOOSE(D20,25,18,15,12,10,8,6,4,2,1)+(F20=1),0)","v":0}]
["OCON Sebastian",null,null,null,null,null,{"$f":"IFERROR(CHOOSE(D21,25,18,15,12,10,8,6,4,2,1)+(F21=1),0)","v":0}]
[null,null,null,null,null,null,{"$f":"IFERROR(CHOOSE(D22,25,18,15,12,10,8,6,4,2,1)+(F22=1),\"\")","v":""}]
["KVYAT Daniil","ALPHA TAURI",null,null,null,null,{"$f":"IFERROR(CHOOSE(D23,25,18,15,12,10,8,6,4,2,1)+(F23=1),0)","v":0}]
["GASLY Pierre",null,null,null,null,null,{"$f":"IFERROR(CHOOSE(D24,25,18,15,12,10,8,6,4,2,1)+(F24=1),0)","v":0}]
[null,null,null,null,null,null,{"$f":"IFERROR(CHOOSE(D25,25,18,15,12,10,8,6,4,2,1)+(F25=1),\"\")","v":""}]
["GROSJEAN Romain","HAAS",null,null,null,null,{"$f":"IFERROR(CHOOSE(D26,25,18,15,12,10,8,6,4,2,1)+(F26=1),0)","v":0}]
["MAGNUSSEN Kevin",null,null,null,null,null,{"$f":"IFERROR(CHOOSE(D27,25,18,15,12,10,8,6,4,2,1)+(F27=1),0)","v":0}]
[null,null,null,null,null,null,{"$f":"IFERROR(CHOOSE(D28,25,18,15,12,10,8,6,4,2,1)+(F28=1),\"\")","v":""}]
["NORRIS Lando","McLAREN",null,null,null,null,{"$f":"IFERROR(CHOOSE(D29,25,18,15,12,10,8,6,4,2,1)+(F29=1),0)","v":0}]
["SAINZ.Jr Carlos",null,null,null,null,null,{"$f":"IFERROR(CHOOSE(D30,25,18,15,12,10,8,6,4,2,1)+(F30=1),0)","v":0}]
[null,null,null,null,null,null,{"$f":"IFERROR(CHOOSE(D31,25,18,15,12,10,8,6,4,2,1)+(F31=1),\"\")","v":""}]
["RAÏKKÖNEN Kimi","ALFA ROMEO",null,null,null,null,{"$f":"IFERROR(CHOOSE(D32,25,18,15,12,10,8,6,4,2,1)+(F32=1),0)","v":0}]
["GIOVANIZZI Antonio",null,null,null,null,null,{"$f":"IFERROR(CHOOSE(D33,25,18,15,12,10,8,6,4,2,1)+(F33=1),0)","v":0}]
[null,null,null,null,null,null,{"$f":"IFERROR(CHOOSE(D34,25,18,15,12,10,8,6,4,2,1)+(F34=1),\"\")","v":""}]

{"sheet":"Espagne","index":9,"n_rows":34,"n_cols":12,"rows_kept":34,"cut":false,"hidden":false,"merged":[[31,1,33,1],[31,2,33,2],[22,1,24,1],[22,2,24,2],[25,1,27,1],[25,2,27,2],[28,1,30,1],[28,2,30,2],[13,1,15,1],[13,2,15,2],[16,1,18,1],[16,2,18,2],[19,1,21,1],[19,2,21,2],[4,1,6,1],[4,2,6,2],[7,1,9,1],[7,2,9,2],[10,1,12,1],[10,2,12,2],[0,0,1,14],[2,1,3,1],[2,2,3,2],[2,3,3,3],[2,5,3,5],[2,6,3,6],[2,8,2,10],[2,4,3,4],[2,0,3,0]]}
["ESPAGNE - 12 MAI 2019"]
[]
["PILOTES","ECURIES","VOITURES","Finish","Pôle","Pt tour","Points",null,"CLASSEMENT"]
[null,null,null,null,null,null,null,{"$f":"IF(G4=\"\",\"\",(RANK(G4,G4:G23)))","v":""},"ÉCURIES","POINTS","RANG","TOTAL"]
["HAMILTON Lewis","MERCEDES",null,null,null,null,{"$f":"IFERROR(CHOOSE(D5,25,18,15,12,10,8,6,4,2,1)+(F5=1),0)","v":0},null,"MERCEDES",{"$f":"SUM(G5:G7)","v":0},{"$f":"IF(J5=\"\",0,(RANK(J5,$J$5:$J$14)))+COUNTIF(J$5:J5,J5)-1","v":1},{"$f":"IF(J5=0,0,J5+Azerbaïdjan!J5)","v":0}]
["BOTTAS Valterri",null,null,null,null,null,{"$f":"IFERROR(CHOOSE(D6,25,18,15,12,10,8,6,4,2,1)+(F6=1),0)","v":0},null,"FERRARI",{"$f":"SUM(G8:G10)","v":0},{"$f":"IF(J6=\"\",0,(RANK(J6,$J$5:$J$14)))+COUNTIF(J$5:J6,J6)-1","v":2},{"$f":"IF(J6=0,0,J6+Azerbaïdjan!J6)","v":0}]
[null,null,null,null,null,null,{"$f":"IFERROR(CHOOSE(D7,25,18,15,12,10,8,6,4,2,1)+(F7=1),\"\")","v":""},null,"RED BULL",{"$f":"SUM(G11:G13)","v":0},{"$f":"IF(J7=\"\",0,(RANK(J7,$J$5:$J$14)))+COUNTIF(J$5:J7,J7)-1","v":3},{"$f":"IF(J7=0,0,J7+Azerbaïdjan!J7)","v":0}]
["VETTEL Sebastian","FERRARI",null,null,null,null,{"$f":"IFERROR(CHOOSE(D8,25,18,15,12,10,8,6,4,2,1)+(F8=1),0)","v":0},null,"RACING POINT",{"$f":"SUM(G14:G16)","v":0},{"$f":"IF(J8=\"\",0,(RANK(J8,$J$5:$J$14)))+COUNTIF(J$5:J8,J8)-1","v":4},{"$f":"IF(J8=0,0,J8+Azerbaïdjan!J8)","v":0}]
["LECLERC Charles",null,null,null,null,null,{"$f":"IFERROR(CHOOSE(D9,25,18,15,12,10,8,6,4,2,1)+(F9=1),0)","v":0},null,"WILLIAMS",{"$f":"SUM(G17:G19)","v":0},{"$f":"IF(J9=\"\",0,(RANK(J9,$J$5:$J$14)))+COUNTIF(J$5:J9,J9)-1","v":5},{"$f":"IF(J9=0,0,J9+Azerbaïdjan!J9)","v":0}]
[null,null,null,null,null,null,{"$f":"IFERROR(CHOOSE(D10,25,18,15,12,10,8,6,4,2,1)+(F10=1),\"\")","v":""},null,"RENAULT",{"$f":"SUM(G20:G22)","v":0},{"$f":"IF(J10=\"\",0,(RANK(J10,$J$5:$J$14)))+COUNTIF(J$5:J10,J10)-1","v":6},{"$f":"IF(J10=0,0,J10+Azerbaïdjan!J10)","v":0}]
["VERSTAPPEN Max","RED BULL",null,null,null,null,{"$f":"IFERROR(CHOOSE(D11,25,18,15,12,10,8,6,4,2,1)+(F11=1),0)","v":0},null,"TORO ROSSO",{"$f":"SUM(G23:G25)","v":0},{"$f":"IF(J11=\"\",0,(RANK(J11,$J$5:$J$14)))+COUNTIF(J$5:J11,J11)-1","v":7},{"$f":"IF(J11=0,0,J11+Azerbaïdjan!J11)","v":0}]
["ALBON Alexander",null,null,null,null,null,{"$f":"IFERROR(CHOOSE(D12,25,18,15,12,10,8,6,4,2,1)+(F12=1),0)","v":0},null,"HAAS",{"$f":"SUM(G26:G28)","v":0},{"$f":"IF(J12=\"\",0,(RANK(J12,$J$5:$J$14)))+COUNTIF(J$5:J12,J12)-1","v":8},{"$f":"IF(J12=0,0,J12+Azerbaïdjan!J12)","v":0}]
[null,null,null,null,null,null,{"$f":"IFERROR(CHOOSE(D13,25,18,15,12,10,8,6,4,2,1)+(F13=1),0)","v":0},null,"Mc LAREN",{"$f":"SUM(G29:G31)","v":0},{"$f":"IF(J13=\"\",0,(RANK(J13,$J$5:$J$14)))+COUNTIF(J$5:J13,J13)-1","v":9},{"$f":"IF(J13=0,0,J13+Azerbaïdjan!J13)","v":0}]
["PEREZ Sergio","RACING\nPOINT",null,null,null,null,{"$f":"IFERROR(CHOOSE(D14,25,18,15,12,10,8,6,4,2,1)+(F14=1),0)","v":0},null,"ALFA ROMEO",{"$f":"SUM(G32:G34)","v":0},{"$f":"IF(J14=\"\",0,(RANK(J14,$J$5:$J$14)))+COUNTIF(J$5:J14,J14)-1","v":10},{"$f":"IF(J14=0,0,J14+Azerbaïdjan!J14)","v":0}]
["STROLL Lance",null,null,null,1,null,{"$f":"IFERROR(CHOOSE(D15,25,18,15,12,10,8,6,4,2,1)+(F15=1),0)","v":0}]
[null,null,null,null,null,null,{"$f":"IFERROR(CHOOSE(D16,25,18,15,12,10,8,6,4,2,1)+(F16=1),\"\")","v":""}]
["RUSSELL George","WILLIAMS",null,null,null,null,{"$f":"IFERROR(CHOOSE(D17,25,18,15,12,10,8,6,4,2,1)+(F17=1),0)","v":0}]
["LATIFI Nichola",null,null,null,null,null,{"$f":"IFERROR(CHOOSE(D18,25,18,15,12,10,8,6,4,2,1)+(F18=1),0)","v":0}]
[null,null,null,null,null,null,{"$f":"IFERROR(CHOOSE(D19,25,18,15,12,10,8,6,4,2,1)+(F19=1),\"\")","v":""}]
["RICCIARDO Daniel","RENAULT",null,null,null,null,{"$f":"IFERROR(CHOOSE(D20,25,18,15,12,10,8,6,4,2,1)+(F20=1),0)","v":0}]
["OCON Sebastian",null,null,null,null,null,{"$f":"IFERROR(CHOOSE(D21,25,18,15,12,10,8,6,4,2,1)+(F21=1),0)","v":0}]
[null,null,null,null,null,null,{"$f":"IFERROR(CHOOSE(D22,25,18,15,12,10,8,6,4,2,1)+(F22=1),\"\")","v":""}]
["KVYAT Daniil","ALPHA TAURI",null,null,null,null,{"$f":"IFERROR(CHOOSE(D23,25,18,15,12,10,8,6,4,2,1)+(F23=1),0)","v":0}]
["GASLY Pierre",null,null,null,null,null,{"$f":"IFERROR(CHOOSE(D24,25,18,15,12,10,8,6,4,2,1)+(F24=1),0)","v":0}]
[null,null,null,null,null,null,{"$f":"IFERROR(CHOOSE(D25,25,18,15,12,10,8,6,4,2,1)+(F25=1),\"\")","v":""}]
["GROSJEAN Romain","HAAS",null,null,null,null,{"$f":"IFERROR(CHOOSE(D26,25,18,15,12,10,8,6,4,2,1)+(F26=1),0)","v":0}]
["MAGNUSSEN Kevin",null,null,null,null,null,{"$f":"IFERROR(CHOOSE(D27,25,18,15,12,10,8,6,4,2,1)+(F27=1),0)","v":0}]
[null,null,null,null,null,null,{"$f":"IFERROR(CHOOSE(D28,25,18,15,12,10,8,6,4,2,1)+(F28=1),\"\")","v":""}]
["NORRIS Lando","McLAREN",null,null,null,null,{"$f":"IFERROR(CHOOSE(D29,25,18,15,12,10,8,6,4,2,1)+(F29=1),0)","v":0}]
["SAINZ.Jr Carlos",null,null,null,null,null,{"$f":"IFERROR(CHOOSE(D30,25,18,15,12,10,8,6,4,2,1)+(F30=1),0)","v":0}]
[null,null,null,null,null,null,{"$f":"IFERROR(CHOOSE(D31,25,18,15,12,10,8,6,4,2,1)+(F31=1),\"\")","v":""}]
["RAÏKKÖNEN Kimi","ALFA ROMEO",null,null,null,null,{"$f":"IFERROR(CHOOSE(D32,25,18,15,12,10,8,6,4,2,1)+(F32=1),0)","v":0}]
["GIOVANIZZI Antonio",null,null,null,null,null,{"$f":"IFERROR(CHOOSE(D33,25,18,15,12,10,8,6,4,2,1)+(F33=1),0)","v":0}]
[null,null,null,null,null,null,{"$f":"IFERROR(CHOOSE(D34,25,18,15,12,10,8,6,4,2,1)+(F34=1),\"\")","v":""}]

{"sheet":"Monaco","index":10,"n_rows":34,"n_cols":12,"rows_kept":34,"cut":false,"hidden":false,"merged":[[31,1,33,1],[31,2,33,2],[22,1,24,1],[22,2,24,2],[25,1,27,1],[25,2,27,2],[28,1,30,1],[28,2,30,2],[13,1,15,1],[13,2,15,2],[16,1,18,1],[16,2,18,2],[19,1,21,1],[19,2,21,2],[4,1,6,1],[4,2,6,2],[7,1,9,1],[7,2,9,2],[10,1,12,1],[10,2,12,2],[0,0,1,14],[2,1,3,1],[2,2,3,2],[2,3,3,3],[2,5,3,5],[2,6,3,6],[2,8,2,10],[2,4,3,4],[2,0,3,0]]}
["MONACO - 26 MAI 2019"]
[]
["PILOTES","ECURIES","VOITURES","Finish","Pôle","Pt tour","Points",null,"CLASSEMENT"]
[null,null,null,null,null,null,null,{"$f":"IF(G4=\"\",\"\",(RANK(G4,G4:G23)))","v":""},"ÉCURIES","POINTS","RANG","TOTAL"]
["HAMILTON Lewis","MERCEDES",null,null,null,null,{"$f":"IFERROR(CHOOSE(D5,25,18,15,12,10,8,6,4,2,1)+(F5=1),0)","v":0},null,"MERCEDES",{"$f":"SUM(G5:G7)","v":0},{"$f":"IF(J5=\"\",0,(RANK(J5,$J$5:$J$14)))+COUNTIF(J$5:J5,J5)-1","v":1},{"$f":"IF(J5=0,0,J5+Espagne!J5)","v":0}]
["BOTTAS Valterri",null,null,null,null,null,{"$f":"IFERROR(CHOOSE(D6,25,18,15,12,10,8,6,4,2,1)+(F6=1),0)","v":0},null,"FERRARI",{"$f":"SUM(G8:G10)","v":0},{"$f":"IF(J6=\"\",0,(RANK(J6,$J$5:$J$14)))+COUNTIF(J$5:J6,J6)-1","v":2},{"$f":"IF(J6=0,0,J6+Espagne!J6)","v":0}]
[null,null,null,null,null,null,{"$f":"IFERROR(CHOOSE(D7,25,18,15,12,10,8,6,4,2,1)+(F7=1),\"\")","v":""},null,"RED BULL",{"$f":"SUM(G11:G13)","v":0},{"$f":"IF(J7=\"\",0,(RANK(J7,$J$5:$J$14)))+COUNTIF(J$5:J7,J7)-1","v":3},{"$f":"IF(J7=0,0,J7+Espagne!J7)","v":0}]
["VETTEL Sebastian","FERRARI",null,null,null,null,{"$f":"IFERROR(CHOOSE(D8,25,18,15,12,10,8,6,4,2,1)+(F8=1),0)","v":0},null,"RACING POINT",{"$f":"SUM(G14:G16)","v":0},{"$f":"IF(J8=\"\",0,(RANK(J8,$J$5:$J$14)))+COUNTIF(J$5:J8,J8)-1","v":4},{"$f":"IF(J8=0,0,J8+Espagne!J8)","v":0}]
["LECLERC Charles",null,null,null,null,null,{"$f":"IFERROR(CHOOSE(D9,25,18,15,12,10,8,6,4,2,1)+(F9=1),0)","v":0},null,"WILLIAMS",{"$f":"SUM(G17:G19)","v":0},{"$f":"IF(J9=\"\",0,(RANK(J9,$J$5:$J$14)))+COUNTIF(J$5:J9,J9)-1","v":5},{"$f":"IF(J9=0,0,J9+Espagne!J9)","v":0}]
[null,null,null,null,null,null,{"$f":"IFERROR(CHOOSE(D10,25,18,15,12,10,8,6,4,2,1)+(F10=1),\"\")","v":""},null,"RENAULT",{"$f":"SUM(G20:G22)","v":0},{"$f":"IF(J10=\"\",0,(RANK(J10,$J$5:$J$14)))+COUNTIF(J$5:J10,J10)-1","v":6},{"$f":"IF(J10=0,0,J10+Espagne!J10)","v":0}]
["VERSTAPPEN Max","RED BULL",null,null,null,null,{"$f":"IFERROR(CHOOSE(D11,25,18,15,12,10,8,6,4,2,1)+(F11=1),0)","v":0},null,"TORO ROSSO",{"$f":"SUM(G23:G25)","v":0},{"$f":"IF(J11=\"\",0,(RANK(J11,$J$5:$J$14)))+COUNTIF(J$5:J11,J11)-1","v":7},{"$f":"IF(J11=0,0,J11+Espagne!J11)","v":0}]
["ALBON Alexander",null,null,null,null,null,{"$f":"IFERROR(CHOOSE(D12,25,18,15,12,10,8,6,4,2,1)+(F12=1),0)","v":0},null,"HAAS",{"$f":"SUM(G26:G28)","v":0},{"$f":"IF(J12=\"\",0,(RANK(J12,$J$5:$J$14)))+COUNTIF(J$5:J12,J12)-1","v":8},{"$f":"IF(J12=0,0,J12+Espagne!J12)","v":0}]
[null,null,null,null,null,null,{"$f":"IFERROR(CHOOSE(D13,25,18,15,12,10,8,6,4,2,1)+(F13=1),\"\")","v":""},null,"Mc LAREN",{"$f":"SUM(G29:G31)","v":0},{"$f":"IF(J13=\"\",0,(RANK(J13,$J$5:$J$14)))+COUNTIF(J$5:J13,J13)-1","v":9},{"$f":"IF(J13=0,0,J13+Espagne!J13)","v":0}]
["PEREZ Sergio","RACING\nPOINT",null,null,null,null,{"$f":"IFERROR(CHOOSE(D14,25,18,15,12,10,8,6,4,2,1)+(F14=1),0)","v":0},null,"ALFA ROMEO",{"$f":"SUM(G32:G34)","v":0},{"$f":"IF(J14=\"\",0,(RANK(J14,$J$5:$J$14)))+COUNTIF(J$5:J14,J14)-1","v":10},{"$f":"IF(J14=0,0,J14+Espagne!J14)","v":0}]
["STROLL Lance",null,null,null,null,null,{"$f":"IFERROR(CHOOSE(D15,25,18,15,12,10,8,6,4,2,1)+(F15=1),0)","v":0}]
[null,null,null,null,null,null,{"$f":"IFERROR(CHOOSE(D16,25,18,15,12,10,8,6,4,2,1)+(F16=1),\"\")","v":""}]
["RUSSELL George","WILLIAMS",null,null,null,null,{"$f":"IFERROR(CHOOSE(D17,25,18,15,12,10,8,6,4,2,1)+(F17=1),0)","v":0}]
["LATIFI Nichola",null,null,null,null,null,{"$f":"IFERROR(CHOOSE(D18,25,18,15,12,10,8,6,4,2,1)+(F18=1),0)","v":0}]
[null,null,null,null,null,null,{"$f":"IFERROR(CHOOSE(D19,25,18,15,12,10,8,6,4,2,1)+(F19=1),\"\")","v":""}]
["RICCIARDO Daniel","RENAULT",null,null,1,null,{"$f":"IFERROR(CHOOSE(D20,25,18,15,12,10,8,6,4,2,1)+(F20=1),0)","v":0}]
["OCON Sebastian",null,null,null,null,null,{"$f":"IFERROR(CHOOSE(D21,25,18,15,12,10,8,6,4,2,1)+(F21=1),0)","v":0}]
[null,null,null,null,null,null,{"$f":"IFERROR(CHOOSE(D22,25,18,15,12,10,8,6,4,2,1)+(F22=1),\"\")","v":""}]
["KVYAT Daniil","ALPHA TAURI",null,null,null,null,{"$f":"IFERROR(CHOOSE(D23,25,18,15,12,10,8,6,4,2,1)+(F23=1),0)","v":0}]
["GASLY Pierre",null,null,null,null,null,{"$f":"IFERROR(CHOOSE(D24,25,18,15,12,10,8,6,4,2,1)+(F24=1),0)","v":0}]
[null,null,null,null,null,null,{"$f":"IFERROR(CHOOSE(D25,25,18,15,12,10,8,6,4,2,1)+(F25=1),\"\")","v":""}]
["GROSJEAN Romain","HAAS",null,null,null,null,{"$f":"IFERROR(CHOOSE(D26,25,18,15,12,10,8,6,4,2,1)+(F26=1),0)","v":0}]
["MAGNUSSEN Kevin",null,null,null,null,null,{"$f":"IFERROR(CHOOSE(D27,25,18,15,12,10,8,6,4,2,1)+(F27=1),0)","v":0}]
[null,null,null,null,null,null,{"$f":"IFERROR(CHOOSE(D28,25,18,15,12,10,8,6,4,2,1)+(F28=1),\"\")","v":""}]
["NORRIS Lando","McLAREN",null,null,null,null,{"$f":"IFERROR(CHOOSE(D29,25,18,15,12,10,8,6,4,2,1)+(F29=1),0)","v":0}]
["SAINZ.Jr Carlos",null,null,null,null,null,{"$f":"IFERROR(CHOOSE(D30,25,18,15,12,10,8,6,4,2,1)+(F30=1),0)","v":0}]
[null,null,null,null,null,null,{"$f":"IFERROR(CHOOSE(D31,25,18,15,12,10,8,6,4,2,1)+(F31=1),\"\")","v":""}]
["RAÏKKÖNEN Kimi","ALFA ROMEO",null,null,null,null,{"$f":"IFERROR(CHOOSE(D32,25,18,15,12,10,8,6,4,2,1)+(F32=1),0)","v":0}]
["GIOVANIZZI Antonio",null,null,null,null,null,{"$f":"IFERROR(CHOOSE(D33,25,18,15,12,10,8,6,4,2,1)+(F33=1),0)","v":0}]
[null,null,null,null,null,null,{"$f":"IFERROR(CHOOSE(D34,25,18,15,12,10,8,6,4,2,1)+(F34=1),\"\")","v":""}]

{"sheet":"Canada","index":11,"n_rows":34,"n_cols":12,"rows_kept":34,"cut":false,"hidden":false,"merged":[[31,1,33,1],[31,2,33,2],[22,1,24,1],[22,2,24,2],[25,1,27,1],[25,2,27,2],[28,1,30,1],[28,2,30,2],[13,1,15,1],[13,2,15,2],[16,1,18,1],[16,2,18,2],[19,1,21,1],[19,2,21,2],[4,1,6,1],[4,2,6,2],[7,1,9,1],[7,2,9,2],[10,1,12,1],[10,2,12,2],[0,0,1,14],[2,1,3,1],[2,2,3,2],[2,3,3,3],[2,5,3,5],[2,6,3,6],[2,8,2,10],[2,4,3,4],[2,0,3,0]]}
["CANADA - 17 MARS 2019"]
[]
["PILOTES","ECURIES","VOITURES","Finish","Pôle","Pt tour","Points",null,"CLASSEMENT"]
[null,null,null,null,null,null,null,{"$f":"IF(G4=\"\",\"\",(RANK(G4,G4:G23)))","v":""},"ÉCURIES","POINTS","RANG","TOTAL"]
["HAMILTON Lewis","MERCEDES",null,null,null,null,{"$f":"IFERROR(CHOOSE(D5,25,18,15,12,10,8,6,4,2,1)+(F5=1),0)","v":0},null,"MERCEDES",{"$f":"SUM(G5:G7)","v":0},{"$f":"IF(J5=\"\",0,(RANK(J5,$J$5:$J$14)))+COUNTIF(J$5:J5,J5)-1","v":1},{"$f":"IF(J5=0,0,J5+Monaco!J5)","v":0}]
["BOTTAS Valterri",null,null,null,null,null,{"$f":"IFERROR(CHOOSE(D6,25,18,15,12,10,8,6,4,2,1)+(F6=1),0)","v":0},null,"FERRARI",{"$f":"SUM(G8:G10)","v":0},{"$f":"IF(J6=\"\",0,(RANK(J6,$J$5:$J$14)))+COUNTIF(J$5:J6,J6)-1","v":2},{"$f":"IF(J6=0,0,J6+Monaco!J6)","v":0}]
[null,null,null,null,null,null,{"$f":"IFERROR(CHOOSE(D7,25,18,15,12,10,8,6,4,2,1)+(F7=1),\"\")","v":""},null,"RED BULL",{"$f":"SUM(G11:G13)","v":0},{"$f":"IF(J7=\"\",0,(RANK(J7,$J$5:$J$14)))+COUNTIF(J$5:J7,J7)-1","v":3},{"$f":"IF(J7=0,0,J7+Monaco!J7)","v":0}]
["VETTEL Sebastian","FERRARI",null,null,null,null,{"$f":"IFERROR(CHOOSE(D8,25,18,15,12,10,8,6,4,2,1)+(F8=1),0)","v":0},null,"RACING POINT",{"$f":"SUM(G14:G16)","v":0},{"$f":"IF(J8=\"\",0,(RANK(J8,$J$5:$J$14)))+COUNTIF(J$5:J8,J8)-1","v":4},{"$f":"IF(J8=0,0,J8+Monaco!J8)","v":0}]
["LECLERC Charles",null,null,null,null,null,{"$f":"IFERROR(CHOOSE(D9,25,18,15,12,10,8,6,4,2,1)+(F9=1),0)","v":0},null,"WILLIAMS",{"$f":"SUM(G17:G19)","v":0},{"$f":"IF(J9=\"\",0,(RANK(J9,$J$5:$J$14)))+COUNTIF(J$5:J9,J9)-1","v":5},{"$f":"IF(J9=0,0,J9+Monaco!J9)","v":0}]
[null,null,null,null,null,null,{"$f":"IFERROR(CHOOSE(D10,25,18,15,12,10,8,6,4,2,1)+(F10=1),\"\")","v":""},null,"RENAULT",{"$f":"SUM(G20:G22)","v":0},{"$f":"IF(J10=\"\",0,(RANK(J10,$J$5:$J$14)))+COUNTIF(J$5:J10,J10)-1","v":6},{"$f":"IF(J10=0,0,J10+Monaco!J10)","v":0}]
["VERSTAPPEN Max","RED BULL",null,null,null,null,{"$f":"IFERROR(CHOOSE(D11,25,18,15,12,10,8,6,4,2,1)+(F11=1),0)","v":0},null,"TORO ROSSO",{"$f":"SUM(G23:G25)","v":0},{"$f":"IF(J11=\"\",0,(RANK(J11,$J$5:$J$14)))+COUNTIF(J$5:J11,J11)-1","v":7},{"$f":"IF(J11=0,0,J11+Monaco!J11)","v":0}]
["ALBON Alexander",null,null,null,null,null,{"$f":"IFERROR(CHOOSE(D12,25,18,15,12,10,8,6,4,2,1)+(F12=1),0)","v":0},null,"HAAS",{"$f":"SUM(G26:G28)","v":0},{"$f":"IF(J12=\"\",0,(RANK(J12,$J$5:$J$14)))+COUNTIF(J$5:J12,J12)-1","v":8},{"$f":"IF(J12=0,0,J12+Monaco!J12)","v":0}]
[null,null,null,null,null,null,{"$f":"IFERROR(CHOOSE(D13,25,18,15,12,10,8,6,4,2,1)+(F13=1),\"\")","v":""},null,"Mc LAREN",{"$f":"SUM(G29:G31)","v":0},{"$f":"IF(J13=\"\",0,(RANK(J13,$J$5:$J$14)))+COUNTIF(J$5:J13,J13)-1","v":9},{"$f":"IF(J13=0,0,J13+Monaco!J13)","v":0}]
["PEREZ Sergio","RACING\nPOINT",null,null,1,null,{"$f":"IFERROR(CHOOSE(D14,25,18,15,12,10,8,6,4,2,1)+(F14=1),0)","v":0},null,"ALFA ROMEO",{"$f":"SUM(G32:G34)","v":0},{"$f":"IF(J14=\"\",0,(RANK(J14,$J$5:$J$14)))+COUNTIF(J$5:J14,J14)-1","v":10},{"$f":"IF(J14=0,0,J14+Monaco!J14)","v":0}]
["STROLL Lance",null,null,null,null,null,{"$f":"IFERROR(CHOOSE(D15,25,18,15,12,10,8,6,4,2,1)+(F15=1),0)","v":0}]
[null,null,null,null,null,null,{"$f":"IFERROR(CHOOSE(D16,25,18,15,12,10,8,6,4,2,1)+(F16=1),\"\")","v":""}]
["RUSSELL George","WILLIAMS",null,null,null,null,{"$f":"IFERROR(CHOOSE(D17,25,18,15,12,10,8,6,4,2,1)+(F17=1),0)","v":0}]
["LATIFI Nichola",null,null,null,null,null,{"$f":"IFERROR(CHOOSE(D18,25,18,15,12,10,8,6,4,2,1)+(F18=1),0)","v":0}]
[null,null,null,null,null,null,{"$f":"IFERROR(CHOOSE(D19,25,18,15,12,10,8,6,4,2,1)+(F19=1),\"\")","v":""}]
["RICCIARDO Daniel","RENAULT",null,null,null,null,{"$f":"IFERROR(CHOOSE(D20,25,18,15,12,10,8,6,4,2,1)+(F20=1),0)","v":0}]
["OCON Sebastian",null,null,null,null,null,{"$f":"IFERROR(CHOOSE(D21,25,18,15,12,10,8,6,4,2,1)+(F21=1),0)","v":0}]
[null,null,null,null,null,null,{"$f":"IFERROR(CHOOSE(D22,25,18,15,12,10,8,6,4,2,1)+(F22=1),\"\")","v":""}]
["KVYAT Daniil","ALPHA TAURI",null,null,null,null,{"$f":"IFERROR(CHOOSE(D23,25,18,15,12,10,8,6,4,2,1)+(F23=1),0)","v":0}]
["GASLY Pierre",null,null,null,null,null,{"$f":"IFERROR(CHOOSE(D24,25,18,15,12,10,8,6,4,2,1)+(F24=1),0)","v":0}]
[null,null,null,null,null,null,{"$f":"IFERROR(CHOOSE(D25,25,18,15,12,10,8,6,4,2,1)+(F25=1),\"\")","v":""}]
["GROSJEAN Romain","HAAS",null,null,null,null,{"$f":"IFERROR(CHOOSE(D26,25,18,15,12,10,8,6,4,2,1)+(F26=1),0)","v":0}]
["MAGNUSSEN Kevin",null,null,null,null,null,{"$f":"IFERROR(CHOOSE(D27,25,18,15,12,10,8,6,4,2,1)+(F27=1),0)","v":0}]
[null,null,null,null,null,null,{"$f":"IFERROR(CHOOSE(D28,25,18,15,12,10,8,6,4,2,1)+(F28=1),\"\")","v":""}]
["NORRIS Lando","McLAREN",null,null,null,null,{"$f":"IFERROR(CHOOSE(D29,25,18,15,12,10,8,6,4,2,1)+(F29=1),0)","v":0}]
["SAINZ.Jr Carlos",null,null,null,null,null,{"$f":"IFERROR(CHOOSE(D30,25,18,15,12,10,8,6,4,2,1)+(F30=1),0)","v":0}]
[null,null,null,null,null,null,{"$f":"IFERROR(CHOOSE(D31,25,18,15,12,10,8,6,4,2,1)+(F31=1),\"\")","v":""}]
["RAÏKKÖNEN Kimi","ALFA ROMEO",null,null,null,null,{"$f":"IFERROR(CHOOSE(D32,25,18,15,12,10,8,6,4,2,1)+(F32=1),0)","v":0}]
["GIOVANIZZI Antonio",null,null,null,null,null,{"$f":"IFERROR(CHOOSE(D33,25,18,15,12,10,8,6,4,2,1)+(F33=1),0)","v":0}]
[null,null,null,null,null,null,{"$f":"IFERROR(CHOOSE(D34,25,18,15,12,10,8,6,4,2,1)+(F34=1),\"\")","v":""}]

{"sheet":"France","index":12,"n_rows":34,"n_cols":12,"rows_kept":34,"cut":false,"hidden":false,"merged":[[31,1,33,1],[31,2,33,2],[22,1,24,1],[22,2,24,2],[25,1,27,1],[25,2,27,2],[28,1,30,1],[28,2,30,2],[13,1,15,1],[13,2,15,2],[16,1,18,1],[16,2,18,2],[19,1,21,1],[19,2,21,2],[4,1,6,1],[4,2,6,2],[7,1,9,1],[7,2,9,2],[10,1,12,1],[10,2,12,2],[0,0,1,14],[2,1,3,1],[2,2,3,2],[2,3,3,3],[2,5,3,5],[2,6,3,6],[2,8,2,10],[2,4,3,4],[2,0,3,0]]}
["FRANCE - 17 MARS 2019"]
[]
["PILOTES","ECURIES","VOITURES","Finish","Pôle","Pt tour","Points",null,"CLASSEMENT"]
[null,null,null,null,null,null,null,{"$f":"IF(G4=\"\",\"\",(RANK(G4,G4:G23)))","v":""},"ÉCURIES","POINTS","RANG","TOTAL"]
["HAMILTON Lewis","MERCEDES",null,null,null,null,{"$f":"IFERROR(CHOOSE(D5,25,18,15,12,10,8,6,4,2,1)+(F5=1),0)","v":0},null,"MERCEDES",{"$f":"SUM(G5:G7)","v":0},{"$f":"IF(J5=\"\",0,(RANK(J5,$J$5:$J$14)))+COUNTIF(J$5:J5,J5)-1","v":1},{"$f":"IF(J5=0,0,J5+Canada!J5)","v":0}]
["BOTTAS Valterri",null,null,null,null,null,{"$f":"IFERROR(CHOOSE(D6,25,18,15,12,10,8,6,4,2,1)+(F6=1),0)","v":0},null,"FERRARI",{"$f":"SUM(G8:G10)","v":0},{"$f":"IF(J6=\"\",0,(RANK(J6,$J$5:$J$14)))+COUNTIF(J$5:J6,J6)-1","v":2},{"$f":"IF(J6=0,0,J6+Canada!J6)","v":0}]
[null,null,null,null,null,null,{"$f":"IFERROR(CHOOSE(D7,25,18,15,12,10,8,6,4,2,1)+(F7=1),\"\")","v":""},null,"RED BULL",{"$f":"SUM(G11:G13)","v":0},{"$f":"IF(J7=\"\",0,(RANK(J7,$J$5:$J$14)))+COUNTIF(J$5:J7,J7)-1","v":3},{"$f":"IF(J7=0,0,J7+Canada!J7)","v":0}]
["VETTEL Sebastian","FERRARI",null,null,null,null,{"$f":"IFERROR(CHOOSE(D8,25,18,15,12,10,8,6,4,2,1)+(F8=1),0)","v":0},null,"RACING POINT",{"$f":"SUM(G14:G16)","v":0},{"$f":"IF(J8=\"\",0,(RANK(J8,$J$5:$J$14)))+COUNTIF(J$5:J8,J8)-1","v":4},{"$f":"IF(J8=0,0,J8+Canada!J8)","v":0}]
["LECLERC Charles",null,null,null,null,null,{"$f":"IFERROR(CHOOSE(D9,25,18,15,12,10,8,6,4,2,1)+(F9=1),0)","v":0},null,"WILLIAMS",{"$f":"SUM(G17:G19)","v":0},{"$f":"IF(J9=\"\",0,(RANK(J9,$J$5:$J$14)))+COUNTIF(J$5:J9,J9)-1","v":5},{"$f":"IF(J9=0,0,J9+Canada!J9)","v":0}]
[null,null,null,null,null,null,{"$f":"IFERROR(CHOOSE(D10,25,18,15,12,10,8,6,4,2,1)+(F10=1),\"\")","v":""},null,"RENAULT",{"$f":"SUM(G20:G22)","v":0},{"$f":"IF(J10=\"\",0,(RANK(J10,$J$5:$J$14)))+COUNTIF(J$5:J10,J10)-1","v":6},{"$f":"IF(J10=0,0,J10+Canada!J10)","v":0}]
["VERSTAPPEN Max","RED BULL",null,null,null,null,{"$f":"IFERROR(CHOOSE(D11,25,18,15,12,10,8,6,4,2,1)+(F11=1),0)","v":0},null,"TORO ROSSO",{"$f":"SUM(G23:G25)","v":0},{"$f":"IF(J11=\"\",0,(RANK(J11,$J$5:$J$14)))+COUNTIF(J$5:J11,J11)-1","v":7},{"$f":"IF(J11=0,0,J11+Canada!J11)","v":0}]
["ALBON Alexander",null,null,null,null,null,{"$f":"IFERROR(CHOOSE(D12,25,18,15,12,10,8,6,4,2,1)+(F12=1),0)","v":0},null,"HAAS",{"$f":"SUM(G26:G28)","v":0},{"$f":"IF(J12=\"\",0,(RANK(J12,$J$5:$J$14)))+COUNTIF(J$5:J12,J12)-1","v":8},{"$f":"IF(J12=0,0,J12+Canada!J12)","v":0}]
[null,null,null,null,null,null,{"$f":"IFERROR(CHOOSE(D13,25,18,15,12,10,8,6,4,2,1)+(F13=1),\"\")","v":""},null,"Mc LAREN",{"$f":"SUM(G29:G31)","v":0},{"$f":"IF(J13=\"\",0,(RANK(J13,$J$5:$J$14)))+COUNTIF(J$5:J13,J13)-1","v":9},{"$f":"IF(J13=0,0,J13+Canada!J13)","v":0}]
["PEREZ Sergio","RACING\nPOINT",null,null,null,null,{"$f":"IFERROR(CHOOSE(D14,25,18,15,12,10,8,6,4,2,1)+(F14=1),0)","v":0},null,"ALFA ROMEO",{"$f":"SUM(G32:G34)","v":0},{"$f":"IF(J14=\"\",0,(RANK(J14,$J$5:$J$14)))+COUNTIF(J$5:J14,J14)-1","v":10},{"$f":"IF(J14=0,0,J14+Canada!J14)","v":0}]
["STROLL Lance",null,null,null,null,null,{"$f":"IFERROR(CHOOSE(D15,25,18,15,12,10,8,6,4,2,1)+(F15=1),0)","v":0}]
[null,null,null,null,null,null,{"$f":"IFERROR(CHOOSE(D16,25,18,15,12,10,8,6,4,2,1)+(F16=1),\"\")","v":""}]
["RUSSELL George","WILLIAMS",null,null,null,null,{"$f":"IFERROR(CHOOSE(D17,25,18,15,12,10,8,6,4,2,1)+(F17=1),0)","v":0}]
["LATIFI Nichola",null,null,null,null,null,{"$f":"IFERROR(CHOOSE(D18,25,18,15,12,10,8,6,4,2,1)+(F18=1),0)","v":0}]
[null,null,null,null,null,null,{"$f":"IFERROR(CHOOSE(D19,25,18,15,12,10,8,6,4,2,1)+(F19=1),\"\")","v":""}]
["RICCIARDO Daniel","RENAULT",null,null,null,null,{"$f":"IFERROR(CHOOSE(D20,25,18,15,12,10,8,6,4,2,1)+(F20=1),0)","v":0}]
["OCON Sebastian",null,null,null,null,null,{"$f":"IFERROR(CHOOSE(D21,25,18,15,12,10,8,6,4,2,1)+(F21=1),0)","v":0}]
[null,null,null,null,null,null,{"$f":"IFERROR(CHOOSE(D22,25,18,15,12,10,8,6,4,2,1)+(F22=1),\"\")","v":""}]
["KVYAT Daniil","ALPHA TAURI",null,null,null,null,{"$f":"IFERROR(CHOOSE(D23,25,18,15,12,10,8,6,4,2,1)+(F23=1),0)","v":0}]
["GASLY Pierre",null,null,null,null,null,{"$f":"IFERROR(CHOOSE(D24,25,18,15,12,10,8,6,4,2,1)+(F24=1),0)","v":0}]
[null,null,null,null,null,null,{"$f":"IFERROR(CHOOSE(D25,25,18,15,12,10,8,6,4,2,1)+(F25=1),\"\")","v":""}]
["GROSJEAN Romain","HAAS",null,null,null,null,{"$f":"IFERROR(CHOOSE(D26,25,18,15,12,10,8,6,4,2,1)+(F26=1),0)","v":0}]
["MAGNUSSEN Kevin",null,null,null,null,null,{"$f":"IFERROR(CHOOSE(D27,25,18,15,12,10,8,6,4,2,1)+(F27=1),0)","v":0}]
[null,null,null,null,null,null,{"$f":"IFERROR(CHOOSE(D28,25,18,15,12,10,8,6,4,2,1)+(F28=1),\"\")","v":""}]
["NORRIS Lando","McLAREN",null,null,1,null,{"$f":"IFERROR(CHOOSE(D29,25,18,15,12,10,8,6,4,2,1)+(F29=1),0)","v":0}]
["SAINZ.Jr Carlos",null,null,null,null,null,{"$f":"IFERROR(CHOOSE(D30,25,18,15,12,10,8,6,4,2,1)+(F30=1),0)","v":0}]
[null,null,null,null,null,null,{"$f":"IFERROR(CHOOSE(D31,25,18,15,12,10,8,6,4,2,1)+(F31=1),\"\")","v":""}]
["RAÏKKÖNEN Kimi","ALFA ROMEO",null,null,null,null,{"$f":"IFERROR(CHOOSE(D32,25,18,15,12,10,8,6,4,2,1)+(F32=1),0)","v":0}]
["GIOVANIZZI Antonio",null,null,null,null,null,{"$f":"IFERROR(CHOOSE(D33,25,18,15,12,10,8,6,4,2,1)+(F33=1),0)","v":0}]
[null,null,null,null,null,null,{"$f":"IFERROR(CHOOSE(D34,25,18,15,12,10,8,6,4,2,1)+(F34=1),\"\")","v":""}]

{"sheet":"Autriche","index":13,"n_rows":34,"n_cols":12,"rows_kept":34,"cut":false,"hidden":false,"merged":[[31,1,33,1],[31,2,33,2],[22,1,24,1],[22,2,24,2],[25,1,27,1],[25,2,27,2],[28,1,30,1],[28,2,30,2],[13,1,15,1],[13,2,15,2],[16,1,18,1],[16,2,18,2],[19,1,21,1],[19,2,21,2],[4,1,6,1],[4,2,6,2],[7,1,9,1],[7,2,9,2],[10,1,12,1],[10,2,12,2],[0,0,1,14],[2,1,3,1],[2,2,3,2],[2,3,3,3],[2,5,3,5],[2,6,3,6],[2,8,2,10],[2,4,3,4],[2,0,3,0]]}
["AUTRICHE - 17 MARS 2019"]
[]
["PILOTES","ECURIES","VOITURES","Finish","Pôle","Pt tour","Points",null,"CLASSEMENT"]
[null,null,null,null,null,null,null,{"$f":"IF(G4=\"\",\"\",(RANK(G4,G4:G23)))","v":""},"ÉCURIES","POINTS","RANG","TOTAL"]
["HAMILTON Lewis","MERCEDES",null,null,null,null,{"$f":"IFERROR(CHOOSE(D5,25,18,15,12,10,8,6,4,2,1)+(F5=1),0)","v":0},null,"MERCEDES",{"$f":"SUM(G5:G7)","v":0},{"$f":"IF(J5=\"\",0,(RANK(J5,$J$5:$J$14)))+COUNTIF(J$5:J5,J5)-1","v":1},{"$f":"IF(J5=0,0,J5+France!J5)","v":0}]
["BOTTAS Valterri",null,null,null,null,null,{"$f":"IFERROR(CHOOSE(D6,25,18,15,12,10,8,6,4,2,1)+(F6=1),0)","v":0},null,"FERRARI",{"$f":"SUM(G8:G10)","v":0},{"$f":"IF(J6=\"\",0,(RANK(J6,$J$5:$J$14)))+COUNTIF(J$5:J6,J6)-1","v":2},{"$f":"IF(J6=0,0,J6+France!J6)","v":0}]
[null,null,null,null,null,null,{"$f":"IFERROR(CHOOSE(D7,25,18,15,12,10,8,6,4,2,1)+(F7=1),\"\")","v":""},null,"RED BULL",{"$f":"SUM(G11:G13)","v":0},{"$f":"IF(J7=\"\",0,(RANK(J7,$J$5:$J$14)))+COUNTIF(J$5:J7,J7)-1","v":3},{"$f":"IF(J7=0,0,J7+France!J7)","v":0}]
["VETTEL Sebastian","FERRARI",null,null,null,null,{"$f":"IFERROR(CHOOSE(D8,25,18,15,12,10,8,6,4,2,1)+(F8=1),0)","v":0},null,"RACING POINT",{"$f":"SUM(G14:G16)","v":0},{"$f":"IF(J8=\"\",0,(RANK(J8,$J$5:$J$14)))+COUNTIF(J$5:J8,J8)-1","v":4},{"$f":"IF(J8=0,0,J8+France!J8)","v":0}]
["LECLERC Charles",null,null,null,null,null,{"$f":"IFERROR(CHOOSE(D9,25,18,15,12,10,8,6,4,2,1)+(F9=1),0)","v":0},null,"WILLIAMS",{"$f":"SUM(G17:G19)","v":0},{"$f":"IF(J9=\"\",0,(RANK(J9,$J$5:$J$14)))+COUNTIF(J$5:J9,J9)-1","v":5},{"$f":"IF(J9=0,0,J9+France!J9)","v":0}]
[null,null,null,null,null,null,{"$f":"IFERROR(CHOOSE(D10,25,18,15,12,10,8,6,4,2,1)+(F10=1),\"\")","v":""},null,"RENAULT",{"$f":"SUM(G20:G22)","v":0},{"$f":"IF(J10=\"\",0,(RANK(J10,$J$5:$J$14)))+COUNTIF(J$5:J10,J10)-1","v":6},{"$f":"IF(J10=0,0,J10+France!J10)","v":0}]
["VERSTAPPEN Max","RED BULL",null,null,null,null,{"$f":"IFERROR(CHOOSE(D11,25,18,15,12,10,8,6,4,2,1)+(F11=1),0)","v":0},null,"TORO ROSSO",{"$f":"SUM(G23:G25)","v":0},{"$f":"IF(J11=\"\",0,(RANK(J11,$J$5:$J$14)))+COUNTIF(J$5:J11,J11)-1","v":7},{"$f":"IF(J11=0,0,J11+France!J11)","v":0}]
["ALBON Alexander",null,null,null,null,null,{"$f":"IFERROR(CHOOSE(D12,25,18,15,12,10,8,6,4,2,1)+(F12=1),0)","v":0},null,"HAAS",{"$f":"SUM(G26:G28)","v":0},{"$f":"IF(J12=\"\",0,(RANK(J12,$J$5:$J$14)))+COUNTIF(J$5:J12,J12)-1","v":8},{"$f":"IF(J12=0,0,J12+France!J12)","v":0}]
[null,null,null,null,null,null,{"$f":"IFERROR(CHOOSE(D13,25,18,15,12,10,8,6,4,2,1)+(F13=1),\"\")","v":""},null,"Mc LAREN",{"$f":"SUM(G29:G31)","v":0},{"$f":"IF(J13=\"\",0,(RANK(J13,$J$5:$J$14)))+COUNTIF(J$5:J13,J13)-1","v":9},{"$f":"IF(J13=0,0,J13+France!J13)","v":0}]
["PEREZ Sergio","RACING\nPOINT",null,null,null,null,{"$f":"IFERROR(CHOOSE(D14,25,18,15,12,10,8,6,4,2,1)+(F14=1),0)","v":0},null,"ALFA ROMEO",{"$f":"SUM(G32:G34)","v":0},{"$f":"IF(J14=\"\",0,(RANK(J14,$J$5:$J$14)))+COUNTIF(J$5:J14,J14)-1","v":10},{"$f":"IF(J14=0,0,J14+France!J14)","v":0}]
["STROLL Lance",null,null,null,null,null,{"$f":"IFERROR(CHOOSE(D15,25,18,15,12,10,8,6,4,2,1)+(F15=1),0)","v":0}]
[null,null,null,null,null,null,{"$f":"IFERROR(CHOOSE(D16,25,18,15,12,10,8,6,4,2,1)+(F16=1),\"\")","v":""}]
["RUSSELL George","WILLIAMS",null,null,null,null,{"$f":"IFERROR(CHOOSE(D17,25,18,15,12,10,8,6,4,2,1)+(F17=1),0)","v":0}]
["LATIFI Nichola",null,null,null,null,null,{"$f":"IFERROR(CHOOSE(D18,25,18,15,12,10,8,6,4,2,1)+(F18=1),0)","v":0}]
[null,null,null,null,null,null,{"$f":"IFERROR(CHOOSE(D19,25,18,15,12,10,8,6,4,2,1)+(F19=1),\"\")","v":""}]
["RICCIARDO Daniel","RENAULT",null,null,null,null,{"$f":"IFERROR(CHOOSE(D20,25,18,15,12,10,8,6,4,2,1)+(F20=1),0)","v":0}]
["OCON Sebastian",null,null,null,1,null,{"$f":"IFERROR(CHOOSE(D21,25,18,15,12,10,8,6,4,2,1)+(F21=1),0)","v":0}]
[null,null,null,null,null,null,{"$f":"IFERROR(CHOOSE(D22,25,18,15,12,10,8,6,4,2,1)+(F22=1),\"\")","v":""}]
["KVYAT Daniil","ALPHA TAURI",null,null,null,null,{"$f":"IFERROR(CHOOSE(D23,25,18,15,12,10,8,6,4,2,1)+(F23=1),0)","v":0}]
["GASLY Pierre",null,null,null,null,null,{"$f":"IFERROR(CHOOSE(D24,25,18,15,12,10,8,6,4,2,1)+(F24=1),0)","v":0}]
[null,null,null,null,null,null,{"$f":"IFERROR(CHOOSE(D25,25,18,15,12,10,8,6,4,2,1)+(F25=1),\"\")","v":""}]
["GROSJEAN Romain","HAAS",null,null,null,null,{"$f":"IFERROR(CHOOSE(D26,25,18,15,12,10,8,6,4,2,1)+(F26=1),0)","v":0}]
["MAGNUSSEN Kevin",null,null,null,null,null,{"$f":"IFERROR(CHOOSE(D27,25,18,15,12,10,8,6,4,2,1)+(F27=1),0)","v":0}]
[null,null,null,null,null,null,{"$f":"IFERROR(CHOOSE(D28,25,18,15,12,10,8,6,4,2,1)+(F28=1),\"\")","v":""}]
["NORRIS Lando","McLAREN",null,null,null,null,{"$f":"IFERROR(CHOOSE(D29,25,18,15,12,10,8,6,4,2,1)+(F29=1),0)","v":0}]
["SAINZ.Jr Carlos",null,null,null,null,null,{"$f":"IFERROR(CHOOSE(D30,25,18,15,12,10,8,6,4,2,1)+(F30=1),0)","v":0}]
[null,null,null,null,null,null,{"$f":"IFERROR(CHOOSE(D31,25,18,15,12,10,8,6,4,2,1)+(F31=1),\"\")","v":""}]
["RAÏKKÖNEN Kimi","ALFA ROMEO",null,null,null,null,{"$f":"IFERROR(CHOOSE(D32,25,18,15,12,10,8,6,4,2,1)+(F32=1),0)","v":0}]
["GIOVANIZZI Antonio",null,null,null,null,null,{"$f":"IFERROR(CHOOSE(D33,25,18,15,12,10,8,6,4,2,1)+(F33=1),0)","v":0}]
[null,null,null,null,null,null,{"$f":"IFERROR(CHOOSE(D34,25,18,15,12,10,8,6,4,2,1)+(F34=1),\"\")","v":""}]

{"sheet":"GB","index":14,"n_rows":34,"n_cols":12,"rows_kept":34,"cut":false,"hidden":false,"merged":[[31,1,33,1],[31,2,33,2],[22,1,24,1],[22,2,24,2],[25,1,27,1],[25,2,27,2],[28,1,30,1],[28,2,30,2],[13,1,15,1],[13,2,15,2],[16,1,18,1],[16,2,18,2],[19,1,21,1],[19,2,21,2],[4,1,6,1],[4,2,6,2],[7,1,9,1],[7,2,9,2],[10,1,12,1],[10,2,12,2],[0,0,1,14],[2,1,3,1],[2,2,3,2],[2,3,3,3],[2,5,3,5],[2,6,3,6],[2,8,2,10],[2,4,3,4],[2,0,3,0]]}
["ANGLETERRE - 17 MARS 2019"]
[]
["PILOTES","ECURIES","VOITURES","Finish","Pôle","Pt tour","Points",null,"CLASSEMENT"]
[null,null,null,null,null,null,null,{"$f":"IF(G4=\"\",\"\",(RANK(G4,G4:G23)))","v":""},"ÉCURIES","POINTS","RANG","TOTAL"]
["HAMILTON Lewis","MERCEDES",null,null,null,null,{"$f":"IFERROR(CHOOSE(D5,25,18,15,12,10,8,6,4,2,1)+(F5=1),0)","v":0},null,"MERCEDES",{"$f":"SUM(G5:G7)","v":0},{"$f":"IF(J5=\"\",0,(RANK(J5,$J$5:$J$14)))+COUNTIF(J$5:J5,J5)-1","v":1},{"$f":"IF(J5=0,0,J5+Autriche!J5)","v":0}]
["BOTTAS Valterri",null,null,null,null,null,{"$f":"IFERROR(CHOOSE(D6,25,18,15,12,10,8,6,4,2,1)+(F6=1),0)","v":0},null,"FERRARI",{"$f":"SUM(G8:G10)","v":0},{"$f":"IF(J6=\"\",0,(RANK(J6,$J$5:$J$14)))+COUNTIF(J$5:J6,J6)-1","v":2},{"$f":"IF(J6=0,0,J6+Autriche!J6)","v":0}]
[null,null,null,null,null,null,{"$f":"IFERROR(CHOOSE(D7,25,18,15,12,10,8,6,4,2,1)+(F7=1),\"\")","v":""},null,"RED BULL",{"$f":"SUM(G11:G13)","v":0},{"$f":"IF(J7=\"\",0,(RANK(J7,$J$5:$J$14)))+COUNTIF(J$5:J7,J7)-1","v":3},{"$f":"IF(J7=0,0,J7+Autriche!J7)","v":0}]
["VETTEL Sebastian","FERRARI",null,null,null,null,{"$f":"IFERROR(CHOOSE(D8,25,18,15,12,10,8,6,4,2,1)+(F8=1),0)","v":0},null,"RACING POINT",{"$f":"SUM(G14:G16)","v":0},{"$f":"IF(J8=\"\",0,(RANK(J8,$J$5:$J$14)))+COUNTIF(J$5:J8,J8)-1","v":4},{"$f":"IF(J8=0,0,J8+Autriche!J8)","v":0}]
["LECLERC Charles",null,null,null,null,null,{"$f":"IFERROR(CHOOSE(D9,25,18,15,12,10,8,6,4,2,1)+(F9=1),0)","v":0},null,"WILLIAMS",{"$f":"SUM(G17:G19)","v":0},{"$f":"IF(J9=\"\",0,(RANK(J9,$J$5:$J$14)))+COUNTIF(J$5:J9,J9)-1","v":5},{"$f":"IF(J9=0,0,J9+Autriche!J9)","v":0}]
[null,null,null,null,null,null,{"$f":"IFERROR(CHOOSE(D10,25,18,15,12,10,8,6,4,2,1)+(F10=1),\"\")","v":""},null,"RENAULT",{"$f":"SUM(G20:G22)","v":0},{"$f":"IF(J10=\"\",0,(RANK(J10,$J$5:$J$14)))+COUNTIF(J$5:J10,J10)-1","v":6},{"$f":"IF(J10=0,0,J10+Autriche!J10)","v":0}]
["VERSTAPPEN Max","RED BULL",null,null,null,null,{"$f":"IFERROR(CHOOSE(D11,25,18,15,12,10,8,6,4,2,1)+(F11=1),0)","v":0},null,"TORO ROSSO",{"$f":"SUM(G23:G25)","v":0},{"$f":"IF(J11=\"\",0,(RANK(J11,$J$5:$J$14)))+COUNTIF(J$5:J11,J11)-1","v":7},{"$f":"IF(J11=0,0,J11+Autriche!J11)","v":0}]
["ALBON Alexander",null,null,null,null,null,{"$f":"IFERROR(CHOOSE(D12,25,18,15,12,10,8,6,4,2,1)+(F12=1),0)","v":0},null,"HAAS",{"$f":"SUM(G26:G28)","v":0},{"$f":"IF(J12=\"\",0,(RANK(J12,$J$5:$J$14)))+COUNTIF(J$5:J12,J12)-1","v":8},{"$f":"IF(J12=0,0,J12+Autriche!J12)","v":0}]
[null,null,null,null,null,null,{"$f":"IFERROR(CHOOSE(D13,25,18,15,12,10,8,6,4,2,1)+(F13=1),\"\")","v":""},null,"Mc LAREN",{"$f":"SUM(G29:G31)","v":0},{"$f":"IF(J13=\"\",0,(RANK(J13,$J$5:$J$14)))+COUNTIF(J$5:J13,J13)-1","v":9},{"$f":"IF(J13=0,0,J13+Autriche!J13)","v":0}]
["PEREZ Sergio","RACING\nPOINT",null,null,null,null,{"$f":"IFERROR(CHOOSE(D14,25,18,15,12,10,8,6,4,2,1)+(F14=1),0)","v":0},null,"ALFA ROMEO",{"$f":"SUM(G32:G34)","v":0},{"$f":"IF(J14=\"\",0,(RANK(J14,$J$5:$J$14)))+COUNTIF(J$5:J14,J14)-1","v":10},{"$f":"IF(J14=0,0,J14+Autriche!J14)","v":0}]
["STROLL Lance",null,null,null,null,null,{"$f":"IFERROR(CHOOSE(D15,25,18,15,12,10,8,6,4,2,1)+(F15=1),0)","v":0}]
[null,null,null,null,null,null,{"$f":"IFERROR(CHOOSE(D16,25,18,15,12,10,8,6,4,2,1)+(F16=1),\"\")","v":""}]
["RUSSELL George","WILLIAMS",null,null,null,null,{"$f":"IFERROR(CHOOSE(D17,25,18,15,12,10,8,6,4,2,1)+(F17=1),0)","v":0}]
["LATIFI Nichola",null,null,null,null,null,{"$f":"IFERROR(CHOOSE(D18,25,18,15,12,10,8,6,4,2,1)+(F18=1),0)","v":0}]
[null,null,null,null,null,null,{"$f":"IFERROR(CHOOSE(D19,25,18,15,12,10,8,6,4,2,1)+(F19=1),\"\")","v":""}]
["RICCIARDO Daniel","RENAULT",null,null,null,null,{"$f":"IFERROR(CHOOSE(D20,25,18,15,12,10,8,6,4,2,1)+(F20=1),0)","v":0}]
["OCON Sebastian",null,null,null,null,null,{"$f":"IFERROR(CHOOSE(D21,25,18,15,12,10,8,6,4,2,1)+(F21=1),0)","v":0}]
[null,null,null,null,null,null,{"$f":"IFERROR(CHOOSE(D22,25,18,15,12,10,8,6,4,2,1)+(F22=1),\"\")","v":""}]
["KVYAT Daniil","ALPHA TAURI",null,null,null,null,{"$f":"IFERROR(CHOOSE(D23,25,18,15,12,10,8,6,4,2,1)+(F23=1),0)","v":0}]
["GASLY Pierre",null,null,null,null,null,{"$f":"IFERROR(CHOOSE(D24,25,18,15,12,10,8,6,4,2,1)+(F24=1),0)","v":0}]
[null,null,null,null,null,null,{"$f":"IFERROR(CHOOSE(D25,25,18,15,12,10,8,6,4,2,1)+(F25=1),\"\")","v":""}]
["GROSJEAN Romain","HAAS",null,null,null,null,{"$f":"IFERROR(CHOOSE(D26,25,18,15,12,10,8,6,4,2,1)+(F26=1),0)","v":0}]
["MAGNUSSEN Kevin",null,null,null,null,null,{"$f":"IFERROR(CHOOSE(D27,25,18,15,12,10,8,6,4,2,1)+(F27=1),0)","v":0}]
[null,null,null,null,null,null,{"$f":"IFERROR(CHOOSE(D28,25,18,15,12,10,8,6,4,2,1)+(F28=1),\"\")","v":""}]
["NORRIS Lando","McLAREN",null,null,1,null,{"$f":"IFERROR(CHOOSE(D29,25,18,15,12,10,8,6,4,2,1)+(F29=1),0)","v":0}]
["SAINZ.Jr Carlos",null,null,null,null,null,{"$f":"IFERROR(CHOOSE(D30,25,18,15,12,10,8,6,4,2,1)+(F30=1),0)","v":0}]
[null,null,null,null,null,null,{"$f":"IFERROR(CHOOSE(D31,25,18,15,12,10,8,6,4,2,1)+(F31=1),\"\")","v":""}]
["RAÏKKÖNEN Kimi","ALFA ROMEO",null,null,null,null,{"$f":"IFERROR(CHOOSE(D32,25,18,15,12,10,8,6,4,2,1)+(F32=1),0)","v":0}]
["GIOVANIZZI Antonio",null,null,null,null,null,{"$f":"IFERROR(CHOOSE(D33,25,18,15,12,10,8,6,4,2,1)+(F33=1),0)","v":0}]
[null,null,null,null,null,null,{"$f":"IFERROR(CHOOSE(D34,25,18,15,12,10,8,6,4,2,1)+(F34=1),\"\")","v":""}]

{"sheet":"Hongrie","index":15,"n_rows":34,"n_cols":12,"rows_kept":34,"cut":false,"hidden":false,"merged":[[31,1,33,1],[31,2,33,2],[22,1,24,1],[22,2,24,2],[25,1,27,1],[25,2,27,2],[28,1,30,1],[28,2,30,2],[13,1,15,1],[13,2,15,2],[16,1,18,1],[16,2,18,2],[19,1,21,1],[19,2,21,2],[4,1,6,1],[4,2,6,2],[7,1,9,1],[7,2,9,2],[10,1,12,1],[10,2,12,2],[0,0,1,14],[2,1,3,1],[2,2,3,2],[2,3,3,3],[2,5,3,5],[2,6,3,6],[2,8,2,10],[2,4,3,4],[2,0,3,0]]}
["HONGRIE - 14 AOUT 2019"]
[]
["PILOTES","ECURIES","VOITURES","Finish","Pôle","Pt tour","Points",null,"CLASSEMENT"]
[null,null,null,null,null,null,null,{"$f":"IF(G4=\"\",\"\",(RANK(G4,G4:G23)))","v":""},"ÉCURIES","POINTS","RANG","TOTAL"]
["HAMILTON Lewis","MERCEDES",null,null,null,null,{"$f":"IFERROR(CHOOSE(D5,25,18,15,12,10,8,6,4,2,1)+(F5=1),0)","v":0},null,"MERCEDES",{"$f":"SUM(G5:G7)","v":0},{"$f":"IF(J5=\"\",0,(RANK(J5,$J$5:$J$14)))+COUNTIF(J$5:J5,J5)-1","v":1},{"$f":"IF(J5=0,0,J5+GB!J5)","v":0}]
["BOTTAS Valterri",null,null,null,null,null,{"$f":"IFERROR(CHOOSE(D6,25,18,15,12,10,8,6,4,2,1)+(F6=1),0)","v":0},null,"FERRARI",{"$f":"SUM(G8:G10)","v":0},{"$f":"IF(J6=\"\",0,(RANK(J6,$J$5:$J$14)))+COUNTIF(J$5:J6,J6)-1","v":2},{"$f":"IF(J6=0,0,J6+GB!J6)","v":0}]
[null,null,null,null,null,null,null,null,"RED BULL",{"$f":"SUM(G11:G13)","v":0},{"$f":"IF(J7=\"\",0,(RANK(J7,$J$5:$J$14)))+COUNTIF(J$5:J7,J7)-1","v":3},{"$f":"IF(J7=0,0,J7+GB!J7)","v":0}]
["VETTEL Sebastian","FERRARI",null,null,null,null,{"$f":"IFERROR(CHOOSE(D8,25,18,15,12,10,8,6,4,2,1)+(F8=1),0)","v":0},null,"RACING POINT",{"$f":"SUM(G14:G16)","v":0},{"$f":"IF(J8=\"\",0,(RANK(J8,$J$5:$J$14)))+COUNTIF(J$5:J8,J8)-1","v":4},{"$f":"IF(J8=0,0,J8+GB!J8)","v":0}]
["LECLERC Charles",null,null,null,null,null,{"$f":"IFERROR(CHOOSE(D9,25,18,15,12,10,8,6,4,2,1)+(F9=1),0)","v":0},null,"WILLIAMS",{"$f":"SUM(G17:G19)","v":0},{"$f":"IF(J9=\"\",0,(RANK(J9,$J$5:$J$14)))+COUNTIF(J$5:J9,J9)-1","v":5},{"$f":"IF(J9=0,0,J9+GB!J9)","v":0}]
[null,null,null,null,null,null,{"$f":"IFERROR(CHOOSE(D10,25,18,15,12,10,8,6,4,2,1)+(F10=1),\"\")","v":""},null,"RENAULT",{"$f":"SUM(G20:G22)","v":0},{"$f":"IF(J10=\"\",0,(RANK(J10,$J$5:$J$14)))+COUNTIF(J$5:J10,J10)-1","v":6},{"$f":"IF(J10=0,0,J10+GB!J10)","v":0}]
["VERSTAPPEN Max","RED BULL",null,null,null,null,{"$f":"IFERROR(CHOOSE(D11,25,18,15,12,10,8,6,4,2,1)+(F11=1),0)","v":0},null,"TORO ROSSO",{"$f":"SUM(G23:G25)","v":0},{"$f":"IF(J11=\"\",0,(RANK(J11,$J$5:$J$14)))+COUNTIF(J$5:J11,J11)-1","v":7},{"$f":"IF(J11=0,0,J11+GB!J11)","v":0}]
["ALBON Alexander",null,null,null,null,null,{"$f":"IFERROR(CHOOSE(D12,25,18,15,12,10,8,6,4,2,1)+(F12=1),0)","v":0},null,"HAAS",{"$f":"SUM(G26:G28)","v":0},{"$f":"IF(J12=\"\",0,(RANK(J12,$J$5:$J$14)))+COUNTIF(J$5:J12,J12)-1","v":8},{"$f":"IF(J12=0,0,J12+GB!J12)","v":0}]
[null,null,null,null,null,null,{"$f":"IFERROR(CHOOSE(D13,25,18,15,12,10,8,6,4,2,1)+(F13=1),\"\")","v":""},null,"Mc LAREN",{"$f":"SUM(G29:G31)","v":0},{"$f":"IF(J13=\"\",0,(RANK(J13,$J$5:$J$14)))+COUNTIF(J$5:J13,J13)-1","v":9},{"$f":"IF(J13=0,0,J13+GB!J13)","v":0}]
["PEREZ Sergio","RACING\nPOINT",null,null,null,null,{"$f":"IFERROR(CHOOSE(D14,25,18,15,12,10,8,6,4,2,1)+(F14=1),0)","v":0},null,"ALFA ROMEO",{"$f":"SUM(G32:G34)","v":0},{"$f":"IF(J14=\"\",0,(RANK(J14,$J$5:$J$14)))+COUNTIF(J$5:J14,J14)-1","v":10},{"$f":"IF(J14=0,0,J14+GB!J14)","v":0}]
["STROLL Lance",null,null,null,null,null,{"$f":"IFERROR(CHOOSE(D15,25,18,15,12,10,8,6,4,2,1)+(F15=1),0)","v":0}]
[null,null,null,null,null,null,{"$f":"IFERROR(CHOOSE(D16,25,18,15,12,10,8,6,4,2,1)+(F16=1),\"\")","v":""}]
["RUSSELL George","WILLIAMS",null,null,null,null,{"$f":"IFERROR(CHOOSE(D17,25,18,15,12,10,8,6,4,2,1)+(F17=1),0)","v":0}]
["LATIFI Nichola",null,null,null,null,null,{"$f":"IFERROR(CHOOSE(D18,25,18,15,12,10,8,6,4,2,1)+(F18=1),0)","v":0}]
[null,null,null,null,null,null,{"$f":"IFERROR(CHOOSE(D19,25,18,15,12,10,8,6,4,2,1)+(F19=1),\"\")","v":""}]
["RICCIARDO Daniel","RENAULT",null,null,null,null,{"$f":"IFERROR(CHOOSE(D20,25,18,15,12,10,8,6,4,2,1)+(F20=1),0)","v":0}]
["OCON Sebastian",null,null,null,null,null,{"$f":"IFERROR(CHOOSE(D21,25,18,15,12,10,8,6,4,2,1)+(F21=1),0)","v":0}]
[null,null,null,null,null,null,{"$f":"IFERROR(CHOOSE(D22,25,18,15,12,10,8,6,4,2,1)+(F22=1),\"\")","v":""}]
["KVYAT Daniil","ALPHA TAURI",null,null,null,null,{"$f":"IFERROR(CHOOSE(D23,25,18,15,12,10,8,6,4,2,1)+(F23=1),0)","v":0}]
["GASLY Pierre",null,null,null,null,null,{"$f":"IFERROR(CHOOSE(D24,25,18,15,12,10,8,6,4,2,1)+(F24=1),0)","v":0}]
[null,null,null,null,null,null,{"$f":"IFERROR(CHOOSE(D25,25,18,15,12,10,8,6,4,2,1)+(F25=1),\"\")","v":""}]
["GROSJEAN Romain","HAAS",null,null,null,null,{"$f":"IFERROR(CHOOSE(D26,25,18,15,12,10,8,6,4,2,1)+(F26=1),0)","v":0}]
["MAGNUSSEN Kevin",null,null,null,null,null,{"$f":"IFERROR(CHOOSE(D27,25,18,15,12,10,8,6,4,2,1)+(F27=1),0)","v":0}]
[null,null,null,null,null,null,{"$f":"IFERROR(CHOOSE(D28,25,18,15,12,10,8,6,4,2,1)+(F28=1),\"\")","v":""}]
["NORRIS Lando","McLAREN",null,null,null,null,{"$f":"IFERROR(CHOOSE(D29,25,18,15,12,10,8,6,4,2,1)+(F29=1),0)","v":0}]
["SAINZ.Jr Carlos",null,null,null,null,null,{"$f":"IFERROR(CHOOSE(D30,25,18,15,12,10,8,6,4,2,1)+(F30=1),0)","v":0}]
[null,null,null,null,null,null,{"$f":"IFERROR(CHOOSE(D31,25,18,15,12,10,8,6,4,2,1)+(F31=1),\"\")","v":""}]
["RAÏKKÖNEN Kimi","ALFA ROMEO",null,null,null,null,{"$f":"IFERROR(CHOOSE(D32,25,18,15,12,10,8,6,4,2,1)+(F32=1),0)","v":0}]
["GIOVANIZZI Antonio",null,null,null,null,null,{"$f":"IFERROR(CHOOSE(D33,25,18,15,12,10,8,6,4,2,1)+(F33=1),0)","v":0}]
[null,null,null,null,null,null,{"$f":"IFERROR(CHOOSE(D34,25,18,15,12,10,8,6,4,2,1)+(F34=1),\"\")","v":""}]

{"sheet":"Belgique","index":16,"n_rows":34,"n_cols":12,"rows_kept":34,"cut":false,"hidden":false,"merged":[[31,1,33,1],[31,2,33,2],[2,0,3,0],[22,1,24,1],[22,2,24,2],[25,1,27,1],[25,2,27,2],[28,1,30,1],[28,2,30,2],[13,1,15,1],[13,2,15,2],[16,1,18,1],[16,2,18,2],[19,1,21,1],[19,2,21,2],[4,1,6,1],[4,2,6,2],[7,1,9,1],[7,2,9,2],[10,1,12,1],[10,2,12,2],[0,0,1,14],[2,1,3,1],[2,2,3,2],[2,3,3,3],[2,4,3,4],[2,5,3,5],[2,6,3,6],[2,8,2,10]]}
["BELGIQUE - 14 AOUT 2019"]
[]
["PILOTES","ECURIES","VOITURES","Finish","Pôle","Pt tour","Points",null,"CLASSEMENT"]
[null,null,null,null,null,null,null,{"$f":"IF(G4=\"\",\"\",(RANK(G4,G4:G23)))","v":""},"ÉCURIES","POINTS","RANG","TOTAL"]
["HAMILTON Lewis","MERCEDES",null,null,null,null,{"$f":"IFERROR(CHOOSE(D5,25,18,15,12,10,8,6,4,2,1)+(F5=1),0)","v":0},null,"MERCEDES",{"$f":"SUM(G5:G7)","v":0},{"$f":"IF(J5=\"\",0,(RANK(J5,$J$5:$J$14)))+COUNTIF(J$5:J5,J5)-1","v":1},{"$f":"IF(J5=0,0,J5+Hongrie!J5)","v":0}]
["BOTTAS Valterri",null,null,null,null,null,{"$f":"IFERROR(CHOOSE(D6,25,18,15,12,10,8,6,4,2,1)+(F6=1),0)","v":0},null,"FERRARI",{"$f":"SUM(G8:G10)","v":0},{"$f":"IF(J6=\"\",0,(RANK(J6,$J$5:$J$14)))+COUNTIF(J$5:J6,J6)-1","v":2},{"$f":"IF(J6=0,0,J6+Hongrie!J6)","v":0}]
[null,null,null,null,null,null,null,null,"RED BULL",{"$f":"SUM(G11:G13)","v":0},{"$f":"IF(J7=\"\",0,(RANK(J7,$J$5:$J$14)))+COUNTIF(J$5:J7,J7)-1","v":3},{"$f":"IF(J7=0,0,J7+Hongrie!J7)","v":0}]
["VETTEL Sebastian","FERRARI",null,null,null,null,{"$f":"IFERROR(CHOOSE(D8,25,18,15,12,10,8,6,4,2,1)+(F8=1),0)","v":0},null,"RACING POINT",{"$f":"SUM(G14:G16)","v":0},{"$f":"IF(J8=\"\",0,(RANK(J8,$J$5:$J$14)))+COUNTIF(J$5:J8,J8)-1","v":4},{"$f":"IF(J8=0,0,J8+Hongrie!J8)","v":0}]
["LECLERC Charles",null,null,null,null,null,{"$f":"IFERROR(CHOOSE(D9,25,18,15,12,10,8,6,4,2,1)+(F9=1),0)","v":0},null,"WILLIAMS",{"$f":"SUM(G17:G19)","v":0},{"$f":"IF(J9=\"\",0,(RANK(J9,$J$5:$J$14)))+COUNTIF(J$5:J9,J9)-1","v":5},{"$f":"IF(J9=0,0,J9+Hongrie!J9)","v":0}]
[null,null,null,null,null,null,{"$f":"IFERROR(CHOOSE(D10,25,18,15,12,10,8,6,4,2,1)+(F10=1),\"\")","v":""},null,"RENAULT",{"$f":"SUM(G20:G22)","v":0},{"$f":"IF(J10=\"\",0,(RANK(J10,$J$5:$J$14)))+COUNTIF(J$5:J10,J10)-1","v":6},{"$f":"IF(J10=0,0,J10+Hongrie!J10)","v":0}]
["VERSTAPPEN Max","RED BULL",null,null,null,null,{"$f":"IFERROR(CHOOSE(D11,25,18,15,12,10,8,6,4,2,1)+(F11=1),0)","v":0},null,"TORO ROSSO",{"$f":"SUM(G23:G25)","v":0},{"$f":"IF(J11=\"\",0,(RANK(J11,$J$5:$J$14)))+COUNTIF(J$5:J11,J11)-1","v":7},{"$f":"IF(J11=0,0,J11+Hongrie!J11)","v":0}]
["ALBON Alexander",null,null,null,null,null,{"$f":"IFERROR(CHOOSE(D12,25,18,15,12,10,8,6,4,2,1)+(F12=1),0)","v":0},null,"HAAS",{"$f":"SUM(G26:G28)","v":0},{"$f":"IF(J12=\"\",0,(RANK(J12,$J$5:$J$14)))+COUNTIF(J$5:J12,J12)-1","v":8},{"$f":"IF(J12=0,0,J12+Hongrie!J12)","v":0}]
[null,null,null,null,null,null,{"$f":"IFERROR(CHOOSE(D13,25,18,15,12,10,8,6,4,2,1)+(F13=1),\"\")","v":""},null,"Mc LAREN",{"$f":"SUM(G29:G31)","v":0},{"$f":"IF(J13=\"\",0,(RANK(J13,$J$5:$J$14)))+COUNTIF(J$5:J13,J13)-1","v":9},{"$f":"IF(J13=0,0,J13+Hongrie!J13)","v":0}]
["PEREZ Sergio","RACING\nPOINT",null,null,null,null,{"$f":"IFERROR(CHOOSE(D14,25,18,15,12,10,8,6,4,2,1)+(F14=1),0)","v":0},null,"ALFA ROMEO",{"$f":"SUM(G32:G34)","v":0},{"$f":"IF(J14=\"\",0,(RANK(J14,$J$5:$J$14)))+COUNTIF(J$5:J14,J14)-1","v":10},{"$f":"IF(J14=0,0,J14+Hongrie!J14)","v":0}]
["STROLL Lance",null,null,null,null,null,{"$f":"IFERROR(CHOOSE(D15,25,18,15,12,10,8,6,4,2,1)+(F15=1),0)","v":0}]
[null,null,null,null,null,null,{"$f":"IFERROR(CHOOSE(D16,25,18,15,12,10,8,6,4,2,1)+(F16=1),\"\")","v":""}]
["RUSSELL George","WILLIAMS",null,null,null,null,{"$f":"IFERROR(CHOOSE(D17,25,18,15,12,10,8,6,4,2,1)+(F17=1),0)","v":0}]
["LATIFI Nichola",null,null,null,null,null,{"$f":"IFERROR(CHOOSE(D18,25,18,15,12,10,8,6,4,2,1)+(F18=1),0)","v":0}]
[null,null,null,null,null,null,{"$f":"IFERROR(CHOOSE(D19,25,18,15,12,10,8,6,4,2,1)+(F19=1),\"\")","v":""}]
["RICCIARDO Daniel","RENAULT",null,null,null,null,{"$f":"IFERROR(CHOOSE(D20,25,18,15,12,10,8,6,4,2,1)+(F20=1),0)","v":0}]
["OCON Sebastian",null,null,null,null,null,{"$f":"IFERROR(CHOOSE(D21,25,18,15,12,10,8,6,4,2,1)+(F21=1),0)","v":0}]
[null,null,null,null,null,null,{"$f":"IFERROR(CHOOSE(D22,25,18,15,12,10,8,6,4,2,1)+(F22=1),\"\")","v":""}]
["KVYAT Daniil","ALPHA TAURI",null,null,null,null,{"$f":"IFERROR(CHOOSE(D23,25,18,15,12,10,8,6,4,2,1)+(F23=1),0)","v":0}]
["GASLY Pierre",null,null,null,null,null,{"$f":"IFERROR(CHOOSE(D24,25,18,15,12,10,8,6,4,2,1)+(F24=1),0)","v":0}]
[null,null,null,null,null,null,{"$f":"IFERROR(CHOOSE(D25,25,18,15,12,10,8,6,4,2,1)+(F25=1),\"\")","v":""}]
["GROSJEAN Romain","HAAS",null,null,null,null,{"$f":"IFERROR(CHOOSE(D26,25,18,15,12,10,8,6,4,2,1)+(F26=1),0)","v":0}]
["MAGNUSSEN Kevin",null,null,null,null,null,{"$f":"IFERROR(CHOOSE(D27,25,18,15,12,10,8,6,4,2,1)+(F27=1),0)","v":0}]
[null,null,null,null,null,null,{"$f":"IFERROR(CHOOSE(D28,25,18,15,12,10,8,6,4,2,1)+(F28=1),\"\")","v":""}]
["NORRIS Lando","McLAREN",null,null,null,null,{"$f":"IFERROR(CHOOSE(D29,25,18,15,12,10,8,6,4,2,1)+(F29=1),0)","v":0}]
["SAINZ.Jr Carlos",null,null,null,null,null,{"$f":"IFERROR(CHOOSE(D30,25,18,15,12,10,8,6,4,2,1)+(F30=1),0)","v":0}]
[null,null,null,null,null,null,{"$f":"IFERROR(CHOOSE(D31,25,18,15,12,10,8,6,4,2,1)+(F31=1),\"\")","v":""}]
["RAÏKKÖNEN Kimi","ALFA ROMEO",null,null,null,null,{"$f":"IFERROR(CHOOSE(D32,25,18,15,12,10,8,6,4,2,1)+(F32=1),0)","v":0}]
["GIOVANIZZI Antonio",null,null,null,null,null,{"$f":"IFERROR(CHOOSE(D33,25,18,15,12,10,8,6,4,2,1)+(F33=1),0)","v":0}]
[null,null,null,null,null,null,{"$f":"IFERROR(CHOOSE(D34,25,18,15,12,10,8,6,4,2,1)+(F34=1),\"\")","v":""}]

{"sheet":"Italie","index":17,"n_rows":34,"n_cols":12,"rows_kept":34,"cut":false,"hidden":false,"merged":[[31,1,33,1],[31,2,33,2],[22,1,24,1],[22,2,24,2],[25,1,27,1],[25,2,27,2],[28,1,30,1],[28,2,30,2],[13,1,15,1],[13,2,15,2],[16,1,18,1],[16,2,18,2],[19,1,21,1],[19,2,21,2],[4,1,6,1],[4,2,6,2],[7,1,9,1],[7,2,9,2],[10,1,12,1],[10,2,12,2],[0,0,1,14],[2,0,3,0],[2,1,3,1],[2,2,3,2],[2,3,3,3],[2,4,3,4],[2,5,3,5],[2,6,3,6],[2,8,2,10]]}
["ITALIE - 14 AOUT 2019"]
[]
["PILOTES","ECURIES","VOITURES","Finish","Pôle","Pt tour","Points",null,"CLASSEMENT"]
[null,null,null,null,null,null,null,{"$f":"IF(G4=\"\",\"\",(RANK(G4,G4:G23)))","v":""},"ÉCURIES","POINTS","RANG","TOTAL"]
["HAMILTON Lewis","MERCEDES",null,null,null,null,{"$f":"IFERROR(CHOOSE(D5,25,18,15,12,10,8,6,4,2,1)+(F5=1),0)","v":0},null,"MERCEDES",{"$f":"SUM(G5:G7)","v":0},{"$f":"IF(J5=\"\",0,(RANK(J5,$J$5:$J$14)))+COUNTIF(J$5:J5,J5)-1","v":1},{"$f":"IF(J5=0,0,J5+Belgique!J5)","v":0}]
["BOTTAS Valterri",null,null,null,null,null,{"$f":"IFERROR(CHOOSE(D6,25,18,15,12,10,8,6,4,2,1)+(F6=1),0)","v":0},null,"FERRARI",{"$f":"SUM(G8:G10)","v":0},{"$f":"IF(J6=\"\",0,(RANK(J6,$J$5:$J$14)))+COUNTIF(J$5:J6,J6)-1","v":2},{"$f":"IF(J6=0,0,J6+Belgique!J6)","v":0}]
[null,null,null,null,null,null,null,null,"RED BULL",{"$f":"SUM(G11:G13)","v":0},{"$f":"IF(J7=\"\",0,(RANK(J7,$J$5:$J$14)))+COUNTIF(J$5:J7,J7)-1","v":3},{"$f":"IF(J7=0,0,J7+Belgique!J7)","v":0}]
["VETTEL Sebastian","FERRARI",null,null,null,null,{"$f":"IFERROR(CHOOSE(D8,25,18,15,12,10,8,6,4,2,1)+(F8=1),0)","v":0},null,"RACING POINT",{"$f":"SUM(G14:G16)","v":0},{"$f":"IF(J8=\"\",0,(RANK(J8,$J$5:$J$14)))+COUNTIF(J$5:J8,J8)-1","v":4},{"$f":"IF(J8=0,0,J8+Belgique!J8)","v":0}]
["LECLERC Charles",null,null,null,null,null,{"$f":"IFERROR(CHOOSE(D9,25,18,15,12,10,8,6,4,2,1)+(F9=1),0)","v":0},null,"WILLIAMS",{"$f":"SUM(G17:G19)","v":0},{"$f":"IF(J9=\"\",0,(RANK(J9,$J$5:$J$14)))+COUNTIF(J$5:J9,J9)-1","v":5},{"$f":"IF(J9=0,0,J9+Belgique!J9)","v":0}]
[null,null,null,null,null,null,{"$f":"IFERROR(CHOOSE(D10,25,18,15,12,10,8,6,4,2,1)+(F10=1),\"\")","v":""},null,"RENAULT",{"$f":"SUM(G20:G22)","v":0},{"$f":"IF(J10=\"\",0,(RANK(J10,$J$5:$J$14)))+COUNTIF(J$5:J10,J10)-1","v":6},{"$f":"IF(J10=0,0,J10+Belgique!J10)","v":0}]
["VERSTAPPEN Max","RED BULL",null,null,null,null,{"$f":"IFERROR(CHOOSE(D11,25,18,15,12,10,8,6,4,2,1)+(F11=1),0)","v":0},null,"TORO ROSSO",{"$f":"SUM(G23:G25)","v":0},{"$f":"IF(J11=\"\",0,(RANK(J11,$J$5:$J$14)))+COUNTIF(J$5:J11,J11)-1","v":7},{"$f":"IF(J11=0,0,J11+Belgique!J11)","v":0}]
["ALBON Alexander",null,null,null,null,null,{"$f":"IFERROR(CHOOSE(D12,25,18,15,12,10,8,6,4,2,1)+(F12=1),0)","v":0},null,"HAAS",{"$f":"SUM(G26:G28)","v":0},{"$f":"IF(J12=\"\",0,(RANK(J12,$J$5:$J$14)))+COUNTIF(J$5:J12,J12)-1","v":8},{"$f":"IF(J12=0,0,J12+Belgique!J12)","v":0}]
[null,null,null,null,null,null,{"$f":"IFERROR(CHOOSE(D13,25,18,15,12,10,8,6,4,2,1)+(F13=1),\"\")","v":""},null,"Mc LAREN",{"$f":"SUM(G29:G31)","v":0},{"$f":"IF(J13=\"\",0,(RANK(J13,$J$5:$J$14)))+COUNTIF(J$5:J13,J13)-1","v":9},{"$f":"IF(J13=0,0,J13+Belgique!J13)","v":0}]
["PEREZ Sergio","RACING\nPOINT",null,null,null,null,{"$f":"IFERROR(CHOOSE(D14,25,18,15,12,10,8,6,4,2,1)+(F14=1),0)","v":0},null,"ALFA ROMEO",{"$f":"SUM(G32:G34)","v":0},{"$f":"IF(J14=\"\",0,(RANK(J14,$J$5:$J$14)))+COUNTIF(J$5:J14,J14)-1","v":10},{"$f":"IF(J14=0,0,J14+Belgique!J14)","v":0}]
["STROLL Lance",null,null,null,null,null,{"$f":"IFERROR(CHOOSE(D15,25,18,15,12,10,8,6,4,2,1)+(F15=1),0)","v":0}]
[null,null,null,null,null,null,{"$f":"IFERROR(CHOOSE(D16,25,18,15,12,10,8,6,4,2,1)+(F16=1),\"\")","v":""}]
["RUSSELL George","WILLIAMS",null,null,null,null,{"$f":"IFERROR(CHOOSE(D17,25,18,15,12,10,8,6,4,2,1)+(F17=1),0)","v":0}]
["LATIFI Nichola",null,null,null,null,null,{"$f":"IFERROR(CHOOSE(D18,25,18,15,12,10,8,6,4,2,1)+(F18=1),0)","v":0}]
[null,null,null,null,null,null,{"$f":"IFERROR(CHOOSE(D19,25,18,15,12,10,8,6,4,2,1)+(F19=1),\"\")","v":""}]
["RICCIARDO Daniel","RENAULT",null,null,null,null,{"$f":"IFERROR(CHOOSE(D20,25,18,15,12,10,8,6,4,2,1)+(F20=1),0)","v":0}]
["OCON Sebastian",null,null,null,null,null,{"$f":"IFERROR(CHOOSE(D21,25,18,15,12,10,8,6,4,2,1)+(F21=1),0)","v":0}]
[null,null,null,null,null,null,{"$f":"IFERROR(CHOOSE(D22,25,18,15,12,10,8,6,4,2,1)+(F22=1),\"\")","v":""}]
["KVYAT Daniil","ALPHA TAURI",null,null,null,null,{"$f":"IFERROR(CHOOSE(D23,25,18,15,12,10,8,6,4,2,1)+(F23=1),0)","v":0}]
["GASLY Pierre",null,null,null,null,null,{"$f":"IFERROR(CHOOSE(D24,25,18,15,12,10,8,6,4,2,1)+(F24=1),0)","v":0}]
[null,null,null,null,null,null,{"$f":"IFERROR(CHOOSE(D25,25,18,15,12,10,8,6,4,2,1)+(F25=1),\"\")","v":""}]
["GROSJEAN Romain","HAAS",null,null,null,null,{"$f":"IFERROR(CHOOSE(D26,25,18,15,12,10,8,6,4,2,1)+(F26=1),0)","v":0}]
["MAGNUSSEN Kevin",null,null,null,null,null,{"$f":"IFERROR(CHOOSE(D27,25,18,15,12,10,8,6,4,2,1)+(F27=1),0)","v":0}]
[null,null,null,null,null,null,{"$f":"IFERROR(CHOOSE(D28,25,18,15,12,10,8,6,4,2,1)+(F28=1),\"\")","v":""}]
["NORRIS Lando","McLAREN",null,null,null,null,{"$f":"IFERROR(CHOOSE(D29,25,18,15,12,10,8,6,4,2,1)+(F29=1),0)","v":0}]
["SAINZ.Jr Carlos",null,null,null,null,null,{"$f":"IFERROR(CHOOSE(D30,25,18,15,12,10,8,6,4,2,1)+(F30=1),0)","v":0}]
[null,null,null,null,null,null,{"$f":"IFERROR(CHOOSE(D31,25,18,15,12,10,8,6,4,2,1)+(F31=1),\"\")","v":""}]
["RAÏKKÖNEN Kimi","ALFA ROMEO",null,null,1,null,{"$f":"IFERROR(CHOOSE(D32,25,18,15,12,10,8,6,4,2,1)+(F32=1),0)","v":0}]
["GIOVANIZZI Antonio",null,null,null,null,null,{"$f":"IFERROR(CHOOSE(D33,25,18,15,12,10,8,6,4,2,1)+(F33=1),0)","v":0}]
[null,null,null,null,null,null,{"$f":"IFERROR(CHOOSE(D34,25,18,15,12,10,8,6,4,2,1)+(F34=1),\"\")","v":""}]

{"sheet":"Singapour","index":18,"n_rows":34,"n_cols":12,"rows_kept":34,"cut":false,"hidden":false,"merged":[[31,1,33,1],[31,2,33,2],[22,1,24,1],[22,2,24,2],[25,1,27,1],[25,2,27,2],[28,1,30,1],[28,2,30,2],[13,1,15,1],[13,2,15,2],[16,1,18,1],[16,2,18,2],[19,1,21,1],[19,2,21,2],[4,1,6,1],[4,2,6,2],[7,1,9,1],[7,2,9,2],[10,1,12,1],[10,2,12,2],[0,0,1,14],[2,0,3,0],[2,1,3,1],[2,2,3,2],[2,3,3,3],[2,4,3,4],[2,5,3,5],[2,6,3,6],[2,8,2,10]]}
["SINGAPOUR - 14 AOUT 2019"]
[]
["PILOTES","ECURIES","VOITURES","Finish","Pôle","Pt tour","Points",null,"CLASSEMENT"]
[null,null,null,null,null,null,null,{"$f":"IF(G4=\"\",\"\",(RANK(G4,G4:G23)))","v":""},"ÉCURIES","POINTS","RANG","TOTAL"]
["HAMILTON Lewis","MERCEDES",null,null,null,null,{"$f":"IFERROR(CHOOSE(D5,25,18,15,12,10,8,6,4,2,1)+(F5=1),0)","v":0},null,"MERCEDES",{"$f":"SUM(G5:G7)","v":0},{"$f":"IF(J5=\"\",0,(RANK(J5,$J$5:$J$14)))+COUNTIF(J$5:J5,J5)-1","v":1},{"$f":"IF(J5=0,0,J5+Italie!J5)","v":0}]
["BOTTAS Valterri",null,null,null,null,null,{"$f":"IFERROR(CHOOSE(D6,25,18,15,12,10,8,6,4,2,1)+(F6=1),0)","v":0},null,"FERRARI",{"$f":"SUM(G8:G10)","v":0},{"$f":"IF(J6=\"\",0,(RANK(J6,$J$5:$J$14)))+COUNTIF(J$5:J6,J6)-1","v":2},{"$f":"IF(J6=0,0,J6+Italie!J6)","v":0}]
[null,null,null,null,null,null,null,null,"RED BULL",{"$f":"SUM(G11:G13)","v":0},{"$f":"IF(J7=\"\",0,(RANK(J7,$J$5:$J$14)))+COUNTIF(J$5:J7,J7)-1","v":3},{"$f":"IF(J7=0,0,J7+Italie!J7)","v":0}]
["VETTEL Sebastian","FERRARI",null,null,null,null,{"$f":"IFERROR(CHOOSE(D8,25,18,15,12,10,8,6,4,2,1)+(F8=1),0)","v":0},null,"RACING POINT",{"$f":"SUM(G14:G16)","v":0},{"$f":"IF(J8=\"\",0,(RANK(J8,$J$5:$J$14)))+COUNTIF(J$5:J8,J8)-1","v":4},{"$f":"IF(J8=0,0,J8+Italie!J8)","v":0}]
["LECLERC Charles",null,null,null,null,null,{"$f":"IFERROR(CHOOSE(D9,25,18,15,12,10,8,6,4,2,1)+(F9=1),0)","v":0},null,"WILLIAMS",{"$f":"SUM(G17:G19)","v":0},{"$f":"IF(J9=\"\",0,(RANK(J9,$J$5:$J$14)))+COUNTIF(J$5:J9,J9)-1","v":5},{"$f":"IF(J9=0,0,J9+Italie!J9)","v":0}]
[null,null,null,null,null,null,{"$f":"IFERROR(CHOOSE(D10,25,18,15,12,10,8,6,4,2,1)+(F10=1),\"\")","v":""},null,"RENAULT",{"$f":"SUM(G20:G22)","v":0},{"$f":"IF(J10=\"\",0,(RANK(J10,$J$5:$J$14)))+COUNTIF(J$5:J10,J10)-1","v":6},{"$f":"IF(J10=0,0,J10+Italie!J10)","v":0}]
["VERSTAPPEN Max","RED BULL",null,null,null,null,{"$f":"IFERROR(CHOOSE(D11,25,18,15,12,10,8,6,4,2,1)+(F11=1),0)","v":0},null,"TORO ROSSO",{"$f":"SUM(G23:G25)","v":0},{"$f":"IF(J11=\"\",0,(RANK(J11,$J$5:$J$14)))+COUNTIF(J$5:J11,J11)-1","v":7},{"$f":"IF(J11=0,0,J11+Italie!J11)","v":0}]
["ALBON Alexander",null,null,null,null,null,{"$f":"IFERROR(CHOOSE(D12,25,18,15,12,10,8,6,4,2,1)+(F12=1),0)","v":0},null,"HAAS",{"$f":"SUM(G26:G28)","v":0},{"$f":"IF(J12=\"\",0,(RANK(J12,$J$5:$J$14)))+COUNTIF(J$5:J12,J12)-1","v":8},{"$f":"IF(J12=0,0,J12+Italie!J12)","v":0}]
[null,null,null,null,null,null,{"$f":"IFERROR(CHOOSE(D13,25,18,15,12,10,8,6,4,2,1)+(F13=1),\"\")","v":""},null,"Mc LAREN",{"$f":"SUM(G29:G31)","v":0},{"$f":"IF(J13=\"\",0,(RANK(J13,$J$5:$J$14)))+COUNTIF(J$5:J13,J13)-1","v":9},{"$f":"IF(J13=0,0,J13+Italie!J13)","v":0}]
["PEREZ Sergio","RACING\nPOINT",null,null,null,null,{"$f":"IFERROR(CHOOSE(D14,25,18,15,12,10,8,6,4,2,1)+(F14=1),0)","v":0},null,"ALFA ROMEO",{"$f":"SUM(G32:G34)","v":0},{"$f":"IF(J14=\"\",0,(RANK(J14,$J$5:$J$14)))+COUNTIF(J$5:J14,J14)-1","v":10},{"$f":"IF(J14=0,0,J14+Italie!J14)","v":0}]
["STROLL Lance",null,null,null,null,null,{"$f":"IFERROR(CHOOSE(D15,25,18,15,12,10,8,6,4,2,1)+(F15=1),0)","v":0}]
[null,null,null,null,null,null,{"$f":"IFERROR(CHOOSE(D16,25,18,15,12,10,8,6,4,2,1)+(F16=1),\"\")","v":""}]
["RUSSELL George","WILLIAMS",null,null,null,null,{"$f":"IFERROR(CHOOSE(D17,25,18,15,12,10,8,6,4,2,1)+(F17=1),0)","v":0}]
["LATIFI Nichola",null,null,null,null,null,{"$f":"IFERROR(CHOOSE(D18,25,18,15,12,10,8,6,4,2,1)+(F18=1),0)","v":0}]
[null,null,null,null,null,null,{"$f":"IFERROR(CHOOSE(D19,25,18,15,12,10,8,6,4,2,1)+(F19=1),\"\")","v":""}]
["RICCIARDO Daniel","RENAULT",null,null,null,null,{"$f":"IFERROR(CHOOSE(D20,25,18,15,12,10,8,6,4,2,1)+(F20=1),0)","v":0}]
["OCON Sebastian",null,null,null,null,null,{"$f":"IFERROR(CHOOSE(D21,25,18,15,12,10,8,6,4,2,1)+(F21=1),0)","v":0}]
[null,null,null,null,null,null,{"$f":"IFERROR(CHOOSE(D22,25,18,15,12,10,8,6,4,2,1)+(F22=1),\"\")","v":""}]
["KVYAT Daniil","ALPHA TAURI",null,null,null,null,{"$f":"IFERROR(CHOOSE(D23,25,18,15,12,10,8,6,4,2,1)+(F23=1),0)","v":0}]
["GASLY Pierre",null,null,null,null,null,{"$f":"IFERROR(CHOOSE(D24,25,18,15,12,10,8,6,4,2,1)+(F24=1),0)","v":0}]
[null,null,null,null,null,null,{"$f":"IFERROR(CHOOSE(D25,25,18,15,12,10,8,6,4,2,1)+(F25=1),\"\")","v":""}]
["GROSJEAN Romain","HAAS",null,null,null,null,{"$f":"IFERROR(CHOOSE(D26,25,18,15,12,10,8,6,4,2,1)+(F26=1),0)","v":0}]
["MAGNUSSEN Kevin",null,null,null,null,null,{"$f":"IFERROR(CHOOSE(D27,25,18,15,12,10,8,6,4,2,1)+(F27=1),0)","v":0}]
[null,null,null,null,null,null,{"$f":"IFERROR(CHOOSE(D28,25,18,15,12,10,8,6,4,2,1)+(F28=1),\"\")","v":""}]
["NORRIS Lando","McLAREN",null,null,null,null,{"$f":"IFERROR(CHOOSE(D29,25,18,15,12,10,8,6,4,2,1)+(F29=1),0)","v":0}]
["SAINZ.Jr Carlos",null,null,null,null,null,{"$f":"IFERROR(CHOOSE(D30,25,18,15,12,10,8,6,4,2,1)+(F30=1),0)","v":0}]
[null,null,null,null,null,null,{"$f":"IFERROR(CHOOSE(D31,25,18,15,12,10,8,6,4,2,1)+(F31=1),\"\")","v":""}]
["RAÏKKÖNEN Kimi","ALFA ROMEO",null,null,null,null,{"$f":"IFERROR(CHOOSE(D32,25,18,15,12,10,8,6,4,2,1)+(F32=1),0)","v":0}]
["GIOVANIZZI Antonio",null,null,null,null,null,{"$f":"IFERROR(CHOOSE(D33,25,18,15,12,10,8,6,4,2,1)+(F33=1),0)","v":0}]
[null,null,null,null,null,null,{"$f":"IFERROR(CHOOSE(D34,25,18,15,12,10,8,6,4,2,1)+(F34=1),\"\")","v":""}]

{"sheet":"Russie","index":19,"n_rows":34,"n_cols":12,"rows_kept":34,"cut":false,"hidden":false,"merged":[[31,1,33,1],[31,2,33,2],[22,1,24,1],[22,2,24,2],[25,1,27,1],[25,2,27,2],[28,1,30,1],[28,2,30,2],[13,1,15,1],[13,2,15,2],[16,1,18,1],[16,2,18,2],[19,1,21,1],[19,2,21,2],[4,1,6,1],[4,2,6,2],[7,1,9,1],[7,2,9,2],[10,1,12,1],[10,2,12,2],[0,0,1,14],[2,0,3,0],[2,1,3,1],[2,2,3,2],[2,3,3,3],[2,4,3,4],[2,5,3,5],[2,6,3,6],[2,8,2,10]]}
["SINGAPOUR - 14 AOUT 2019"]
[]
["PILOTES","ECURIES","VOITURES","Finish","Pôle","Pt tour","Points",null,"CLASSEMENT"]
[null,null,null,null,null,null,null,{"$f":"IF(G4=\"\",\"\",(RANK(G4,G4:G23)))","v":""},"ÉCURIES","POINTS","RANG","TOTAL"]
["HAMILTON Lewis","MERCEDES",null,null,null,null,{"$f":"IFERROR(CHOOSE(D5,25,18,15,12,10,8,6,4,2,1)+(F5=1),0)","v":0},null,"MERCEDES",{"$f":"SUM(G5:G7)","v":0},{"$f":"IF(J5=\"\",0,(RANK(J5,$J$5:$J$14)))+COUNTIF(J$5:J5,J5)-1","v":1},{"$f":"IF(J5=0,0,J5+Singapour!J5)","v":0}]
["BOTTAS Valterri",null,null,null,null,null,{"$f":"IFERROR(CHOOSE(D6,25,18,15,12,10,8,6,4,2,1)+(F6=1),0)","v":0},null,"FERRARI",{"$f":"SUM(G8:G10)","v":0},{"$f":"IF(J6=\"\",0,(RANK(J6,$J$5:$J$14)))+COUNTIF(J$5:J6,J6)-1","v":2},{"$f":"IF(J6=0,0,J6+Singapour!J6)","v":0}]
[null,null,null,null,null,null,null,null,"RED BULL",{"$f":"SUM(G11:G13)","v":0},{"$f":"IF(J7=\"\",0,(RANK(J7,$J$5:$J$14)))+COUNTIF(J$5:J7,J7)-1","v":3},{"$f":"IF(J7=0,0,J7+Singapour!J7)","v":0}]
["VETTEL Sebastian","FERRARI",null,null,null,null,{"$f":"IFERROR(CHOOSE(D8,25,18,15,12,10,8,6,4,2,1)+(F8=1),0)","v":0},null,"RACING POINT",{"$f":"SUM(G14:G16)","v":0},{"$f":"IF(J8=\"\",0,(RANK(J8,$J$5:$J$14)))+COUNTIF(J$5:J8,J8)-1","v":4},{"$f":"IF(J8=0,0,J8+Singapour!J8)","v":0}]
["LECLERC Charles",null,null,null,null,null,{"$f":"IFERROR(CHOOSE(D9,25,18,15,12,10,8,6,4,2,1)+(F9=1),0)","v":0},null,"WILLIAMS",{"$f":"SUM(G17:G19)","v":0},{"$f":"IF(J9=\"\",0,(RANK(J9,$J$5:$J$14)))+COUNTIF(J$5:J9,J9)-1","v":5},{"$f":"IF(J9=0,0,J9+Singapour!J9)","v":0}]
[null,null,null,null,null,null,{"$f":"IFERROR(CHOOSE(D10,25,18,15,12,10,8,6,4,2,1)+(F10=1),\"\")","v":""},null,"RENAULT",{"$f":"SUM(G20:G22)","v":0},{"$f":"IF(J10=\"\",0,(RANK(J10,$J$5:$J$14)))+COUNTIF(J$5:J10,J10)-1","v":6},{"$f":"IF(J10=0,0,J10+Singapour!J10)","v":0}]
["VERSTAPPEN Max","RED BULL",null,null,null,null,{"$f":"IFERROR(CHOOSE(D11,25,18,15,12,10,8,6,4,2,1)+(F11=1),0)","v":0},null,"TORO ROSSO",{"$f":"SUM(G23:G25)","v":0},{"$f":"IF(J11=\"\",0,(RANK(J11,$J$5:$J$14)))+COUNTIF(J$5:J11,J11)-1","v":7},{"$f":"IF(J11=0,0,J11+Singapour!J11)","v":0}]
["ALBON Alexander",null,null,null,null,null,{"$f":"IFERROR(CHOOSE(D12,25,18,15,12,10,8,6,4,2,1)+(F12=1),0)","v":0},null,"HAAS",{"$f":"SUM(G26:G28)","v":0},{"$f":"IF(J12=\"\",0,(RANK(J12,$J$5:$J$14)))+COUNTIF(J$5:J12,J12)-1","v":8},{"$f":"IF(J12=0,0,J12+Singapour!J12)","v":0}]
[null,null,null,null,null,null,{"$f":"IFERROR(CHOOSE(D13,25,18,15,12,10,8,6,4,2,1)+(F13=1),\"\")","v":""},null,"Mc LAREN",{"$f":"SUM(G29:G31)","v":0},{"$f":"IF(J13=\"\",0,(RANK(J13,$J$5:$J$14)))+COUNTIF(J$5:J13,J13)-1","v":9},{"$f":"IF(J13=0,0,J13+Singapour!J13)","v":0}]
["PEREZ Sergio","RACING\nPOINT",null,null,null,null,{"$f":"IFERROR(CHOOSE(D14,25,18,15,12,10,8,6,4,2,1)+(F14=1),0)","v":0},null,"ALFA ROMEO",{"$f":"SUM(G32:G34)","v":0},{"$f":"IF(J14=\"\",0,(RANK(J14,$J$5:$J$14)))+COUNTIF(J$5:J14,J14)-1","v":10},{"$f":"IF(J14=0,0,J14+Singapour!J14)","v":0}]
["STROLL Lance",null,null,null,null,null,{"$f":"IFERROR(CHOOSE(D15,25,18,15,12,10,8,6,4,2,1)+(F15=1),0)","v":0}]
[null,null,null,null,null,null,{"$f":"IFERROR(CHOOSE(D16,25,18,15,12,10,8,6,4,2,1)+(F16=1),\"\")","v":""}]
["RUSSELL George","WILLIAMS",null,null,null,null,{"$f":"IFERROR(CHOOSE(D17,25,18,15,12,10,8,6,4,2,1)+(F17=1),0)","v":0}]
["LATIFI Nichola",null,null,null,null,null,{"$f":"IFERROR(CHOOSE(D18,25,18,15,12,10,8,6,4,2,1)+(F18=1),0)","v":0}]
[null,null,null,null,null,null,{"$f":"IFERROR(CHOOSE(D19,25,18,15,12,10,8,6,4,2,1)+(F19=1),\"\")","v":""}]
["RICCIARDO Daniel","RENAULT",null,null,null,null,{"$f":"IFERROR(CHOOSE(D20,25,18,15,12,10,8,6,4,2,1)+(F20=1),0)","v":0}]
["OCON Sebastian",null,null,null,null,null,{"$f":"IFERROR(CHOOSE(D21,25,18,15,12,10,8,6,4,2,1)+(F21=1),0)","v":0}]
[null,null,null,null,null,null,{"$f":"IFERROR(CHOOSE(D22,25,18,15,12,10,8,6,4,2,1)+(F22=1),\"\")","v":""}]
["KVYAT Daniil","ALPHA TAURI",null,null,null,null,{"$f":"IFERROR(CHOOSE(D23,25,18,15,12,10,8,6,4,2,1)+(F23=1),0)","v":0}]
["GASLY Pierre",null,null,null,null,null,{"$f":"IFERROR(CHOOSE(D24,25,18,15,12,10,8,6,4,2,1)+(F24=1),0)","v":0}]
[null,null,null,null,null,null,{"$f":"IFERROR(CHOOSE(D25,25,18,15,12,10,8,6,4,2,1)+(F25=1),\"\")","v":""}]
["GROSJEAN Romain","HAAS",null,null,null,null,{"$f":"IFERROR(CHOOSE(D26,25,18,15,12,10,8,6,4,2,1)+(F26=1),0)","v":0}]
["MAGNUSSEN Kevin",null,null,null,null,null,{"$f":"IFERROR(CHOOSE(D27,25,18,15,12,10,8,6,4,2,1)+(F27=1),0)","v":0}]
[null,null,null,null,null,null,{"$f":"IFERROR(CHOOSE(D28,25,18,15,12,10,8,6,4,2,1)+(F28=1),\"\")","v":""}]
["NORRIS Lando","McLAREN",null,null,null,null,{"$f":"IFERROR(CHOOSE(D29,25,18,15,12,10,8,6,4,2,1)+(F29=1),0)","v":0}]
["SAINZ.Jr Carlos",null,null,null,null,null,{"$f":"IFERROR(CHOOSE(D30,25,18,15,12,10,8,6,4,2,1)+(F30=1),0)","v":0}]
[null,null,null,null,null,null,{"$f":"IFERROR(CHOOSE(D31,25,18,15,12,10,8,6,4,2,1)+(F31=1),\"\")","v":""}]
["RAÏKKÖNEN Kimi","ALFA ROMEO",null,null,null,null,{"$f":"IFERROR(CHOOSE(D32,25,18,15,12,10,8,6,4,2,1)+(F32=1),0)","v":0}]
["GIOVANIZZI Antonio",null,null,null,null,null,{"$f":"IFERROR(CHOOSE(D33,25,18,15,12,10,8,6,4,2,1)+(F33=1),0)","v":0}]
[null,null,null,null,null,null,{"$f":"IFERROR(CHOOSE(D34,25,18,15,12,10,8,6,4,2,1)+(F34=1),\"\")","v":""}]

{"sheet":"Japon","index":20,"n_rows":34,"n_cols":16,"rows_kept":34,"cut":false,"hidden":false,"merged":[[31,1,33,1],[31,2,33,2],[22,1,24,1],[22,2,24,2],[25,1,27,1],[25,2,27,2],[28,1,30,1],[28,2,30,2],[13,1,15,1],[13,2,15,2],[16,1,18,1],[16,2,18,2],[19,1,21,1],[19,2,21,2],[4,1,6,1],[4,2,6,2],[7,1,9,1],[7,2,9,2],[10,1,12,1],[10,2,12,2],[0,0,1,14],[2,0,3,0],[2,1,3,1],[2,2,3,2],[2,3,3,3],[2,4,3,4],[2,5,3,5],[2,6,3,6],[2,8,2,10]]}
["JAPON - 14 AOUT 2019",null,null,null,null,null,null,null,null,null,null,null,null,null,null,14.5]
[]
["PILOTES","ECURIES","VOITURES","Finish","Pôle","Pt tour","Points",null,"CLASSEMENT"]
[null,null,null,null,null,null,null,{"$f":"IF(G4=\"\",\"\",(RANK(G4,G4:G23)))","v":""},"ÉCURIES","POINTS","RANG","TOTAL"]
["HAMILTON Lewis","MERCEDES",null,null,null,null,{"$f":"IFERROR(CHOOSE(D5,25,18,15,12,10,8,6,4,2,1)+(F5=1),0)","v":0},null,"MERCEDES",{"$f":"SUM(G5:G7)","v":0},{"$f":"IF(J5=\"\",0,(RANK(J5,$J$5:$J$14)))+COUNTIF(J$5:J5,J5)-1","v":1},{"$f":"IF(J5=0,0,J5+Russie!J5)","v":0}]
["BOTTAS Valterri",null,null,null,null,null,{"$f":"IFERROR(CHOOSE(D6,25,18,15,12,10,8,6,4,2,1)+(F6=1),0)","v":0},null,"FERRARI",{"$f":"SUM(G8:G10)","v":0},{"$f":"IF(J6=\"\",0,(RANK(J6,$J$5:$J$14)))+COUNTIF(J$5:J6,J6)-1","v":2},{"$f":"IF(J6=0,0,J6+Russie!J6)","v":0}]
[null,null,null,null,null,null,null,null,"RED BULL",{"$f":"SUM(G11:G13)","v":0},{"$f":"IF(J7=\"\",0,(RANK(J7,$J$5:$J$14)))+COUNTIF(J$5:J7,J7)-1","v":3},{"$f":"IF(J7=0,0,J7+Russie!J7)","v":0}]
["VETTEL Sebastian","FERRARI",null,null,null,null,{"$f":"IFERROR(CHOOSE(D8,25,18,15,12,10,8,6,4,2,1)+(F8=1),0)","v":0},null,"RACING POINT",{"$f":"SUM(G14:G16)","v":0},{"$f":"IF(J8=\"\",0,(RANK(J8,$J$5:$J$14)))+COUNTIF(J$5:J8,J8)-1","v":4},{"$f":"IF(J8=0,0,J8+Russie!J8)","v":0}]
["LECLERC Charles",null,null,null,null,null,{"$f":"IFERROR(CHOOSE(D9,25,18,15,12,10,8,6,4,2,1)+(F9=1),0)","v":0},null,"WILLIAMS",{"$f":"SUM(G17:G19)","v":0},{"$f":"IF(J9=\"\",0,(RANK(J9,$J$5:$J$14)))+COUNTIF(J$5:J9,J9)-1","v":5},{"$f":"IF(J9=0,0,J9+Russie!J9)","v":0}]
[null,null,null,null,null,null,{"$f":"IFERROR(CHOOSE(D10,25,18,15,12,10,8,6,4,2,1)+(F10=1),\"\")","v":""},null,"RENAULT",{"$f":"SUM(G20:G22)","v":0},{"$f":"IF(J10=\"\",0,(RANK(J10,$J$5:$J$14)))+COUNTIF(J$5:J10,J10)-1","v":6},{"$f":"IF(J10=0,0,J10+Russie!J10)","v":0}]
["VERSTAPPEN Max","RED BULL",null,null,null,null,{"$f":"IFERROR(CHOOSE(D11,25,18,15,12,10,8,6,4,2,1)+(F11=1),0)","v":0},null,"TORO ROSSO",{"$f":"SUM(G23:G25)","v":0},{"$f":"IF(J11=\"\",0,(RANK(J11,$J$5:$J$14)))+COUNTIF(J$5:J11,J11)-1","v":7},{"$f":"IF(J11=0,0,J11+Russie!J11)","v":0}]
["ALBON Alexander",null,null,null,null,null,{"$f":"IFERROR(CHOOSE(D12,25,18,15,12,10,8,6,4,2,1)+(F12=1),0)","v":0},null,"HAAS",{"$f":"SUM(G26:G28)","v":0},{"$f":"IF(J12=\"\",0,(RANK(J12,$J$5:$J$14)))+COUNTIF(J$5:J12,J12)-1","v":8},{"$f":"IF(J12=0,0,J12+Russie!J12)","v":0}]
[null,null,null,null,null,null,{"$f":"IFERROR(CHOOSE(D13,25,18,15,12,10,8,6,4,2,1)+(F13=1),\"\")","v":""},null,"Mc LAREN",{"$f":"SUM(G29:G31)","v":0},{"$f":"IF(J13=\"\",0,(RANK(J13,$J$5:$J$14)))+COUNTIF(J$5:J13,J13)-1","v":9},{"$f":"IF(J13=0,0,J13+Russie!J13)","v":0}]
["PEREZ Sergio","RACING\nPOINT",null,null,null,null,{"$f":"IFERROR(CHOOSE(D14,25,18,15,12,10,8,6,4,2,1)+(F14=1),0)","v":0},null,"ALFA ROMEO",{"$f":"SUM(G32:G34)","v":0},{"$f":"IF(J14=\"\",0,(RANK(J14,$J$5:$J$14)))+COUNTIF(J$5:J14,J14)-1","v":10},{"$f":"IF(J14=0,0,J14+Russie!J14)","v":0}]
["STROLL Lance",null,null,null,null,null,{"$f":"IFERROR(CHOOSE(D15,25,18,15,12,10,8,6,4,2,1)+(F15=1),0)","v":0}]
[null,null,null,null,null,null,{"$f":"IFERROR(CHOOSE(D16,25,18,15,12,10,8,6,4,2,1)+(F16=1),\"\")","v":""}]
["RUSSELL George","WILLIAMS",null,null,null,null,{"$f":"IFERROR(CHOOSE(D17,25,18,15,12,10,8,6,4,2,1)+(F17=1),0)","v":0}]
["LATIFI Nichola",null,null,null,null,null,{"$f":"IFERROR(CHOOSE(D18,25,18,15,12,10,8,6,4,2,1)+(F18=1),0)","v":0}]
[null,null,null,null,null,null,{"$f":"IFERROR(CHOOSE(D19,25,18,15,12,10,8,6,4,2,1)+(F19=1),\"\")","v":""}]
["RICCIARDO Daniel","RENAULT",null,null,null,null,{"$f":"IFERROR(CHOOSE(D20,25,18,15,12,10,8,6,4,2,1)+(F20=1),0)","v":0}]
["OCON Sebastian",null,null,null,null,null,{"$f":"IFERROR(CHOOSE(D21,25,18,15,12,10,8,6,4,2,1)+(F21=1),0)","v":0}]
[null,null,null,null,null,null,{"$f":"IFERROR(CHOOSE(D22,25,18,15,12,10,8,6,4,2,1)+(F22=1),\"\")","v":""}]
["KVYAT Daniil","ALPHA TAURI",null,null,null,null,{"$f":"IFERROR(CHOOSE(D23,25,18,15,12,10,8,6,4,2,1)+(F23=1),0)","v":0}]
["GASLY Pierre",null,null,null,null,null,{"$f":"IFERROR(CHOOSE(D24,25,18,15,12,10,8,6,4,2,1)+(F24=1),0)","v":0}]
[null,null,null,null,null,null,{"$f":"IFERROR(CHOOSE(D25,25,18,15,12,10,8,6,4,2,1)+(F25=1),\"\")","v":""}]
["GROSJEAN Romain","HAAS",null,null,null,null,{"$f":"IFERROR(CHOOSE(D26,25,18,15,12,10,8,6,4,2,1)+(F26=1),0)","v":0}]
["MAGNUSSEN Kevin",null,null,null,null,null,{"$f":"IFERROR(CHOOSE(D27,25,18,15,12,10,8,6,4,2,1)+(F27=1),0)","v":0}]
[null,null,null,null,null,null,{"$f":"IFERROR(CHOOSE(D28,25,18,15,12,10,8,6,4,2,1)+(F28=1),\"\")","v":""}]
["NORRIS Lando","McLAREN",null,null,null,null,{"$f":"IFERROR(CHOOSE(D29,25,18,15,12,10,8,6,4,2,1)+(F29=1),0)","v":0}]
["SAINZ.Jr Carlos",null,null,null,null,null,{"$f":"IFERROR(CHOOSE(D30,25,18,15,12,10,8,6,4,2,1)+(F30=1),0)","v":0}]
[null,null,null,null,null,null,{"$f":"IFERROR(CHOOSE(D31,25,18,15,12,10,8,6,4,2,1)+(F31=1),\"\")","v":""}]
["RAÏKKÖNEN Kimi","ALFA ROMEO",null,null,null,null,{"$f":"IFERROR(CHOOSE(D32,25,18,15,12,10,8,6,4,2,1)+(F32=1),0)","v":0}]
["GIOVANIZZI Antonio",null,null,null,null,null,{"$f":"IFERROR(CHOOSE(D33,25,18,15,12,10,8,6,4,2,1)+(F33=1),0)","v":0}]
[null,null,null,null,null,null,{"$f":"IFERROR(CHOOSE(D34,25,18,15,12,10,8,6,4,2,1)+(F34=1),\"\")","v":""}]

{"sheet":"USA","index":21,"n_rows":34,"n_cols":12,"rows_kept":34,"cut":false,"hidden":false,"merged":[[31,1,33,1],[31,2,33,2],[22,1,24,1],[22,2,24,2],[25,1,27,1],[25,2,27,2],[28,1,30,1],[28,2,30,2],[13,1,15,1],[13,2,15,2],[16,1,18,1],[16,2,18,2],[19,1,21,1],[19,2,21,2],[4,1,6,1],[4,2,6,2],[7,1,9,1],[7,2,9,2],[10,1,12,1],[10,2,12,2],[0,0,1,14],[2,0,3,0],[2,1,3,1],[2,2,3,2],[2,3,3,3],[2,4,3,4],[2,5,3,5],[2,6,3,6],[2,8,2,10]]}
["USA- 14 AOUT 2019"]
[]
["PILOTES","ECURIES","VOITURES","Finish","Pôle","Pt tour","Points",null,"CLASSEMENT"]
[null,null,null,null,null,null,null,{"$f":"IF(G4=\"\",\"\",(RANK(G4,G4:G23)))","v":""},"ÉCURIES","POINTS","RANG","TOTAL"]
["HAMILTON Lewis","MERCEDES",null,null,null,null,{"$f":"IFERROR(CHOOSE(D5,25,18,15,12,10,8,6,4,2,1)+(F5=1),0)","v":0},null,"MERCEDES",{"$f":"SUM(G5:G7)","v":0},{"$f":"IF(J5=\"\",0,(RANK(J5,$J$5:$J$14)))+COUNTIF(J$5:J5,J5)-1","v":1},{"$f":"IF(J5=0,0,J5+Japon!J5)","v":0}]
["BOTTAS Valterri",null,null,null,null,null,{"$f":"IFERROR(CHOOSE(D6,25,18,15,12,10,8,6,4,2,1)+(F6=1),0)","v":0},null,"FERRARI",{"$f":"SUM(G8:G10)","v":0},{"$f":"IF(J6=\"\",0,(RANK(J6,$J$5:$J$14)))+COUNTIF(J$5:J6,J6)-1","v":2},{"$f":"IF(J6=0,0,J6+#REF!)","v":0}]
[null,null,null,null,null,null,null,null,"RED BULL",{"$f":"SUM(G11:G13)","v":0},{"$f":"IF(J7=\"\",0,(RANK(J7,$J$5:$J$14)))+COUNTIF(J$5:J7,J7)-1","v":3},{"$f":"IF(J7=0,0,J7+#REF!)","v":0}]
["VETTEL Sebastian","FERRARI",null,null,null,null,{"$f":"IFERROR(CHOOSE(D8,25,18,15,12,10,8,6,4,2,1)+(F8=1),0)","v":0},null,"RACING POINT",{"$f":"SUM(G14:G16)","v":0},{"$f":"IF(J8=\"\",0,(RANK(J8,$J$5:$J$14)))+COUNTIF(J$5:J8,J8)-1","v":4},{"$f":"IF(J8=0,0,J8+#REF!)","v":0}]
["LECLERC Charles",null,null,null,null,null,{"$f":"IFERROR(CHOOSE(D9,25,18,15,12,10,8,6,4,2,1)+(F9=1),0)","v":0},null,"WILLIAMS",{"$f":"SUM(G17:G19)","v":0},{"$f":"IF(J9=\"\",0,(RANK(J9,$J$5:$J$14)))+COUNTIF(J$5:J9,J9)-1","v":5},{"$f":"IF(J9=0,0,J9+#REF!)","v":0}]
[null,null,null,null,null,null,{"$f":"IFERROR(CHOOSE(D10,25,18,15,12,10,8,6,4,2,1)+(F10=1),\"\")","v":""},null,"RENAULT",{"$f":"SUM(G20:G22)","v":0},{"$f":"IF(J10=\"\",0,(RANK(J10,$J$5:$J$14)))+COUNTIF(J$5:J10,J10)-1","v":6},{"$f":"IF(J10=0,0,J10+#REF!)","v":0}]
["VERSTAPPEN Max","RED BULL",null,null,null,null,{"$f":"IFERROR(CHOOSE(D11,25,18,15,12,10,8,6,4,2,1)+(F11=1),0)","v":0},null,"TORO ROSSO",{"$f":"SUM(G23:G25)","v":0},{"$f":"IF(J11=\"\",0,(RANK(J11,$J$5:$J$14)))+COUNTIF(J$5:J11,J11)-1","v":7},{"$f":"IF(J11=0,0,J11+#REF!)","v":0}]
["ALBON Alexander",null,null,null,null,null,{"$f":"IFERROR(CHOOSE(D12,25,18,15,12,10,8,6,4,2,1)+(F12=1),0)","v":0},null,"HAAS",{"$f":"SUM(G26:G28)","v":0},{"$f":"IF(J12=\"\",0,(RANK(J12,$J$5:$J$14)))+COUNTIF(J$5:J12,J12)-1","v":8},{"$f":"IF(J12=0,0,J12+#REF!)","v":0}]
[null,null,null,null,null,null,{"$f":"IFERROR(CHOOSE(D13,25,18,15,12,10,8,6,4,2,1)+(F13=1),\"\")","v":""},null,"Mc LAREN",{"$f":"SUM(G29:G31)","v":0},{"$f":"IF(J13=\"\",0,(RANK(J13,$J$5:$J$14)))+COUNTIF(J$5:J13,J13)-1","v":9},{"$f":"IF(J13=0,0,J13+#REF!)","v":0}]
["PEREZ Sergio","RACING\nPOINT",null,null,null,null,{"$f":"IFERROR(CHOOSE(D14,25,18,15,12,10,8,6,4,2,1)+(F14=1),0)","v":0},null,"ALFA ROMEO",{"$f":"SUM(G32:G34)","v":0},{"$f":"IF(J14=\"\",0,(RANK(J14,$J$5:$J$14)))+COUNTIF(J$5:J14,J14)-1","v":10},{"$f":"IF(J14=0,0,J14+Singapour!J14)","v":0}]
["STROLL Lance",null,null,null,null,null,{"$f":"IFERROR(CHOOSE(D15,25,18,15,12,10,8,6,4,2,1)+(F15=1),0)","v":0}]
[null,null,null,null,null,null,{"$f":"IFERROR(CHOOSE(D16,25,18,15,12,10,8,6,4,2,1)+(F16=1),\"\")","v":""}]
["RUSSELL George","WILLIAMS",null,null,null,null,{"$f":"IFERROR(CHOOSE(D17,25,18,15,12,10,8,6,4,2,1)+(F17=1),0)","v":0}]
["LATIFI Nichola",null,null,null,null,null,{"$f":"IFERROR(CHOOSE(D18,25,18,15,12,10,8,6,4,2,1)+(F18=1),0)","v":0}]
[null,null,null,null,null,null,{"$f":"IFERROR(CHOOSE(D19,25,18,15,12,10,8,6,4,2,1)+(F19=1),\"\")","v":""}]
["RICCIARDO Daniel","RENAULT",null,null,null,null,{"$f":"IFERROR(CHOOSE(D20,25,18,15,12,10,8,6,4,2,1)+(F20=1),0)","v":0}]
["OCON Sebastian",null,null,null,null,null,{"$f":"IFERROR(CHOOSE(D21,25,18,15,12,10,8,6,4,2,1)+(F21=1),0)","v":0}]
[null,null,null,null,null,null,{"$f":"IFERROR(CHOOSE(D22,25,18,15,12,10,8,6,4,2,1)+(F22=1),\"\")","v":""}]
["KVYAT Daniil","ALPHA TAURI",null,null,null,null,{"$f":"IFERROR(CHOOSE(D23,25,18,15,12,10,8,6,4,2,1)+(F23=1),0)","v":0}]
["GASLY Pierre",null,null,null,null,null,{"$f":"IFERROR(CHOOSE(D24,25,18,15,12,10,8,6,4,2,1)+(F24=1),0)","v":0}]
[null,null,null,null,null,null,{"$f":"IFERROR(CHOOSE(D25,25,18,15,12,10,8,6,4,2,1)+(F25=1),\"\")","v":""}]
["GROSJEAN Romain","HAAS",null,null,null,null,{"$f":"IFERROR(CHOOSE(D26,25,18,15,12,10,8,6,4,2,1)+(F26=1),0)","v":0}]
["MAGNUSSEN Kevin",null,null,null,null,null,{"$f":"IFERROR(CHOOSE(D27,25,18,15,12,10,8,6,4,2,1)+(F27=1),0)","v":0}]
[null,null,null,null,null,null,{"$f":"IFERROR(CHOOSE(D28,25,18,15,12,10,8,6,4,2,1)+(F28=1),\"\")","v":""}]
["NORRIS Lando","McLAREN",null,null,null,null,{"$f":"IFERROR(CHOOSE(D29,25,18,15,12,10,8,6,4,2,1)+(F29=1),0)","v":0}]
["SAINZ.Jr Carlos",null,null,null,null,null,{"$f":"IFERROR(CHOOSE(D30,25,18,15,12,10,8,6,4,2,1)+(F30=1),0)","v":0}]
[null,null,null,null,null,null,{"$f":"IFERROR(CHOOSE(D31,25,18,15,12,10,8,6,4,2,1)+(F31=1),\"\")","v":""}]
["RAÏKKÖNEN Kimi","ALFA ROMEO",null,null,null,null,{"$f":"IFERROR(CHOOSE(D32,25,18,15,12,10,8,6,4,2,1)+(F32=1),0)","v":0}]
["GIOVANIZZI Antonio",null,null,null,null,null,{"$f":"IFERROR(CHOOSE(D33,25,18,15,12,10,8,6,4,2,1)+(F33=1),0)","v":0}]
[null,null,null,null,null,null,{"$f":"IFERROR(CHOOSE(D34,25,18,15,12,10,8,6,4,2,1)+(F34=1),\"\")","v":""}]

{"sheet":"Mexique","index":22,"n_rows":34,"n_cols":16,"rows_kept":34,"cut":false,"hidden":false,"merged":[[0,0,1,14],[2,0,3,0],[2,1,3,1],[2,2,3,2],[2,3,3,3],[2,4,3,4],[2,5,3,5],[2,6,3,6],[2,8,2,10],[4,1,6,1],[4,2,6,2],[7,1,9,1],[7,2,9,2],[10,1,12,1],[10,2,12,2],[13,1,15,1],[13,2,15,2],[16,1,18,1],[16,2,18,2],[19,1,21,1],[19,2,21,2],[31,1,33,1],[31,2,33,2],[22,1,24,1],[22,2,24,2],[25,1,27,1],[25,2,27,2],[28,1,30,1],[28,2,30,2]]}
["MEXIQUE - 14 AOUT 2019",null,null,null,null,null,null,null,null,null,null,null,null,null,null,14.5]
[]
["PILOTES","ECURIES","VOITURES","Finish","Pôle","Pt tour","Points",null,"CLASSEMENT"]
[null,null,null,null,null,null,null,{"$f":"IF(G4=\"\",\"\",(RANK(G4,G4:G23)))","v":""},"ÉCURIES","POINTS","RANG","TOTAL"]
["HAMILTON Lewis","MERCEDES",null,null,null,null,{"$f":"IFERROR(CHOOSE(D5,25,18,15,12,10,8,6,4,2,1)+(F5=1),0)","v":0},null,"MERCEDES",{"$f":"SUM(G5:G7)","v":0},{"$f":"IF(J5=\"\",0,(RANK(J5,$J$5:$J$14)))+COUNTIF(J$5:J5,J5)-1","v":1},{"$f":"IF(J5=0,0,J5+USA!J5)","v":0}]
["BOTTAS Valterri",null,null,null,null,null,{"$f":"IFERROR(CHOOSE(D6,25,18,15,12,10,8,6,4,2,1)+(F6=1),0)","v":0},null,"FERRARI",{"$f":"SUM(G8:G10)","v":0},{"$f":"IF(J6=\"\",0,(RANK(J6,$J$5:$J$14)))+COUNTIF(J$5:J6,J6)-1","v":2},{"$f":"IF(J6=0,0,J6+#REF!)","v":0}]
[null,null,null,null,null,null,null,null,"RED BULL",{"$f":"SUM(G11:G13)","v":0},{"$f":"IF(J7=\"\",0,(RANK(J7,$J$5:$J$14)))+COUNTIF(J$5:J7,J7)-1","v":3},{"$f":"IF(J7=0,0,J7+#REF!)","v":0}]
["VETTEL Sebastian","FERRARI",null,null,null,null,{"$f":"IFERROR(CHOOSE(D8,25,18,15,12,10,8,6,4,2,1)+(F8=1),0)","v":0},null,"RACING POINT",{"$f":"SUM(G14:G16)","v":0},{"$f":"IF(J8=\"\",0,(RANK(J8,$J$5:$J$14)))+COUNTIF(J$5:J8,J8)-1","v":4},{"$f":"IF(J8=0,0,J8+#REF!)","v":0}]
["LECLERC Charles",null,null,null,null,null,{"$f":"IFERROR(CHOOSE(D9,25,18,15,12,10,8,6,4,2,1)+(F9=1),0)","v":0},null,"WILLIAMS",{"$f":"SUM(G17:G19)","v":0},{"$f":"IF(J9=\"\",0,(RANK(J9,$J$5:$J$14)))+COUNTIF(J$5:J9,J9)-1","v":5},{"$f":"IF(J9=0,0,J9+#REF!)","v":0}]
[null,null,null,null,null,null,{"$f":"IFERROR(CHOOSE(D10,25,18,15,12,10,8,6,4,2,1)+(F10=1),\"\")","v":""},null,"RENAULT",{"$f":"SUM(G20:G22)","v":0},{"$f":"IF(J10=\"\",0,(RANK(J10,$J$5:$J$14)))+COUNTIF(J$5:J10,J10)-1","v":6},{"$f":"IF(J10=0,0,J10+#REF!)","v":0}]
["VERSTAPPEN Max","RED BULL",null,null,null,null,{"$f":"IFERROR(CHOOSE(D11,25,18,15,12,10,8,6,4,2,1)+(F11=1),0)","v":0},null,"TORO ROSSO",{"$f":"SUM(G23:G25)","v":0},{"$f":"IF(J11=\"\",0,(RANK(J11,$J$5:$J$14)))+COUNTIF(J$5:J11,J11)-1","v":7},{"$f":"IF(J11=0,0,J11+#REF!)","v":0}]
["ALBON Alexander",null,null,null,null,null,{"$f":"IFERROR(CHOOSE(D12,25,18,15,12,10,8,6,4,2,1)+(F12=1),0)","v":0},null,"HAAS",{"$f":"SUM(G26:G28)","v":0},{"$f":"IF(J12=\"\",0,(RANK(J12,$J$5:$J$14)))+COUNTIF(J$5:J12,J12)-1","v":8},{"$f":"IF(J12=0,0,J12+#REF!)","v":0}]
[null,null,null,null,null,null,{"$f":"IFERROR(CHOOSE(D13,25,18,15,12,10,8,6,4,2,1)+(F13=1),\"\")","v":""},null,"Mc LAREN",{"$f":"SUM(G29:G31)","v":0},{"$f":"IF(J13=\"\",0,(RANK(J13,$J$5:$J$14)))+COUNTIF(J$5:J13,J13)-1","v":9},{"$f":"IF(J13=0,0,J13+#REF!)","v":0}]
["PEREZ Sergio","RACING\nPOINT",null,null,null,null,{"$f":"IFERROR(CHOOSE(D14,25,18,15,12,10,8,6,4,2,1)+(F14=1),0)","v":0},null,"ALFA ROMEO",{"$f":"SUM(G32:G34)","v":0},{"$f":"IF(J14=\"\",0,(RANK(J14,$J$5:$J$14)))+COUNTIF(J$5:J14,J14)-1","v":10},{"$f":"IF(J14=0,0,J14+USA!J14)","v":0}]
["STROLL Lance",null,null,null,null,null,{"$f":"IFERROR(CHOOSE(D15,25,18,15,12,10,8,6,4,2,1)+(F15=1),0)","v":0}]
[null,null,null,null,null,null,{"$f":"IFERROR(CHOOSE(D16,25,18,15,12,10,8,6,4,2,1)+(F16=1),\"\")","v":""}]
["RUSSELL George","WILLIAMS",null,null,null,null,{"$f":"IFERROR(CHOOSE(D17,25,18,15,12,10,8,6,4,2,1)+(F17=1),0)","v":0}]
["LATIFI Nichola",null,null,null,null,null,{"$f":"IFERROR(CHOOSE(D18,25,18,15,12,10,8,6,4,2,1)+(F18=1),0)","v":0}]
[null,null,null,null,null,null,{"$f":"IFERROR(CHOOSE(D19,25,18,15,12,10,8,6,4,2,1)+(F19=1),\"\")","v":""}]
["RICCIARDO Daniel","RENAULT",null,null,null,null,{"$f":"IFERROR(CHOOSE(D20,25,18,15,12,10,8,6,4,2,1)+(F20=1),0)","v":0}]
["OCON Sebastian",null,null,null,null,null,{"$f":"IFERROR(CHOOSE(D21,25,18,15,12,10,8,6,4,2,1)+(F21=1),0)","v":0}]
[null,null,null,null,null,null,{"$f":"IFERROR(CHOOSE(D22,25,18,15,12,10,8,6,4,2,1)+(F22=1),\"\")","v":""}]
["KVYAT Daniil","ALPHA TAURI",null,null,null,null,{"$f":"IFERROR(CHOOSE(D23,25,18,15,12,10,8,6,4,2,1)+(F23=1),0)","v":0}]
["GASLY Pierre",null,null,null,null,null,{"$f":"IFERROR(CHOOSE(D24,25,18,15,12,10,8,6,4,2,1)+(F24=1),0)","v":0}]
[null,null,null,null,null,null,{"$f":"IFERROR(CHOOSE(D25,25,18,15,12,10,8,6,4,2,1)+(F25=1),\"\")","v":""}]
["GROSJEAN Romain","HAAS",null,null,null,null,{"$f":"IFERROR(CHOOSE(D26,25,18,15,12,10,8,6,4,2,1)+(F26=1),0)","v":0}]
["MAGNUSSEN Kevin",null,null,null,null,null,{"$f":"IFERROR(CHOOSE(D27,25,18,15,12,10,8,6,4,2,1)+(F27=1),0)","v":0}]
[null,null,null,null,null,null,{"$f":"IFERROR(CHOOSE(D28,25,18,15,12,10,8,6,4,2,1)+(F28=1),\"\")","v":""}]
["NORRIS Lando","McLAREN",null,null,1,null,{"$f":"IFERROR(CHOOSE(D29,25,18,15,12,10,8,6,4,2,1)+(F29=1),0)","v":0}]
["SAINZ.Jr Carlos",null,null,null,null,null,{"$f":"IFERROR(CHOOSE(D30,25,18,15,12,10,8,6,4,2,1)+(F30=1),0)","v":0}]
[null,null,null,null,null,null,{"$f":"IFERROR(CHOOSE(D31,25,18,15,12,10,8,6,4,2,1)+(F31=1),\"\")","v":""}]
["RAÏKKÖNEN Kimi","ALFA ROMEO",null,null,null,null,{"$f":"IFERROR(CHOOSE(D32,25,18,15,12,10,8,6,4,2,1)+(F32=1),0)","v":0}]
["GIOVANIZZI Antonio",null,null,null,null,null,{"$f":"IFERROR(CHOOSE(D33,25,18,15,12,10,8,6,4,2,1)+(F33=1),0)","v":0}]
[null,null,null,null,null,null,{"$f":"IFERROR(CHOOSE(D34,25,18,15,12,10,8,6,4,2,1)+(F34=1),\"\")","v":""}]

{"sheet":"Abu Dhabi","index":23,"n_rows":34,"n_cols":16,"rows_kept":34,"cut":false,"hidden":false,"merged":[[0,0,1,14],[2,0,3,0],[2,1,3,1],[2,2,3,2],[2,3,3,3],[2,4,3,4],[2,5,3,5],[2,6,3,6],[2,8,2,10],[4,1,6,1],[4,2,6,2],[7,1,9,1],[7,2,9,2],[10,1,12,1],[10,2,12,2],[13,1,15,1],[13,2,15,2],[16,1,18,1],[16,2,18,2],[19,1,21,1],[19,2,21,2],[31,1,33,1],[31,2,33,2],[22,1,24,1],[22,2,24,2],[25,1,27,1],[25,2,27,2],[28,1,30,1],[28,2,30,2]]}
["ABU DHABI - 14 AOUT 2019",null,null,null,null,null,null,null,null,null,null,null,null,null,null,14.5]
[]
["PILOTES","ECURIES","VOITURES","Finish","Pôle","Pt tour","Points",null,"CLASSEMENT"]
[null,null,null,null,null,null,null,{"$f":"IF(G4=\"\",\"\",(RANK(G4,G4:G23)))","v":""},"ÉCURIES","POINTS","RANG","TOTAL"]
["HAMILTON Lewis","MERCEDES",null,null,null,null,{"$f":"IFERROR(CHOOSE(D5,25,18,15,12,10,8,6,4,2,1)+(F5=1),0)","v":0},null,"MERCEDES",{"$f":"SUM(G5:G7)","v":0},{"$f":"IF(J5=\"\",0,(RANK(J5,$J$5:$J$14)))+COUNTIF(J$5:J5,J5)-1","v":1},{"$f":"IF(J5=0,0,J5+Mexique!J5)","v":0}]
["BOTTAS Valterri",null,null,null,null,null,{"$f":"IFERROR(CHOOSE(D6,25,18,15,12,10,8,6,4,2,1)+(F6=1),0)","v":0},null,"FERRARI",{"$f":"SUM(G8:G10)","v":0},{"$f":"IF(J6=\"\",0,(RANK(J6,$J$5:$J$14)))+COUNTIF(J$5:J6,J6)-1","v":2},{"$f":"IF(J6=0,0,J6+Mexique!J6)","v":0}]
[null,null,null,null,null,null,null,null,"RED BULL",{"$f":"SUM(G11:G13)","v":0},{"$f":"IF(J7=\"\",0,(RANK(J7,$J$5:$J$14)))+COUNTIF(J$5:J7,J7)-1","v":3},{"$f":"IF(J7=0,0,J7+Mexique!J7)","v":0}]
["VETTEL Sebastian","FERRARI",null,null,null,null,{"$f":"IFERROR(CHOOSE(D8,25,18,15,12,10,8,6,4,2,1)+(F8=1),0)","v":0},null,"RACING POINT",{"$f":"SUM(G14:G16)","v":0},{"$f":"IF(J8=\"\",0,(RANK(J8,$J$5:$J$14)))+COUNTIF(J$5:J8,J8)-1","v":4},{"$f":"IF(J8=0,0,J8+Mexique!J8)","v":0}]
["LECLERC Charles",null,null,null,null,null,{"$f":"IFERROR(CHOOSE(D9,25,18,15,12,10,8,6,4,2,1)+(F9=1),0)","v":0},null,"WILLIAMS",{"$f":"SUM(G17:G19)","v":0},{"$f":"IF(J9=\"\",0,(RANK(J9,$J$5:$J$14)))+COUNTIF(J$5:J9,J9)-1","v":5},{"$f":"IF(J9=0,0,J9+Mexique!J9)","v":0}]
[null,null,null,null,null,null,{"$f":"IFERROR(CHOOSE(D10,25,18,15,12,10,8,6,4,2,1)+(F10=1),\"\")","v":""},null,"RENAULT",{"$f":"SUM(G20:G22)","v":0},{"$f":"IF(J10=\"\",0,(RANK(J10,$J$5:$J$14)))+COUNTIF(J$5:J10,J10)-1","v":6},{"$f":"IF(J10=0,0,J10+Mexique!J10)","v":0}]
["VERSTAPPEN Max","RED BULL",null,null,null,null,{"$f":"IFERROR(CHOOSE(D11,25,18,15,12,10,8,6,4,2,1)+(F11=1),0)","v":0},null,"TORO ROSSO",{"$f":"SUM(G23:G25)","v":0},{"$f":"IF(J11=\"\",0,(RANK(J11,$J$5:$J$14)))+COUNTIF(J$5:J11,J11)-1","v":7},{"$f":"IF(J11=0,0,J11+Mexique!J11)","v":0}]
["ALBON Alexander",null,null,null,null,null,{"$f":"IFERROR(CHOOSE(D12,25,18,15,12,10,8,6,4,2,1)+(F12=1),0)","v":0},null,"HAAS",{"$f":"SUM(G26:G28)","v":0},{"$f":"IF(J12=\"\",0,(RANK(J12,$J$5:$J$14)))+COUNTIF(J$5:J12,J12)-1","v":8},{"$f":"IF(J12=0,0,J12+Mexique!J12)","v":0}]
[null,null,null,null,null,null,{"$f":"IFERROR(CHOOSE(D13,25,18,15,12,10,8,6,4,2,1)+(F13=1),\"\")","v":""},null,"Mc LAREN",{"$f":"SUM(G29:G31)","v":0},{"$f":"IF(J13=\"\",0,(RANK(J13,$J$5:$J$14)))+COUNTIF(J$5:J13,J13)-1","v":9},{"$f":"IF(J13=0,0,J13+Mexique!J13)","v":0}]
["PEREZ Sergio","RACING\nPOINT",null,null,null,null,{"$f":"IFERROR(CHOOSE(D14,25,18,15,12,10,8,6,4,2,1)+(F14=1),0)","v":0},null,"ALFA ROMEO",{"$f":"SUM(G32:G34)","v":0},{"$f":"IF(J14=\"\",0,(RANK(J14,$J$5:$J$14)))+COUNTIF(J$5:J14,J14)-1","v":10},{"$f":"IF(J14=0,0,J14+USA!J14)","v":0}]
["STROLL Lance",null,null,null,null,null,{"$f":"IFERROR(CHOOSE(D15,25,18,15,12,10,8,6,4,2,1)+(F15=1),0)","v":0}]
[null,null,null,null,null,null,{"$f":"IFERROR(CHOOSE(D16,25,18,15,12,10,8,6,4,2,1)+(F16=1),\"\")","v":""}]
["RUSSELL George","WILLIAMS",null,null,null,null,{"$f":"IFERROR(CHOOSE(D17,25,18,15,12,10,8,6,4,2,1)+(F17=1),0)","v":0}]
["LATIFI Nichola",null,null,null,null,null,{"$f":"IFERROR(CHOOSE(D18,25,18,15,12,10,8,6,4,2,1)+(F18=1),0)","v":0}]
[null,null,null,null,null,null,{"$f":"IFERROR(CHOOSE(D19,25,18,15,12,10,8,6,4,2,1)+(F19=1),\"\")","v":""}]
["RICCIARDO Daniel","RENAULT",null,null,null,null,{"$f":"IFERROR(CHOOSE(D20,25,18,15,12,10,8,6,4,2,1)+(F20=1),0)","v":0}]
["OCON Sebastian",null,null,null,null,null,{"$f":"IFERROR(CHOOSE(D21,25,18,15,12,10,8,6,4,2,1)+(F21=1),0)","v":0}]
[null,null,null,null,null,null,{"$f":"IFERROR(CHOOSE(D22,25,18,15,12,10,8,6,4,2,1)+(F22=1),\"\")","v":""}]
["KVYAT Daniil","ALPHA TAURI",null,null,null,null,{"$f":"IFERROR(CHOOSE(D23,25,18,15,12,10,8,6,4,2,1)+(F23=1),0)","v":0}]
["GASLY Pierre",null,null,null,1,null,{"$f":"IFERROR(CHOOSE(D24,25,18,15,12,10,8,6,4,2,1)+(F24=1),0)","v":0}]
[null,null,null,null,null,null,{"$f":"IFERROR(CHOOSE(D25,25,18,15,12,10,8,6,4,2,1)+(F25=1),\"\")","v":""}]
["GROSJEAN Romain","HAAS",null,null,null,null,{"$f":"IFERROR(CHOOSE(D26,25,18,15,12,10,8,6,4,2,1)+(F26=1),0)","v":0}]
["MAGNUSSEN Kevin",null,null,null,null,null,{"$f":"IFERROR(CHOOSE(D27,25,18,15,12,10,8,6,4,2,1)+(F27=1),0)","v":0}]
[null,null,null,null,null,null,{"$f":"IFERROR(CHOOSE(D28,25,18,15,12,10,8,6,4,2,1)+(F28=1),\"\")","v":""}]
["NORRIS Lando","McLAREN",null,null,null,null,{"$f":"IFERROR(CHOOSE(D29,25,18,15,12,10,8,6,4,2,1)+(F29=1),0)","v":0}]
["SAINZ.Jr Carlos",null,null,null,null,null,{"$f":"IFERROR(CHOOSE(D30,25,18,15,12,10,8,6,4,2,1)+(F30=1),0)","v":0}]
[null,null,null,null,null,null,{"$f":"IFERROR(CHOOSE(D31,25,18,15,12,10,8,6,4,2,1)+(F31=1),\"\")","v":""}]
["RAÏKKÖNEN Kimi","ALFA ROMEO",null,null,null,null,{"$f":"IFERROR(CHOOSE(D32,25,18,15,12,10,8,6,4,2,1)+(F32=1),0)","v":0}]
["GIOVANIZZI Antonio",null,null,null,null,null,{"$f":"IFERROR(CHOOSE(D33,25,18,15,12,10,8,6,4,2,1)+(F33=1),0)","v":0}]
[null,null,null,null,null,null,{"$f":"IFERROR(CHOOSE(D34,25,18,15,12,10,8,6,4,2,1)+(F34=1),\"\")","v":""}]