{"text_format":"1","workbook":"xlsx","n_sheets":4,"sheets":["donnée source","AMP P01","AMP PI03","donnée source (2)"],"not_rendered":{"charts":0,"images":1,"macros":1,"external_links":0,"defined_names":2,"comments":0,"pivot_tables":0},"unopened":[],"bounds":{"document_bytes":16777216,"sheet_cells":100000,"rows_first":2000,"rows_last":500,"rows_between":2000,"halvings":0,"cell_chars":16384,"cell_head_chars":4096},"cells_cut":0,"cells_raw":0,"read":"whole","date_system":"1900"}

{"sheet":"donnée source","index":0,"n_rows":147,"n_cols":10,"rows_kept":147,"cut":false,"hidden":false,"merged":[[0,4,0,5]]}
["CIP10",null,"Date","Nature (1)","Résultat (2)",null,"Décision (3)","Périodicité","Notes (4)","Référence Document (5)"]
["AMP P01",1,"2014-03-06","E","c",null,"RM","1 an","Vref : 6825 tr/min","Ce AMP 2014 017"]
["AMP P01",{"$f":"IF(C2=\"\",,B2+1)","v":2},"2014-08-28","E","c",null,"RM","1 an","Vref : 6878 tr/min","Ce AMP 2014 040"]
["AMP P01",{"$f":"IF(C3=\"\",,B3+1)","v":3},"2015-08-19","E","c",null,"RM","1 an","Vref : 6795 tr/min","Ce AMP 2015 001"]
["AMP P01",{"$f":"IF(C4=\"\",,B4+1)","v":4},"2015-09-25","RE","c",null,null,null,"changement de batterie"]
["AMP P01",5,"2015-09-25","E","c",null,"RM","1 an","Vref : 6952 tr/min","Ce AMP 2015 039"]
["AMP P01",6,"2016-01-14","E","c",null,"RM","1 an","Vref : 6755 tr/min","Ce AMP 2016 001"]
["AMP P01",7,"2017-01-11","E","c",null,"RM","1 an","Vref : 6808 tr/min","Ce AMP 2017 001"]
["AMP P01",8,"2018-01-31","E","c",null,"RM","1 an","Vref : 6852 tr/min","Ce AMP 2018 001"]
["AMP P01",9,"2018-01-31","RE","c"]
["AMP P01",10,"2019-01-24","E","c",null,"RM","1 an","Vref : 6856 tr/min","Ce AMP 2019 001"]
["AMP P01",11]
["AMP P01",0]
["AMP P01",0]
["AMP P01",0]
["AMP P01",0]
["AMP P01",0]
["AMP P01",0]
["AMP P01",{"$f":"IF(C18=\"\",,B18+1)","v":0}]
["AMP P01",0]
["AMP P01",0]
["AMP P03",1,"2014-03-06","E","C",null,"RM","1 an","Vref : 6284 tr/min Inhalable","Ce AMP 2014 0018"]
["AMP P03",2,"2014-08-28","E","C",null,"RM","1 an","Vref : 6245 tr/min Inhalable","Ce AMP 2014 041"]
["AMP P03",3,"2015-08-19","E","C",null,"RM","1 an","Vref : 6271 tr/min Inhalable","Ce AMP 2015 053"]
["AMP P03",4,"2016-01-14","E","C",null,"RM","1 an","Vref : 6198 tr/min Inhalable","Ce AMP 2016 002"]
["AMP P03",5,"2017-01-11","E","C",null,"RM","1 an","Vref : 6167 tr/min Inhalable","Ce AMP 2017 002"]
["AMP P03",6,"2018-01-31","E","C",null,"RM","1 an","Vref : 6195 tr/min Inhalable","Ce AMP 2018 002"]
["AMP P03",7,"2019-01-24","E","C",null,"RM","1 an","Vref : 6136 tr/min Inhalable","Ce AMP 2019 040"]
["AMP P03",8]
["AMP P03",0]
["AMP P03",0]
["AMP P03",0]
["AMP P03",0]
["AMP P03",0]
["AMP P03",0]
["AMP P03",0]
["AMP P03",0]
["AMP P03",0]
["AMP P03",0]
["AMP P03",0]
["AMP P03",0]
["AMP P04",1]
["AMP P04"]
["AMP P04"]
["AMP P04"]
["AMP P04"]
["AMP P04"]
["AMP P04"]
["AMP P04"]
["AMP P04"]
["AMP P04"]
["AMP P04"]
["AMP P04"]
["AMP P04"]
["AMP P04"]
["AMP P04"]
["AMP P04"]
["AMP P04"]
["AMP P04"]
["AMP P04"]
["AMP P04"]
["AMP P05",{"$f":"IF(C42=\"\",,B42+1)","v":0}]
[]
[]
[]
[]
[]
[]
[]
[]
[]
[]
[]
[]
[]
[]
[]
[]
[]
[]
[]
["AMP P06",{"$f":"IF(C62=\"\",,B62+1)","v":0}]
["AMP P07",{"$f":"IF(C82=\"\",,B82+1)","v":0}]
["AMP P08",0]
["AMP P09",0]
["AMP P10",0]
["AMP P11",0]
["AMP P12",0]
["AMP P13",0]
["AMP P14",0]
["AMP P15",0]
["AMP P16",0]
["AMP P17",0]
["AMP P18",{"$f":"IF(C93=\"\",,B93+1)","v":0}]
["AMP P19",{"$f":"IF(C94=\"\",,B94+1)","v":0}]
["AMP P20",0]
["AMP P21",2]
["AMP P22",{"$f":"IF(C97=\"\",,B97+1)","v":0}]
["AMP P23",0]
["AMP P24",0]
["AMP P25",0]
["AMP P26",0]
["AMP P27",0]
["AMP P28"]
["AMP P29"]
["AMP P30"]
["AMP P31"]
["AMP P32"]
["AMP P33"]
["AMP P34"]
["AMP P35"]
["AMP P36"]
["AMP P37"]
["AMP P38"]
["AMP P39"]
["AMP P40"]
["AMP P41"]
["AMP P42"]
["AMP P43"]
["AMP P44"]
["AMP P45"]
["AMP P46"]
["AMP P47"]
["AMP P48"]
["AMP P49"]
["AMP P50"]
["AMP P51"]
["AMP P52"]
["AMP P53"]
["AMP P54"]
["AMP P55"]
["AMP P56"]
["AMP P57"]
["AMP P58"]
["AMP P59"]
["AMP P60"]
["AMP P61"]
["AMP P62"]
["AMP P63"]
["AMP P64"]
["AMP P65"]
["AMP P66"]
["AMP P67"]
["AMP P68"]
["AMP P69"]
["AMP P70"]
["AMP P71"]

{"sheet":"AMP P01","index":1,"n_rows":26,"n_cols":19,"rows_kept":26,"cut":false,"hidden":false,"merged":[[0,16,0,18],[2,12,2,13]]}
["FICHE SIGNALETIQUE",null,null,null,null,null,null,null,"N° de fiche de vie : AMP P01",null,"FICHE DE SUIVI",null,null,null,null,null,{"$f":"I1","v":"N° de fiche de vie : AMP P01"}]
[]
["Description",null,null,null,null,null,null,"Etalonnage ou Réglage du débit",null,null,"Date","Nature (1)","Résultat (2)",null,"Décision (3)","Périodicité","Notes (4)","Référence Document (5)","Visa"]
[null,null,null,null,null,null,null,null,null,null,{"$f":"IF('donnée source'!C2=\"\",\"\",'donnée source'!C2)","v":"2014-03-06"},{"$f":"IF('donnée source'!D2=\"\",\"\",'donnée source'!D2)","v":"E"},{"$f":"IF('donnée source'!E2=\"\",\"\",'donnée source'!E2)","v":"c"},{"$f":"IF('donnée source'!F2=\"\",\"\",'donnée source'!F2)","v":""},{"$f":"IF('donnée source'!G2=\"\",\"\",'donnée source'!G2)","v":"RM"},{"$f":"IF('donnée source'!H2=\"\",\"\",'donnée source'!H2)","v":"1 an"},{"$f":"IF('donnée source'!I2=\"\",\"\",'donnée source'!I2)","v":"Vref : 6825 tr/min"},{"$f":"IF('donnée source'!J2=\"\",\"\",'donnée source'!J2)","v":"Ce AMP 2014 017"}]
[null,null,null,null,null,null,null,null,null,null,{"$f":"IF('donnée source'!C3=\"\",\"\",'donnée source'!C3)","v":"2014-08-28"},{"$f":"IF('donnée source'!D3=\"\",\"\",'donnée source'!D3)","v":"E"},{"$f":"IF('donnée source'!E3=\"\",\"\",'donnée source'!E3)","v":"c"},{"$f":"IF('donnée source'!F3=\"\",\"\",'donnée source'!F3)","v":""},{"$f":"IF('donnée source'!G3=\"\",\"\",'donnée source'!G3)","v":"RM"},{"$f":"IF('donnée source'!H3=\"\",\"\",'donnée source'!H3)","v":"1 an"},{"$f":"IF('donnée source'!I3=\"\",\"\",'donnée source'!I3)","v":"Vref : 6878 tr/min"},{"$f":"IF('donnée source'!J3=\"\",\"\",'donnée source'!J3)","v":"Ce AMP 2014 040"}]
[null,null,null,null,null,null,null,null,null,null,{"$f":"IF('donnée source'!C4=\"\",\"\",'donnée source'!C4)","v":"2015-08-19"},{"$f":"IF('donnée source'!D4=\"\",\"\",'donnée source'!D4)","v":"E"},{"$f":"IF('donnée source'!E4=\"\",\"\",'donnée source'!E4)","v":"c"},{"$f":"IF('donnée source'!F4=\"\",\"\",'donnée source'!F4)","v":""},{"$f":"IF('donnée source'!G4=\"\",\"\",'donnée source'!G4)","v":"RM"},{"$f":"IF('donnée source'!H4=\"\",\"\",'donnée source'!H4)","v":"1 an"},{"$f":"IF('donnée source'!I4=\"\",\"\",'donnée source'!I4)","v":"Vref : 6795 tr/min"},{"$f":"IF('donnée source'!J4=\"\",\"\",'donnée source'!J4)","v":"Ce AMP 2015 001"}]
[null,null,null,null,null,null,null,null,"Périodicité : 1 an",null,{"$f":"IF('donnée source'!C5=\"\",\"\",'donnée source'!C5)","v":"2015-09-25"},{"$f":"IF('donnée source'!D5=\"\",\"\",'donnée source'!D5)","v":"RE"},{"$f":"IF('donnée source'!E5=\"\",\"\",'donnée source'!E5)","v":"c"},{"$f":"IF('donnée source'!F5=\"\",\"\",'donnée source'!F5)","v":""},{"$f":"IF('donnée source'!G5=\"\",\"\",'donnée source'!G5)","v":""},{"$f":"IF('donnée source'!H5=\"\",\"\",'donnée source'!H5)","v":""},{"$f":"IF('donnée source'!I5=\"\",\"\",'donnée source'!I5)","v":"changement de batterie"},{"$f":"IF('donnée source'!J5=\"\",\"\",'donnée source'!J5)","v":""}]
[null,null,null,null,null,null,null,null,"Procédure de référence interne : EMP-MOP-01",null,{"$f":"IF('donnée source'!C6=\"\",\"\",'donnée source'!C6)","v":"2015-09-25"},{"$f":"IF('donnée source'!D6=\"\",\"\",'donnée source'!D6)","v":"E"},{"$f":"IF('donnée source'!E6=\"\",\"\",'donnée source'!E6)","v":"c"},{"$f":"IF('donnée source'!F6=\"\",\"\",'donnée source'!F6)","v":""},{"$f":"IF('donnée source'!G6=\"\",\"\",'donnée source'!G6)","v":"RM"},{"$f":"IF('donnée source'!H6=\"\",\"\",'donnée source'!H6)","v":"1 an"},{"$f":"IF('donnée source'!I6=\"\",\"\",'donnée source'!I6)","v":"Vref : 6952 tr/min"},{"$f":"IF('donnée source'!J6=\"\",\"\",'donnée source'!J6)","v":"Ce AMP 2015 039"}]
[null,null,null,null,null,null,null,null,null,null,{"$f":"IF('donnée source'!C7=\"\",\"\",'donnée source'!C7)","v":"2016-01-14"},{"$f":"IF('donnée source'!D7=\"\",\"\",'donnée source'!D7)","v":"E"},{"$f":"IF('donnée source'!E7=\"\",\"\",'donnée source'!E7)","v":"c"},{"$f":"IF('donnée source'!F7=\"\",\"\",'donnée source'!F7)","v":""},{"$f":"IF('donnée source'!G7=\"\",\"\",'donnée source'!G7)","v":"RM"},{"$f":"IF('donnée source'!H7=\"\",\"\",'donnée source'!H7)","v":"1 an"},{"$f":"IF('donnée source'!I7=\"\",\"\",'donnée source'!I7)","v":"Vref : 6755 tr/min"},{"$f":"IF('donnée source'!J7=\"\",\"\",'donnée source'!J7)","v":"Ce AMP 2016 001"}]
[null,null,null,null,null,null,null,null,null,null,{"$f":"IF('donnée source'!C8=\"\",\"\",'donnée source'!C8)","v":"2017-01-11"},{"$f":"IF('donnée source'!D8=\"\",\"\",'donnée source'!D8)","v":"E"},{"$f":"IF('donnée source'!E8=\"\",\"\",'donnée source'!E8)","v":"c"},{"$f":"IF('donnée source'!F8=\"\",\"\",'donnée source'!F8)","v":""},{"$f":"IF('donnée source'!G8=\"\",\"\",'donnée source'!G8)","v":"RM"},{"$f":"IF('donnée source'!H8=\"\",\"\",'donnée source'!H8)","v":"1 an"},{"$f":"IF('donnée source'!I8=\"\",\"\",'donnée source'!I8)","v":"Vref : 6808 tr/min"},{"$f":"IF('donnée source'!J8=\"\",\"\",'donnée source'!J8)","v":"Ce AMP 2017 001"}]
["Référence des documents applicables",null,null,null,null,null,null,"Vérification",null,null,{"$f":"IF('donnée source'!C9=\"\",\"\",'donnée source'!C9)","v":"2018-01-31"},{"$f":"IF('donnée source'!D9=\"\",\"\",'donnée source'!D9)","v":"E"},{"$f":"IF('donnée source'!E9=\"\",\"\",'donnée source'!E9)","v":"c"},{"$f":"IF('donnée source'!F9=\"\",\"\",'donnée source'!F9)","v":""},{"$f":"IF('donnée source'!G9=\"\",\"\",'donnée source'!G9)","v":"RM"},{"$f":"IF('donnée source'!H9=\"\",\"\",'donnée source'!H9)","v":"1 an"},{"$f":"IF('donnée source'!I9=\"\",\"\",'donnée source'!I9)","v":"Vref : 6852 tr/min"},{"$f":"IF('donnée source'!J9=\"\",\"\",'donnée source'!J9)","v":"Ce AMP 2018 001"}]
[null,"PRV-MAQ-01",null,null,null,null,null,null,null,null,{"$f":"IF('donnée source'!C10=\"\",\"\",'donnée source'!C10)","v":"2018-01-31"},{"$f":"IF('donnée source'!D10=\"\",\"\",'donnée source'!D10)","v":"RE"},{"$f":"IF('donnée source'!E10=\"\",\"\",'donnée source'!E10)","v":"c"},{"$f":"IF('donnée source'!F10=\"\",\"\",'donnée source'!F10)","v":""},{"$f":"IF('donnée source'!G10=\"\",\"\",'donnée source'!G10)","v":""},{"$f":"IF('donnée source'!H10=\"\",\"\",'donnée source'!H10)","v":""},{"$f":"IF('donnée source'!I10=\"\",\"\",'donnée source'!I10)","v":""},{"$f":"IF('donnée source'!J10=\"\",\"\",'donnée source'!J10)","v":""}]
[null,"EMP-PRO-02",null,null,null,null,null,null,"Périodicité : 1 an",null,{"$f":"IF('donnée source'!C11=\"\",\"\",'donnée source'!C11)","v":"2019-01-24"},{"$f":"IF('donnée source'!D11=\"\",\"\",'donnée source'!D11)","v":"E"},{"$f":"IF('donnée source'!E11=\"\",\"\",'donnée source'!E11)","v":"c"},{"$f":"IF('donnée source'!F11=\"\",\"\",'donnée source'!F11)","v":""},{"$f":"IF('donnée source'!G11=\"\",\"\",'donnée source'!G11)","v":"RM"},{"$f":"IF('donnée source'!H11=\"\",\"\",'donnée source'!H11)","v":"1 an"},{"$f":"IF('donnée source'!I11=\"\",\"\",'donnée source'!I11)","v":"Vref : 6856 tr/min"},{"$f":"IF('donnée source'!J11=\"\",\"\",'donnée source'!J11)","v":"Ce AMP 2019 001"}]
[null,null,null,null,null,null,null,null,"Procédure de référence interne : EMP-MOP-01"]
[]
["Caractéristiques",null,null,null,null,null,null,"Tolérances"]
[null,null,null,null,null,null,null,null,"Erreurs Limites tolérées (ELT) : Vitesse de référence ± 150 trs/min"]
[null,null,null,null,null,null,null,null,"Erreurs Maximales Tolérées (EMT) : Vitesse de référence ± 200 trs/min"]
[]
["Autres informations",null,null,null,null,null,null,"Responsable métrologie"]
[]
[]
[null,null,null,null,null,null,null,"Correspondant métrologie de l'antenne"]
[null,null,null,null,null,null,null,null,null,null,"(1) - D : Réglage du débit ; V : Vérification ; M : Maintenance ; RE : Réparation ; RF : Réforme ; É : Etalonnage ;  C.B. : Contrôle batterie"]
[null,null,null,null,null,null,null,null,null,null,"(3) - M ou RM : Mise ou Remise en service ; A ; RE ; RF",null,null,null,null,null,null,null,"(4) - Noter : la valeur du résultat et/ou la vitesse de référence et/ou le numéro d'essai et/ou les observations"]
[null,null,null,null,null,null,null,null,null,null,"(5) - CM : Compte rendu de Maintenance, de réparation ; Ce : Certificat d'étalonnage ; FA : Fiche d'amélioration"]

{"sheet":"AMP PI03","index":2,"n_rows":26,"n_cols":19,"rows_kept":26,"cut":false,"hidden":false,"merged":[[0,16,0,18],[2,12,2,13]]}
["FICHE SIGNALETIQUE",null,null,null,null,null,null,null,"N° de fiche de vie : AMP P03",null,"FICHE DE SUIVI",null,null,null,null,null,{"$f":"I1","v":"N° de fiche de vie : AMP P03"}]
[]
["Description",null,null,null,null,null,null,"Etalonnage ou Réglage du débit",null,null,"Date","Nature (1)","Résultat (2)",null,"Décision (3)","Périodicité","Notes (4)","Référence Document (5)","Visa"]
[null,null,null,null,null,null,null,null,null,null,{"$f":"IF('donnée source'!C22=\"\",\"\",'donnée source'!C22)","v":"2014-03-06"},{"$f":"IF('donnée source'!D22=\"\",\"\",'donnée source'!D22)","v":"E"},{"$f":"IF('donnée source'!E22=\"\",\"\",'donnée source'!E22)","v":"C"},{"$f":"IF('donnée source'!F22=\"\",\"\",'donnée source'!F22)","v":""},{"$f":"IF('donnée source'!G22=\"\",\"\",'donnée source'!G22)","v":"RM"},{"$f":"IF('donnée source'!H22=\"\",\"\",'donnée source'!H22)","v":"1 an"},{"$f":"IF('donnée source'!I22=\"\",\"\",'donnée source'!I22)","v":"Vref : 6284 tr/min Inhalable"},{"$f":"IF('donnée source'!J22=\"\",\"\",'donnée source'!J22)","v":"Ce AMP 2014 0018"}]
[null,null,null,null,null,null,null,null,null,null,{"$f":"IF('donnée source'!C23=\"\",\"\",'donnée source'!C23)","v":"2014-08-28"},{"$f":"IF('donnée source'!D23=\"\",\"\",'donnée source'!D23)","v":"E"},{"$f":"IF('donnée source'!E23=\"\",\"\",'donnée source'!E23)","v":"C"},{"$f":"IF('donnée source'!F23=\"\",\"\",'donnée source'!F23)","v":""},{"$f":"IF('donnée source'!G23=\"\",\"\",'donnée source'!G23)","v":"RM"},{"$f":"IF('donnée source'!H23=\"\",\"\",'donnée source'!H23)","v":"1 an"},{"$f":"IF('donnée source'!I23=\"\",\"\",'donnée source'!I23)","v":"Vref : 6245 tr/min Inhalable"},{"$f":"IF('donnée source'!J23=\"\",\"\",'donnée source'!J23)","v":"Ce AMP 2014 041"}]
[null,null,null,null,null,null,null,null,null,null,{"$f":"IF('donnée source'!C24=\"\",\"\",'donnée source'!C24)","v":"2015-08-19"},{"$f":"IF('donnée source'!D24=\"\",\"\",'donnée source'!D24)","v":"E"},{"$f":"IF('donnée source'!E24=\"\",\"\",'donnée source'!E24)","v":"C"},{"$f":"IF('donnée source'!F24=\"\",\"\",'donnée source'!F24)","v":""},{"$f":"IF('donnée source'!G24=\"\",\"\",'donnée source'!G24)","v":"RM"},{"$f":"IF('donnée source'!H24=\"\",\"\",'donnée source'!H24)","v":"1 an"},{"$f":"IF('donnée source'!I24=\"\",\"\",'donnée source'!I24)","v":"Vref : 6271 tr/min Inhalable"},{"$f":"IF('donnée source'!J24=\"\",\"\",'donnée source'!J24)","v":"Ce AMP 2015 053"}]
[null,null,null,null,null,null,null,null,"Périodicité : 1 an",null,{"$f":"IF('donnée source'!C25=\"\",\"\",'donnée source'!C25)","v":"2016-01-14"},{"$f":"IF('donnée source'!D25=\"\",\"\",'donnée source'!D25)","v":"E"},{"$f":"IF('donnée source'!E25=\"\",\"\",'donnée source'!E25)","v":"C"},{"$f":"IF('donnée source'!F25=\"\",\"\",'donnée source'!F25)","v":""},{"$f":"IF('donnée source'!G25=\"\",\"\",'donnée source'!G25)","v":"RM"},{"$f":"IF('donnée source'!H25=\"\",\"\",'donnée source'!H25)","v":"1 an"},{"$f":"IF('donnée source'!I25=\"\",\"\",'donnée source'!I25)","v":"Vref : 6198 tr/min Inhalable"},{"$f":"IF('donnée source'!J25=\"\",\"\",'donnée source'!J25)","v":"Ce AMP 2016 002"}]
[null,null,null,null,null,null,null,null,"Procédure de référence interne : EMP-MOP-01",null,{"$f":"IF('donnée source'!C26=\"\",\"\",'donnée source'!C26)","v":"2017-01-11"},{"$f":"IF('donnée source'!D26=\"\",\"\",'donnée source'!D26)","v":"E"},{"$f":"IF('donnée source'!E26=\"\",\"\",'donnée source'!E26)","v":"C"},{"$f":"IF('donnée source'!F26=\"\",\"\",'donnée source'!F26)","v":""},{"$f":"IF('donnée source'!G26=\"\",\"\",'donnée source'!G26)","v":"RM"},{"$f":"IF('donnée source'!H26=\"\",\"\",'donnée source'!H26)","v":"1 an"},{"$f":"IF('donnée source'!I26=\"\",\"\",'donnée source'!I26)","v":"Vref : 6167 tr/min Inhalable"},{"$f":"IF('donnée source'!J26=\"\",\"\",'donnée source'!J26)","v":"Ce AMP 2017 002"}]
[null,null,null,null,null,null,null,null,null,null,{"$f":"IF('donnée source'!C27=\"\",\"\",'donnée source'!C27)","v":"2018-01-31"},{"$f":"IF('donnée source'!D27=\"\",\"\",'donnée source'!D27)","v":"E"},{"$f":"IF('donnée source'!E27=\"\",\"\",'donnée source'!E27)","v":"C"},{"$f":"IF('donnée source'!F27=\"\",\"\",'donnée source'!F27)","v":""},{"$f":"IF('donnée source'!G27=\"\",\"\",'donnée source'!G27)","v":"RM"},{"$f":"IF('donnée source'!H27=\"\",\"\",'donnée source'!H27)","v":"1 an"},{"$f":"IF('donnée source'!I27=\"\",\"\",'donnée source'!I27)","v":"Vref : 6195 tr/min Inhalable"},{"$f":"IF('donnée source'!J27=\"\",\"\",'donnée source'!J27)","v":"Ce AMP 2018 002"}]
[null,null,null,null,null,null,null,null,null,null,{"$f":"IF('donnée source'!C28=\"\",\"\",'donnée source'!C28)","v":"2019-01-24"},{"$f":"IF('donnée source'!D28=\"\",\"\",'donnée source'!D28)","v":"E"},{"$f":"IF('donnée source'!E28=\"\",\"\",'donnée source'!E28)","v":"C"},{"$f":"IF('donnée source'!F28=\"\",\"\",'donnée source'!F28)","v":""},{"$f":"IF('donnée source'!G28=\"\",\"\",'donnée source'!G28)","v":"RM"},{"$f":"IF('donnée source'!H28=\"\",\"\",'donnée source'!H28)","v":"1 an"},{"$f":"IF('donnée source'!I28=\"\",\"\",'donnée source'!I28)","v":"Vref : 6136 tr/min Inhalable"},{"$f":"IF('donnée source'!J28=\"\",\"\",'donnée source'!J28)","v":"Ce AMP 2019 040"}]
["Référence des documents applicables",null,null,null,null,null,null,"Vérification"]
[null,"PRV-MAQ-01"]
[null,"EMP-PRO-02",null,null,null,null,null,null,"Périodicité : 1 an"]
[null,null,null,null,null,null,null,null,"Procédure de référence interne : EMP-MOP-01"]
[]
["Caractéristiques",null,null,null,null,null,null,"Tolérances"]
[]
[]
[]
["Autres informations",null,null,null,null,null,null,"Responsable métrologie"]
[]
[]
[null,null,null,null,null,null,null,"Correspondant métrologie de l'antenne"]
[null,null,null,null,null,null,null,null,null,null,"(1) - D : Réglage du débit ; V : Vérification ; M : Maintenance ; RE : Réparation ; RF : Réforme ; É : Etalonnage ;  C.B. : Contrôle batterie",null,null,null,null,null,null,null,"    (2) - C : Conforme ; N.C. : Non-conforme "]
[null,null,null,null,null,null,null,null,null,null,"(3) - M ou RM : Mise ou Remise en service ; A ; RE ; RF",null,null,null,null,null,null,null,"(4) - Noter : la valeur du résultat et/ou la vitesse de référence et/ou le numéro d'essai et/ou les observations"]
[null,null,null,null,null,null,null,null,null,null,"(5) - CM : Compte rendu de Maintenance, de réparation ; Ce : Certificat d'étalonnage ; FA : Fiche d'amélioration"]

{"sheet":"donnée source (2)","index":3,"n_rows":104,"n_cols":9,"rows_kept":104,"cut":false,"hidden":false,"merged":[[0,3,0,4]]}
["CIP10","Date","Nature (1)","Résultat (2)",null,"Décision (3)","Périodicité","Notes (4)","Référence Document (5)"]
[]
["AMP P01","2019-01-24","E","c",null,"RM","1 an","Vref : 6856 tr/min","Ce AMP 2019 001"]
["AMP P03","2019-01-24","E","C",null,"RM","1 an","Vref : 6136 tr/min Inhalable","Ce AMP 2019 040"]
["AMP P01","2018-01-31","E","c",null,"RM","1 an","Vref : 6852 tr/min","Ce AMP 2018 001"]
["AMP P01","2018-01-31","RE","c"]
["AMP P03","2018-01-31","E","C",null,"RM","1 an","Vref : 6195 tr/min Inhalable","Ce AMP 2018 002"]
["AMP P01","2017-01-11","E","c",null,"RM","1 an","Vref : 6808 tr/min","Ce AMP 2017 001"]
["AMP P03","2017-01-11","E","C",null,"RM","1 an","Vref : 6167 tr/min Inhalable","Ce AMP 2017 002"]
["AMP P01","2016-01-14","E","c",null,"RM","1 an","Vref : 6755 tr/min","Ce AMP 2016 001"]
["AMP P03","2016-01-14","E","C",null,"RM","1 an","Vref : 6198 tr/min Inhalable","Ce AMP 2016 002"]
["AMP P01","2015-09-25","RE","c",null,null,null,"changement de batterie"]
["AMP P01","2015-09-25","E","c",null,"RM","1 an","Vref : 6952 tr/min","Ce AMP 2015 039"]
["AMP P01","2015-08-19","E","c",null,"RM","1 an","Vref : 6795 tr/min","Ce AMP 2015 001"]
["AMP P03","2015-08-19","E","C",null,"RM","1 an","Vref : 6271 tr/min Inhalable","Ce AMP 2015 053"]
["AMP P01","2014-08-28","E","c",null,"RM","1 an","Vref : 6878 tr/min","Ce AMP 2014 040"]
["AMP P03","2014-08-28","E","C",null,"RM","1 an","Vref : 6245 tr/min Inhalable","Ce AMP 2014 041"]
["AMP P01","2014-03-06","E","c",null,"RM","1 an","Vref : 6825 tr/min","Ce AMP 2014 017"]
["AMP P03","2014-03-06","E","C",null,"RM","1 an","Vref : 6284 tr/min Inhalable","Ce AMP 2014 0018"]
[]
[]
[]
[]
[]
[]
[]
[]
[]
[]
[]
[]
[]
[]
[]
[]
[]
[]
[]
["AMP P06"]
["AMP P07"]
["AMP P08"]
["AMP P09"]
["AMP P10"]
["AMP P11"]
["AMP P12"]
["AMP P13"]
["AMP P14"]
["AMP P15"]
["AMP P16"]
["AMP P17"]
["AMP P18"]
["AMP P19"]
["AMP P20"]
["AMP P21"]
["AMP P22"]
["AMP P23"]
["AMP P24"]
["AMP P25"]
["AMP P26"]
["AMP P27"]
["AMP P28"]
["AMP P29"]
["AMP P30"]
["AMP P31"]
["AMP P32"]
["AMP P33"]
["AMP P34"]
["AMP P35"]
["AMP P36"]
["AMP P37"]
["AMP P38"]
["AMP P39"]
["AMP P40"]
["AMP P41"]
["AMP P42"]
["AMP P43"]
["AMP P44"]
["AMP P45"]
["AMP P46"]
["AMP P47"]
["AMP P48"]
["AMP P49"]
["AMP P50"]
["AMP P51"]
["AMP P52"]
["AMP P53"]
["AMP P54"]
["AMP P55"]
["AMP P56"]
["AMP P57"]
["AMP P58"]
["AMP P59"]
["AMP P60"]
["AMP P61"]
["AMP P62"]
["AMP P63"]
["AMP P64"]
["AMP P65"]
["AMP P66"]
["AMP P67"]
["AMP P68"]
["AMP P69"]
["AMP P70"]
["AMP P71"]