{"text_format":"1","workbook":"xlsx","n_sheets":4,"sheets":["VILLES","COUT TR 2019","BD","PLANNING LIV"],"not_rendered":{"charts":0,"images":0,"macros":1,"external_links":0,"defined_names":7,"comments":0,"pivot_tables":0},"unopened":[],"bounds":{"document_bytes":16777216,"sheet_cells":100000,"rows_first":2000,"rows_last":500,"rows_between":2000,"halvings":0,"cell_chars":16384,"cell_head_chars":4096},"cells_cut":0,"cells_raw":0,"read":"whole","date_system":"1900"}

{"sheet":"VILLES","index":0,"n_rows":299,"n_cols":11,"rows_kept":299,"cut":false,"hidden":false,"merged":[]}
[]
[]
[null,null,"VILLE","KM",0.1,"KM A/R","KM A/R +10%","TEMPS",0.2,"TEMPS A/R","TEMPS A/R +20%"]
[null,null,"VILLE 1",20,22,40,44,"00:37:00","00:44:24","01:14:00","01:28:48"]
[null,null,"VILLE 2",36.5,40.150000000000006,73,80.300000000000011,"00:57:00","01:08:24","01:54:00","02:16:48"]
[null,null,"VILLE 3",25.2,27.720000000000002,50.4,55.440000000000005,"00:44:00","00:52:48","01:28:00","01:45:36"]
[null,null,"VILLE 4",25.3,27.830000000000002,50.6,55.660000000000004,"00:42:00","00:50:24","01:24:00","01:40:48"]
[null,null,"VILLE 5",25,27.500000000000004,50,55.000000000000007,"00:40:00","00:48:00","01:20:00","01:36:00"]
[null,null,"VILLE 6",15.4,16.940000000000001,30.8,33.880000000000003,"00:30:00","00:36:00","01:00:00","01:12:00"]
[null,null,"VILLE 7",38.200000000000003,42.02,76.400000000000006,84.04,"00:59:00","01:10:48","01:58:00","02:21:36"]
[null,null,"VILLE 8",31.7,34.870000000000005,63.4,69.740000000000009,"00:50:00","01:00:00","01:40:00","02:00:00"]
[null,null,"VILLE 9",101.4,111.54000000000002,202.8,223.08000000000004,"02:01:00","02:25:12","04:02:00","04:50:24"]
[null,null,"VILLE 10",66.3,72.930000000000007,132.6,145.86000000000001,"01:19:00","01:34:48","02:38:00","03:09:36"]
[null,null,"VILLE 11",25.2,27.720000000000002,50.4,55.440000000000005,"00:44:00","00:52:48","01:28:00","01:45:36"]
[null,null,"VILLE 12",28.4,31.240000000000002,56.8,62.480000000000004,"00:49:00","00:58:48","01:38:00","01:57:36"]
[null,null,"VILLE 13",16,17.600000000000001,32,35.200000000000003,"00:08:00","00:09:36","00:16:00","00:19:12"]
[null,null,"VILLE 14",43.8,48.18,87.6,96.36,"01:00:00","01:12:00","02:00:00","02:24:00"]
[null,null,"VILLE 15",12,13.200000000000001,24,26.400000000000002,"00:22:00","00:26:24","00:44:00","00:52:48"]
[null,null,"VILLE 16",40.299999999999997,44.33,80.599999999999994,88.66,"01:08:00","01:21:36","02:16:00","02:43:12"]
[null,null,"VILLE 17",29.1,32.010000000000005,58.2,64.02000000000001,"00:51:00","01:01:12","01:42:00","02:02:24"]
[null,null,"VILLE 18",24.7,27.17,49.4,54.34,"00:40:00","00:48:00","01:20:00","01:36:00"]
[null,null,"VILLE 19",39.700000000000003,43.670000000000009,79.400000000000006,87.340000000000018,"00:57:00","01:08:24","01:54:00","02:16:48"]
[null,null,"VILLE 20",18,19.8,36,39.6,"00:30:00","00:36:00","01:00:00","01:12:00"]
[null,null,"VILLE 21",32.6,35.860000000000007,65.2,71.720000000000013,"00:58:00","01:09:36","01:56:00","02:19:12"]
[null,null,"VILLE 22",16.3,17.930000000000003,32.6,35.860000000000007,"00:31:00","00:37:12","01:02:00","01:14:24"]
[null,null,"VILLE 23",15,16.5,30,33,"00:25:00","00:30:00","00:50:00","01:00:00"]
[null,null,"VILLE 24",17.899999999999999,19.690000000000001,35.799999999999997,39.380000000000003,"00:34:00","00:40:48","01:08:00","01:21:36"]
[null,null,"VILLE 25",31,34.1,62,68.2,"00:56:00","01:07:12","01:52:00","02:14:24"]
[null,null,"VILLE 26",49.9,54.89,99.8,109.78,"01:14:00","01:28:48","02:28:00","02:57:36"]
[null,null,"VILLE 27",18.399999999999999,20.239999999999998,36.799999999999997,40.479999999999997,"00:35:00","00:42:00","01:10:00","01:24:00"]
[null,null,"VILLE 28",92.5,101.75000000000001,185,203.50000000000003,"01:45:00","02:06:00","03:30:00","04:12:00"]
[null,null,"VILLE 29",28.9,31.790000000000003,57.8,63.580000000000005,"00:51:00","01:01:12","01:42:00","02:02:24"]
[null,null,"VILLE 30",64.599999999999994,71.06,129.19999999999999,142.12,"01:16:00","01:31:12","02:32:00","03:02:24"]
[null,null,"VILLE 31",58.7,64.570000000000007,117.4,129.14000000000001,"01:39:00","01:58:48","03:18:00","03:57:36"]
[null,null,"VILLE 32",75,82.5,150,165,"01:30:00","01:48:00","03:00:00","03:36:00"]
[null,null,"VILLE 33",70,77,140,154,"01:30:00","01:48:00","03:00:00","03:36:00"]
[null,null,"VILLE 34",12,13.200000000000001,24,26.400000000000002,"00:16:00","00:19:12","00:32:00","00:38:24"]
[null,null,"VILLE 35",6,6.6000000000000005,12,13.200000000000001,"00:10:00","00:12:00","00:20:00","00:24:00"]
[null,null,"VILLE 36",37.299999999999997,41.03,74.599999999999994,82.06,"01:02:00","01:14:24","02:04:00","02:28:48"]
[null,null,"VILLE 37",35.5,39.050000000000004,71,78.100000000000009,"00:55:00","01:06:00","01:50:00","02:12:00"]
[null,null,"VILLE 38",52.5,57.750000000000007,105,115.50000000000001,"01:06:00","01:19:12","02:12:00","02:38:24"]
[null,null,"VILLE 39",34,37.400000000000006,68,74.800000000000011,"01:00:00","01:12:00","02:00:00","02:24:00"]
[null,null,"VILLE 40",29.3,32.230000000000004,58.6,64.460000000000008,"00:46:00","00:55:12","01:32:00","01:50:24"]
[null,null,"VILLE 41",34.200000000000003,37.620000000000005,68.400000000000006,75.240000000000009,"00:53:00","01:03:36","01:46:00","02:07:12"]
[null,null,"VILLE 42",69.400000000000006,76.340000000000018,138.80000000000001,152.68000000000004,"01:19:00","01:34:48","02:38:00","03:09:36"]
[null,null,"VILLE 43",21.5,23.650000000000002,43,47.300000000000004,"00:36:00","00:43:12","01:12:00","01:26:24"]
[null,null,"VILLE 44",51.8,56.980000000000004,103.6,113.96000000000001,"01:11:00","01:25:12","02:22:00","02:50:24"]
[null,null,"VILLE 45",86.5,95.15,173,190.3,"01:38:00","01:57:36","03:16:00","03:55:12"]
[null,null,"VILLE 46",75.099999999999994,82.61,150.19999999999999,165.22,"01:33:00","01:51:36","03:06:00","03:43:12"]
[null,null,"VILLE 47",8,8.8000000000000007,16,17.600000000000001,"00:13:00","00:15:36","00:26:00","00:31:12"]
[null,null,"VILLE 48",20.399999999999999,22.44,40.799999999999997,44.88,"00:40:00","00:48:00","01:20:00","01:36:00"]
[null,null,"VILLE 49",67,73.7,134,147.4,"01:17:00","01:32:24","02:34:00","03:04:48"]
[null,null,"VILLE 50",34,37.400000000000006,68,74.800000000000011,"00:53:00","01:03:36","01:46:00","02:07:12"]
[null,null,"VILLE 51",41,45.1,82,90.2,"00:54:00","01:04:48","01:48:00","02:09:36"]
[null,null,"VILLE 52",25.6,28.160000000000004,51.2,56.320000000000007,"00:44:00","00:52:48","01:28:00","01:45:36"]
[null,null,"VILLE 53",30.5,33.550000000000004,61,67.100000000000009,"00:53:00","01:03:36","01:46:00","02:07:12"]
[null,null,"VILLE 54",5.3,5.83,10.6,11.66,"00:12:00","00:14:24","00:24:00","00:28:48"]
[null,null,"VILLE 55",98,107.80000000000001,196,215.60000000000002,"02:06:00","02:31:12","04:12:00","05:02:24"]
[null,null,"VILLE 56",54,59.400000000000006,108,118.80000000000001,"01:02:00","01:14:24","02:04:00","02:28:48"]
[null,null,"VILLE 57",19.3,21.230000000000004,38.6,42.460000000000008,"00:38:00","00:45:36","01:16:00","01:31:12"]
{"$rows_left_out":240}
{"sheet":"COUT TR 2019","index":1,"n_rows":32,"n_cols":14,"rows_kept":32,"cut":false,"hidden":false,"merged":[[2,2,2,3],[20,5,20,6]]}
[]
[]
[null,null,2019]
[null,null,"CHARGE 1",8000,null,"AMORTISSEMENT","CHOIX DU VEHICULE",null,null,null,null,"COUT/AN/VEHICULE"]
[null,null,"CHARGE 2",8000,null,1,"VEHICULE 1","IMMAT XX 99",50000,5,{"$f":"+I5/J5","v":10000},{"$f":"+K5+$D$18","v":20400},{"$f":"+$K$32/$F$14","v":20000},{"$f":"+L5/M5","v":1.02}]
[null,null,"CHARGE 3",8000,null,2,"VEHICULE 2","IMMAT XX 100",50000,5,10000,20400,{"$f":"+$K$32/$F$14","v":20000},1.02]
[null,null,"CHARGE 4",8000,null,3,"VEHICULE 3","IMMAT XX 101",50000,5,10000,20400,20000,1.02]
[null,null,"CHARGE 5",8000,null,4,"VEHICULE 4","IMMAT XX 102",50000,5,10000,20400,20000,1.02]
[null,null,"CHARGE 6",8000,null,5,"VEHICULE 5","IMMAT XX 103",50000,5,10000,20400,20000,1.02]
[null,null,"CHARGE 7",8000,null,6,"VEHICULE 6","IMMAT XX 104",50000,5,10000,20400,20000,1.02]
[null,null,"CHARGE 8",8000,null,7,"VEHICULE 7","IMMAT XX 105",50000,5,10000,20400,20000,1.02]
[null,null,"CHARGE 9",8000,null,8,"VEHICULE 8","IMMAT XX 106",50000,5,10000,20400,20000,1.02]
[null,null,"CHARGE 10",8000,null,9,"VEHICULE 9","IMMAT XX 107",50000,5,10000,20400,20000,{"$f":"+L13/M13","v":1.02}]
[null,null,"CHARGE 11",8000,null,10,"VEHICULE 10","IMMAT XX 108",50000,5,10000,20400,20000,{"$f":"+L14/M14","v":1.02}]
[null,null,"CHARGE 12",8000,null,null,null,null,null,null,{"$f":"SUM(K5:K14)","v":100000},null,{"$f":"SUM(M5:M14)","v":200000}]
[null,null,"CHARGE 13",8000]
[null,null,"somme",{"$f":"SUM(D4:D16)","v":104000}]
[null,null,"par VEHICULE =",{"$f":"+D17/F14","v":10400}]
[]
[null,null,null,null,null,null,null,null,2019,2018]
[null,null,null,null,null,"KM",null,null,"KM PARCOURU"]
[null,null,null,null,null,1,"VEHICULE 1","IMMAT XX 99",100000,80000,{"$f":"+I22-J22","v":20000}]
[null,null,null,null,null,2,"VEHICULE 2","IMMAT XX 100",100000,80000,20000]
[null,null,null,null,null,3,"VEHICULE 3","IMMAT XX 101",100000,80000,20000]
[null,null,null,null,null,4,"VEHICULE 4","IMMAT XX 102",100000,80000,20000]
[null,null,null,null,null,5,"VEHICULE 5","IMMAT XX 103",100000,80000,20000]
[null,null,null,null,null,6,"VEHICULE 6","IMMAT XX 104",100000,80000,{"$f":"+I27-J27","v":20000}]
[null,null,null,null,null,7,"VEHICULE 7","IMMAT XX 105",100000,80000,20000]
[null,null,null,null,null,8,"VEHICULE 8","IMMAT XX 106",100000,80000,20000]
[null,null,null,null,null,9,"VEHICULE 9","IMMAT XX 107",100000,80000,20000]
[null,null,null,null,null,10,"VEHICULE 10","IMMAT XX 108",100000,80000,20000]
[null,null,null,null,null,null,null,null,null,null,{"$f":"SUM(K22:K31)","v":200000}]

{"sheet":"BD","index":2,"n_rows":166,"n_cols":9,"rows_kept":166,"cut":false,"hidden":false,"merged":[]}
["Choix1","Choix2","Choix3",null,"Choix1",null,"Choix1","Choix2"]
[{"$f":"+'PLANNING LIV'!D25","v":"2019-12-30"},"MATIN",{"$f":"+'PLANNING LIV'!C96","v":"CHAUFFEUR 1 dispo"},null,{"$f":"+A2","v":"2019-12-30"},null,{"$f":"+E2","v":"2019-12-30"},"MATIN"," "]
[{"$f":"+A2","v":"2019-12-30"},"MATIN",{"$f":"+'PLANNING LIV'!D96","v":"NON"},null,{"$f":"+E2+1","v":"2019-12-31"},null,{"$f":"+E2","v":"2019-12-30"},"APRES MIDI"," "]
[{"$f":"+A3","v":"2019-12-30"},"MATIN",{"$f":"+'PLANNING LIV'!E96","v":"NON"},null,{"$f":"+E3+1","v":"2020-01-01"},null,{"$f":"+G2+1","v":"2019-12-31"},"MATIN"," "]
["2019-12-30","APRES MIDI",{"$f":"+'PLANNING LIV'!C125","v":"NON"},null,"2020-01-02",null,{"$f":"+G3+1","v":"2019-12-31"},"APRES MIDI"," "]
["2019-12-30","APRES MIDI",{"$f":"+'PLANNING LIV'!D125","v":"NON"},null,"2020-01-03",null,{"$f":"+G4+1","v":"2020-01-01"},"MATIN"," "]
["2019-12-30","APRES MIDI",{"$f":"+'PLANNING LIV'!E125","v":"NON"},null,"2020-01-04",null,"2020-01-01","APRES MIDI"," "]
[{"$f":"+A2+1","v":"2019-12-31"},"MATIN",{"$f":"+'PLANNING LIV'!H96","v":"NON"},null,"2020-01-05",null,"2020-01-02","MATIN"," "]
[{"$f":"+A3+1","v":"2019-12-31"},"MATIN",{"$f":"+'PLANNING LIV'!I96","v":"NON"},null,"2020-01-06",null,"2020-01-02","APRES MIDI"," "]
["2019-12-31","MATIN",{"$f":"+'PLANNING LIV'!J96","v":"NON"},null,"2020-01-07",null,"2020-01-03","MATIN"," "]
["2019-12-31","APRES MIDI",{"$f":"+'PLANNING LIV'!H125","v":"NON"},null,"2020-01-08",null,"2020-01-03","APRES MIDI"," "]
["2019-12-31","APRES MIDI",{"$f":"+'PLANNING LIV'!I125","v":"NON"},null,"2020-01-09",null,"2020-01-04","MATIN"," "]
["2019-12-31","APRES MIDI",{"$f":"+'PLANNING LIV'!J125","v":"NON"},null,"2020-01-10",null,{"$f":"G2+7","v":"2020-01-06"},"MATIN"," "]
[{"$f":"+A8+1","v":"2020-01-01"},"MATIN",{"$f":"+'PLANNING LIV'!M96","v":"NON"},null,"2020-01-11",null,{"$f":"G3+7","v":"2020-01-06"},"APRES MIDI"," "]
["2020-01-01","MATIN",{"$f":"+'PLANNING LIV'!N96","v":"NON"},null,"2020-01-12",null,"2020-01-07","MATIN"]
["2020-01-01","MATIN",{"$f":"+'PLANNING LIV'!O96","v":"NON"},null,"2020-01-13",null,"2020-01-07","APRES MIDI"]
["2020-01-01","APRES MIDI",{"$f":"+'PLANNING LIV'!M125","v":"NON"},null,"2020-01-14",null,"2020-01-08","MATIN"]
["2020-01-01","APRES MIDI",{"$f":"+'PLANNING LIV'!N125","v":"NON"},null,"2020-01-15",null,"2020-01-08","APRES MIDI"]
["2020-01-01","APRES MIDI",{"$f":"+'PLANNING LIV'!O125","v":"NON"},null,"2020-01-16",null,"2020-01-09","MATIN"]
["2020-01-02","MATIN",{"$f":"+'PLANNING LIV'!R96","v":"NON"},null,"2020-01-17",null,"2020-01-09","APRES MIDI"]
["2020-01-02","MATIN",{"$f":"+'PLANNING LIV'!S96","v":"NON"},null,"2020-01-18",null,"2020-01-10","MATIN"]
["2020-01-02","MATIN",{"$f":"+'PLANNING LIV'!T96","v":"NON"},null,"2020-01-19",null,"2020-01-10","APRES MIDI"]
["2020-01-02","APRES MIDI",{"$f":"+'PLANNING LIV'!R125","v":"NON"},null,"2020-01-20",null,"2020-01-11","MATIN"]
["2020-01-02","APRES MIDI",{"$f":"+'PLANNING LIV'!S125","v":"NON"},null,"2020-01-21",null,{"$f":"G13+7","v":"2020-01-13"},"MATIN"]
["2020-01-02","APRES MIDI",{"$f":"+'PLANNING LIV'!T125","v":"NON"},null,"2020-01-22",null,{"$f":"G14+7","v":"2020-01-13"},"APRES MIDI"]
["2020-01-03","MATIN",{"$f":"+'PLANNING LIV'!W96","v":"NON"},null,"2020-01-23",null,"2020-01-14","MATIN"]
["2020-01-03","MATIN",{"$f":"+'PLANNING LIV'!X96","v":"NON"},null,"2020-01-24",null,"2020-01-14","APRES MIDI"]
["2020-01-03","MATIN",{"$f":"+'PLANNING LIV'!Y96","v":"NON"},null,"2020-01-25",null,"2020-01-15","MATIN"]
["2020-01-03","APRES MIDI",{"$f":"'PLANNING LIV'!W125","v":"NON"},null,"2020-01-26",null,"2020-01-15","APRES MIDI"]
["2020-01-03","APRES MIDI",{"$f":"'PLANNING LIV'!X125","v":"NON"},null,"2020-01-27",null,"2020-01-16","MATIN"]
["2020-01-03","APRES MIDI",{"$f":"'PLANNING LIV'!Y125","v":"NON"},null,"2020-01-28",null,"2020-01-16","APRES MIDI"]
["2020-01-04","MATIN",{"$f":"+'PLANNING LIV'!AB96","v":"NON"},null,"2020-01-29",null,"2020-01-17","MATIN"]
["2020-01-04","MATIN",{"$f":"+'PLANNING LIV'!AC96","v":"NON"},null,"2020-01-30",null,"2020-01-17","APRES MIDI"]
["2020-01-04","MATIN",{"$f":"+'PLANNING LIV'!AD96","v":"NON"},null,"2020-01-31",null,"2020-01-18","MATIN"]
[{"$f":"+A2+7","v":"2020-01-06"},"MATIN",{"$f":"'PLANNING LIV'!C156","v":"NON"},null,"2020-02-01",null,{"$f":"G24+7","v":"2020-01-20"},"MATIN"]
[{"$f":"+A35","v":"2020-01-06"},"MATIN",{"$f":"+'PLANNING LIV'!D156","v":"NON"},null,null,null,{"$f":"G25+7","v":"2020-01-20"},"APRES MIDI"]
[{"$f":"+A36","v":"2020-01-06"},"MATIN",{"$f":"+'PLANNING LIV'!E156","v":"NON"},null,null,null,"2020-01-21","MATIN"]
["2020-01-06","APRES MIDI",{"$f":"'PLANNING LIV'!C185","v":"NON"},null,null,null,"2020-01-21","APRES MIDI"]
["2020-01-06","APRES MIDI",{"$f":"'PLANNING LIV'!D185","v":"NON"},null,null,null,"2020-01-22","MATIN"]
["2020-01-06","APRES MIDI",{"$f":"'PLANNING LIV'!E185","v":"NON"},null,null,null,"2020-01-22","APRES MIDI"]
["2020-01-07","MATIN",{"$f":"'PLANNING LIV'!H156","v":"NON"},null,null,null,"2020-01-23","MATIN"]
["2020-01-07","MATIN",{"$f":"'PLANNING LIV'!I156","v":"NON"},null,null,null,"2020-01-23","APRES MIDI"]
["2020-01-07","MATIN",{"$f":"'PLANNING LIV'!J156","v":"NON"},null,null,null,"2020-01-24","MATIN"]
["2020-01-07","APRES MIDI",{"$f":"'PLANNING LIV'!H185","v":"NON"},null,null,null,"2020-01-24","APRES MIDI"]
["2020-01-07","APRES MIDI",{"$f":"'PLANNING LIV'!I185","v":"NON"},null,null,null,"2020-01-25","MATIN"]
["2020-01-07","APRES MIDI",{"$f":"'PLANNING LIV'!J185","v":"NON"},null,null,null,{"$f":"G35+7","v":"2020-01-27"},"MATIN"]
["2020-01-08","MATIN",{"$f":"'PLANNING LIV'!M156","v":"NON"},null,null,null,{"$f":"G36+7","v":"2020-01-27"},"APRES MIDI"]
["2020-01-08","MATIN",{"$f":"'PLANNING LIV'!N156","v":"NON"},null,null,null,"2020-01-28","MATIN"]
["2020-01-08","MATIN",{"$f":"'PLANNING LIV'!O156","v":"NON"},null,null,null,"2020-01-28","APRES MIDI"]
["2020-01-08","APRES MIDI",{"$f":"'PLANNING LIV'!M185","v":"NON"},null,null,null,"2020-01-29","MATIN"]
["2020-01-08","APRES MIDI",{"$f":"'PLANNING LIV'!N185","v":"NON"},null,null,null,"2020-01-29","APRES MIDI"]
["2020-01-08","APRES MIDI",{"$f":"'PLANNING LIV'!O185","v":"NON"},null,null,null,"2020-01-30","MATIN"]
["2020-01-09","MATIN",{"$f":"'PLANNING LIV'!R156","v":"NON"},null,null,null,"2020-01-30","APRES MIDI"]
["2020-01-09","MATIN",{"$f":"'PLANNING LIV'!S156","v":"NON"},null,null,null,"2020-01-31","MATIN"]
["2020-01-09","MATIN",{"$f":"+'PLANNING LIV'!T156","v":"NON"},null,null,null,"2020-01-31","APRES MIDI"]
["2020-01-09","APRES MIDI",{"$f":"'PLANNING LIV'!R185","v":"NON"},null,null,null,"2020-02-01","MATIN"]
["2020-01-09","APRES MIDI",{"$f":"+'PLANNING LIV'!S185","v":"NON"}]
["2020-01-09","APRES MIDI",{"$f":"+'PLANNING LIV'!T185","v":"NON"}]
["2020-01-10","MATIN",{"$f":"'PLANNING LIV'!W156","v":"NON"}]
["2020-01-10","MATIN",{"$f":"'PLANNING LIV'!X156","v":"NON"}]
{"$rows_left_out":107}
{"sheet":"PLANNING LIV","index":3,"n_rows":381,"n_cols":30,"rows_kept":381,"cut":false,"hidden":false,"merged":[[1,1,1,4],[92,8,92,9],[92,6,92,7],[92,3,92,4],[92,1,92,2],[3,1,6,1],[92,28,92,29],[92,26,92,27],[92,23,92,24],[92,21,92,22],[92,18,92,19],[92,16,92,17],[92,13,92,14],[92,11,92,12],[3,6,4,6],[3,7,4,7],[121,21,121,22],[121,23,121,24],[121,1,121,2],[121,3,121,4],[121,6,121,7],[121,8,121,9],[121,11,121,12],[121,13,121,14],[121,16,121,17],[121,18,121,19],[152,16,152,17],[152,18,152,19],[152,21,152,22],[152,23,152,24],[152,26,152,27],[152,28,152,29],[152,1,152,2],[152,3,152,4],[152,6,152,7],[152,8,152,9],[152,11,152,12],[152,13,152,14],[181,23,181,24],[240,23,240,24],[240,21,240,22],[240,18,240,19],[240,16,240,17],[181,1,181,2],[181,3,181,4],[181,6,181,7],[181,8,181,9],[181,11,181,12],[181,13,181,14],[240,13,240,14],[240,11,240,12],[240,8,240,9],[240,6,240,7],[240,3,240,4],[240,1,240,2],[181,16,181,17],[181,18,181,19],[181,21,181,22],[211,13,211,14],[211,11,211,12],[211,8,211,9],[211,6,211,7],[270,6,270,7],[270,3,270,4],[299,8,299,9],[299,6,299,7],[299,3,299,4],[211,3,211,4],[211,1,211,2],[211,28,211,29],[211,26,211,27],[211,23,211,24],[211,21,211,22],[211,18,211,19],[211,16,211,17],[270,28,270,29],[270,26,270,27],[270,23,270,24],[270,21,270,22],[270,18,270,19],[270,16,270,17],[270,1,270,2],[329,28,329,29],[329,26,329,27],[329,23,329,24],[329,21,329,22],[329,18,329,19],[329,16,329,17],[329,1,329,2],[299,23,299,24],[299,21,299,22],[299,18,299,19],[299,16,299,17],[358,1,358,2],[358,13,358,14],[358,11,358,12],[23,10,23,14],[25,10,30,10],[45,11,45,15],[358,23,358,24],[358,21,358,22],[358,18,358,19],[358,16,358,17],[329,13,329,14],[329,11,329,12],[329,8,329,9],[329,6,329,7],[329,3,329,4],[358,8,358,9],[358,6,358,7],[358,3,358,4],[299,1,299,2],[299,13,299,14],[299,11,299,12],[270,13,270,14],[270,11,270,12],[270,8,270,9]]}
[]
[null,"OUTIL CALCUL LIVRAISON",null,null,null,null,"N°: COMMANDE:","commande n°: 999","PRIX MINI:","TTC"]
[null,null,"LIBELLE","ZONE CHOIX","ZONE CALCUL",null,"VILLE:","*ville*3",{"$f":"+'PLANNING LIV'!O27+('PLANNING LIV'!$R$40*'PLANNING LIV'!L27*24)+(H4*'PLANNING LIV'!$R$40*24)","v":105.62045421245419},{"$f":"+I3*1.196","v":126.32206323809521}]
[null,1,"CHOIX DU JOUR:","2019-12-30","HEURE DE DEPART:",null,"TEMPS DECHARGEMENT ESTIME","01:00:00","PRIX MAXI:","TTC"]
[null,null,"MATIN OU APRES MIDI","MATIN","08:00:00",null,null,null,{"$f":"+'PLANNING LIV'!O29+('PLANNING LIV'!$R$40*'PLANNING LIV'!L29*24)+(H4*'PLANNING LIV'!$R$40*24)","v":117.20814065934066},{"$f":"+I5*1.196","v":140.18093622857143}]
[null,null,"CHOIX DU CHAUFFEUR:","CHAUFFEUR 1 dispo","HEURE DE RETOUR:",null,"VEHICULE CHOISI:","VEHICULE 1","PRIX MOYEN:","TTC"]
[null,null,null,null,{"$f":"ROUNDUP(((+E5+'PLANNING LIV'!L31+H4)*4*24),0)/4/24","v":"10:45:00"},null,"IMMATRICULATION:",{"$f":"VLOOKUP(H6,'PLANNING LIV'!H25:I35,2,FALSE)","v":"IMMAT XX 99"},{"$f":"+'PLANNING LIV'!O31+('PLANNING LIV'!$R$40*'PLANNING LIV'!L31*24)+(H4*'PLANNING LIV'!$R$40*24)","v":111.41429743589744},{"$f":"+I7*1.196","v":133.25149973333333}]
[]
[]
[null,null,"CHOIX DU CHAUFFEUR","TACHE",null,null,null,"CHOIX DU TPS DE DECHARGEMENT"]
[null,null,"CHAUFFEUR 1",null,null,null,null,"00:15:00"]
[null,null,"CHAUFFEUR 2","TACHE 1",null,null,null,"00:30:00"]
[null,null,"CHAUFFEUR 3","TACHE 2",null,null,null,"00:45:00"]
[null,null,"CHAUFFEUR 4","TACHE 3",null,null,null,"01:00:00"]
[null,null,null,"TACHE 4",null,null,null,"01:15:00"]
[null,null,null,"TACHE 5",null,null,null,"01:30:00"]
[null,null,null,"TACHE 6",null,null,null,"01:45:00"]
[null,null,null,"TACHE 7",null,null,null,"02:00:00"]
[null,null,null,"TACHE 8",null,null,null,"02:30:00"]
[null,null,null,null,null,null,null,"03:00:00"]
[null,null,"MATIN","APRES MIDI",null,null,null,"04:00:00"]
[]
[]
[null,null,"jour","DATE",null,null,"N°:","CHOIX DU VEHICULE","IMMAT",null,"CALCUL cout livraison",null,null,null,null,null,"CHAUFFEUR","NBR HEURES TRAVAILLEES","RENUMERATION ANNUELLE","NBR D'HEURES A RECUPERER"]
[null,null,"LUNDI","2019-12-30",null,null,1,"VEHICULE 1","IMMAT XX 99",null,null,"tps","KM MOYEN:","vehicule","HT",null,"CHAUFFEUR 1 JANTON",1820,40000]
[null,null,"MARDI",{"$f":"+D25+1","v":"2019-12-31"},null,null,2,"VEHICULE 2","IMMAT XX 100",null,1,"CALCUL TEMPS DE LIVRAISON MINI:","CALCUL KM MINI:","VEHICULE:","PRIX MINI:",null,"CHAUFFEUR 2 PAYAGE",1820,40000]
[null,null,"MERCREDI","2020-01-01",null,null,3,"VEHICULE 3","IMMAT XX 101",null,null,{"$f":"VLOOKUP('PLANNING LIV'!H3,VILLES!C3:K299,8,FALSE)","v":"01:28:00"},{"$f":"VLOOKUP('PLANNING LIV'!H3,VILLES!$C$3:$K$299,4,FALSE)","v":50.4},{"$f":"'PLANNING LIV'!H6","v":"VEHICULE 1"},{"$f":"VLOOKUP(N27,'COUT TR 2019'!G4:N15,8,FALSE)*M27","v":51.408000000000001},null,"CHAUFFEUR 3THAIRE LANVERS",1820,40000]
[null,null,"JEUDI","2020-01-02",null,null,4,"VEHICULE 4","IMMAT XX 102",null,null,"CALCUL TEMPS DE LIVRAISON MAXI:","CALCUL KM MAXI:",null,"PRIX MAXI:"]
[null,null,"VENDREDI","2020-01-03",null,null,5,"VEHICULE 5","IMMAT XX 103",null,null,{"$f":"VLOOKUP('PLANNING LIV'!H3,VILLES!$C$3:$K$299,9,FALSE)","v":"01:45:36"},{"$f":"VLOOKUP('PLANNING LIV'!H3,VILLES!$C$3:$K$299,5,FALSE)","v":55.440000000000005},null,{"$f":"VLOOKUP(N27,'COUT TR 2019'!$G$4:$N$18,8,FALSE)*M29","v":56.548800000000007}]
[null,null,"SAMEDI","2020-01-04",null,null,6,"VEHICULE 6","IMMAT XX 104",null,null,"TEMPS DE LIVRAISON MOYEN:","KM MOYEN:",null,"PRIX MOYEN:",null,"MAJORATION","NBR D'HEURE MAJORE","COUT MOYEN HORAIRE ANNUEL","SURCOUT HEURE SUP"]
[null,null,"DIMANCHE","2020-01-05",null,null,7,"VEHICULE 7","IMMAT XX 105",null,null,{"$f":"+(L29+L27)/2","v":"01:36:48"},{"$f":"+(M29+M27)/2","v":52.92},null,{"$f":"+(O29+O27)/2","v":53.978400000000008},null,null,{"$f":"+T25","v":0},{"$f":"+S25/R25","v":21.978021978021978},{"$f":"+S31*R31","v":0}]
[null,null,"LUNDI","2020-01-06",null,null,8,"VEHICULE 8","IMMAT XX 106",null,null,null,null,null,null,null,null,{"$f":"+T26","v":0},{"$f":"+S26/R26","v":21.978021978021978},{"$f":"+S32*R32","v":0}]
[null,null,"MARDI","2020-01-07",null,null,9,"VEHICULE 9","IMMAT XX 107",null,null,null,null,null,null,null,null,{"$f":"+T27","v":0},{"$f":"+S27/R27","v":21.978021978021978},{"$f":"+S33*R33","v":0}]
[null,null,"MERCREDI","2020-01-08",null,null,10,"VEHICULE 10","IMMAT XX 108",null,null,null,null,null,null,null,null,null,{"$f":"AVERAGE(S31:S33)","v":21.978021978021975},{"$f":"SUM(T31:T33)","v":0}]
[null,null,"JEUDI","2020-01-09",null,null,11,"VEHICULE 11","IMMAT XX 109"]
[null,null,"VENDREDI","2020-01-10",null,null,null,null,null,null,null,null,null,null,null,null,"COUT TOTAL ANNUEL","COUT HORAIRE TOTAL MOYEN ANNUEL"]
[null,null,"SAMEDI","2020-01-11",null,null,null,null,null,null,null,null,null,null,null,null,{"$f":"+T31+S25","v":40000},{"$f":"+Q37/R25","v":21.978021978021978}]
[null,null,"DIMANCHE","2020-01-12",null,null,null,null,null,null,null,null,null,null,null,null,{"$f":"+T32+S26","v":40000},{"$f":"+Q38/R26","v":21.978021978021978}]
[null,null,"LUNDI","2020-01-13",null,null,null,null,null,null,null,null,null,null,null,null,{"$f":"+T33+S27","v":40000},{"$f":"+Q39/R27","v":21.978021978021978}]
[null,null,"MARDI","2020-01-14",null,null,null,null,null,null,null,null,null,null,null,null,{"$f":"SUM(Q37:Q39)","v":120000},{"$f":"AVERAGE(R37:R39)","v":21.978021978021975}]
[null,null,"MERCREDI","2020-01-15"]
[null,null,"JEUDI","2020-01-16"]
[null,null,"VENDREDI","2020-01-17"]
[null,null,"SAMEDI","2020-01-18"]
[null,null,"DIMANCHE","2020-01-19"]
[null,null,"LUNDI","2020-01-20",null,null,null,null,null,null,null,"DECHARGEMENT"]
[null,null,"MARDI","2020-01-21",null,null,null,null,null,null,null,"TEMPS (% D'HEURE)","00:15:00","00:30:00","00:45:00","01:00:00","01:15:00","01:30:00","01:45:00","02:00:00","02:30:00","03:00:00","04:00:00"]
[null,null,"MERCREDI","2020-01-22",null,null,null,null,null,null,null,"COUT",{"$f":"+$R$40*M47*24","v":5.4945054945054936},10.989010989010987,16.483516483516482,21.978021978021975,27.47252747252745,32.967032967032964,38.461538461538474,43.956043956043935,54.945054945054942,65.934065934065927,87.912087912087898]
[null,null,"JEUDI","2020-01-23"]
[null,null,"VENDREDI","2020-01-24"]
[null,null,"SAMEDI","2020-01-25"]
[null,null,"DIMANCHE","2020-01-26"]
[null,null,"LUNDI","2020-01-27"]
[null,null,"MARDI","2020-01-28"]
[null,null,"MERCREDI","2020-01-29"]
[null,null,"JEUDI","2020-01-30"]
[null,null,"VENDREDI","2020-01-31"]
[null,null,"SAMEDI","2020-02-01"]
[null,null,"DIMANCHE","2020-02-02"]
[null,null,"LUNDI","2020-02-03"]
{"$rows_left_out":321}