{"text_format":"1","workbook":"xlsx","n_sheets":4,"sheets":["VILLES","COUT TR 2019","BD","PLANNING LIV"],"not_rendered":{"charts":0,"images":0,"macros":1,"external_links":0,"defined_names":7,"comments":0,"pivot_tables":0},"unopened":[],"bounds":{"document_bytes":16777216,"sheet_cells":100000,"rows_first":2000,"rows_last":500,"rows_between":2000,"halvings":0,"cell_chars":16384,"cell_head_chars":4096},"cells_cut":0,"cells_raw":0,"read":"whole","date_system":"1900"}

{"sheet":"VILLES","index":0,"n_rows":299,"n_cols":11,"rows_kept":299,"cut":false,"hidden":false,"merged":[]}
[]
[]
[null,null,"VILLE","KM",0.1,"KM A/R","KM A/R +10%","TEMPS",0.2,"TEMPS A/R","TEMPS A/R +20%"]
[null,null,"VILLE 1",20,22,40,44,"00:37:00","00:44:24","01:14:00","01:28:48"]
[null,null,"VILLE 2",36.5,40.150000000000006,73,80.300000000000011,"00:57:00","01:08:24","01:54:00","02:16:48"]
[null,null,"VILLE 3",25.2,27.720000000000002,50.4,55.440000000000005,"00:44:00","00:52:48","01:28:00","01:45:36"]
[null,null,"VILLE 4",25.3,27.830000000000002,50.6,55.660000000000004,"00:42:00","00:50:24","01:24:00","01:40:48"]
[null,null,"VILLE 5",25,27.500000000000004,50,55.000000000000007,"00:40:00","00:48:00","01:20:00","01:36:00"]
[null,null,"VILLE 6",15.4,16.940000000000001,30.8,33.880000000000003,"00:30:00","00:36:00","01:00:00","01:12:00"]
[null,null,"VILLE 7",38.200000000000003,42.02,76.400000000000006,84.04,"00:59:00","01:10:48","01:58:00","02:21:36"]
[null,null,"VILLE 8",31.7,34.870000000000005,63.4,69.740000000000009,"00:50:00","01:00:00","01:40:00","02:00:00"]
[null,null,"VILLE 9",101.4,111.54000000000002,202.8,223.08000000000004,"02:01:00","02:25:12","04:02:00","04:50:24"]
[null,null,"VILLE 10",66.3,72.930000000000007,132.6,145.86000000000001,"01:19:00","01:34:48","02:38:00","03:09:36"]
[null,null,"VILLE 11",25.2,27.720000000000002,50.4,55.440000000000005,"00:44:00","00:52:48","01:28:00","01:45:36"]
[null,null,"VILLE 12",28.4,31.240000000000002,56.8,62.480000000000004,"00:49:00","00:58:48","01:38:00","01:57:36"]
[null,null,"VILLE 13",16,17.600000000000001,32,35.200000000000003,"00:08:00","00:09:36","00:16:00","00:19:12"]
[null,null,"VILLE 14",43.8,48.18,87.6,96.36,"01:00:00","01:12:00","02:00:00","02:24:00"]
[null,null,"VILLE 15",12,13.200000000000001,24,26.400000000000002,"00:22:00","00:26:24","00:44:00","00:52:48"]
[null,null,"VILLE 16",40.299999999999997,44.33,80.599999999999994,88.66,"01:08:00","01:21:36","02:16:00","02:43:12"]
[null,null,"VILLE 17",29.1,32.010000000000005,58.2,64.02000000000001,"00:51:00","01:01:12","01:42:00","02:02:24"]
[null,null,"VILLE 18",24.7,27.17,49.4,54.34,"00:40:00","00:48:00","01:20:00","01:36:00"]
[null,null,"VILLE 19",39.700000000000003,43.670000000000009,79.400000000000006,87.340000000000018,"00:57:00","01:08:24","01:54:00","02:16:48"]
[null,null,"VILLE 20",18,19.8,36,39.6,"00:30:00","00:36:00","01:00:00","01:12:00"]
[null,null,"VILLE 21",32.6,35.860000000000007,65.2,71.720000000000013,"00:58:00","01:09:36","01:56:00","02:19:12"]
[null,null,"VILLE 22",16.3,17.930000000000003,32.6,35.860000000000007,"00:31:00","00:37:12","01:02:00","01:14:24"]
[null,null,"VILLE 23",15,16.5,30,33,"00:25:00","00:30:00","00:50:00","01:00:00"]
[null,null,"VILLE 24",17.899999999999999,19.690000000000001,35.799999999999997,39.380000000000003,"00:34:00","00:40:48","01:08:00","01:21:36"]
[null,null,"VILLE 25",31,34.1,62,68.2,"00:56:00","01:07:12","01:52:00","02:14:24"]
[null,null,"VILLE 26",49.9,54.89,99.8,109.78,"01:14:00","01:28:48","02:28:00","02:57:36"]
[null,null,"VILLE 27",18.399999999999999,20.239999999999998,36.799999999999997,40.479999999999997,"00:35:00","00:42:00","01:10:00","01:24:00"]
[null,null,"VILLE 28",92.5,101.75000000000001,185,203.50000000000003,"01:45:00","02:06:00","03:30:00","04:12:00"]
[null,null,"VILLE 29",28.9,31.790000000000003,57.8,63.580000000000005,"00:51:00","01:01:12","01:42:00","02:02:24"]
[null,null,"VILLE 30",64.599999999999994,71.06,129.19999999999999,142.12,"01:16:00","01:31:12","02:32:00","03:02:24"]
[null,null,"VILLE 31",58.7,64.570000000000007,117.4,129.14000000000001,"01:39:00","01:58:48","03:18:00","03:57:36"]
[null,null,"VILLE 32",75,82.5,150,165,"01:30:00","01:48:00","03:00:00","03:36:00"]
[null,null,"VILLE 33",70,77,140,154,"01:30:00","01:48:00","03:00:00","03:36:00"]
[null,null,"VILLE 34",12,13.200000000000001,24,26.400000000000002,"00:16:00","00:19:12","00:32:00","00:38:24"]
[null,null,"VILLE 35",6,6.6000000000000005,12,13.200000000000001,"00:10:00","00:12:00","00:20:00","00:24:00"]
[null,null,"VILLE 36",37.299999999999997,41.03,74.599999999999994,82.06,"01:02:00","01:14:24","02:04:00","02:28:48"]
[null,null,"VILLE 37",35.5,39.050000000000004,71,78.100000000000009,"00:55:00","01:06:00","01:50:00","02:12:00"]
[null,null,"VILLE 38",52.5,57.750000000000007,105,115.50000000000001,"01:06:00","01:19:12","02:12:00","02:38:24"]
[null,null,"VILLE 39",34,37.400000000000006,68,74.800000000000011,"01:00:00","01:12:00","02:00:00","02:24:00"]
[null,null,"VILLE 40",29.3,32.230000000000004,58.6,64.460000000000008,"00:46:00","00:55:12","01:32:00","01:50:24"]
[null,null,"VILLE 41",34.200000000000003,37.620000000000005,68.400000000000006,75.240000000000009,"00:53:00","01:03:36","01:46:00","02:07:12"]
[null,null,"VILLE 42",69.400000000000006,76.340000000000018,138.80000000000001,152.68000000000004,"01:19:00","01:34:48","02:38:00","03:09:36"]
[null,null,"VILLE 43",21.5,23.650000000000002,43,47.300000000000004,"00:36:00","00:43:12","01:12:00","01:26:24"]
[null,null,"VILLE 44",51.8,56.980000000000004,103.6,113.96000000000001,"01:11:00","01:25:12","02:22:00","02:50:24"]
[null,null,"VILLE 45",86.5,95.15,173,190.3,"01:38:00","01:57:36","03:16:00","03:55:12"]
[null,null,"VILLE 46",75.099999999999994,82.61,150.19999999999999,165.22,"01:33:00","01:51:36","03:06:00","03:43:12"]
[null,null,"VILLE 47",8,8.8000000000000007,16,17.600000000000001,"00:13:00","00:15:36","00:26:00","00:31:12"]
[null,null,"VILLE 48",20.399999999999999,22.44,40.799999999999997,44.88,"00:40:00","00:48:00","01:20:00","01:36:00"]
[null,null,"VILLE 49",67,73.7,134,147.4,"01:17:00","01:32:24","02:34:00","03:04:48"]
[null,null,"VILLE 50",34,37.400000000000006,68,74.800000000000011,"00:53:00","01:03:36","01:46:00","02:07:12"]
[null,null,"VILLE 51",41,45.1,82,90.2,"00:54:00","01:04:48","01:48:00","02:09:36"]
[null,null,"VILLE 52",25.6,28.160000000000004,51.2,56.320000000000007,"00:44:00","00:52:48","01:28:00","01:45:36"]
[null,null,"VILLE 53",30.5,33.550000000000004,61,67.100000000000009,"00:53:00","01:03:36","01:46:00","02:07:12"]
[null,null,"VILLE 54",5.3,5.83,10.6,11.66,"00:12:00","00:14:24","00:24:00","00:28:48"]
[null,null,"VILLE 55",98,107.80000000000001,196,215.60000000000002,"02:06:00","02:31:12","04:12:00","05:02:24"]
[null,null,"VILLE 56",54,59.400000000000006,108,118.80000000000001,"01:02:00","01:14:24","02:04:00","02:28:48"]
[null,null,"VILLE 57",19.3,21.230000000000004,38.6,42.460000000000008,"00:38:00","00:45:36","01:16:00","01:31:12"]
[null,null,"VILLE 58",33.6,36.960000000000008,67.2,73.920000000000016,"01:00:00","01:12:00","02:00:00","02:24:00"]
[null,null,"VILLE 59",30,33,60,66,"00:45:00","00:54:00","01:30:00","01:48:00"]
[null,null,"VILLE 60",9.6999999999999993,10.67,19.399999999999999,21.34,"00:20:00","00:24:00","00:40:00","00:48:00"]
[null,null,"VILLE 61",82,90.2,164,180.4,"01:30:00","01:48:00","03:00:00","03:36:00"]
[null,null,"VILLE 62",30,33,60,66,"00:47:00","00:56:24","01:34:00","01:52:48"]
[null,null,"VILLE 63",60.8,66.88,121.6,133.76,"01:16:00","01:31:12","02:32:00","03:02:24"]
[null,null,"VILLE 64",31.1,34.21,62.2,68.42,"00:57:00","01:08:24","01:54:00","02:16:48"]
[null,null,"VILLE 65",34.4,37.840000000000003,68.8,75.680000000000007,"01:02:00","01:14:24","02:04:00","02:28:48"]
[null,null,"VILLE 66",21,23.1,42,46.2,"00:34:00","00:40:48","01:08:00","01:21:36"]
[null,null,"VILLE 67",73,80.300000000000011,146,160.60000000000002,"01:28:00","01:45:36","02:56:00","03:31:12"]
[null,null,"VILLE 68",51.8,56.980000000000004,103.6,113.96000000000001,"01:25:00","01:42:00","02:50:00","03:24:00"]
[null,null,"VILLE 69",64,70.400000000000006,128,140.80000000000001,"01:33:00","01:51:36","03:06:00","03:43:12"]
[null,null,"VILLE 70",36,39.6,72,79.2,"01:00:00","01:12:00","02:00:00","02:24:00"]
[null,null,"VILLE 71",37,40.700000000000003,74,81.400000000000006,"00:57:00","01:08:24","01:54:00","02:16:48"]
[null,null,"VILLE 72",40,44,80,88,"00:58:00","01:09:36","01:56:00","02:19:12"]
[null,null,"VILLE 73",19,20.900000000000002,38,41.800000000000004,"00:29:00","00:34:48","00:58:00","01:09:36"]
[null,null,"VILLE 74",30.6,33.660000000000004,61.2,67.320000000000007,"00:55:00","01:06:00","01:50:00","02:12:00"]
[null,null,"VILLE 75",81,89.100000000000009,162,178.20000000000002,"01:24:00","01:40:48","02:48:00","03:21:36"]
[null,null,"VILLE 76",23,25.3,46,50.6,"00:42:00","00:50:24","01:24:00","01:40:48"]
[null,null,"VILLE 77",38.799999999999997,42.68,77.599999999999994,85.36,"01:09:00","01:22:48","02:18:00","02:45:36"]
[null,null,"VILLE 78",69,75.900000000000006,138,151.80000000000001,"01:27:00","01:44:24","02:54:00","03:28:48"]
[null,null,"VILLE 79",9.6999999999999993,10.67,19.399999999999999,21.34,"00:16:00","00:19:12","00:32:00","00:38:24"]
[null,null,"VILLE 80",74,81.400000000000006,148,162.80000000000001,"01:29:00","01:46:48","02:58:00","03:33:36"]
[null,null,"VILLE 81",24.3,26.730000000000004,48.6,53.460000000000008,"00:41:00","00:49:12","01:22:00","01:38:24"]
[null,null,"VILLE 82",36.6,40.260000000000005,73.2,80.52000000000001,"01:05:00","01:18:00","02:10:00","02:36:00"]
[null,null,"VILLE 83",36.200000000000003,39.820000000000007,72.400000000000006,79.640000000000015,"01:02:00","01:14:24","02:04:00","02:28:48"]
[null,null,"VILLE 84",18.100000000000001,19.910000000000004,36.200000000000003,39.820000000000007,"00:35:00","00:42:00","01:10:00","01:24:00"]
[null,null,"VILLE 85",15,16.5,30,33,"00:25:00","00:30:00","00:50:00","01:00:00"]
[null,null,"VILLE 86",61,67.100000000000009,122,134.20000000000002,"01:13:00","01:27:36","02:26:00","02:55:12"]
[null,null,"VILLE 87",14,15.400000000000002,28,30.800000000000004,"00:21:00","00:25:12","00:42:00","00:50:24"]
[null,null,"VILLE 88",15.6,17.16,31.2,34.32,"00:31:00","00:37:12","01:02:00","01:14:24"]
[null,null,"VILLE 89",11.8,12.980000000000002,23.6,25.960000000000004,"00:23:00","00:27:36","00:46:00","00:55:12"]
[null,null,"VILLE 90",49.7,54.670000000000009,99.4,109.34000000000002,"01:10:00","01:24:00","02:20:00","02:48:00"]
[null,null,"VILLE 91",26.5,29.150000000000002,53,58.300000000000004,"00:45:00","00:54:00","01:30:00","01:48:00"]
[null,null,"VILLE 92",52,57.2,104,114.4,"01:08:00","01:21:36","02:16:00","02:43:12"]
[null,null,"VILLE 93",11,12.100000000000001,22,24.200000000000003,"00:18:00","00:21:36","00:36:00","00:43:12"]
[null,null,"VILLE 94",33.700000000000003,37.070000000000007,67.400000000000006,74.140000000000015,"01:00:00","01:12:00","02:00:00","02:24:00"]
[null,null,"VILLE 95",17.8,19.580000000000002,35.6,39.160000000000004,"00:35:00","00:42:00","01:10:00","01:24:00"]
[null,null,"VILLE 96",2.5,2.75,5,5.5,"00:05:00","00:06:00","00:10:00","00:12:00"]
[null,null,"VILLE 97",66,72.600000000000009,132,145.20000000000002,"01:16:00","01:31:12","02:32:00","03:02:24"]
[null,null,"VILLE 98",70,77,140,154,"01:20:00","01:36:00","02:40:00","03:12:00"]
[null,null,"VILLE 99",46,50.6,92,101.2,"01:12:00","01:26:24","02:24:00","02:52:48"]
[null,null,"VILLE 100",65,71.5,130,143,"01:20:00","01:36:00","02:40:00","03:12:00"]
[null,null,"VILLE 101",43,47.300000000000004,86,94.600000000000009,"00:55:00","01:06:00","01:50:00","02:12:00"]
[null,null,"VILLE 102",49.3,54.230000000000004,98.6,108.46000000000001,"01:22:00","01:38:24","02:44:00","03:16:48"]
[null,null,"VILLE 103",52,57.2,104,114.4,"01:27:00","01:44:24","02:54:00","03:28:48"]
[null,null,"VILLE 104",81,89.100000000000009,162,178.20000000000002,"01:32:00","01:50:24","03:04:00","03:40:48"]
[null,null,"VILLE 105",74,81.400000000000006,148,162.80000000000001,"01:31:00","01:49:12","03:02:00","03:38:24"]
[null,null,"VILLE 106",28.1,30.910000000000004,56.2,61.820000000000007,"00:44:00","00:52:48","01:28:00","01:45:36"]
[null,null,"VILLE 107",2,2.2000000000000002,4,4.4000000000000004,"00:05:00","00:06:00","00:10:00","00:12:00"]
[null,null,"VILLE 108",31.3,34.430000000000007,62.6,68.860000000000014,"00:55:00","01:06:00","01:50:00","02:12:00"]
[null,null,"VILLE 109",39.5,43.45,79,86.9,"01:00:00","01:12:00","02:00:00","02:24:00"]
[null,null,"VILLE 110",45,49.500000000000007,90,99.000000000000014,"01:11:00","01:25:12","02:22:00","02:50:24"]
[null,null,"VILLE 111",24.7,27.17,49.4,54.34,"00:44:00","00:52:48","01:28:00","01:45:36"]
[null,null,"VILLE 112",81,89.100000000000009,162,178.20000000000002,"01:24:00","01:40:48","02:48:00","03:21:36"]
[null,null,"VILLE 113",34,37.400000000000006,68,74.800000000000011,"00:53:00","01:03:36","01:46:00","02:07:12"]
[null,null,"VILLE 114",17.899999999999999,19.690000000000001,35.799999999999997,39.380000000000003,"00:35:00","00:42:00","01:10:00","01:24:00"]
[null,null,"VILLE 115",49,53.900000000000006,98,107.80000000000001,"01:07:00","01:20:24","02:14:00","02:40:48"]
[null,null,"VILLE 116",70,77,140,154,"01:20:00","01:36:00","02:40:00","03:12:00"]
[null,null,"VILLE 117",45.3,49.83,90.6,99.66,"01:08:00","01:21:36","02:16:00","02:43:12"]
[null,null,"VILLE 118",66,72.600000000000009,132,145.20000000000002,"01:15:00","01:30:00","02:30:00","03:00:00"]
[null,null,"VILLE 119",26.9,29.59,53.8,59.18,"00:46:00","00:55:12","01:32:00","01:50:24"]
[null,null,"VILLE 120",34,37.400000000000006,68,74.800000000000011,"00:53:00","01:03:36","01:46:00","02:07:12"]
[null,null,"VILLE 121",30.9,33.99,61.8,67.98,"00:53:00","01:03:36","01:46:00","02:07:12"]
[null,null,"VILLE 122",41,45.1,82,90.2,"01:01:00","01:13:12","02:02:00","02:26:24"]
[null,null,"VILLE 123",70,77,140,154,"01:20:00","01:36:00","02:40:00","03:12:00"]
[null,null,"VILLE 124",26,28.6,52,57.2,"00:44:00","00:52:48","01:28:00","01:45:36"]
[null,null,"VILLE 125",33,36.300000000000004,66,72.600000000000009,"00:49:00","00:58:48","01:38:00","01:57:36"]
[null,null,"VILLE 126",11,12.100000000000001,22,24.200000000000003,"00:22:00","00:26:24","00:44:00","00:52:48"]
[null,null,"VILLE 127",54,59.400000000000006,108,118.80000000000001,"01:05:00","01:18:00","02:10:00","02:36:00"]
[null,null,"VILLE 128",94,103.4,188,206.8,"02:00:00","02:24:00","04:00:00","04:48:00"]
[null,null,"VILLE 129",78,85.800000000000011,156,171.60000000000002,"01:34:00","01:52:48","03:08:00","03:45:36"]
[null,null,"VILLE 130",73,80.300000000000011,146,160.60000000000002,"01:21:00","01:37:12","02:42:00","03:14:24"]
[null,null,"VILLE 131",88,96.800000000000011,176,193.60000000000002,"01:41:00","02:01:12","03:22:00","04:02:24"]
[null,null,"VILLE 132",42.4,46.64,84.8,93.28,"01:10:00","01:24:00","02:20:00","02:48:00"]
[null,null,"VILLE 133",72,79.2,144,158.4,"01:24:00","01:40:48","02:48:00","03:21:36"]
[null,null,"VILLE 134",37,40.700000000000003,74,81.400000000000006,"00:54:00","01:04:48","01:48:00","02:09:36"]
[null,null,"VILLE 135",17,18.700000000000003,34,37.400000000000006,"00:29:00","00:34:48","00:58:00","01:09:36"]
[null,null,"VILLE 136",17,18.700000000000003,34,37.400000000000006,"00:29:00","00:34:48","00:58:00","01:09:36"]
[null,null,"VILLE 137",80,88,160,176,"01:27:00","01:44:24","02:54:00","03:28:48"]
[null,null,"VILLE 138",37,40.700000000000003,74,81.400000000000006,"00:59:00","01:10:48","01:58:00","02:21:36"]
[null,null,"VILLE 139",52,57.2,104,114.4,"01:00:00","01:12:00","02:00:00","02:24:00"]
[null,null,"VILLE 140",62,68.2,124,136.4,"01:14:00","01:28:48","02:28:00","02:57:36"]
[null,null,"VILLE 141",33.9,37.29,67.8,74.58,"00:59:00","01:10:48","01:58:00","02:21:36"]
[null,null,"VILLE 142",42,46.2,84,92.4,"00:56:00","01:07:12","01:52:00","02:14:24"]
[null,null,"VILLE 143",51,56.1,102,112.2,"01:23:00","01:39:36","02:46:00","03:19:12"]
[null,null,"VILLE 144",74,81.400000000000006,148,162.80000000000001,"01:42:00","02:02:24","03:24:00","04:04:48"]
[null,null,"VILLE 145",19.899999999999999,21.89,39.799999999999997,43.78,"00:39:00","00:46:48","01:18:00","01:33:36"]
[null,null,"VILLE 146",55,60.500000000000007,110,121.00000000000001,"01:11:00","01:25:12","02:22:00","02:50:24"]
[null,null,"VILLE 147",38.799999999999997,42.68,77.599999999999994,85.36,"01:03:00","01:15:36","02:06:00","02:31:12"]
[null,null,"VILLE 148",33.200000000000003,36.520000000000003,66.400000000000006,73.040000000000006,"00:56:00","01:07:12","01:52:00","02:14:24"]
[null,null,"VILLE 149",51,56.1,102,112.2,"01:14:00","01:28:48","02:28:00","02:57:36"]
[null,null,"VILLE 150",32.700000000000003,35.970000000000006,65.400000000000006,71.940000000000012,"01:50:00","02:12:00","03:40:00","04:24:00"]
[null,null,"VILLE 151",14,15.400000000000002,28,30.800000000000004,"00:23:00","00:27:36","00:46:00","00:55:12"]
[null,null,"VILLE 152",27,29.700000000000003,54,59.400000000000006,"00:43:00","00:51:36","01:26:00","01:43:12"]
[null,null,"VILLE 153",74,81.400000000000006,148,162.80000000000001,"01:33:00","01:51:36","03:06:00","03:43:12"]
[null,null,"VILLE 154",24,26.400000000000002,48,52.800000000000004,"00:36:00","00:43:12","01:12:00","01:26:24"]
[null,null,"VILLE 155",46,50.6,92,101.2,"01:04:00","01:16:48","02:08:00","02:33:36"]
[null,null,"VILLE 156",35,38.5,70,77,"00:54:00","01:04:48","01:48:00","02:09:36"]
[null,null,"VILLE 157",23.9,26.29,47.8,52.58,"00:40:00","00:48:00","01:20:00","01:36:00"]
[null,null,"VILLE 158",48,52.800000000000004,96,105.60000000000001,"01:02:00","01:14:24","02:04:00","02:28:48"]
[null,null,"VILLE 159",4,4.4000000000000004,8,8.8000000000000007,"00:08:00","00:09:36","00:16:00","00:19:12"]
[null,null,"VILLE 160",45.7,50.27000000000001,91.4,100.54000000000002,"01:03:00","01:15:36","02:06:00","02:31:12"]
[null,null,"VILLE 161",146,160.60000000000002,292,321.20000000000005,"02:35:00","03:06:00","05:10:00","06:12:00"]
[null,null,"VILLE 162",34,37.400000000000006,68,74.800000000000011,"01:10:00","01:24:00","02:20:00","02:48:00"]
[null,null,"VILLE 163",69.3,76.23,138.6,152.46,"01:17:00","01:32:24","02:34:00","03:04:48"]
[null,null,"VILLE 164",31,34.1,62,68.2,"00:45:00","00:54:00","01:30:00","01:48:00"]
[null,null,null,null,{"$f":"+D168*(1+$E$3)","v":0},{"$f":"+D168*2","v":0},{"$f":"+E168*2","v":0},null,{"$f":"+H168*(1+$I$3)","v":"00:00:00"},{"$f":"+H168*2","v":"00:00:00"},{"$f":"+I168*2","v":"00:00:00"}]
[null,null,null,null,0,0,0,null,"00:00:00","00:00:00","00:00:00"]
[null,null,null,null,0,0,0,null,"00:00:00","00:00:00","00:00:00"]
[null,null,null,null,0,0,0,null,"00:00:00","00:00:00","00:00:00"]
[null,null,null,null,0,0,0,null,"00:00:00","00:00:00","00:00:00"]
[null,null,null,null,0,0,0,null,"00:00:00","00:00:00","00:00:00"]
[null,null,null,null,0,0,0,null,"00:00:00","00:00:00","00:00:00"]
[null,null,null,null,0,0,0,null,"00:00:00","00:00:00","00:00:00"]
[null,null,null,null,0,0,0,null,"00:00:00","00:00:00","00:00:00"]
[null,null,null,null,0,0,0,null,"00:00:00","00:00:00","00:00:00"]
[null,null,null,null,0,0,0,null,"00:00:00","00:00:00","00:00:00"]
[null,null,null,null,0,0,0,null,"00:00:00","00:00:00","00:00:00"]
[null,null,null,null,0,0,0,null,"00:00:00","00:00:00","00:00:00"]
[null,null,null,null,0,0,0,null,"00:00:00","00:00:00","00:00:00"]
[null,null,null,null,0,0,0,null,"00:00:00","00:00:00","00:00:00"]
[null,null,null,null,0,0,0,null,"00:00:00","00:00:00","00:00:00"]
[null,null,null,null,0,0,0,null,"00:00:00","00:00:00","00:00:00"]
[null,null,null,null,0,0,0,null,"00:00:00","00:00:00","00:00:00"]
[null,null,null,null,0,0,0,null,"00:00:00","00:00:00","00:00:00"]
[null,null,null,null,0,0,0,null,"00:00:00","00:00:00","00:00:00"]
[null,null,null,null,0,0,0,null,"00:00:00","00:00:00","00:00:00"]
[null,null,null,null,0,0,0,null,"00:00:00","00:00:00","00:00:00"]
[null,null,null,null,0,0,0,null,"00:00:00","00:00:00","00:00:00"]
[null,null,null,null,0,0,0,null,"00:00:00","00:00:00","00:00:00"]
[null,null,null,null,0,0,0,null,"00:00:00","00:00:00","00:00:00"]
[null,null,null,null,0,0,0,null,"00:00:00","00:00:00","00:00:00"]
[null,null,null,null,0,0,0,null,"00:00:00","00:00:00","00:00:00"]
[null,null,null,null,0,0,0,null,"00:00:00","00:00:00","00:00:00"]
[null,null,null,null,0,0,0,null,"00:00:00","00:00:00","00:00:00"]
[null,null,null,null,0,0,0,null,{"$f":"+H197*(1+$I$3)","v":"00:00:00"},{"$f":"+H197*2","v":"00:00:00"},{"$f":"+I197*2","v":"00:00:00"}]
[null,null,null,null,{"$f":"+D198*(1+$E$3)","v":0},{"$f":"+D198*2","v":0},{"$f":"+E198*2","v":0},null,"00:00:00","00:00:00","00:00:00"]
[null,null,null,null,0,0,0,null,"00:00:00","00:00:00","00:00:00"]
[null,null,null,null,0,0,0,null,"00:00:00","00:00:00","00:00:00"]
[null,null,null,null,0,0,0,null,"00:00:00","00:00:00","00:00:00"]
[null,null,null,null,0,0,0,null,"00:00:00","00:00:00","00:00:00"]
[null,null,null,null,0,0,0,null,"00:00:00","00:00:00","00:00:00"]
[null,null,null,null,0,0,0,null,"00:00:00","00:00:00","00:00:00"]
[null,null,null,null,0,0,0,null,"00:00:00","00:00:00","00:00:00"]
[null,null,null,null,0,0,0,null,"00:00:00","00:00:00","00:00:00"]
[null,null,null,null,0,0,0,null,"00:00:00","00:00:00","00:00:00"]
[null,null,null,null,0,0,0,null,"00:00:00","00:00:00","00:00:00"]
[null,null,null,null,0,0,0,null,"00:00:00","00:00:00","00:00:00"]
[null,null,null,null,0,0,0,null,"00:00:00","00:00:00","00:00:00"]
[null,null,null,null,0,0,0,null,"00:00:00","00:00:00","00:00:00"]
[null,null,null,null,0,0,0,null,"00:00:00","00:00:00","00:00:00"]
[null,null,null,null,0,0,0,null,"00:00:00","00:00:00","00:00:00"]
[null,null,null,null,0,0,0,null,"00:00:00","00:00:00","00:00:00"]
[null,null,null,null,0,0,0,null,"00:00:00","00:00:00","00:00:00"]
[null,null,null,null,0,0,0,null,"00:00:00","00:00:00","00:00:00"]
[null,null,null,null,0,0,0,null,"00:00:00","00:00:00","00:00:00"]
[null,null,null,null,0,0,0,null,"00:00:00","00:00:00","00:00:00"]
[null,null,null,null,0,0,0,null,"00:00:00","00:00:00","00:00:00"]
[null,null,null,null,0,0,0,null,"00:00:00","00:00:00","00:00:00"]
[null,null,null,null,0,0,0,null,"00:00:00","00:00:00","00:00:00"]
[null,null,null,null,0,0,0,null,"00:00:00","00:00:00","00:00:00"]
[null,null,null,null,0,0,0,null,"00:00:00","00:00:00","00:00:00"]
[null,null,null,null,0,0,0,null,"00:00:00","00:00:00","00:00:00"]
[null,null,null,null,0,0,0,null,"00:00:00","00:00:00","00:00:00"]
[null,null,null,null,0,0,0,null,"00:00:00","00:00:00","00:00:00"]
[null,null,null,null,0,0,0,null,"00:00:00","00:00:00","00:00:00"]
[null,null,null,null,0,0,0,null,"00:00:00","00:00:00","00:00:00"]
[null,null,null,null,0,0,0,null,"00:00:00","00:00:00","00:00:00"]
[null,null,null,null,0,0,0,null,"00:00:00","00:00:00","00:00:00"]
[null,null,null,null,0,0,0,null,"00:00:00","00:00:00","00:00:00"]
[null,null,null,null,0,0,0,null,"00:00:00","00:00:00","00:00:00"]
[null,null,null,null,0,0,0,null,"00:00:00","00:00:00","00:00:00"]
[null,null,null,null,0,0,0,null,"00:00:00","00:00:00","00:00:00"]
[null,null,null,null,0,0,0,null,"00:00:00","00:00:00","00:00:00"]
[null,null,null,null,0,0,0,null,"00:00:00","00:00:00","00:00:00"]
[null,null,null,null,0,0,0,null,"00:00:00","00:00:00","00:00:00"]
[null,null,null,null,0,0,0,null,"00:00:00","00:00:00","00:00:00"]
[null,null,null,null,0,0,0,null,"00:00:00","00:00:00","00:00:00"]
[null,null,null,null,0,0,0,null,"00:00:00","00:00:00","00:00:00"]
[null,null,null,null,0,0,0,null,"00:00:00","00:00:00","00:00:00"]
[null,null,null,null,0,0,0,null,"00:00:00","00:00:00","00:00:00"]
[null,null,null,null,0,0,0,null,"00:00:00","00:00:00","00:00:00"]
[null,null,null,null,0,0,0,null,"00:00:00","00:00:00","00:00:00"]
[null,null,null,null,0,0,0,null,"00:00:00","00:00:00","00:00:00"]
[null,null,null,null,0,0,0,null,"00:00:00","00:00:00","00:00:00"]
[null,null,null,null,0,0,0,null,"00:00:00","00:00:00","00:00:00"]
[null,null,null,null,0,0,0,null,"00:00:00","00:00:00","00:00:00"]
[null,null,null,null,0,0,0,null,"00:00:00","00:00:00","00:00:00"]
[null,null,null,null,0,0,0,null,"00:00:00","00:00:00","00:00:00"]
[null,null,null,null,0,0,0,null,"00:00:00","00:00:00","00:00:00"]
[null,null,null,null,0,0,0,null,"00:00:00","00:00:00","00:00:00"]
[null,null,null,null,0,0,0,null,"00:00:00","00:00:00","00:00:00"]
[null,null,null,null,0,0,0,null,"00:00:00","00:00:00","00:00:00"]
[null,null,null,null,0,0,0,null,"00:00:00","00:00:00","00:00:00"]
[null,null,null,null,0,0,0,null,"00:00:00","00:00:00","00:00:00"]
[null,null,null,null,0,0,0,null,"00:00:00","00:00:00","00:00:00"]
[null,null,null,null,0,0,0,null,"00:00:00","00:00:00","00:00:00"]
[null,null,null,null,0,0,0,null,"00:00:00","00:00:00","00:00:00"]
[null,null,null,null,0,0,0,null,"00:00:00","00:00:00","00:00:00"]
[null,null,null,null,0,0,0,null,{"$f":"+H261*(1+$I$3)","v":"00:00:00"},{"$f":"+H261*2","v":"00:00:00"},{"$f":"+I261*2","v":"00:00:00"}]
[null,null,null,null,{"$f":"+D262*(1+$E$3)","v":0},{"$f":"+D262*2","v":0},{"$f":"+E262*2","v":0},null,"00:00:00","00:00:00","00:00:00"]
[null,null,null,null,0,0,0,null,"00:00:00","00:00:00","00:00:00"]
[null,null,null,null,0,0,0,null,"00:00:00","00:00:00","00:00:00"]
[null,null,null,null,0,0,0,null,"00:00:00","00:00:00","00:00:00"]
[null,null,null,null,0,0,0,null,"00:00:00","00:00:00","00:00:00"]
[null,null,null,null,0,0,0,null,"00:00:00","00:00:00","00:00:00"]
[null,null,null,null,0,0,0,null,"00:00:00","00:00:00","00:00:00"]
[null,null,null,null,0,0,0,null,"00:00:00","00:00:00","00:00:00"]
[null,null,null,null,0,0,0,null,"00:00:00","00:00:00","00:00:00"]
[null,null,null,null,0,0,0,null,"00:00:00","00:00:00","00:00:00"]
[null,null,null,null,0,0,0,null,"00:00:00","00:00:00","00:00:00"]
[null,null,null,null,0,0,0,null,"00:00:00","00:00:00","00:00:00"]
[null,null,null,null,0,0,0,null,"00:00:00","00:00:00","00:00:00"]
[null,null,null,null,0,0,0,null,"00:00:00","00:00:00","00:00:00"]
[null,null,null,null,0,0,0,null,"00:00:00","00:00:00","00:00:00"]
[null,null,null,null,0,0,0,null,"00:00:00","00:00:00","00:00:00"]
[null,null,null,null,0,0,0,null,"00:00:00","00:00:00","00:00:00"]
[null,null,null,null,0,0,0,null,"00:00:00","00:00:00","00:00:00"]
[null,null,null,null,0,0,0,null,"00:00:00","00:00:00","00:00:00"]
[null,null,null,null,0,0,0,null,"00:00:00","00:00:00","00:00:00"]
[null,null,null,null,0,0,0,null,"00:00:00","00:00:00","00:00:00"]
[null,null,null,null,0,0,0,null,"00:00:00","00:00:00","00:00:00"]
[null,null,null,null,0,0,0,null,"00:00:00","00:00:00","00:00:00"]
[null,null,null,null,0,0,0,null,"00:00:00","00:00:00","00:00:00"]
[null,null,null,null,0,0,0,null,"00:00:00","00:00:00","00:00:00"]
[null,null,null,null,0,{"$f":"+D287*2","v":0},{"$f":"+E287*2","v":0},null,"00:00:00",{"$f":"+H287*2","v":"00:00:00"},{"$f":"+I287*2","v":"00:00:00"}]
[null,null,null,null,0,0,0,null,"00:00:00","00:00:00","00:00:00"]
[null,null,null,null,0,0,0,null,"00:00:00","00:00:00","00:00:00"]
[null,null,null,null,0,0,0,null,"00:00:00","00:00:00","00:00:00"]
[null,null,null,null,0,0,0,null,"00:00:00","00:00:00","00:00:00"]
[null,null,null,null,0,0,0,null,"00:00:00","00:00:00","00:00:00"]
[null,null,null,null,0,0,0,null,"00:00:00","00:00:00","00:00:00"]
[null,null,null,null,0,0,0,null,"00:00:00","00:00:00","00:00:00"]
[null,null,null,null,0,0,0,null,"00:00:00","00:00:00","00:00:00"]
[null,null,null,null,0,0,0,null,"00:00:00","00:00:00","00:00:00"]
[null,null,null,null,0,0,0,null,"00:00:00","00:00:00","00:00:00"]
[null,null,null,null,0,0,0,null,"00:00:00","00:00:00","00:00:00"]
[null,null,null,null,0,0,0,null,"00:00:00","00:00:00","00:00:00"]

{"sheet":"COUT TR 2019","index":1,"n_rows":32,"n_cols":14,"rows_kept":32,"cut":false,"hidden":false,"merged":[[2,2,2,3],[20,5,20,6]]}
[]
[]
[null,null,2019]
[null,null,"CHARGE 1",8000,null,"AMORTISSEMENT","CHOIX DU VEHICULE",null,null,null,null,"COUT/AN/VEHICULE"]
[null,null,"CHARGE 2",8000,null,1,"VEHICULE 1","IMMAT XX 99",50000,5,{"$f":"+I5/J5","v":10000},{"$f":"+K5+$D$18","v":20400},{"$f":"+$K$32/$F$14","v":20000},{"$f":"+L5/M5","v":1.02}]
[null,null,"CHARGE 3",8000,null,2,"VEHICULE 2","IMMAT XX 100",50000,5,10000,20400,{"$f":"+$K$32/$F$14","v":20000},1.02]
[null,null,"CHARGE 4",8000,null,3,"VEHICULE 3","IMMAT XX 101",50000,5,10000,20400,20000,1.02]
[null,null,"CHARGE 5",8000,null,4,"VEHICULE 4","IMMAT XX 102",50000,5,10000,20400,20000,1.02]
[null,null,"CHARGE 6",8000,null,5,"VEHICULE 5","IMMAT XX 103",50000,5,10000,20400,20000,1.02]
[null,null,"CHARGE 7",8000,null,6,"VEHICULE 6","IMMAT XX 104",50000,5,10000,20400,20000,1.02]
[null,null,"CHARGE 8",8000,null,7,"VEHICULE 7","IMMAT XX 105",50000,5,10000,20400,20000,1.02]
[null,null,"CHARGE 9",8000,null,8,"VEHICULE 8","IMMAT XX 106",50000,5,10000,20400,20000,1.02]
[null,null,"CHARGE 10",8000,null,9,"VEHICULE 9","IMMAT XX 107",50000,5,10000,20400,20000,{"$f":"+L13/M13","v":1.02}]
[null,null,"CHARGE 11",8000,null,10,"VEHICULE 10","IMMAT XX 108",50000,5,10000,20400,20000,{"$f":"+L14/M14","v":1.02}]
[null,null,"CHARGE 12",8000,null,null,null,null,null,null,{"$f":"SUM(K5:K14)","v":100000},null,{"$f":"SUM(M5:M14)","v":200000}]
[null,null,"CHARGE 13",8000]
[null,null,"somme",{"$f":"SUM(D4:D16)","v":104000}]
[null,null,"par VEHICULE =",{"$f":"+D17/F14","v":10400}]
[]
[null,null,null,null,null,null,null,null,2019,2018]
[null,null,null,null,null,"KM",null,null,"KM PARCOURU"]
[null,null,null,null,null,1,"VEHICULE 1","IMMAT XX 99",100000,80000,{"$f":"+I22-J22","v":20000}]
[null,null,null,null,null,2,"VEHICULE 2","IMMAT XX 100",100000,80000,20000]
[null,null,null,null,null,3,"VEHICULE 3","IMMAT XX 101",100000,80000,20000]
[null,null,null,null,null,4,"VEHICULE 4","IMMAT XX 102",100000,80000,20000]
[null,null,null,null,null,5,"VEHICULE 5","IMMAT XX 103",100000,80000,20000]
[null,null,null,null,null,6,"VEHICULE 6","IMMAT XX 104",100000,80000,{"$f":"+I27-J27","v":20000}]
[null,null,null,null,null,7,"VEHICULE 7","IMMAT XX 105",100000,80000,20000]
[null,null,null,null,null,8,"VEHICULE 8","IMMAT XX 106",100000,80000,20000]
[null,null,null,null,null,9,"VEHICULE 9","IMMAT XX 107",100000,80000,20000]
[null,null,null,null,null,10,"VEHICULE 10","IMMAT XX 108",100000,80000,20000]
[null,null,null,null,null,null,null,null,null,null,{"$f":"SUM(K22:K31)","v":200000}]

{"sheet":"BD","index":2,"n_rows":166,"n_cols":9,"rows_kept":166,"cut":false,"hidden":false,"merged":[]}
["Choix1","Choix2","Choix3",null,"Choix1",null,"Choix1","Choix2"]
[{"$f":"+'PLANNING LIV'!D25","v":"2019-12-30"},"MATIN",{"$f":"+'PLANNING LIV'!C96","v":"CHAUFFEUR 1 dispo"},null,{"$f":"+A2","v":"2019-12-30"},null,{"$f":"+E2","v":"2019-12-30"},"MATIN"," "]
[{"$f":"+A2","v":"2019-12-30"},"MATIN",{"$f":"+'PLANNING LIV'!D96","v":"NON"},null,{"$f":"+E2+1","v":"2019-12-31"},null,{"$f":"+E2","v":"2019-12-30"},"APRES MIDI"," "]
[{"$f":"+A3","v":"2019-12-30"},"MATIN",{"$f":"+'PLANNING LIV'!E96","v":"NON"},null,{"$f":"+E3+1","v":"2020-01-01"},null,{"$f":"+G2+1","v":"2019-12-31"},"MATIN"," "]
["2019-12-30","APRES MIDI",{"$f":"+'PLANNING LIV'!C125","v":"NON"},null,"2020-01-02",null,{"$f":"+G3+1","v":"2019-12-31"},"APRES MIDI"," "]
["2019-12-30","APRES MIDI",{"$f":"+'PLANNING LIV'!D125","v":"NON"},null,"2020-01-03",null,{"$f":"+G4+1","v":"2020-01-01"},"MATIN"," "]
["2019-12-30","APRES MIDI",{"$f":"+'PLANNING LIV'!E125","v":"NON"},null,"2020-01-04",null,"2020-01-01","APRES MIDI"," "]
[{"$f":"+A2+1","v":"2019-12-31"},"MATIN",{"$f":"+'PLANNING LIV'!H96","v":"NON"},null,"2020-01-05",null,"2020-01-02","MATIN"," "]
[{"$f":"+A3+1","v":"2019-12-31"},"MATIN",{"$f":"+'PLANNING LIV'!I96","v":"NON"},null,"2020-01-06",null,"2020-01-02","APRES MIDI"," "]
["2019-12-31","MATIN",{"$f":"+'PLANNING LIV'!J96","v":"NON"},null,"2020-01-07",null,"2020-01-03","MATIN"," "]
["2019-12-31","APRES MIDI",{"$f":"+'PLANNING LIV'!H125","v":"NON"},null,"2020-01-08",null,"2020-01-03","APRES MIDI"," "]
["2019-12-31","APRES MIDI",{"$f":"+'PLANNING LIV'!I125","v":"NON"},null,"2020-01-09",null,"2020-01-04","MATIN"," "]
["2019-12-31","APRES MIDI",{"$f":"+'PLANNING LIV'!J125","v":"NON"},null,"2020-01-10",null,{"$f":"G2+7","v":"2020-01-06"},"MATIN"," "]
[{"$f":"+A8+1","v":"2020-01-01"},"MATIN",{"$f":"+'PLANNING LIV'!M96","v":"NON"},null,"2020-01-11",null,{"$f":"G3+7","v":"2020-01-06"},"APRES MIDI"," "]
["2020-01-01","MATIN",{"$f":"+'PLANNING LIV'!N96","v":"NON"},null,"2020-01-12",null,"2020-01-07","MATIN"]
["2020-01-01","MATIN",{"$f":"+'PLANNING LIV'!O96","v":"NON"},null,"2020-01-13",null,"2020-01-07","APRES MIDI"]
["2020-01-01","APRES MIDI",{"$f":"+'PLANNING LIV'!M125","v":"NON"},null,"2020-01-14",null,"2020-01-08","MATIN"]
["2020-01-01","APRES MIDI",{"$f":"+'PLANNING LIV'!N125","v":"NON"},null,"2020-01-15",null,"2020-01-08","APRES MIDI"]
["2020-01-01","APRES MIDI",{"$f":"+'PLANNING LIV'!O125","v":"NON"},null,"2020-01-16",null,"2020-01-09","MATIN"]
["2020-01-02","MATIN",{"$f":"+'PLANNING LIV'!R96","v":"NON"},null,"2020-01-17",null,"2020-01-09","APRES MIDI"]
["2020-01-02","MATIN",{"$f":"+'PLANNING LIV'!S96","v":"NON"},null,"2020-01-18",null,"2020-01-10","MATIN"]
["2020-01-02","MATIN",{"$f":"+'PLANNING LIV'!T96","v":"NON"},null,"2020-01-19",null,"2020-01-10","APRES MIDI"]
["2020-01-02","APRES MIDI",{"$f":"+'PLANNING LIV'!R125","v":"NON"},null,"2020-01-20",null,"2020-01-11","MATIN"]
["2020-01-02","APRES MIDI",{"$f":"+'PLANNING LIV'!S125","v":"NON"},null,"2020-01-21",null,{"$f":"G13+7","v":"2020-01-13"},"MATIN"]
["2020-01-02","APRES MIDI",{"$f":"+'PLANNING LIV'!T125","v":"NON"},null,"2020-01-22",null,{"$f":"G14+7","v":"2020-01-13"},"APRES MIDI"]
["2020-01-03","MATIN",{"$f":"+'PLANNING LIV'!W96","v":"NON"},null,"2020-01-23",null,"2020-01-14","MATIN"]
["2020-01-03","MATIN",{"$f":"+'PLANNING LIV'!X96","v":"NON"},null,"2020-01-24",null,"2020-01-14","APRES MIDI"]
["2020-01-03","MATIN",{"$f":"+'PLANNING LIV'!Y96","v":"NON"},null,"2020-01-25",null,"2020-01-15","MATIN"]
["2020-01-03","APRES MIDI",{"$f":"'PLANNING LIV'!W125","v":"NON"},null,"2020-01-26",null,"2020-01-15","APRES MIDI"]
["2020-01-03","APRES MIDI",{"$f":"'PLANNING LIV'!X125","v":"NON"},null,"2020-01-27",null,"2020-01-16","MATIN"]
["2020-01-03","APRES MIDI",{"$f":"'PLANNING LIV'!Y125","v":"NON"},null,"2020-01-28",null,"2020-01-16","APRES MIDI"]
["2020-01-04","MATIN",{"$f":"+'PLANNING LIV'!AB96","v":"NON"},null,"2020-01-29",null,"2020-01-17","MATIN"]
["2020-01-04","MATIN",{"$f":"+'PLANNING LIV'!AC96","v":"NON"},null,"2020-01-30",null,"2020-01-17","APRES MIDI"]
["2020-01-04","MATIN",{"$f":"+'PLANNING LIV'!AD96","v":"NON"},null,"2020-01-31",null,"2020-01-18","MATIN"]
[{"$f":"+A2+7","v":"2020-01-06"},"MATIN",{"$f":"'PLANNING LIV'!C156","v":"NON"},null,"2020-02-01",null,{"$f":"G24+7","v":"2020-01-20"},"MATIN"]
[{"$f":"+A35","v":"2020-01-06"},"MATIN",{"$f":"+'PLANNING LIV'!D156","v":"NON"},null,null,null,{"$f":"G25+7","v":"2020-01-20"},"APRES MIDI"]
[{"$f":"+A36","v":"2020-01-06"},"MATIN",{"$f":"+'PLANNING LIV'!E156","v":"NON"},null,null,null,"2020-01-21","MATIN"]
["2020-01-06","APRES MIDI",{"$f":"'PLANNING LIV'!C185","v":"NON"},null,null,null,"2020-01-21","APRES MIDI"]
["2020-01-06","APRES MIDI",{"$f":"'PLANNING LIV'!D185","v":"NON"},null,null,null,"2020-01-22","MATIN"]
["2020-01-06","APRES MIDI",{"$f":"'PLANNING LIV'!E185","v":"NON"},null,null,null,"2020-01-22","APRES MIDI"]
["2020-01-07","MATIN",{"$f":"'PLANNING LIV'!H156","v":"NON"},null,null,null,"2020-01-23","MATIN"]
["2020-01-07","MATIN",{"$f":"'PLANNING LIV'!I156","v":"NON"},null,null,null,"2020-01-23","APRES MIDI"]
["2020-01-07","MATIN",{"$f":"'PLANNING LIV'!J156","v":"NON"},null,null,null,"2020-01-24","MATIN"]
["2020-01-07","APRES MIDI",{"$f":"'PLANNING LIV'!H185","v":"NON"},null,null,null,"2020-01-24","APRES MIDI"]
["2020-01-07","APRES MIDI",{"$f":"'PLANNING LIV'!I185","v":"NON"},null,null,null,"2020-01-25","MATIN"]
["2020-01-07","APRES MIDI",{"$f":"'PLANNING LIV'!J185","v":"NON"},null,null,null,{"$f":"G35+7","v":"2020-01-27"},"MATIN"]
["2020-01-08","MATIN",{"$f":"'PLANNING LIV'!M156","v":"NON"},null,null,null,{"$f":"G36+7","v":"2020-01-27"},"APRES MIDI"]
["2020-01-08","MATIN",{"$f":"'PLANNING LIV'!N156","v":"NON"},null,null,null,"2020-01-28","MATIN"]
["2020-01-08","MATIN",{"$f":"'PLANNING LIV'!O156","v":"NON"},null,null,null,"2020-01-28","APRES MIDI"]
["2020-01-08","APRES MIDI",{"$f":"'PLANNING LIV'!M185","v":"NON"},null,null,null,"2020-01-29","MATIN"]
["2020-01-08","APRES MIDI",{"$f":"'PLANNING LIV'!N185","v":"NON"},null,null,null,"2020-01-29","APRES MIDI"]
["2020-01-08","APRES MIDI",{"$f":"'PLANNING LIV'!O185","v":"NON"},null,null,null,"2020-01-30","MATIN"]
["2020-01-09","MATIN",{"$f":"'PLANNING LIV'!R156","v":"NON"},null,null,null,"2020-01-30","APRES MIDI"]
["2020-01-09","MATIN",{"$f":"'PLANNING LIV'!S156","v":"NON"},null,null,null,"2020-01-31","MATIN"]
["2020-01-09","MATIN",{"$f":"+'PLANNING LIV'!T156","v":"NON"},null,null,null,"2020-01-31","APRES MIDI"]
["2020-01-09","APRES MIDI",{"$f":"'PLANNING LIV'!R185","v":"NON"},null,null,null,"2020-02-01","MATIN"]
["2020-01-09","APRES MIDI",{"$f":"+'PLANNING LIV'!S185","v":"NON"}]
["2020-01-09","APRES MIDI",{"$f":"+'PLANNING LIV'!T185","v":"NON"}]
["2020-01-10","MATIN",{"$f":"'PLANNING LIV'!W156","v":"NON"}]
["2020-01-10","MATIN",{"$f":"'PLANNING LIV'!X156","v":"NON"}]
["2020-01-10","MATIN",{"$f":"'PLANNING LIV'!Y156","v":"NON"}]
["2020-01-10","APRES MIDI",{"$f":"'PLANNING LIV'!W185","v":"NON"}]
["2020-01-10","APRES MIDI",{"$f":"'PLANNING LIV'!X185","v":"NON"}]
[{"$f":"+A58+1","v":"2020-01-10"},"APRES MIDI",{"$f":"'PLANNING LIV'!Y185","v":"NON"}]
["2020-01-11","MATIN",{"$f":"+'PLANNING LIV'!AB156","v":"NON"}]
["2020-01-11","MATIN",{"$f":"+'PLANNING LIV'!AC156","v":"NON"}]
["2020-01-11","MATIN",{"$f":"+'PLANNING LIV'!AD156","v":"NON"}]
[{"$f":"+A35+7","v":"2020-01-13"},"MATIN",{"$f":"'PLANNING LIV'!C215","v":"NON"}]
[{"$f":"+A68","v":"2020-01-13"},"MATIN",{"$f":"'PLANNING LIV'!D215","v":"NON"}]
[{"$f":"+A69","v":"2020-01-13"},"MATIN",{"$f":"'PLANNING LIV'!E215","v":"NON"}]
["2020-01-13","APRES MIDI",{"$f":"'PLANNING LIV'!C244","v":"NON"}]
["2020-01-13","APRES MIDI",{"$f":"'PLANNING LIV'!D244","v":"NON"}]
["2020-01-13","APRES MIDI",{"$f":"'PLANNING LIV'!E244","v":"NON"}]
[{"$f":"+A68+1","v":"2020-01-14"},"MATIN",{"$f":"'PLANNING LIV'!H215","v":"NON"}]
["2020-01-14","MATIN",{"$f":"'PLANNING LIV'!I215","v":"NON"}]
["2020-01-14","MATIN",{"$f":"'PLANNING LIV'!J215","v":"NON"}]
["2020-01-14","APRES MIDI",{"$f":"+'PLANNING LIV'!H244","v":"NON"}]
["2020-01-14","APRES MIDI",{"$f":"+'PLANNING LIV'!I244","v":"NON"}]
["2020-01-14","APRES MIDI",{"$f":"+'PLANNING LIV'!J244","v":"NON"}]
["2020-01-15","MATIN",{"$f":"+'PLANNING LIV'!M215","v":"NON"}]
["2020-01-15","MATIN",{"$f":"+'PLANNING LIV'!N215","v":"NON"}]
["2020-01-15","MATIN",{"$f":"+'PLANNING LIV'!O215","v":"NON"}]
["2020-01-15","APRES MIDI",{"$f":"+'PLANNING LIV'!M244","v":"NON"}]
["2020-01-15","APRES MIDI",{"$f":"+'PLANNING LIV'!N244","v":"NON"}]
["2020-01-15","APRES MIDI",{"$f":"'PLANNING LIV'!O244","v":"NON"}]
["2020-01-16","MATIN",{"$f":"+'PLANNING LIV'!R215","v":"NON"}]
["2020-01-16","MATIN",{"$f":"+'PLANNING LIV'!S215","v":"NON"}]
["2020-01-16","MATIN",{"$f":"+'PLANNING LIV'!T215","v":"NON"}]
["2020-01-16","APRES MIDI",{"$f":"+'PLANNING LIV'!R244","v":"NON"}]
["2020-01-16","APRES MIDI",{"$f":"+'PLANNING LIV'!S244","v":"NON"}]
["2020-01-16","APRES MIDI",{"$f":"+'PLANNING LIV'!T244","v":"NON"}]
["2020-01-17","MATIN",{"$f":"+'PLANNING LIV'!W215","v":"NON"}]
["2020-01-17","MATIN",{"$f":"+'PLANNING LIV'!X215","v":"NON"}]
["2020-01-17","MATIN",{"$f":"+'PLANNING LIV'!Y215","v":"NON"}]
["2020-01-17","APRES MIDI",{"$f":"+'PLANNING LIV'!W244","v":"NON"}]
["2020-01-17","APRES MIDI",{"$f":"+'PLANNING LIV'!X244","v":"NON"}]
["2020-01-17","APRES MIDI",{"$f":"+'PLANNING LIV'!Y244","v":"NON"}]
["2020-01-18","MATIN",{"$f":"+'PLANNING LIV'!AB215","v":"NON"}]
["2020-01-18","MATIN",{"$f":"+'PLANNING LIV'!AC215","v":"NON"}]
["2020-01-18","MATIN",{"$f":"+'PLANNING LIV'!AD215","v":"NON"}]
[{"$f":"+A68+7","v":"2020-01-20"},"MATIN",{"$f":"+'PLANNING LIV'!C274","v":"NON"}]
[{"$f":"+A101","v":"2020-01-20"},"MATIN",{"$f":"+'PLANNING LIV'!D274","v":"NON"}]
[{"$f":"+A102","v":"2020-01-20"},"MATIN",{"$f":"+'PLANNING LIV'!E274","v":"NON"}]
["2020-01-20","APRES MIDI",{"$f":"+'PLANNING LIV'!C303","v":"NON"}]
["2020-01-20","APRES MIDI",{"$f":"+'PLANNING LIV'!D303","v":"NON"}]
["2020-01-20","APRES MIDI",{"$f":"+'PLANNING LIV'!E303","v":"NON"}]
[{"$f":"+A101+1","v":"2020-01-21"},"MATIN",{"$f":"+'PLANNING LIV'!H274","v":"NON"}]
["2020-01-21","MATIN",{"$f":"+'PLANNING LIV'!I274","v":"NON"}]
["2020-01-21","MATIN",{"$f":"+'PLANNING LIV'!J274","v":"NON"}]
["2020-01-21","APRES MIDI",{"$f":"+'PLANNING LIV'!H303","v":"NON"}]
["2020-01-21","APRES MIDI",{"$f":"+'PLANNING LIV'!I303","v":"NON"}]
["2020-01-21","APRES MIDI",{"$f":"+'PLANNING LIV'!J303","v":"NON"}]
["2020-01-22","MATIN",{"$f":"+'PLANNING LIV'!M274","v":"NON"}]
["2020-01-22","MATIN",{"$f":"+'PLANNING LIV'!N274","v":"NON"}]
["2020-01-22","MATIN",{"$f":"+'PLANNING LIV'!O274","v":"NON"}]
["2020-01-22","APRES MIDI",{"$f":"+'PLANNING LIV'!M303","v":"NON"}]
["2020-01-22","APRES MIDI",{"$f":"+'PLANNING LIV'!N303","v":"NON"}]
["2020-01-22","APRES MIDI",{"$f":"+'PLANNING LIV'!O303","v":"NON"}]
["2020-01-23","MATIN",{"$f":"+'PLANNING LIV'!R274","v":"NON"}]
["2020-01-23","MATIN",{"$f":"+'PLANNING LIV'!S274","v":"NON"}]
["2020-01-23","MATIN",{"$f":"+'PLANNING LIV'!T274","v":"NON"}]
["2020-01-23","APRES MIDI",{"$f":"+'PLANNING LIV'!R303","v":"NON"}]
["2020-01-23","APRES MIDI",{"$f":"+'PLANNING LIV'!S303","v":"NON"}]
["2020-01-23","APRES MIDI",{"$f":"+'PLANNING LIV'!T303","v":"NON"}]
["2020-01-24","MATIN",{"$f":"+'PLANNING LIV'!W274","v":"NON"}]
["2020-01-24","MATIN",{"$f":"+'PLANNING LIV'!X274","v":"NON"}]
["2020-01-24","MATIN",{"$f":"+'PLANNING LIV'!Y274","v":"NON"}]
["2020-01-24","APRES MIDI",{"$f":"+'PLANNING LIV'!W303","v":"NON"}]
["2020-01-24","APRES MIDI",{"$f":"+'PLANNING LIV'!X303","v":"NON"}]
["2020-01-24","APRES MIDI",{"$f":"+'PLANNING LIV'!Y303","v":"NON"}]
["2020-01-25","MATIN",{"$f":"+'PLANNING LIV'!AB274","v":"NON"}]
["2020-01-25","MATIN",{"$f":"+'PLANNING LIV'!AC274","v":"NON"}]
["2020-01-25","MATIN",{"$f":"+'PLANNING LIV'!AD274","v":"NON"}]
[{"$f":"+A101+7","v":"2020-01-27"},"MATIN",{"$f":"+'PLANNING LIV'!C333","v":"NON"}]
[{"$f":"+A134","v":"2020-01-27"},"MATIN",{"$f":"+'PLANNING LIV'!D333","v":"NON"}]
[{"$f":"+A135","v":"2020-01-27"},"MATIN",{"$f":"+'PLANNING LIV'!E333","v":"NON"}]
["2020-01-27","APRES MIDI",{"$f":"+'PLANNING LIV'!C362","v":"NON"}]
["2020-01-27","APRES MIDI",{"$f":"+'PLANNING LIV'!D362","v":"NON"}]
["2020-01-27","APRES MIDI",{"$f":"+'PLANNING LIV'!E362","v":"NON"}]
[{"$f":"+A134+1","v":"2020-01-28"},"MATIN",{"$f":"+'PLANNING LIV'!H333","v":"NON"}]
["2020-01-28","MATIN",{"$f":"+'PLANNING LIV'!I333","v":"NON"}]
["2020-01-28","MATIN",{"$f":"+'PLANNING LIV'!J333","v":"NON"}]
["2020-01-28","APRES MIDI",{"$f":"+'PLANNING LIV'!H362","v":"NON"}]
["2020-01-28","APRES MIDI",{"$f":"+'PLANNING LIV'!I362","v":"NON"}]
["2020-01-28","APRES MIDI",{"$f":"+'PLANNING LIV'!J362","v":"NON"}]
["2020-01-29","MATIN",{"$f":"+'PLANNING LIV'!M333","v":"NON"}]
["2020-01-29","MATIN",{"$f":"+'PLANNING LIV'!N333","v":"NON"}]
["2020-01-29","MATIN",{"$f":"+'PLANNING LIV'!O333","v":"NON"}]
["2020-01-29","APRES MIDI",{"$f":"+'PLANNING LIV'!M362","v":"NON"}]
["2020-01-29","APRES MIDI",{"$f":"+'PLANNING LIV'!N362","v":"NON"}]
["2020-01-29","APRES MIDI",{"$f":"+'PLANNING LIV'!O362","v":"NON"}]
["2020-01-30","MATIN",{"$f":"+'PLANNING LIV'!R333","v":"NON"}]
["2020-01-30","MATIN",{"$f":"+'PLANNING LIV'!S333","v":"NON"}]
["2020-01-30","MATIN",{"$f":"+'PLANNING LIV'!T333","v":"NON"}]
["2020-01-30","APRES MIDI",{"$f":"+'PLANNING LIV'!R362","v":"NON"}]
["2020-01-30","APRES MIDI",{"$f":"+'PLANNING LIV'!S362","v":"NON"}]
["2020-01-30","APRES MIDI",{"$f":"+'PLANNING LIV'!T362","v":"NON"}]
["2020-01-31","MATIN",{"$f":"+'PLANNING LIV'!W333","v":"NON"}]
["2020-01-31","MATIN",{"$f":"+'PLANNING LIV'!X333","v":"NON"}]
["2020-01-31","MATIN",{"$f":"+'PLANNING LIV'!Y333","v":"NON"}]
["2020-01-31","APRES MIDI",{"$f":"+'PLANNING LIV'!W362","v":"NON"}]
["2020-01-31","APRES MIDI",{"$f":"+'PLANNING LIV'!X362","v":"NON"}]
["2020-01-31","APRES MIDI",{"$f":"+'PLANNING LIV'!Y362","v":"NON"}]
["2020-02-01","MATIN",{"$f":"+'PLANNING LIV'!AB333","v":"NON"}]
["2020-02-01","MATIN",{"$f":"+'PLANNING LIV'!AC333","v":"NON"}]
["2020-02-01","MATIN",{"$f":"+'PLANNING LIV'!AD333","v":"NON"}]

{"sheet":"PLANNING LIV","index":3,"n_rows":381,"n_cols":30,"rows_kept":381,"cut":false,"hidden":false,"merged":[[1,1,1,4],[92,8,92,9],[92,6,92,7],[92,3,92,4],[92,1,92,2],[3,1,6,1],[92,28,92,29],[92,26,92,27],[92,23,92,24],[92,21,92,22],[92,18,92,19],[92,16,92,17],[92,13,92,14],[92,11,92,12],[3,6,4,6],[3,7,4,7],[121,21,121,22],[121,23,121,24],[121,1,121,2],[121,3,121,4],[121,6,121,7],[121,8,121,9],[121,11,121,12],[121,13,121,14],[121,16,121,17],[121,18,121,19],[152,16,152,17],[152,18,152,19],[152,21,152,22],[152,23,152,24],[152,26,152,27],[152,28,152,29],[152,1,152,2],[152,3,152,4],[152,6,152,7],[152,8,152,9],[152,11,152,12],[152,13,152,14],[181,23,181,24],[240,23,240,24],[240,21,240,22],[240,18,240,19],[240,16,240,17],[181,1,181,2],[181,3,181,4],[181,6,181,7],[181,8,181,9],[181,11,181,12],[181,13,181,14],[240,13,240,14],[240,11,240,12],[240,8,240,9],[240,6,240,7],[240,3,240,4],[240,1,240,2],[181,16,181,17],[181,18,181,19],[181,21,181,22],[211,13,211,14],[211,11,211,12],[211,8,211,9],[211,6,211,7],[270,6,270,7],[270,3,270,4],[299,8,299,9],[299,6,299,7],[299,3,299,4],[211,3,211,4],[211,1,211,2],[211,28,211,29],[211,26,211,27],[211,23,211,24],[211,21,211,22],[211,18,211,19],[211,16,211,17],[270,28,270,29],[270,26,270,27],[270,23,270,24],[270,21,270,22],[270,18,270,19],[270,16,270,17],[270,1,270,2],[329,28,329,29],[329,26,329,27],[329,23,329,24],[329,21,329,22],[329,18,329,19],[329,16,329,17],[329,1,329,2],[299,23,299,24],[299,21,299,22],[299,18,299,19],[299,16,299,17],[358,1,358,2],[358,13,358,14],[358,11,358,12],[23,10,23,14],[25,10,30,10],[45,11,45,15],[358,23,358,24],[358,21,358,22],[358,18,358,19],[358,16,358,17],[329,13,329,14],[329,11,329,12],[329,8,329,9],[329,6,329,7],[329,3,329,4],[358,8,358,9],[358,6,358,7],[358,3,358,4],[299,1,299,2],[299,13,299,14],[299,11,299,12],[270,13,270,14],[270,11,270,12],[270,8,270,9]]}
[]
[null,"OUTIL CALCUL LIVRAISON",null,null,null,null,"N°: COMMANDE:","commande n°: 999","PRIX MINI:","TTC"]
[null,null,"LIBELLE","ZONE CHOIX","ZONE CALCUL",null,"VILLE:","*ville*3",{"$f":"+'PLANNING LIV'!O27+('PLANNING LIV'!$R$40*'PLANNING LIV'!L27*24)+(H4*'PLANNING LIV'!$R$40*24)","v":105.62045421245419},{"$f":"+I3*1.196","v":126.32206323809521}]
[null,1,"CHOIX DU JOUR:","2019-12-30","HEURE DE DEPART:",null,"TEMPS DECHARGEMENT ESTIME","01:00:00","PRIX MAXI:","TTC"]
[null,null,"MATIN OU APRES MIDI","MATIN","08:00:00",null,null,null,{"$f":"+'PLANNING LIV'!O29+('PLANNING LIV'!$R$40*'PLANNING LIV'!L29*24)+(H4*'PLANNING LIV'!$R$40*24)","v":117.20814065934066},{"$f":"+I5*1.196","v":140.18093622857143}]
[null,null,"CHOIX DU CHAUFFEUR:","CHAUFFEUR 1 dispo","HEURE DE RETOUR:",null,"VEHICULE CHOISI:","VEHICULE 1","PRIX MOYEN:","TTC"]
[null,null,null,null,{"$f":"ROUNDUP(((+E5+'PLANNING LIV'!L31+H4)*4*24),0)/4/24","v":"10:45:00"},null,"IMMATRICULATION:",{"$f":"VLOOKUP(H6,'PLANNING LIV'!H25:I35,2,FALSE)","v":"IMMAT XX 99"},{"$f":"+'PLANNING LIV'!O31+('PLANNING LIV'!$R$40*'PLANNING LIV'!L31*24)+(H4*'PLANNING LIV'!$R$40*24)","v":111.41429743589744},{"$f":"+I7*1.196","v":133.25149973333333}]
[]
[]
[null,null,"CHOIX DU CHAUFFEUR","TACHE",null,null,null,"CHOIX DU TPS DE DECHARGEMENT"]
[null,null,"CHAUFFEUR 1",null,null,null,null,"00:15:00"]
[null,null,"CHAUFFEUR 2","TACHE 1",null,null,null,"00:30:00"]
[null,null,"CHAUFFEUR 3","TACHE 2",null,null,null,"00:45:00"]
[null,null,"CHAUFFEUR 4","TACHE 3",null,null,null,"01:00:00"]
[null,null,null,"TACHE 4",null,null,null,"01:15:00"]
[null,null,null,"TACHE 5",null,null,null,"01:30:00"]
[null,null,null,"TACHE 6",null,null,null,"01:45:00"]
[null,null,null,"TACHE 7",null,null,null,"02:00:00"]
[null,null,null,"TACHE 8",null,null,null,"02:30:00"]
[null,null,null,null,null,null,null,"03:00:00"]
[null,null,"MATIN","APRES MIDI",null,null,null,"04:00:00"]
[]
[]
[null,null,"jour","DATE",null,null,"N°:","CHOIX DU VEHICULE","IMMAT",null,"CALCUL cout livraison",null,null,null,null,null,"CHAUFFEUR","NBR HEURES TRAVAILLEES","RENUMERATION ANNUELLE","NBR D'HEURES A RECUPERER"]
[null,null,"LUNDI","2019-12-30",null,null,1,"VEHICULE 1","IMMAT XX 99",null,null,"tps","KM MOYEN:","vehicule","HT",null,"CHAUFFEUR 1 JANTON",1820,40000]
[null,null,"MARDI",{"$f":"+D25+1","v":"2019-12-31"},null,null,2,"VEHICULE 2","IMMAT XX 100",null,1,"CALCUL TEMPS DE LIVRAISON MINI:","CALCUL KM MINI:","VEHICULE:","PRIX MINI:",null,"CHAUFFEUR 2 PAYAGE",1820,40000]
[null,null,"MERCREDI","2020-01-01",null,null,3,"VEHICULE 3","IMMAT XX 101",null,null,{"$f":"VLOOKUP('PLANNING LIV'!H3,VILLES!C3:K299,8,FALSE)","v":"01:28:00"},{"$f":"VLOOKUP('PLANNING LIV'!H3,VILLES!$C$3:$K$299,4,FALSE)","v":50.4},{"$f":"'PLANNING LIV'!H6","v":"VEHICULE 1"},{"$f":"VLOOKUP(N27,'COUT TR 2019'!G4:N15,8,FALSE)*M27","v":51.408000000000001},null,"CHAUFFEUR 3THAIRE LANVERS",1820,40000]
[null,null,"JEUDI","2020-01-02",null,null,4,"VEHICULE 4","IMMAT XX 102",null,null,"CALCUL TEMPS DE LIVRAISON MAXI:","CALCUL KM MAXI:",null,"PRIX MAXI:"]
[null,null,"VENDREDI","2020-01-03",null,null,5,"VEHICULE 5","IMMAT XX 103",null,null,{"$f":"VLOOKUP('PLANNING LIV'!H3,VILLES!$C$3:$K$299,9,FALSE)","v":"01:45:36"},{"$f":"VLOOKUP('PLANNING LIV'!H3,VILLES!$C$3:$K$299,5,FALSE)","v":55.440000000000005},null,{"$f":"VLOOKUP(N27,'COUT TR 2019'!$G$4:$N$18,8,FALSE)*M29","v":56.548800000000007}]
[null,null,"SAMEDI","2020-01-04",null,null,6,"VEHICULE 6","IMMAT XX 104",null,null,"TEMPS DE LIVRAISON MOYEN:","KM MOYEN:",null,"PRIX MOYEN:",null,"MAJORATION","NBR D'HEURE MAJORE","COUT MOYEN HORAIRE ANNUEL","SURCOUT HEURE SUP"]
[null,null,"DIMANCHE","2020-01-05",null,null,7,"VEHICULE 7","IMMAT XX 105",null,null,{"$f":"+(L29+L27)/2","v":"01:36:48"},{"$f":"+(M29+M27)/2","v":52.92},null,{"$f":"+(O29+O27)/2","v":53.978400000000008},null,null,{"$f":"+T25","v":0},{"$f":"+S25/R25","v":21.978021978021978},{"$f":"+S31*R31","v":0}]
[null,null,"LUNDI","2020-01-06",null,null,8,"VEHICULE 8","IMMAT XX 106",null,null,null,null,null,null,null,null,{"$f":"+T26","v":0},{"$f":"+S26/R26","v":21.978021978021978},{"$f":"+S32*R32","v":0}]
[null,null,"MARDI","2020-01-07",null,null,9,"VEHICULE 9","IMMAT XX 107",null,null,null,null,null,null,null,null,{"$f":"+T27","v":0},{"$f":"+S27/R27","v":21.978021978021978},{"$f":"+S33*R33","v":0}]
[null,null,"MERCREDI","2020-01-08",null,null,10,"VEHICULE 10","IMMAT XX 108",null,null,null,null,null,null,null,null,null,{"$f":"AVERAGE(S31:S33)","v":21.978021978021975},{"$f":"SUM(T31:T33)","v":0}]
[null,null,"JEUDI","2020-01-09",null,null,11,"VEHICULE 11","IMMAT XX 109"]
[null,null,"VENDREDI","2020-01-10",null,null,null,null,null,null,null,null,null,null,null,null,"COUT TOTAL ANNUEL","COUT HORAIRE TOTAL MOYEN ANNUEL"]
[null,null,"SAMEDI","2020-01-11",null,null,null,null,null,null,null,null,null,null,null,null,{"$f":"+T31+S25","v":40000},{"$f":"+Q37/R25","v":21.978021978021978}]
[null,null,"DIMANCHE","2020-01-12",null,null,null,null,null,null,null,null,null,null,null,null,{"$f":"+T32+S26","v":40000},{"$f":"+Q38/R26","v":21.978021978021978}]
[null,null,"LUNDI","2020-01-13",null,null,null,null,null,null,null,null,null,null,null,null,{"$f":"+T33+S27","v":40000},{"$f":"+Q39/R27","v":21.978021978021978}]
[null,null,"MARDI","2020-01-14",null,null,null,null,null,null,null,null,null,null,null,null,{"$f":"SUM(Q37:Q39)","v":120000},{"$f":"AVERAGE(R37:R39)","v":21.978021978021975}]
[null,null,"MERCREDI","2020-01-15"]
[null,null,"JEUDI","2020-01-16"]
[null,null,"VENDREDI","2020-01-17"]
[null,null,"SAMEDI","2020-01-18"]
[null,null,"DIMANCHE","2020-01-19"]
[null,null,"LUNDI","2020-01-20",null,null,null,null,null,null,null,"DECHARGEMENT"]
[null,null,"MARDI","2020-01-21",null,null,null,null,null,null,null,"TEMPS (% D'HEURE)","00:15:00","00:30:00","00:45:00","01:00:00","01:15:00","01:30:00","01:45:00","02:00:00","02:30:00","03:00:00","04:00:00"]
[null,null,"MERCREDI","2020-01-22",null,null,null,null,null,null,null,"COUT",{"$f":"+$R$40*M47*24","v":5.4945054945054936},10.989010989010987,16.483516483516482,21.978021978021975,27.47252747252745,32.967032967032964,38.461538461538474,43.956043956043935,54.945054945054942,65.934065934065927,87.912087912087898]
[null,null,"JEUDI","2020-01-23"]
[null,null,"VENDREDI","2020-01-24"]
[null,null,"SAMEDI","2020-01-25"]
[null,null,"DIMANCHE","2020-01-26"]
[null,null,"LUNDI","2020-01-27"]
[null,null,"MARDI","2020-01-28"]
[null,null,"MERCREDI","2020-01-29"]
[null,null,"JEUDI","2020-01-30"]
[null,null,"VENDREDI","2020-01-31"]
[null,null,"SAMEDI","2020-02-01"]
[null,null,"DIMANCHE","2020-02-02"]
[null,null,"LUNDI","2020-02-03"]
[null,null,"MARDI","2020-02-04"]
[null,null,"MERCREDI","2020-02-05"]
[null,null,"JEUDI","2020-02-06"]
[null,null,"VENDREDI","2020-02-07"]
[null,null,"SAMEDI","2020-02-08"]
[null,null,"DIMANCHE","2020-02-09"]
[null,null,"LUNDI","2020-02-10"]
[null,null,"MARDI","2020-02-11"]
[null,null,"MERCREDI","2020-02-12"]
[]
[]
[]
[]
[]
[]
[]
[]
[]
[]
[]
[]
[]
[]
[]
[]
[]
[]
[null,null,"CHAUFFEUR","TACHE",null,null,null,"CHAUFFEUR","TACHE",null,null,null,"CHAUFFEUR","TACHE",null,null,null,"CHAUFFEUR","TACHE",null,null,null,"CHAUFFEUR","TACHE",null,null,null,"CHAUFFEUR","TACHE"]
[null,null,{"$f":"+$C$11","v":"CHAUFFEUR 1"},"TACHE 1",null,null,null,{"$f":"+$C$11","v":"CHAUFFEUR 1"},null,null,null,null,{"$f":"+$C$11","v":"CHAUFFEUR 1"},null,null,null,null,{"$f":"+$C$11","v":"CHAUFFEUR 1"},null,null,null,null,{"$f":"+$C$11","v":"CHAUFFEUR 1"},null,null,null,null,{"$f":"+$C$11","v":"CHAUFFEUR 1"}]
[null,null,{"$f":"+$C$12","v":"CHAUFFEUR 2"},null,null,null,null,{"$f":"+$C$12","v":"CHAUFFEUR 2"},null,null,null,null,{"$f":"+$C$12","v":"CHAUFFEUR 2"},null,null,null,null,{"$f":"+$C$12","v":"CHAUFFEUR 2"},null,null,null,null,{"$f":"+$C$12","v":"CHAUFFEUR 2"},null,null,null,null,{"$f":"+$C$12","v":"CHAUFFEUR 2"}]
[null,null,{"$f":"+$C$13","v":"CHAUFFEUR 3"},null,null,null,null,{"$f":"+$C$13","v":"CHAUFFEUR 3"},null,null,null,null,{"$f":"+$C$13","v":"CHAUFFEUR 3"},null,null,null,null,{"$f":"+$C$13","v":"CHAUFFEUR 3"},null,null,null,null,{"$f":"+$C$13","v":"CHAUFFEUR 3"},null,null,null,null,{"$f":"+$C$13","v":"CHAUFFEUR 3"}]
[]
[null,"LUNDI MATIN",null,{"$f":"+D25","v":"2019-12-30"},null,null,"MARDI MATIN",null,{"$f":"+D93+1","v":"2019-12-31"},null,null,"MERCREDI MATIN",null,{"$f":"+I93+1","v":"2020-01-01"},null,null,"JEUDI MATIN",null,{"$f":"+N93+1","v":"2020-01-02"},null,null,"VENDREDI MATIN",null,{"$f":"+S93+1","v":"2020-01-03"},null,null,"SAMEDI MATIN",null,{"$f":"+X93+1","v":"2020-01-04"}]
[null,null,{"$f":"+$C$11","v":"CHAUFFEUR 1"},{"$f":"+$C$12","v":"CHAUFFEUR 2"},{"$f":"+$C$13","v":"CHAUFFEUR 3"},null,null,{"$f":"+$C$11","v":"CHAUFFEUR 1"},{"$f":"+$C$12","v":"CHAUFFEUR 2"},{"$f":"+$C$13","v":"CHAUFFEUR 3"},null,null,{"$f":"+$C$11","v":"CHAUFFEUR 1"},{"$f":"+$C$12","v":"CHAUFFEUR 2"},{"$f":"+$C$13","v":"CHAUFFEUR 3"},null,null,{"$f":"+$C$11","v":"CHAUFFEUR 1"},{"$f":"+$C$12","v":"CHAUFFEUR 2"},{"$f":"+$C$13","v":"CHAUFFEUR 3"},null,null,{"$f":"+$C$11","v":"CHAUFFEUR 1"},{"$f":"+$C$12","v":"CHAUFFEUR 2"},{"$f":"+$C$13","v":"CHAUFFEUR 3"},null,null,{"$f":"+$C$11","v":"CHAUFFEUR 1"},{"$f":"+$C$12","v":"CHAUFFEUR 2"},{"$f":"+$C$13","v":"CHAUFFEUR 3"}]
[null,"TACHE",{"$f":"+D89","v":"TACHE 1"},{"$f":"+D90","v":0},{"$f":"+D91","v":0},null,"TACHE",{"$f":"+I89","v":0},{"$f":"+I90","v":0},{"$f":"+I91","v":0},null,"TACHE",{"$f":"+N89","v":0},{"$f":"+N90","v":0},{"$f":"+N91","v":0},null,"TACHE",{"$f":"+S89","v":0},{"$f":"+S90","v":0},{"$f":"+S91","v":0},null,"TACHE",{"$f":"+X89","v":0},{"$f":"+X90","v":0},{"$f":"+X91","v":0},null,"TACHE",{"$f":"+AC89","v":0},{"$f":"+AC90","v":0},{"$f":"+AC91","v":0}]
[null,"DISPO:",{"$f":"IF(C95=\"TACHE 1\",\"CHAUFFEUR 1 dispo\",\"NON\")","v":"CHAUFFEUR 1 dispo"},{"$f":"IF(D95=\"TACHE 1\",\"CHAUFFEUR 2 dispo\",\"NON\")","v":"NON"},{"$f":"IF(E95:E95=\"TACHE 1\",\"CHAUFFEUR 3 dispo\",\"NON\")","v":"NON"},null,"DISPO:",{"$f":"IF(H95=\"TACHE 1\",\"CHAUFFEUR 1 dispo\",\"NON\")","v":"NON"},{"$f":"IF(I95=\"TACHE 1\",\"CHAUFFEUR 2 dispo\",\"NON\")","v":"NON"},{"$f":"IF(J95:J95=\"TACHE 1\",\"CHAUFFEUR 3 dispo\",\"NON\")","v":"NON"},null,"DISPO:",{"$f":"IF(M95=\"TACHE 1\",\"CHAUFFEUR 1 dispo\",\"NON\")","v":"NON"},{"$f":"IF(N95=\"TACHE 1\",\"CHAUFFEUR 2 dispo\",\"NON\")","v":"NON"},{"$f":"IF(O95:O95=\"TACHE 1\",\"CHAUFFEUR 3 dispo\",\"NON\")","v":"NON"},null,"DISPO:",{"$f":"IF(R95=\"TACHE 1\",\"CHAUFFEUR 1 dispo\",\"NON\")","v":"NON"},{"$f":"IF(S95=\"TACHE 1\",\"CHAUFFEUR 2 dispo\",\"NON\")","v":"NON"},{"$f":"IF(T95:T95=\"TACHE 1\",\"CHAUFFEUR 3 dispo\",\"NON\")","v":"NON"},null,"DISPO:",{"$f":"IF(W95=\"TACHE 1\",\"CHAUFFEUR 1 dispo\",\"NON\")","v":"NON"},{"$f":"IF(X95=\"TACHE 1\",\"CHAUFFEUR 2 dispo\",\"NON\")","v":"NON"},{"$f":"IF(Y95:Y95=\"TACHE 1\",\"CHAUFFEUR 3 dispo\",\"NON\")","v":"NON"},null,"DISPO:",{"$f":"IF(AB95=\"TACHE 1\",\"CHAUFFEUR 1 dispo\",\"NON\")","v":"NON"},{"$f":"IF(AC95=\"TACHE 1\",\"CHAUFFEUR 2 dispo\",\"NON\")","v":"NON"},{"$f":"IF(AD95:AD95=\"TACHE 1\",\"CHAUFFEUR 3 dispo\",\"NON\")","v":"NON"}]
[null,"07:30:00",null,null,null,null,"07:30:00",null,null,null,null,"07:30:00",null,null,null,null,"07:30:00",null,null,null,null,"07:30:00",null,null,null,null,"07:30:00"]
[null,"07:45:00",null,null,null,null,"07:45:00",null,null,null,null,"07:45:00",null,null,null,null,"07:45:00",null,null,null,null,"07:45:00",null,null,null,null,"07:45:00"]
[null,"08:00:00",null,null,null,null,"08:00:00",null,null,null,null,"08:00:00",null,null,null,null,"08:00:00",null,null,null,null,"08:00:00",null,null,null,null,"08:00:00"]
[null,"08:15:00",null,null,null,null,"08:15:00",null,null,null,null,"08:15:00",null,null,null,null,"08:15:00",null,null,null,null,"08:15:00",null,null,null,null,"08:15:00"]
[null,"08:30:00",null,null,null,null,"08:30:00",null,null,null,null,"08:30:00",null,null,null,null,"08:30:00",null,null,null,null,"08:30:00",null,null,null,null,"08:30:00"]
[null,"08:45:00",null,null,null,null,"08:45:00",null,null,null,null,"08:45:00",null,null,null,null,"08:45:00",null,null,null,null,"08:45:00",null,null,null,null,"08:45:00"]
[null,"09:00:00",null,null,null,null,"09:00:00",null,null,null,null,"09:00:00",null,null,null,null,"09:00:00",null,null,null,null,"09:00:00",null,null,null,null,"09:00:00"]
[null,"09:15:00",null,null,null,null,"09:15:00",null,null,null,null,"09:15:00",null,null,null,null,"09:15:00",null,null,null,null,"09:15:00",null,null,null,null,"09:15:00"]
[null,"09:30:00",null,null,null,null,"09:30:00",null,null,null,null,"09:30:00",null,null,null,null,"09:30:00",null,null,null,null,"09:30:00",null,null,null,null,"09:30:00"]
[null,"09:45:00",null,null,null,null,"09:45:00",null,null,null,null,"09:45:00",null,null,null,null,"09:45:00",null,null,null,null,"09:45:00",null,null,null,null,"09:45:00"]
[null,"10:00:00",null,null,null,null,"10:00:00",null,null,null,null,"10:00:00",null,null,null,null,"10:00:00",null,null,null,null,"10:00:00",null,null,null,null,"10:00:00"]
[null,"10:15:00",null,null,null,null,"10:15:00",null,null,null,null,"10:15:00",null,null,null,null,"10:15:00",null,null,null,null,"10:15:00",null,null,null,null,"10:15:00"]
[null,"10:30:00",null,null,null,null,"10:30:00",null,null,null,null,"10:30:00",null,null,null,null,"10:30:00",null,null,null,null,"10:30:00",null,null,null,null,"10:30:00"]
[null,"10:45:00",null,null,null,null,"10:45:00",null,null,null,null,"10:45:00",null,null,null,null,"10:45:00",null,null,null,null,"10:45:00",null,null,null,null,"10:45:00"]
[null,"11:00:00",null,null,null,null,"11:00:00",null,null,null,null,"11:00:00",null,null,null,null,"11:00:00",null,null,null,null,"11:00:00",null,null,null,null,"11:00:00"]
[null,"11:15:00",null,null,null,null,"11:15:00",null,null,null,null,"11:15:00",null,null,null,null,"11:15:00",null,null,null,null,"11:15:00",null,null,null,null,"11:15:00"]
[null,"11:30:00",null,null,null,null,"11:30:00",null,null,null,null,"11:30:00",null,null,null,null,"11:30:00",null,null,null,null,"11:30:00",null,null,null,null,"11:30:00"]
[null,"11:45:00",null,null,null,null,"11:45:00",null,null,null,null,"11:45:00",null,null,null,null,"11:45:00",null,null,null,null,"11:45:00",null,null,null,null,"11:45:00"]
[null,"12:00:00",null,null,null,null,"12:00:00",null,null,null,null,"12:00:00",null,null,null,null,"12:00:00",null,null,null,null,"12:00:00",null,null,null,null,"12:00:00"]
[]
[null,null,"CHAUFFEUR","TACHE",null,null,null,"CHAUFFEUR","TACHE",null,null,null,"CHAUFFEUR","TACHE",null,null,null,"CHAUFFEUR","TACHE",null,null,null,"CHAUFFEUR","TACHE"]
[null,null,{"$f":"+C89","v":"CHAUFFEUR 1"},null,null,null,null,{"$f":"+H89","v":"CHAUFFEUR 1"},null,null,null,null,{"$f":"+M89","v":"CHAUFFEUR 1"},null,null,null,null,{"$f":"+R89","v":"CHAUFFEUR 1"},null,null,null,null,{"$f":"+W89","v":"CHAUFFEUR 1"}]
[null,null,{"$f":"+C90","v":"CHAUFFEUR 2"},null,null,null,null,{"$f":"+H90","v":"CHAUFFEUR 2"},null,null,null,null,{"$f":"+M90","v":"CHAUFFEUR 2"},null,null,null,null,{"$f":"+R90","v":"CHAUFFEUR 2"},null,null,null,null,{"$f":"+W90","v":"CHAUFFEUR 2"}]
[null,null,"CHAUFFEUR 3",null,null,null,null,"CHAUFFEUR 3",null,null,null,null,"CHAUFFEUR 3",null,null,null,null,"CHAUFFEUR 3",null,null,null,null,"CHAUFFEUR 3"]
[]
[null,"LUNDI A-P",null,{"$f":"+D93","v":"2019-12-30"},null,null,"MARDI A-P",null,{"$f":"+D122+1","v":"2019-12-31"},null,null,"MERCREDI A-P",null,{"$f":"+I122+1","v":"2020-01-01"},null,null,"JEUDI A-P",null,{"$f":"+N122+1","v":"2020-01-02"},null,null,"VENDREDI A-P",null,{"$f":"+S122+1","v":"2020-01-03"}]
[null,null,{"$f":"+$C$11","v":"CHAUFFEUR 1"},{"$f":"+$C$12","v":"CHAUFFEUR 2"},{"$f":"+$C$13","v":"CHAUFFEUR 3"},null,null,{"$f":"+$C$11","v":"CHAUFFEUR 1"},{"$f":"+$C$12","v":"CHAUFFEUR 2"},{"$f":"+$C$13","v":"CHAUFFEUR 3"},null,null,{"$f":"+$C$11","v":"CHAUFFEUR 1"},{"$f":"+$C$12","v":"CHAUFFEUR 2"},{"$f":"+$C$13","v":"CHAUFFEUR 3"},null,null,{"$f":"+$C$11","v":"CHAUFFEUR 1"},{"$f":"+$C$12","v":"CHAUFFEUR 2"},{"$f":"+$C$13","v":"CHAUFFEUR 3"},null,null,{"$f":"+$C$11","v":"CHAUFFEUR 1"},{"$f":"+$C$12","v":"CHAUFFEUR 2"},{"$f":"+$C$13","v":"CHAUFFEUR 3"}]
[null,"TACHE",{"$f":"+D118","v":0},{"$f":"+D119","v":0},{"$f":"+D120","v":0},null,"TACHE",{"$f":"+I118","v":0},{"$f":"+I119","v":0},{"$f":"+I120","v":0},null,"TACHE",{"$f":"+N118","v":0},{"$f":"+N119","v":0},{"$f":"+N120","v":0},null,"TACHE",{"$f":"+S118","v":0},{"$f":"+S119","v":0},{"$f":"+S120","v":0},null,"TACHE",{"$f":"+X118","v":0},{"$f":"+X119","v":0},{"$f":"+X120","v":0}]
[null,"DISPO:",{"$f":"IF(C124=\"TACHE 1\",\"CHAUFFEUR 1 dispo\",\"NON\")","v":"NON"},{"$f":"IF(D124=\"TACHE 1\",\"CHAUFFEUR 2 dispo\",\"NON\")","v":"NON"},{"$f":"IF(E124:E124=\"TACHE 1\",\"CHAUFFEUR 3 dispo\",\"NON\")","v":"NON"},null,"DISPO:",{"$f":"IF(H124=\"TACHE 1\",\"CHAUFFEUR 1 dispo\",\"NON\")","v":"NON"},{"$f":"IF(I124=\"TACHE 1\",\"CHAUFFEUR 2 dispo\",\"NON\")","v":"NON"},{"$f":"IF(J124:J124=\"TACHE 1\",\"CHAUFFEUR 3 dispo\",\"NON\")","v":"NON"},null,"DISPO:",{"$f":"IF(M124=\"TACHE 1\",\"CHAUFFEUR 1 dispo\",\"NON\")","v":"NON"},{"$f":"IF(N124=\"TACHE 1\",\"CHAUFFEUR 2 dispo\",\"NON\")","v":"NON"},{"$f":"IF(O124:O124=\"TACHE 1\",\"CHAUFFEUR 3 dispo\",\"NON\")","v":"NON"},null,"DISPO:",{"$f":"IF(R124=\"TACHE 1\",\"CHAUFFEUR 1 dispo\",\"NON\")","v":"NON"},{"$f":"IF(S124=\"TACHE 1\",\"CHAUFFEUR 2 dispo\",\"NON\")","v":"NON"},{"$f":"IF(T124:T124=\"TACHE 1\",\"CHAUFFEUR 3 dispo\",\"NON\")","v":"NON"},null,"DISPO:",{"$f":"IF(W124=\"TACHE 1\",\"CHAUFFEUR 1 dispo\",\"NON\")","v":"NON"},{"$f":"IF(X124=\"TACHE 1\",\"CHAUFFEUR 2 dispo\",\"NON\")","v":"NON"},{"$f":"IF(Y124:Y124=\"TACHE 1\",\"CHAUFFEUR 3 dispo\",\"NON\")","v":"NON"}]
[null,"13:30:00",null,null,null,null,"13:30:00",null,null,null,null,"13:30:00",null,null,null,null,"13:30:00",null,null,null,null,"13:30:00"]
[null,"13:45:00",null,null,null,null,"13:45:00",null,null,null,null,"13:45:00",null,null,null,null,"13:45:00",null,null,null,null,"13:45:00"]
[null,"14:00:00",null,null,null,null,"14:00:00",null,null,null,null,"14:00:00",null,null,null,null,"14:00:00",null,null,null,null,"14:00:00"]
[null,"14:15:00",null,null,null,null,"14:15:00",null,null,null,null,"14:15:00",null,null,null,null,"14:15:00",null,null,null,null,"14:15:00"]
[null,"14:30:00",null,null,null,null,"14:30:00",null,null,null,null,"14:30:00",null,null,null,null,"14:30:00",null,null,null,null,"14:30:00"]
[null,"14:45:00",null,null,null,null,"14:45:00",null,null,null,null,"14:45:00",null,null,null,null,"14:45:00",null,null,null,null,"14:45:00"]
[null,"15:00:00",null,null,null,null,"15:00:00",null,null,null,null,"15:00:00",null,null,null,null,"15:00:00",null,null,null,null,"15:00:00"]
[null,"15:15:00",null,null,null,null,"15:15:00",null,null,null,null,"15:15:00",null,null,null,null,"15:15:00",null,null,null,null,"15:15:00"]
[null,"15:30:00",null,null,null,null,"15:30:00",null,null,null,null,"15:30:00",null,null,null,null,"15:30:00",null,null,null,null,"15:30:00"]
[null,"15:45:00",null,null,null,null,"15:45:00",null,null,null,null,"15:45:00",null,null,null,null,"15:45:00",null,null,null,null,"15:45:00"]
[null,"16:00:00",null,null,null,null,"16:00:00",null,null,null,null,"16:00:00",null,null,null,null,"16:00:00",null,null,null,null,"16:00:00"]
[null,"16:15:00",null,null,null,null,"16:15:00",null,null,null,null,"16:15:00",null,null,null,null,"16:15:00",null,null,null,null,"16:15:00"]
[null,"16:30:00",null,null,null,null,"16:30:00",null,null,null,null,"16:30:00",null,null,null,null,"16:30:00",null,null,null,null,"16:30:00"]
[null,"16:45:00",null,null,null,null,"16:45:00",null,null,null,null,"16:45:00",null,null,null,null,"16:45:00",null,null,null,null,"16:45:00"]
[null,"17:00:00",null,null,null,null,"17:00:00",null,null,null,null,"17:00:00",null,null,null,null,"17:00:00",null,null,null,null,"17:00:00"]
[null,"17:15:00",null,null,null,null,"17:15:00",null,null,null,null,"17:15:00",null,null,null,null,"17:15:00",null,null,null,null,"17:15:00"]
[null,"17:30:00",null,null,null,null,"17:30:00",null,null,null,null,"17:30:00",null,null,null,null,"17:30:00",null,null,null,null,"17:30:00"]
[null,"17:45:00",null,null,null,null,"17:45:00",null,null,null,null,"17:45:00",null,null,null,null,"17:45:00",null,null,null,null,"17:45:00"]
[null,"18:00:00",null,null,null,null,"18:00:00",null,null,null,null,"18:00:00",null,null,null,null,"18:00:00",null,null,null,null,"18:00:00"]
[]
[]
[]
[null,null,"CHAUFFEUR","TACHE",null,null,null,"CHAUFFEUR","TACHE",null,null,null,"CHAUFFEUR","TACHE",null,null,null,"CHAUFFEUR","TACHE",null,null,null,"CHAUFFEUR","TACHE",null,null,null,"CHAUFFEUR","TACHE"]
[null,null,{"$f":"+C118","v":"CHAUFFEUR 1"},null,null,null,null,{"$f":"+H118","v":"CHAUFFEUR 1"},null,null,null,null,{"$f":"+M118","v":"CHAUFFEUR 1"},null,null,null,null,{"$f":"+R118","v":"CHAUFFEUR 1"},null,null,null,null,{"$f":"+W118","v":"CHAUFFEUR 1"},null,null,null,null,{"$f":"+AB89","v":"CHAUFFEUR 1"}]
[null,null,{"$f":"+C119","v":"CHAUFFEUR 2"},null,null,null,null,{"$f":"+H119","v":"CHAUFFEUR 2"},null,null,null,null,{"$f":"+M119","v":"CHAUFFEUR 2"},null,null,null,null,{"$f":"+R119","v":"CHAUFFEUR 2"},null,null,null,null,{"$f":"+W119","v":"CHAUFFEUR 2"},null,null,null,null,{"$f":"+AB90","v":"CHAUFFEUR 2"}]
[null,null,"CHAUFFEUR 3",null,null,null,null,"CHAUFFEUR 3",null,null,null,null,"CHAUFFEUR 3",null,null,null,null,"CHAUFFEUR 3",null,null,null,null,"CHAUFFEUR 3",null,null,null,null,"CHAUFFEUR 3"]
[]
[null,"LUNDI MATIN",null,{"$f":"+D93+7","v":"2020-01-06"},null,null,"MARDI MATIN",null,{"$f":"+D153+1","v":"2020-01-07"},null,null,"MERCREDI MATIN",null,{"$f":"+I153+1","v":"2020-01-08"},null,null,"JEUDI MATIN",null,{"$f":"+N153+1","v":"2020-01-09"},null,null,"VENDREDI MATIN",null,{"$f":"+S153+1","v":"2020-01-10"},null,null,"SAMEDI MATIN",null,{"$f":"+X153+1","v":"2020-01-11"}]
[null,null,{"$f":"+$C$11","v":"CHAUFFEUR 1"},{"$f":"+$C$12","v":"CHAUFFEUR 2"},{"$f":"+$C$13","v":"CHAUFFEUR 3"},null,null,{"$f":"+$C$11","v":"CHAUFFEUR 1"},{"$f":"+$C$12","v":"CHAUFFEUR 2"},{"$f":"+$C$13","v":"CHAUFFEUR 3"},null,null,{"$f":"+$C$11","v":"CHAUFFEUR 1"},{"$f":"+$C$12","v":"CHAUFFEUR 2"},{"$f":"+$C$13","v":"CHAUFFEUR 3"},null,null,{"$f":"+$C$11","v":"CHAUFFEUR 1"},{"$f":"+$C$12","v":"CHAUFFEUR 2"},{"$f":"+$C$13","v":"CHAUFFEUR 3"},null,null,{"$f":"+$C$11","v":"CHAUFFEUR 1"},{"$f":"+$C$12","v":"CHAUFFEUR 2"},{"$f":"+$C$13","v":"CHAUFFEUR 3"},null,null,{"$f":"+$C$11","v":"CHAUFFEUR 1"},{"$f":"+$C$12","v":"CHAUFFEUR 2"},{"$f":"+$C$13","v":"CHAUFFEUR 3"}]
[null,"TACHE",{"$f":"+D149","v":0},{"$f":"+D150","v":0},{"$f":"+D151","v":0},null,"TACHE",{"$f":"+I149","v":0},{"$f":"+I150","v":0},{"$f":"+I151","v":0},null,"TACHE",{"$f":"+N149","v":0},{"$f":"+N150","v":0},{"$f":"+N151","v":0},null,"TACHE",{"$f":"+S149","v":0},{"$f":"+S150","v":0},{"$f":"+S151","v":0},null,"TACHE",{"$f":"+X149","v":0},{"$f":"+X150","v":0},{"$f":"+X151","v":0},null,"TACHE",{"$f":"+AC149","v":0},{"$f":"+AC150","v":0},{"$f":"+AC151","v":0}]
[null,"DISPO:",{"$f":"IF(C155=\"TACHE 1\",\"CHAUFFEUR 1 dispo\",\"NON\")","v":"NON"},{"$f":"IF(D155=\"TACHE 1\",\"CHAUFFEUR 2 dispo\",\"NON\")","v":"NON"},{"$f":"IF(E155:E155=\"TACHE 1\",\"CHAUFFEUR 3 dispo\",\"NON\")","v":"NON"},null,"DISPO:",{"$f":"IF(H155=\"TACHE 1\",\"CHAUFFEUR 1 dispo\",\"NON\")","v":"NON"},{"$f":"IF(I155=\"TACHE 1\",\"CHAUFFEUR 2 dispo\",\"NON\")","v":"NON"},{"$f":"IF(J155:J155=\"TACHE 1\",\"CHAUFFEUR 3 dispo\",\"NON\")","v":"NON"},null,"DISPO:",{"$f":"IF(M155=\"TACHE 1\",\"CHAUFFEUR 1 dispo\",\"NON\")","v":"NON"},{"$f":"IF(N155=\"TACHE 1\",\"CHAUFFEUR 2 dispo\",\"NON\")","v":"NON"},{"$f":"IF(O155:O155=\"TACHE 1\",\"CHAUFFEUR 3 dispo\",\"NON\")","v":"NON"},null,"DISPO:",{"$f":"IF(R155=\"TACHE 1\",\"CHAUFFEUR 1 dispo\",\"NON\")","v":"NON"},{"$f":"IF(S155=\"TACHE 1\",\"CHAUFFEUR 2 dispo\",\"NON\")","v":"NON"},{"$f":"IF(T155:T155=\"TACHE 1\",\"CHAUFFEUR 3 dispo\",\"NON\")","v":"NON"},null,"DISPO:",{"$f":"IF(W155=\"TACHE 1\",\"CHAUFFEUR 1 dispo\",\"NON\")","v":"NON"},{"$f":"IF(X155=\"TACHE 1\",\"CHAUFFEUR 2 dispo\",\"NON\")","v":"NON"},{"$f":"IF(Y155:Y155=\"TACHE 1\",\"CHAUFFEUR 3 dispo\",\"NON\")","v":"NON"},null,"DISPO:",{"$f":"IF(AB155=\"TACHE 1\",\"CHAUFFEUR 1 dispo\",\"NON\")","v":"NON"},{"$f":"IF(AC155=\"TACHE 1\",\"CHAUFFEUR 2 dispo\",\"NON\")","v":"NON"},{"$f":"IF(AD155:AD155=\"TACHE 1\",\"CHAUFFEUR 3 dispo\",\"NON\")","v":"NON"}]
[null,"07:30:00",null,null,null,null,"07:30:00",null,null,null,null,"07:30:00",null,null,null,null,"07:30:00",null,null,null,null,"07:30:00",null,null,null,null,"07:30:00"]
[null,"07:45:00",null,null,null,null,"07:45:00",null,null,null,null,"07:45:00",null,null,null,null,"07:45:00",null,null,null,null,"07:45:00",null,null,null,null,"07:45:00"]
[null,"08:00:00",null,null,null,null,"08:00:00",null,null,null,null,"08:00:00",null,null,null,null,"08:00:00",null,null,null,null,"08:00:00",null,null,null,null,"08:00:00"]
[null,"08:15:00",null,null,null,null,"08:15:00",null,null,null,null,"08:15:00",null,null,null,null,"08:15:00",null,null,null,null,"08:15:00",null,null,null,null,"08:15:00"]
[null,"08:30:00",null,null,null,null,"08:30:00",null,null,null,null,"08:30:00",null,null,null,null,"08:30:00",null,null,null,null,"08:30:00",null,null,null,null,"08:30:00"]
[null,"08:45:00",null,null,null,null,"08:45:00",null,null,null,null,"08:45:00",null,null,null,null,"08:45:00",null,null,null,null,"08:45:00",null,null,null,null,"08:45:00"]
[null,"09:00:00",null,null,null,null,"09:00:00",null,null,null,null,"09:00:00",null,null,null,null,"09:00:00",null,null,null,null,"09:00:00",null,null,null,null,"09:00:00"]
[null,"09:15:00",null,null,null,null,"09:15:00",null,null,null,null,"09:15:00",null,null,null,null,"09:15:00",null,null,null,null,"09:15:00",null,null,null,null,"09:15:00"]
[null,"09:30:00",null,null,null,null,"09:30:00",null,null,null,null,"09:30:00",null,null,null,null,"09:30:00",null,null,null,null,"09:30:00",null,null,null,null,"09:30:00"]
[null,"09:45:00",null,null,null,null,"09:45:00",null,null,null,null,"09:45:00",null,null,null,null,"09:45:00",null,null,null,null,"09:45:00",null,null,null,null,"09:45:00"]
[null,"10:00:00",null,null,null,null,"10:00:00",null,null,null,null,"10:00:00",null,null,null,null,"10:00:00",null,null,null,null,"10:00:00",null,null,null,null,"10:00:00"]
[null,"10:15:00",null,null,null,null,"10:15:00",null,null,null,null,"10:15:00",null,null,null,null,"10:15:00",null,null,null,null,"10:15:00",null,null,null,null,"10:15:00"]
[null,"10:30:00",null,null,null,null,"10:30:00",null,null,null,null,"10:30:00",null,null,null,null,"10:30:00",null,null,null,null,"10:30:00",null,null,null,null,"10:30:00"]
[null,"10:45:00",null,null,null,null,"10:45:00",null,null,null,null,"10:45:00",null,null,null,null,"10:45:00",null,null,null,null,"10:45:00",null,null,null,null,"10:45:00"]
[null,"11:00:00",null,null,null,null,"11:00:00",null,null,null,null,"11:00:00",null,null,null,null,"11:00:00",null,null,null,null,"11:00:00",null,null,null,null,"11:00:00"]
[null,"11:15:00",null,null,null,null,"11:15:00",null,null,null,null,"11:15:00",null,null,null,null,"11:15:00",null,null,null,null,"11:15:00",null,null,null,null,"11:15:00"]
[null,"11:30:00",null,null,null,null,"11:30:00",null,null,null,null,"11:30:00",null,null,null,null,"11:30:00",null,null,null,null,"11:30:00",null,null,null,null,"11:30:00"]
[null,"11:45:00",null,null,null,null,"11:45:00",null,null,null,null,"11:45:00",null,null,null,null,"11:45:00",null,null,null,null,"11:45:00",null,null,null,null,"11:45:00"]
[null,"12:00:00",null,null,null,null,"12:00:00",null,null,null,null,"12:00:00",null,null,null,null,"12:00:00",null,null,null,null,"12:00:00",null,null,null,null,"12:00:00"]
[]
[null,null,"CHAUFFEUR","TACHE",null,null,null,"CHAUFFEUR","TACHE",null,null,null,"CHAUFFEUR","TACHE",null,null,null,"CHAUFFEUR","TACHE",null,null,null,"CHAUFFEUR","TACHE"]
[null,null,{"$f":"+C149","v":"CHAUFFEUR 1"},null,null,null,null,{"$f":"+H149","v":"CHAUFFEUR 1"},null,null,null,null,{"$f":"+M149","v":"CHAUFFEUR 1"},null,null,null,null,{"$f":"+R149","v":"CHAUFFEUR 1"},null,null,null,null,{"$f":"+W149","v":"CHAUFFEUR 1"}]
[null,null,{"$f":"+C150","v":"CHAUFFEUR 2"},null,null,null,null,{"$f":"+H150","v":"CHAUFFEUR 2"},null,null,null,null,{"$f":"+M150","v":"CHAUFFEUR 2"},null,null,null,null,{"$f":"+R150","v":"CHAUFFEUR 2"},null,null,null,null,{"$f":"+W150","v":"CHAUFFEUR 2"}]
[null,null,"CHAUFFEUR 3",null,null,null,null,"CHAUFFEUR 3",null,null,null,null,"CHAUFFEUR 3",null,null,null,null,"CHAUFFEUR 3",null,null,null,null,"CHAUFFEUR 3"]
[]
[null,"LUNDI A-P",null,{"$f":"+D153","v":"2020-01-06"},null,null,"MARDI A-P",null,{"$f":"+D182+1","v":"2020-01-07"},null,null,"MERCREDI A-P",null,{"$f":"+I182+1","v":"2020-01-08"},null,null,"JEUDI A-P",null,{"$f":"+N182+1","v":"2020-01-09"},null,null,"VENDREDI A-P",null,{"$f":"+S182+1","v":"2020-01-10"}]
[null,null,{"$f":"+$C$11","v":"CHAUFFEUR 1"},{"$f":"+$C$12","v":"CHAUFFEUR 2"},{"$f":"+$C$13","v":"CHAUFFEUR 3"},null,null,{"$f":"+$C$11","v":"CHAUFFEUR 1"},{"$f":"+$C$12","v":"CHAUFFEUR 2"},{"$f":"+$C$13","v":"CHAUFFEUR 3"},null,null,{"$f":"+$C$11","v":"CHAUFFEUR 1"},{"$f":"+$C$12","v":"CHAUFFEUR 2"},{"$f":"+$C$13","v":"CHAUFFEUR 3"},null,null,{"$f":"+$C$11","v":"CHAUFFEUR 1"},{"$f":"+$C$12","v":"CHAUFFEUR 2"},{"$f":"+$C$13","v":"CHAUFFEUR 3"},null,null,{"$f":"+$C$11","v":"CHAUFFEUR 1"},{"$f":"+$C$12","v":"CHAUFFEUR 2"},{"$f":"+$C$13","v":"CHAUFFEUR 3"}]
[null,"TACHE",{"$f":"+D178","v":0},{"$f":"+D179","v":0},{"$f":"+D180","v":0},null,"TACHE",{"$f":"+I178","v":0},{"$f":"+I179","v":0},{"$f":"+I180","v":0},null,"TACHE",{"$f":"+N178","v":0},{"$f":"+N179","v":0},{"$f":"+N180","v":0},null,"TACHE",{"$f":"+S178","v":0},{"$f":"+S179","v":0},{"$f":"+S180","v":0},null,"TACHE",{"$f":"+X178","v":0},{"$f":"+X179","v":0},{"$f":"+X180","v":0}]
[null,"DISPO:",{"$f":"IF(C184=\"TACHE 1\",\"CHAUFFEUR 1 dispo\",\"NON\")","v":"NON"},{"$f":"IF(D184=\"TACHE 1\",\"CHAUFFEUR 2 dispo\",\"NON\")","v":"NON"},{"$f":"IF(E184:E184=\"TACHE 1\",\"CHAUFFEUR 3 dispo\",\"NON\")","v":"NON"},null,"DISPO:",{"$f":"IF(H184=\"TACHE 1\",\"CHAUFFEUR 1 dispo\",\"NON\")","v":"NON"},{"$f":"IF(I184=\"TACHE 1\",\"CHAUFFEUR 2 dispo\",\"NON\")","v":"NON"},{"$f":"IF(J184:J184=\"TACHE 1\",\"CHAUFFEUR 3 dispo\",\"NON\")","v":"NON"},null,"DISPO:",{"$f":"IF(M184=\"TACHE 1\",\"CHAUFFEUR 1 dispo\",\"NON\")","v":"NON"},{"$f":"IF(N184=\"TACHE 1\",\"CHAUFFEUR 2 dispo\",\"NON\")","v":"NON"},{"$f":"IF(O184:O184=\"TACHE 1\",\"CHAUFFEUR 3 dispo\",\"NON\")","v":"NON"},null,"DISPO:",{"$f":"IF(R184=\"TACHE 1\",\"CHAUFFEUR 1 dispo\",\"NON\")","v":"NON"},{"$f":"IF(S184=\"TACHE 1\",\"CHAUFFEUR 2 dispo\",\"NON\")","v":"NON"},{"$f":"IF(T184:T184=\"TACHE 1\",\"CHAUFFEUR 3 dispo\",\"NON\")","v":"NON"},null,"DISPO:",{"$f":"IF(W184=\"TACHE 1\",\"CHAUFFEUR 1 dispo\",\"NON\")","v":"NON"},{"$f":"IF(X184=\"TACHE 1\",\"CHAUFFEUR 2 dispo\",\"NON\")","v":"NON"},{"$f":"IF(Y184:Y184=\"TACHE 1\",\"CHAUFFEUR 3 dispo\",\"NON\")","v":"NON"}]
[null,"13:30:00",null,null,null,null,"13:30:00",null,null,null,null,"13:30:00",null,null,null,null,"13:30:00",null,null,null,null,"13:30:00"]
[null,"13:45:00",null,null,null,null,"13:45:00",null,null,null,null,"13:45:00",null,null,null,null,"13:45:00",null,null,null,null,"13:45:00"]
[null,"14:00:00",null,null,null,null,"14:00:00",null,null,null,null,"14:00:00",null,null,null,null,"14:00:00",null,null,null,null,"14:00:00"]
[null,"14:15:00",null,null,null,null,"14:15:00",null,null,null,null,"14:15:00",null,null,null,null,"14:15:00",null,null,null,null,"14:15:00"]
[null,"14:30:00",null,null,null,null,"14:30:00",null,null,null,null,"14:30:00",null,null,null,null,"14:30:00",null,null,null,null,"14:30:00"]
[null,"14:45:00",null,null,null,null,"14:45:00",null,null,null,null,"14:45:00",null,null,null,null,"14:45:00",null,null,null,null,"14:45:00"]
[null,"15:00:00",null,null,null,null,"15:00:00",null,null,null,null,"15:00:00",null,null,null,null,"15:00:00",null,null,null,null,"15:00:00"]
[null,"15:15:00",null,null,null,null,"15:15:00",null,null,null,null,"15:15:00",null,null,null,null,"15:15:00",null,null,null,null,"15:15:00"]
[null,"15:30:00",null,null,null,null,"15:30:00",null,null,null,null,"15:30:00",null,null,null,null,"15:30:00",null,null,null,null,"15:30:00"]
[null,"15:45:00",null,null,null,null,"15:45:00",null,null,null,null,"15:45:00",null,null,null,null,"15:45:00",null,null,null,null,"15:45:00"]
[null,"16:00:00",null,null,null,null,"16:00:00",null,null,null,null,"16:00:00",null,null,null,null,"16:00:00",null,null,null,null,"16:00:00"]
[null,"16:15:00",null,null,null,null,"16:15:00",null,null,null,null,"16:15:00",null,null,null,null,"16:15:00",null,null,null,null,"16:15:00"]
[null,"16:30:00",null,null,null,null,"16:30:00",null,null,null,null,"16:30:00",null,null,null,null,"16:30:00",null,null,null,null,"16:30:00"]
[null,"16:45:00",null,null,null,null,"16:45:00",null,null,null,null,"16:45:00",null,null,null,null,"16:45:00",null,null,null,null,"16:45:00"]
[null,"17:00:00",null,null,null,null,"17:00:00",null,null,null,null,"17:00:00",null,null,null,null,"17:00:00",null,null,null,null,"17:00:00"]
[null,"17:15:00",null,null,null,null,"17:15:00",null,null,null,null,"17:15:00",null,null,null,null,"17:15:00",null,null,null,null,"17:15:00"]
[null,"17:30:00",null,null,null,null,"17:30:00",null,null,null,null,"17:30:00",null,null,null,null,"17:30:00",null,null,null,null,"17:30:00"]
[null,"17:45:00",null,null,null,null,"17:45:00",null,null,null,null,"17:45:00",null,null,null,null,"17:45:00",null,null,null,null,"17:45:00"]
[null,"18:00:00",null,null,null,null,"18:00:00",null,null,null,null,"18:00:00",null,null,null,null,"18:00:00",null,null,null,null,"18:00:00"]
[]
[]
[null,null,"CHAUFFEUR","TACHE",null,null,null,"CHAUFFEUR","TACHE",null,null,null,"CHAUFFEUR","TACHE",null,null,null,"CHAUFFEUR","TACHE",null,null,null,"CHAUFFEUR","TACHE",null,null,null,"CHAUFFEUR","TACHE"]
[null,null,{"$f":"+C178","v":"CHAUFFEUR 1"},null,null,null,null,{"$f":"+H178","v":"CHAUFFEUR 1"},null,null,null,null,{"$f":"+M178","v":"CHAUFFEUR 1"},null,null,null,null,{"$f":"+R178","v":"CHAUFFEUR 1"},null,null,null,null,{"$f":"+W178","v":"CHAUFFEUR 1"},null,null,null,null,{"$f":"+AB149","v":"CHAUFFEUR 1"}]
[null,null,{"$f":"+C179","v":"CHAUFFEUR 2"},null,null,null,null,{"$f":"+H179","v":"CHAUFFEUR 2"},null,null,null,null,{"$f":"+M179","v":"CHAUFFEUR 2"},null,null,null,null,{"$f":"+R179","v":"CHAUFFEUR 2"},null,null,null,null,{"$f":"+W179","v":"CHAUFFEUR 2"},null,null,null,null,{"$f":"+AB150","v":"CHAUFFEUR 2"}]
[null,null,{"$f":"+C180","v":"CHAUFFEUR 3"},null,null,null,null,{"$f":"+H180","v":"CHAUFFEUR 3"},null,null,null,null,{"$f":"+M180","v":"CHAUFFEUR 3"},null,null,null,null,{"$f":"+R180","v":"CHAUFFEUR 3"},null,null,null,null,{"$f":"+W180","v":"CHAUFFEUR 3"},null,null,null,null,"CHAUFFEUR 3"]
[]
[null,"LUNDI MATIN",null,{"$f":"+D153+7","v":"2020-01-13"},null,null,"MARDI MATIN",null,{"$f":"+D212+1","v":"2020-01-14"},null,null,"MERCREDI MATIN",null,{"$f":"+I212+1","v":"2020-01-15"},null,null,"JEUDI MATIN",null,{"$f":"+N212+1","v":"2020-01-16"},null,null,"VENDREDI MATIN",null,{"$f":"+S212+1","v":"2020-01-17"},null,null,"SAMEDI MATIN",null,{"$f":"+X212+1","v":"2020-01-18"}]
[null,null,{"$f":"+$C$11","v":"CHAUFFEUR 1"},{"$f":"+$C$12","v":"CHAUFFEUR 2"},{"$f":"+$C$13","v":"CHAUFFEUR 3"},null,null,{"$f":"+$C$11","v":"CHAUFFEUR 1"},{"$f":"+$C$12","v":"CHAUFFEUR 2"},{"$f":"+$C$13","v":"CHAUFFEUR 3"},null,null,{"$f":"+$C$11","v":"CHAUFFEUR 1"},{"$f":"+$C$12","v":"CHAUFFEUR 2"},{"$f":"+$C$13","v":"CHAUFFEUR 3"},null,null,{"$f":"+$C$11","v":"CHAUFFEUR 1"},{"$f":"+$C$12","v":"CHAUFFEUR 2"},{"$f":"+$C$13","v":"CHAUFFEUR 3"},null,null,{"$f":"+$C$11","v":"CHAUFFEUR 1"},{"$f":"+$C$12","v":"CHAUFFEUR 2"},{"$f":"+$C$13","v":"CHAUFFEUR 3"},null,null,{"$f":"+$C$11","v":"CHAUFFEUR 1"},{"$f":"+$C$12","v":"CHAUFFEUR 2"},{"$f":"+$C$13","v":"CHAUFFEUR 3"}]
[null,"TACHE",{"$f":"+D208","v":0},{"$f":"+D209","v":0},{"$f":"+D210","v":0},null,"TACHE",{"$f":"+I208","v":0},{"$f":"+I209","v":0},{"$f":"+I210","v":0},null,"TACHE",{"$f":"+N208","v":0},{"$f":"+N209","v":0},{"$f":"+N210","v":0},null,"TACHE",{"$f":"+S208","v":0},{"$f":"+S209","v":0},{"$f":"+S210","v":0},null,"TACHE",{"$f":"+X208","v":0},{"$f":"+X209","v":0},{"$f":"+X210","v":0},null,"TACHE",{"$f":"+AC208","v":0},{"$f":"+AC209","v":0},{"$f":"+AC210","v":0}]
[null,"DISPO:",{"$f":"IF(C214=\"TACHE 1\",\"CHAUFFEUR 1 dispo\",\"NON\")","v":"NON"},{"$f":"IF(D214=\"TACHE 1\",\"CHAUFFEUR 2 dispo\",\"NON\")","v":"NON"},{"$f":"IF(E214:E214=\"TACHE 1\",\"CHAUFFEUR 3 dispo\",\"NON\")","v":"NON"},null,"DISPO:",{"$f":"IF(H214=\"TACHE 1\",\"CHAUFFEUR 1 dispo\",\"NON\")","v":"NON"},{"$f":"IF(I214=\"TACHE 1\",\"CHAUFFEUR 2 dispo\",\"NON\")","v":"NON"},{"$f":"IF(J214:J214=\"TACHE 1\",\"CHAUFFEUR 3 dispo\",\"NON\")","v":"NON"},null,"DISPO:",{"$f":"IF(M214=\"TACHE 1\",\"CHAUFFEUR 1 dispo\",\"NON\")","v":"NON"},{"$f":"IF(N214=\"TACHE 1\",\"CHAUFFEUR 2 dispo\",\"NON\")","v":"NON"},{"$f":"IF(O214:O214=\"TACHE 1\",\"CHAUFFEUR 3 dispo\",\"NON\")","v":"NON"},null,"DISPO:",{"$f":"IF(R214=\"TACHE 1\",\"CHAUFFEUR 1 dispo\",\"NON\")","v":"NON"},{"$f":"IF(S214=\"TACHE 1\",\"CHAUFFEUR 2 dispo\",\"NON\")","v":"NON"},{"$f":"IF(T214:T214=\"TACHE 1\",\"CHAUFFEUR 3 dispo\",\"NON\")","v":"NON"},null,"DISPO:",{"$f":"IF(W214=\"TACHE 1\",\"CHAUFFEUR 1 dispo\",\"NON\")","v":"NON"},{"$f":"IF(X214=\"TACHE 1\",\"CHAUFFEUR 2 dispo\",\"NON\")","v":"NON"},{"$f":"IF(Y214:Y214=\"TACHE 1\",\"CHAUFFEUR 3 dispo\",\"NON\")","v":"NON"},null,"DISPO:",{"$f":"IF(AB214=\"TACHE 1\",\"CHAUFFEUR 1 dispo\",\"NON\")","v":"NON"},{"$f":"IF(AC214=\"TACHE 1\",\"CHAUFFEUR 2 dispo\",\"NON\")","v":"NON"},{"$f":"IF(AD214:AD214=\"TACHE 1\",\"CHAUFFEUR 3 dispo\",\"NON\")","v":"NON"}]
[null,"07:30:00",null,null,null,null,"07:30:00",null,null,null,null,"07:30:00",null,null,null,null,"07:30:00",null,null,null,null,"07:30:00",null,null,null,null,"07:30:00"]
[null,"07:45:00",null,null,null,null,"07:45:00",null,null,null,null,"07:45:00",null,null,null,null,"07:45:00",null,null,null,null,"07:45:00",null,null,null,null,"07:45:00"]
[null,"08:00:00",null,null,null,null,"08:00:00",null,null,null,null,"08:00:00",null,null,null,null,"08:00:00",null,null,null,null,"08:00:00",null,null,null,null,"08:00:00"]
[null,"08:15:00",null,null,null,null,"08:15:00",null,null,null,null,"08:15:00",null,null,null,null,"08:15:00",null,null,null,null,"08:15:00",null,null,null,null,"08:15:00"]
[null,"08:30:00",null,null,null,null,"08:30:00",null,null,null,null,"08:30:00",null,null,null,null,"08:30:00",null,null,null,null,"08:30:00",null,null,null,null,"08:30:00"]
[null,"08:45:00",null,null,null,null,"08:45:00",null,null,null,null,"08:45:00",null,null,null,null,"08:45:00",null,null,null,null,"08:45:00",null,null,null,null,"08:45:00"]
[null,"09:00:00",null,null,null,null,"09:00:00",null,null,null,null,"09:00:00",null,null,null,null,"09:00:00",null,null,null,null,"09:00:00",null,null,null,null,"09:00:00"]
[null,"09:15:00",null,null,null,null,"09:15:00",null,null,null,null,"09:15:00",null,null,null,null,"09:15:00",null,null,null,null,"09:15:00",null,null,null,null,"09:15:00"]
[null,"09:30:00",null,null,null,null,"09:30:00",null,null,null,null,"09:30:00",null,null,null,null,"09:30:00",null,null,null,null,"09:30:00",null,null,null,null,"09:30:00"]
[null,"09:45:00",null,null,null,null,"09:45:00",null,null,null,null,"09:45:00",null,null,null,null,"09:45:00",null,null,null,null,"09:45:00",null,null,null,null,"09:45:00"]
[null,"10:00:00",null,null,null,null,"10:00:00",null,null,null,null,"10:00:00",null,null,null,null,"10:00:00",null,null,null,null,"10:00:00",null,null,null,null,"10:00:00"]
[null,"10:15:00",null,null,null,null,"10:15:00",null,null,null,null,"10:15:00",null,null,null,null,"10:15:00",null,null,null,null,"10:15:00",null,null,null,null,"10:15:00"]
[null,"10:30:00",null,null,null,null,"10:30:00",null,null,null,null,"10:30:00",null,null,null,null,"10:30:00",null,null,null,null,"10:30:00",null,null,null,null,"10:30:00"]
[null,"10:45:00",null,null,null,null,"10:45:00",null,null,null,null,"10:45:00",null,null,null,null,"10:45:00",null,null,null,null,"10:45:00",null,null,null,null,"10:45:00"]
[null,"11:00:00",null,null,null,null,"11:00:00",null,null,null,null,"11:00:00",null,null,null,null,"11:00:00",null,null,null,null,"11:00:00",null,null,null,null,"11:00:00"]
[null,"11:15:00",null,null,null,null,"11:15:00",null,null,null,null,"11:15:00",null,null,null,null,"11:15:00",null,null,null,null,"11:15:00",null,null,null,null,"11:15:00"]
[null,"11:30:00",null,null,null,null,"11:30:00",null,null,null,null,"11:30:00",null,null,null,null,"11:30:00",null,null,null,null,"11:30:00",null,null,null,null,"11:30:00"]
[null,"11:45:00",null,null,null,null,"11:45:00",null,null,null,null,"11:45:00",null,null,null,null,"11:45:00",null,null,null,null,"11:45:00",null,null,null,null,"11:45:00"]
[null,"12:00:00",null,null,null,null,"12:00:00",null,null,null,null,"12:00:00",null,null,null,null,"12:00:00",null,null,null,null,"12:00:00",null,null,null,null,"12:00:00"]
[]
[null,null,"CHAUFFEUR","TACHE",null,null,null,"CHAUFFEUR","TACHE",null,null,null,"CHAUFFEUR","TACHE",null,null,null,"CHAUFFEUR","TACHE",null,null,null,"CHAUFFEUR","TACHE"]
[null,null,{"$f":"+C208","v":"CHAUFFEUR 1"},null,null,null,null,{"$f":"+H208","v":"CHAUFFEUR 1"},null,null,null,null,{"$f":"+M208","v":"CHAUFFEUR 1"},null,null,null,null,{"$f":"+R208","v":"CHAUFFEUR 1"},null,null,null,null,{"$f":"+W208","v":"CHAUFFEUR 1"}]
[null,null,{"$f":"+C209","v":"CHAUFFEUR 2"},null,null,null,null,{"$f":"+H209","v":"CHAUFFEUR 2"},null,null,null,null,{"$f":"+M209","v":"CHAUFFEUR 2"},null,null,null,null,{"$f":"+R209","v":"CHAUFFEUR 2"},null,null,null,null,{"$f":"+W209","v":"CHAUFFEUR 2"}]
[null,null,"CHAUFFEUR 3",null,null,null,null,"CHAUFFEUR 3",null,null,null,null,"CHAUFFEUR 3",null,null,null,null,"CHAUFFEUR 3",null,null,null,null,"CHAUFFEUR 3"]
[]
[null,"LUNDI A-P",null,{"$f":"+D212","v":"2020-01-13"},null,null,"MARDI A-P",null,{"$f":"+D241+1","v":"2020-01-14"},null,null,"MERCREDI A-P",null,{"$f":"+I241+1","v":"2020-01-15"},null,null,"JEUDI A-P",null,{"$f":"+N241+1","v":"2020-01-16"},null,null,"VENDREDI A-P",null,{"$f":"+S241+1","v":"2020-01-17"}]
[null,null,{"$f":"+$C$11","v":"CHAUFFEUR 1"},{"$f":"+$C$12","v":"CHAUFFEUR 2"},{"$f":"+$C$13","v":"CHAUFFEUR 3"},null,null,{"$f":"+$C$11","v":"CHAUFFEUR 1"},{"$f":"+$C$12","v":"CHAUFFEUR 2"},{"$f":"+$C$13","v":"CHAUFFEUR 3"},null,null,{"$f":"+$C$11","v":"CHAUFFEUR 1"},{"$f":"+$C$12","v":"CHAUFFEUR 2"},{"$f":"+$C$13","v":"CHAUFFEUR 3"},null,null,{"$f":"+$C$11","v":"CHAUFFEUR 1"},{"$f":"+$C$12","v":"CHAUFFEUR 2"},{"$f":"+$C$13","v":"CHAUFFEUR 3"},null,null,{"$f":"+$C$11","v":"CHAUFFEUR 1"},{"$f":"+$C$12","v":"CHAUFFEUR 2"},{"$f":"+$C$13","v":"CHAUFFEUR 3"}]
[null,"TACHE",{"$f":"+D237","v":0},{"$f":"+D238","v":0},{"$f":"+D239","v":0},null,"TACHE",{"$f":"+I237","v":0},{"$f":"+I238","v":0},{"$f":"+I239","v":0},null,"TACHE",{"$f":"+N237","v":0},{"$f":"+N238","v":0},{"$f":"+N239","v":0},null,"TACHE",{"$f":"+S237","v":0},{"$f":"+S238","v":0},{"$f":"+S239","v":0},null,"TACHE",{"$f":"+X237","v":0},{"$f":"+X238","v":0},{"$f":"+X239","v":0}]
[null,"DISPO:",{"$f":"IF(C243=\"TACHE 1\",\"CHAUFFEUR 1 dispo\",\"NON\")","v":"NON"},{"$f":"IF(D243=\"TACHE 1\",\"CHAUFFEUR 2 dispo\",\"NON\")","v":"NON"},{"$f":"IF(E243:E243=\"TACHE 1\",\"CHAUFFEUR 3 dispo\",\"NON\")","v":"NON"},null,"DISPO:",{"$f":"IF(H243=\"TACHE 1\",\"CHAUFFEUR 1 dispo\",\"NON\")","v":"NON"},{"$f":"IF(I243=\"TACHE 1\",\"CHAUFFEUR 2 dispo\",\"NON\")","v":"NON"},{"$f":"IF(J243:J243=\"TACHE 1\",\"CHAUFFEUR 3 dispo\",\"NON\")","v":"NON"},null,"DISPO:",{"$f":"IF(M243=\"TACHE 1\",\"CHAUFFEUR 1 dispo\",\"NON\")","v":"NON"},{"$f":"IF(N243=\"TACHE 1\",\"CHAUFFEUR 2 dispo\",\"NON\")","v":"NON"},{"$f":"IF(O243:O243=\"TACHE 1\",\"CHAUFFEUR 3 dispo\",\"NON\")","v":"NON"},null,"DISPO:",{"$f":"IF(R243=\"TACHE 1\",\"CHAUFFEUR 1 dispo\",\"NON\")","v":"NON"},{"$f":"IF(S243=\"TACHE 1\",\"CHAUFFEUR 2 dispo\",\"NON\")","v":"NON"},{"$f":"IF(T243:T243=\"TACHE 1\",\"CHAUFFEUR 3 dispo\",\"NON\")","v":"NON"},null,"DISPO:",{"$f":"IF(W243=\"TACHE 1\",\"CHAUFFEUR 1 dispo\",\"NON\")","v":"NON"},{"$f":"IF(X243=\"TACHE 1\",\"CHAUFFEUR 2 dispo\",\"NON\")","v":"NON"},{"$f":"IF(Y243:Y243=\"TACHE 1\",\"CHAUFFEUR 3 dispo\",\"NON\")","v":"NON"}]
[null,"13:30:00",null,null,null,null,"13:30:00",null,null,null,null,"13:30:00",null,null,null,null,"13:30:00",null,null,null,null,"13:30:00"]
[null,"13:45:00",null,null,null,null,"13:45:00",null,null,null,null,"13:45:00",null,null,null,null,"13:45:00",null,null,null,null,"13:45:00"]
[null,"14:00:00",null,null,null,null,"14:00:00",null,null,null,null,"14:00:00",null,null,null,null,"14:00:00",null,null,null,null,"14:00:00"]
[null,"14:15:00",null,null,null,null,"14:15:00",null,null,null,null,"14:15:00",null,null,null,null,"14:15:00",null,null,null,null,"14:15:00"]
[null,"14:30:00",null,null,null,null,"14:30:00",null,null,null,null,"14:30:00",null,null,null,null,"14:30:00",null,null,null,null,"14:30:00"]
[null,"14:45:00",null,null,null,null,"14:45:00",null,null,null,null,"14:45:00",null,null,null,null,"14:45:00",null,null,null,null,"14:45:00"]
[null,"15:00:00",null,null,null,null,"15:00:00",null,null,null,null,"15:00:00",null,null,null,null,"15:00:00",null,null,null,null,"15:00:00"]
[null,"15:15:00",null,null,null,null,"15:15:00",null,null,null,null,"15:15:00",null,null,null,null,"15:15:00",null,null,null,null,"15:15:00"]
[null,"15:30:00",null,null,null,null,"15:30:00",null,null,null,null,"15:30:00",null,null,null,null,"15:30:00",null,null,null,null,"15:30:00"]
[null,"15:45:00",null,null,null,null,"15:45:00",null,null,null,null,"15:45:00",null,null,null,null,"15:45:00",null,null,null,null,"15:45:00"]
[null,"16:00:00",null,null,null,null,"16:00:00",null,null,null,null,"16:00:00",null,null,null,null,"16:00:00",null,null,null,null,"16:00:00"]
[null,"16:15:00",null,null,null,null,"16:15:00",null,null,null,null,"16:15:00",null,null,null,null,"16:15:00",null,null,null,null,"16:15:00"]
[null,"16:30:00",null,null,null,null,"16:30:00",null,null,null,null,"16:30:00",null,null,null,null,"16:30:00",null,null,null,null,"16:30:00"]
[null,"16:45:00",null,null,null,null,"16:45:00",null,null,null,null,"16:45:00",null,null,null,null,"16:45:00",null,null,null,null,"16:45:00"]
[null,"17:00:00",null,null,null,null,"17:00:00",null,null,null,null,"17:00:00",null,null,null,null,"17:00:00",null,null,null,null,"17:00:00"]
[null,"17:15:00",null,null,null,null,"17:15:00",null,null,null,null,"17:15:00",null,null,null,null,"17:15:00",null,null,null,null,"17:15:00"]
[null,"17:30:00",null,null,null,null,"17:30:00",null,null,null,null,"17:30:00",null,null,null,null,"17:30:00",null,null,null,null,"17:30:00"]
[null,"17:45:00",null,null,null,null,"17:45:00",null,null,null,null,"17:45:00",null,null,null,null,"17:45:00",null,null,null,null,"17:45:00"]
[null,"18:00:00",null,null,null,null,"18:00:00",null,null,null,null,"18:00:00",null,null,null,null,"18:00:00",null,null,null,null,"18:00:00"]
[]
[]
[null,null,"CHAUFFEUR","TACHE",null,null,null,"CHAUFFEUR","TACHE",null,null,null,"CHAUFFEUR","TACHE",null,null,null,"CHAUFFEUR","TACHE",null,null,null,"CHAUFFEUR","TACHE",null,null,null,"CHAUFFEUR","TACHE"]
[null,null,{"$f":"+C237","v":"CHAUFFEUR 1"},null,null,null,null,{"$f":"+H237","v":"CHAUFFEUR 1"},null,null,null,null,{"$f":"+M237","v":"CHAUFFEUR 1"},null,null,null,null,{"$f":"+R237","v":"CHAUFFEUR 1"},null,null,null,null,{"$f":"+W237","v":"CHAUFFEUR 1"},null,null,null,null,{"$f":"+AB208","v":"CHAUFFEUR 1"}]
[null,null,{"$f":"+C238","v":"CHAUFFEUR 2"},null,null,null,null,{"$f":"+H238","v":"CHAUFFEUR 2"},null,null,null,null,{"$f":"+M238","v":"CHAUFFEUR 2"},null,null,null,null,{"$f":"+R238","v":"CHAUFFEUR 2"},null,null,null,null,{"$f":"+W238","v":"CHAUFFEUR 2"},null,null,null,null,{"$f":"+AB209","v":"CHAUFFEUR 2"}]
[null,null,{"$f":"+C239","v":"CHAUFFEUR 3"},null,null,null,null,{"$f":"+H239","v":"CHAUFFEUR 3"},null,null,null,null,{"$f":"+M239","v":"CHAUFFEUR 3"},null,null,null,null,{"$f":"+R239","v":"CHAUFFEUR 3"},null,null,null,null,{"$f":"+W239","v":"CHAUFFEUR 3"},null,null,null,null,"CHAUFFEUR 3"]
[]
[null,"LUNDI MATIN",null,{"$f":"+D212+7","v":"2020-01-20"},null,null,"MARDI MATIN",null,{"$f":"+D271+1","v":"2020-01-21"},null,null,"MERCREDI MATIN",null,{"$f":"+I271+1","v":"2020-01-22"},null,null,"JEUDI MATIN",null,{"$f":"+N271+1","v":"2020-01-23"},null,null,"VENDREDI MATIN",null,{"$f":"+S271+1","v":"2020-01-24"},null,null,"SAMEDI MATIN",null,{"$f":"+X271+1","v":"2020-01-25"}]
[null,null,{"$f":"+$C$11","v":"CHAUFFEUR 1"},{"$f":"+$C$12","v":"CHAUFFEUR 2"},{"$f":"+$C$13","v":"CHAUFFEUR 3"},null,null,{"$f":"+$C$11","v":"CHAUFFEUR 1"},{"$f":"+$C$12","v":"CHAUFFEUR 2"},{"$f":"+$C$13","v":"CHAUFFEUR 3"},null,null,{"$f":"+$C$11","v":"CHAUFFEUR 1"},{"$f":"+$C$12","v":"CHAUFFEUR 2"},{"$f":"+$C$13","v":"CHAUFFEUR 3"},null,null,{"$f":"+$C$11","v":"CHAUFFEUR 1"},{"$f":"+$C$12","v":"CHAUFFEUR 2"},{"$f":"+$C$13","v":"CHAUFFEUR 3"},null,null,{"$f":"+$C$11","v":"CHAUFFEUR 1"},{"$f":"+$C$12","v":"CHAUFFEUR 2"},{"$f":"+$C$13","v":"CHAUFFEUR 3"},null,null,{"$f":"+$C$11","v":"CHAUFFEUR 1"},{"$f":"+$C$12","v":"CHAUFFEUR 2"},{"$f":"+$C$13","v":"CHAUFFEUR 3"}]
[null,"TACHE",{"$f":"+D267","v":0},{"$f":"+D268","v":0},{"$f":"+D269","v":0},null,"TACHE",{"$f":"+I267","v":0},{"$f":"+I268","v":0},{"$f":"+I269","v":0},null,"TACHE",{"$f":"+N267","v":0},{"$f":"+N268","v":0},{"$f":"+N269","v":0},null,"TACHE",{"$f":"+S267","v":0},{"$f":"+S268","v":0},{"$f":"+S269","v":0},null,"TACHE",{"$f":"+X267","v":0},{"$f":"+X268","v":0},{"$f":"+X269","v":0},null,"TACHE",{"$f":"+AC267","v":0},{"$f":"+AC268","v":0},{"$f":"+AC269","v":0}]
[null,"DISPO:",{"$f":"IF(C273=\"TACHE 1\",\"CHAUFFEUR 1 dispo\",\"NON\")","v":"NON"},{"$f":"IF(D273=\"TACHE 1\",\"CHAUFFEUR 2 dispo\",\"NON\")","v":"NON"},{"$f":"IF(E273:E273=\"TACHE 1\",\"CHAUFFEUR 3 dispo\",\"NON\")","v":"NON"},null,"DISPO:",{"$f":"IF(H273=\"TACHE 1\",\"CHAUFFEUR 1 dispo\",\"NON\")","v":"NON"},{"$f":"IF(I273=\"TACHE 1\",\"CHAUFFEUR 2 dispo\",\"NON\")","v":"NON"},{"$f":"IF(J273:J273=\"TACHE 1\",\"CHAUFFEUR 3 dispo\",\"NON\")","v":"NON"},null,"DISPO:",{"$f":"IF(M273=\"TACHE 1\",\"CHAUFFEUR 1 dispo\",\"NON\")","v":"NON"},{"$f":"IF(N273=\"TACHE 1\",\"CHAUFFEUR 2 dispo\",\"NON\")","v":"NON"},{"$f":"IF(O273:O273=\"TACHE 1\",\"CHAUFFEUR 3 dispo\",\"NON\")","v":"NON"},null,"DISPO:",{"$f":"IF(R273=\"TACHE 1\",\"CHAUFFEUR 1 dispo\",\"NON\")","v":"NON"},{"$f":"IF(S273=\"TACHE 1\",\"CHAUFFEUR 2 dispo\",\"NON\")","v":"NON"},{"$f":"IF(T273:T273=\"TACHE 1\",\"CHAUFFEUR 3 dispo\",\"NON\")","v":"NON"},null,"DISPO:",{"$f":"IF(W273=\"TACHE 1\",\"CHAUFFEUR 1 dispo\",\"NON\")","v":"NON"},{"$f":"IF(X273=\"TACHE 1\",\"CHAUFFEUR 2 dispo\",\"NON\")","v":"NON"},{"$f":"IF(Y273:Y273=\"TACHE 1\",\"CHAUFFEUR 3 dispo\",\"NON\")","v":"NON"},null,"DISPO:",{"$f":"IF(AB273=\"TACHE 1\",\"CHAUFFEUR 1 dispo\",\"NON\")","v":"NON"},{"$f":"IF(AC273=\"TACHE 1\",\"CHAUFFEUR 2 dispo\",\"NON\")","v":"NON"},{"$f":"IF(AD273:AD273=\"TACHE 1\",\"CHAUFFEUR 3 dispo\",\"NON\")","v":"NON"}]
[null,"07:30:00",null,null,null,null,"07:30:00",null,null,null,null,"07:30:00",null,null,null,null,"07:30:00",null,null,null,null,"07:30:00",null,null,null,null,"07:30:00"]
[null,"07:45:00",null,null,null,null,"07:45:00",null,null,null,null,"07:45:00",null,null,null,null,"07:45:00",null,null,null,null,"07:45:00",null,null,null,null,"07:45:00"]
[null,"08:00:00",null,null,null,null,"08:00:00",null,null,null,null,"08:00:00",null,null,null,null,"08:00:00",null,null,null,null,"08:00:00",null,null,null,null,"08:00:00"]
[null,"08:15:00",null,null,null,null,"08:15:00",null,null,null,null,"08:15:00",null,null,null,null,"08:15:00",null,null,null,null,"08:15:00",null,null,null,null,"08:15:00"]
[null,"08:30:00",null,null,null,null,"08:30:00",null,null,null,null,"08:30:00",null,null,null,null,"08:30:00",null,null,null,null,"08:30:00",null,null,null,null,"08:30:00"]
[null,"08:45:00",null,null,null,null,"08:45:00",null,null,null,null,"08:45:00",null,null,null,null,"08:45:00",null,null,null,null,"08:45:00",null,null,null,null,"08:45:00"]
[null,"09:00:00",null,null,null,null,"09:00:00",null,null,null,null,"09:00:00",null,null,null,null,"09:00:00",null,null,null,null,"09:00:00",null,null,null,null,"09:00:00"]
[null,"09:15:00",null,null,null,null,"09:15:00",null,null,null,null,"09:15:00",null,null,null,null,"09:15:00",null,null,null,null,"09:15:00",null,null,null,null,"09:15:00"]
[null,"09:30:00",null,null,null,null,"09:30:00",null,null,null,null,"09:30:00",null,null,null,null,"09:30:00",null,null,null,null,"09:30:00",null,null,null,null,"09:30:00"]
[null,"09:45:00",null,null,null,null,"09:45:00",null,null,null,null,"09:45:00",null,null,null,null,"09:45:00",null,null,null,null,"09:45:00",null,null,null,null,"09:45:00"]
[null,"10:00:00",null,null,null,null,"10:00:00",null,null,null,null,"10:00:00",null,null,null,null,"10:00:00",null,null,null,null,"10:00:00",null,null,null,null,"10:00:00"]
[null,"10:15:00",null,null,null,null,"10:15:00",null,null,null,null,"10:15:00",null,null,null,null,"10:15:00",null,null,null,null,"10:15:00",null,null,null,null,"10:15:00"]
[null,"10:30:00",null,null,null,null,"10:30:00",null,null,null,null,"10:30:00",null,null,null,null,"10:30:00",null,null,null,null,"10:30:00",null,null,null,null,"10:30:00"]
[null,"10:45:00",null,null,null,null,"10:45:00",null,null,null,null,"10:45:00",null,null,null,null,"10:45:00",null,null,null,null,"10:45:00",null,null,null,null,"10:45:00"]
[null,"11:00:00",null,null,null,null,"11:00:00",null,null,null,null,"11:00:00",null,null,null,null,"11:00:00",null,null,null,null,"11:00:00",null,null,null,null,"11:00:00"]
[null,"11:15:00",null,null,null,null,"11:15:00",null,null,null,null,"11:15:00",null,null,null,null,"11:15:00",null,null,null,null,"11:15:00",null,null,null,null,"11:15:00"]
[null,"11:30:00",null,null,null,null,"11:30:00",null,null,null,null,"11:30:00",null,null,null,null,"11:30:00",null,null,null,null,"11:30:00",null,null,null,null,"11:30:00"]
[null,"11:45:00",null,null,null,null,"11:45:00",null,null,null,null,"11:45:00",null,null,null,null,"11:45:00",null,null,null,null,"11:45:00",null,null,null,null,"11:45:00"]
[null,"12:00:00",null,null,null,null,"12:00:00",null,null,null,null,"12:00:00",null,null,null,null,"12:00:00",null,null,null,null,"12:00:00",null,null,null,null,"12:00:00"]
[]
[null,null,"CHAUFFEUR","TACHE",null,null,null,"CHAUFFEUR","TACHE",null,null,null,"CHAUFFEUR","TACHE",null,null,null,"CHAUFFEUR","TACHE",null,null,null,"CHAUFFEUR","TACHE"]
[null,null,{"$f":"+C267","v":"CHAUFFEUR 1"},null,null,null,null,{"$f":"+H267","v":"CHAUFFEUR 1"},null,null,null,null,{"$f":"+M267","v":"CHAUFFEUR 1"},null,null,null,null,{"$f":"+R267","v":"CHAUFFEUR 1"},null,null,null,null,{"$f":"+W267","v":"CHAUFFEUR 1"}]
[null,null,{"$f":"+C268","v":"CHAUFFEUR 2"},null,null,null,null,{"$f":"+H268","v":"CHAUFFEUR 2"},null,null,null,null,{"$f":"+M268","v":"CHAUFFEUR 2"},null,null,null,null,{"$f":"+R268","v":"CHAUFFEUR 2"},null,null,null,null,{"$f":"+W268","v":"CHAUFFEUR 2"}]
[null,null,"CHAUFFEUR 3",null,null,null,null,"CHAUFFEUR 3",null,null,null,null,"CHAUFFEUR 3",null,null,null,null,"CHAUFFEUR 3",null,null,null,null,"CHAUFFEUR 3"]
[]
[null,"LUNDI A-P",null,{"$f":"+D271","v":"2020-01-20"},null,null,"MARDI A-P",null,{"$f":"+D300+1","v":"2020-01-21"},null,null,"MERCREDI A-P",null,{"$f":"+I300+1","v":"2020-01-22"},null,null,"JEUDI A-P",null,{"$f":"+N300+1","v":"2020-01-23"},null,null,"VENDREDI A-P",null,{"$f":"+S300+1","v":"2020-01-24"}]
[null,null,{"$f":"+$C$11","v":"CHAUFFEUR 1"},{"$f":"+$C$12","v":"CHAUFFEUR 2"},{"$f":"+$C$13","v":"CHAUFFEUR 3"},null,null,{"$f":"+$C$11","v":"CHAUFFEUR 1"},{"$f":"+$C$12","v":"CHAUFFEUR 2"},{"$f":"+$C$13","v":"CHAUFFEUR 3"},null,null,{"$f":"+$C$11","v":"CHAUFFEUR 1"},{"$f":"+$C$12","v":"CHAUFFEUR 2"},{"$f":"+$C$13","v":"CHAUFFEUR 3"},null,null,{"$f":"+$C$11","v":"CHAUFFEUR 1"},{"$f":"+$C$12","v":"CHAUFFEUR 2"},{"$f":"+$C$13","v":"CHAUFFEUR 3"},null,null,{"$f":"+$C$11","v":"CHAUFFEUR 1"},{"$f":"+$C$12","v":"CHAUFFEUR 2"},{"$f":"+$C$13","v":"CHAUFFEUR 3"}]
[null,"TACHE",{"$f":"+D296","v":0},{"$f":"+D297","v":0},{"$f":"+D298","v":0},null,"TACHE",{"$f":"+I296","v":0},{"$f":"+I297","v":0},{"$f":"+I298","v":0},null,"TACHE",{"$f":"+N296","v":0},{"$f":"+N297","v":0},{"$f":"+N298","v":0},null,"TACHE",{"$f":"+S296","v":0},{"$f":"+S297","v":0},{"$f":"+S298","v":0},null,"TACHE",{"$f":"+X296","v":0},{"$f":"+X297","v":0},{"$f":"+X298","v":0}]
[null,"DISPO:",{"$f":"IF(C302=\"TACHE 1\",\"CHAUFFEUR 1 dispo\",\"NON\")","v":"NON"},{"$f":"IF(D302=\"TACHE 1\",\"CHAUFFEUR 2 dispo\",\"NON\")","v":"NON"},{"$f":"IF(E302:E302=\"TACHE 1\",\"CHAUFFEUR 3 dispo\",\"NON\")","v":"NON"},null,"DISPO:",{"$f":"IF(H302=\"TACHE 1\",\"CHAUFFEUR 1 dispo\",\"NON\")","v":"NON"},{"$f":"IF(I302=\"TACHE 1\",\"CHAUFFEUR 2 dispo\",\"NON\")","v":"NON"},{"$f":"IF(J302:J302=\"TACHE 1\",\"CHAUFFEUR 3 dispo\",\"NON\")","v":"NON"},null,"DISPO:",{"$f":"IF(M302=\"TACHE 1\",\"CHAUFFEUR 1 dispo\",\"NON\")","v":"NON"},{"$f":"IF(N302=\"TACHE 1\",\"CHAUFFEUR 2 dispo\",\"NON\")","v":"NON"},{"$f":"IF(O302:O302=\"TACHE 1\",\"CHAUFFEUR 3 dispo\",\"NON\")","v":"NON"},null,"DISPO:",{"$f":"IF(R302=\"TACHE 1\",\"CHAUFFEUR 1 dispo\",\"NON\")","v":"NON"},{"$f":"IF(S302=\"TACHE 1\",\"CHAUFFEUR 2 dispo\",\"NON\")","v":"NON"},{"$f":"IF(T302:T302=\"TACHE 1\",\"CHAUFFEUR 3 dispo\",\"NON\")","v":"NON"},null,"DISPO:",{"$f":"IF(W302=\"TACHE 1\",\"CHAUFFEUR 1 dispo\",\"NON\")","v":"NON"},{"$f":"IF(X302=\"TACHE 1\",\"CHAUFFEUR 2 dispo\",\"NON\")","v":"NON"},{"$f":"IF(Y302:Y302=\"TACHE 1\",\"CHAUFFEUR 3 dispo\",\"NON\")","v":"NON"}]
[null,"13:30:00",null,null,null,null,"13:30:00",null,null,null,null,"13:30:00",null,null,null,null,"13:30:00",null,null,null,null,"13:30:00"]
[null,"13:45:00",null,null,null,null,"13:45:00",null,null,null,null,"13:45:00",null,null,null,null,"13:45:00",null,null,null,null,"13:45:00"]
[null,"14:00:00",null,null,null,null,"14:00:00",null,null,null,null,"14:00:00",null,null,null,null,"14:00:00",null,null,null,null,"14:00:00"]
[null,"14:15:00",null,null,null,null,"14:15:00",null,null,null,null,"14:15:00",null,null,null,null,"14:15:00",null,null,null,null,"14:15:00"]
[null,"14:30:00",null,null,null,null,"14:30:00",null,null,null,null,"14:30:00",null,null,null,null,"14:30:00",null,null,null,null,"14:30:00"]
[null,"14:45:00",null,null,null,null,"14:45:00",null,null,null,null,"14:45:00",null,null,null,null,"14:45:00",null,null,null,null,"14:45:00"]
[null,"15:00:00",null,null,null,null,"15:00:00",null,null,null,null,"15:00:00",null,null,null,null,"15:00:00",null,null,null,null,"15:00:00"]
[null,"15:15:00",null,null,null,null,"15:15:00",null,null,null,null,"15:15:00",null,null,null,null,"15:15:00",null,null,null,null,"15:15:00"]
[null,"15:30:00",null,null,null,null,"15:30:00",null,null,null,null,"15:30:00",null,null,null,null,"15:30:00",null,null,null,null,"15:30:00"]
[null,"15:45:00",null,null,null,null,"15:45:00",null,null,null,null,"15:45:00",null,null,null,null,"15:45:00",null,null,null,null,"15:45:00"]
[null,"16:00:00",null,null,null,null,"16:00:00",null,null,null,null,"16:00:00",null,null,null,null,"16:00:00",null,null,null,null,"16:00:00"]
[null,"16:15:00",null,null,null,null,"16:15:00",null,null,null,null,"16:15:00",null,null,null,null,"16:15:00",null,null,null,null,"16:15:00"]
[null,"16:30:00",null,null,null,null,"16:30:00",null,null,null,null,"16:30:00",null,null,null,null,"16:30:00",null,null,null,null,"16:30:00"]
[null,"16:45:00",null,null,null,null,"16:45:00",null,null,null,null,"16:45:00",null,null,null,null,"16:45:00",null,null,null,null,"16:45:00"]
[null,"17:00:00",null,null,null,null,"17:00:00",null,null,null,null,"17:00:00",null,null,null,null,"17:00:00",null,null,null,null,"17:00:00"]
[null,"17:15:00",null,null,null,null,"17:15:00",null,null,null,null,"17:15:00",null,null,null,null,"17:15:00",null,null,null,null,"17:15:00"]
[null,"17:30:00",null,null,null,null,"17:30:00",null,null,null,null,"17:30:00",null,null,null,null,"17:30:00",null,null,null,null,"17:30:00"]
[null,"17:45:00",null,null,null,null,"17:45:00",null,null,null,null,"17:45:00",null,null,null,null,"17:45:00",null,null,null,null,"17:45:00"]
[null,"18:00:00",null,null,null,null,"18:00:00",null,null,null,null,"18:00:00",null,null,null,null,"18:00:00",null,null,null,null,"18:00:00"]
[]
[]
[null,null,"CHAUFFEUR","TACHE",null,null,null,"CHAUFFEUR","TACHE",null,null,null,"CHAUFFEUR","TACHE",null,null,null,"CHAUFFEUR","TACHE",null,null,null,"CHAUFFEUR","TACHE",null,null,null,"CHAUFFEUR","TACHE"]
[null,null,{"$f":"+C296","v":"CHAUFFEUR 1"},null,null,null,null,{"$f":"+H296","v":"CHAUFFEUR 1"},null,null,null,null,{"$f":"+M296","v":"CHAUFFEUR 1"},null,null,null,null,{"$f":"+R296","v":"CHAUFFEUR 1"},null,null,null,null,{"$f":"+W296","v":"CHAUFFEUR 1"},null,null,null,null,{"$f":"+AB267","v":"CHAUFFEUR 1"}]
[null,null,{"$f":"+C297","v":"CHAUFFEUR 2"},null,null,null,null,{"$f":"+H297","v":"CHAUFFEUR 2"},null,null,null,null,{"$f":"+M297","v":"CHAUFFEUR 2"},null,null,null,null,{"$f":"+R297","v":"CHAUFFEUR 2"},null,null,null,null,{"$f":"+W297","v":"CHAUFFEUR 2"},null,null,null,null,{"$f":"+AB268","v":"CHAUFFEUR 2"}]
[null,null,{"$f":"+C298","v":"CHAUFFEUR 3"},null,null,null,null,{"$f":"+H298","v":"CHAUFFEUR 3"},null,null,null,null,{"$f":"+M298","v":"CHAUFFEUR 3"},null,null,null,null,{"$f":"+R298","v":"CHAUFFEUR 3"},null,null,null,null,{"$f":"+W298","v":"CHAUFFEUR 3"},null,null,null,null,"CHAUFFEUR 3"]
[]
[null,"LUNDI MATIN",null,{"$f":"+D271+7","v":"2020-01-27"},null,null,"MARDI MATIN",null,{"$f":"+D330+1","v":"2020-01-28"},null,null,"MERCREDI MATIN",null,{"$f":"+I330+1","v":"2020-01-29"},null,null,"JEUDI MATIN",null,{"$f":"+N330+1","v":"2020-01-30"},null,null,"VENDREDI MATIN",null,{"$f":"+S330+1","v":"2020-01-31"},null,null,"SAMEDI MATIN",null,{"$f":"+X330+1","v":"2020-02-01"}]
[null,null,{"$f":"+$C$11","v":"CHAUFFEUR 1"},{"$f":"+$C$12","v":"CHAUFFEUR 2"},{"$f":"+$C$13","v":"CHAUFFEUR 3"},null,null,{"$f":"+$C$11","v":"CHAUFFEUR 1"},{"$f":"+$C$12","v":"CHAUFFEUR 2"},{"$f":"+$C$13","v":"CHAUFFEUR 3"},null,null,{"$f":"+$C$11","v":"CHAUFFEUR 1"},{"$f":"+$C$12","v":"CHAUFFEUR 2"},{"$f":"+$C$13","v":"CHAUFFEUR 3"},null,null,{"$f":"+$C$11","v":"CHAUFFEUR 1"},{"$f":"+$C$12","v":"CHAUFFEUR 2"},{"$f":"+$C$13","v":"CHAUFFEUR 3"},null,null,{"$f":"+$C$11","v":"CHAUFFEUR 1"},{"$f":"+$C$12","v":"CHAUFFEUR 2"},{"$f":"+$C$13","v":"CHAUFFEUR 3"},null,null,{"$f":"+$C$11","v":"CHAUFFEUR 1"},{"$f":"+$C$12","v":"CHAUFFEUR 2"},{"$f":"+$C$13","v":"CHAUFFEUR 3"}]
[null,"TACHE",{"$f":"+D326","v":0},{"$f":"+D327","v":0},{"$f":"+D328","v":0},null,"TACHE",{"$f":"+I326","v":0},{"$f":"+I327","v":0},{"$f":"+I328","v":0},null,"TACHE",{"$f":"+N326","v":0},{"$f":"+N327","v":0},{"$f":"+N328","v":0},null,"TACHE",{"$f":"+S326","v":0},{"$f":"+S327","v":0},{"$f":"+S328","v":0},null,"TACHE",{"$f":"+X326","v":0},{"$f":"+X327","v":0},{"$f":"+X328","v":0},null,"TACHE",{"$f":"+AC326","v":0},{"$f":"+AC327","v":0},{"$f":"+AC328","v":0}]
[null,"DISPO:",{"$f":"IF(C332=\"TACHE 1\",\"CHAUFFEUR 1 dispo\",\"NON\")","v":"NON"},{"$f":"IF(D332=\"TACHE 1\",\"CHAUFFEUR 2 dispo\",\"NON\")","v":"NON"},{"$f":"IF(E332:E332=\"TACHE 1\",\"CHAUFFEUR 3 dispo\",\"NON\")","v":"NON"},null,"DISPO:",{"$f":"IF(H332=\"TACHE 1\",\"CHAUFFEUR 1 dispo\",\"NON\")","v":"NON"},{"$f":"IF(I332=\"TACHE 1\",\"CHAUFFEUR 2 dispo\",\"NON\")","v":"NON"},{"$f":"IF(J332:J332=\"TACHE 1\",\"CHAUFFEUR 3 dispo\",\"NON\")","v":"NON"},null,"DISPO:",{"$f":"IF(M332=\"TACHE 1\",\"CHAUFFEUR 1 dispo\",\"NON\")","v":"NON"},{"$f":"IF(N332=\"TACHE 1\",\"CHAUFFEUR 2 dispo\",\"NON\")","v":"NON"},{"$f":"IF(O332:O332=\"TACHE 1\",\"CHAUFFEUR 3 dispo\",\"NON\")","v":"NON"},null,"DISPO:",{"$f":"IF(R332=\"TACHE 1\",\"CHAUFFEUR 1 dispo\",\"NON\")","v":"NON"},{"$f":"IF(S332=\"TACHE 1\",\"CHAUFFEUR 2 dispo\",\"NON\")","v":"NON"},{"$f":"IF(T332:T332=\"TACHE 1\",\"CHAUFFEUR 3 dispo\",\"NON\")","v":"NON"},null,"DISPO:",{"$f":"IF(W332=\"TACHE 1\",\"CHAUFFEUR 1 dispo\",\"NON\")","v":"NON"},{"$f":"IF(X332=\"TACHE 1\",\"CHAUFFEUR 2 dispo\",\"NON\")","v":"NON"},{"$f":"IF(Y332:Y332=\"TACHE 1\",\"CHAUFFEUR 3 dispo\",\"NON\")","v":"NON"},null,"DISPO:",{"$f":"IF(AB332=\"TACHE 1\",\"CHAUFFEUR 1 dispo\",\"NON\")","v":"NON"},{"$f":"IF(AC332=\"TACHE 1\",\"CHAUFFEUR 2 dispo\",\"NON\")","v":"NON"},{"$f":"IF(AD332:AD332=\"TACHE 1\",\"CHAUFFEUR 3 dispo\",\"NON\")","v":"NON"}]
[null,"07:30:00",null,null,null,null,"07:30:00",null,null,null,null,"07:30:00",null,null,null,null,"07:30:00",null,null,null,null,"07:30:00",null,null,null,null,"07:30:00"]
[null,"07:45:00",null,null,null,null,"07:45:00",null,null,null,null,"07:45:00",null,null,null,null,"07:45:00",null,null,null,null,"07:45:00",null,null,null,null,"07:45:00"]
[null,"08:00:00",null,null,null,null,"08:00:00",null,null,null,null,"08:00:00",null,null,null,null,"08:00:00",null,null,null,null,"08:00:00",null,null,null,null,"08:00:00"]
[null,"08:15:00",null,null,null,null,"08:15:00",null,null,null,null,"08:15:00",null,null,null,null,"08:15:00",null,null,null,null,"08:15:00",null,null,null,null,"08:15:00"]
[null,"08:30:00",null,null,null,null,"08:30:00",null,null,null,null,"08:30:00",null,null,null,null,"08:30:00",null,null,null,null,"08:30:00",null,null,null,null,"08:30:00"]
[null,"08:45:00",null,null,null,null,"08:45:00",null,null,null,null,"08:45:00",null,null,null,null,"08:45:00",null,null,null,null,"08:45:00",null,null,null,null,"08:45:00"]
[null,"09:00:00",null,null,null,null,"09:00:00",null,null,null,null,"09:00:00",null,null,null,null,"09:00:00",null,null,null,null,"09:00:00",null,null,null,null,"09:00:00"]
[null,"09:15:00",null,null,null,null,"09:15:00",null,null,null,null,"09:15:00",null,null,null,null,"09:15:00",null,null,null,null,"09:15:00",null,null,null,null,"09:15:00"]
[null,"09:30:00",null,null,null,null,"09:30:00",null,null,null,null,"09:30:00",null,null,null,null,"09:30:00",null,null,null,null,"09:30:00",null,null,null,null,"09:30:00"]
[null,"09:45:00",null,null,null,null,"09:45:00",null,null,null,null,"09:45:00",null,null,null,null,"09:45:00",null,null,null,null,"09:45:00",null,null,null,null,"09:45:00"]
[null,"10:00:00",null,null,null,null,"10:00:00",null,null,null,null,"10:00:00",null,null,null,null,"10:00:00",null,null,null,null,"10:00:00",null,null,null,null,"10:00:00"]
[null,"10:15:00",null,null,null,null,"10:15:00",null,null,null,null,"10:15:00",null,null,null,null,"10:15:00",null,null,null,null,"10:15:00",null,null,null,null,"10:15:00"]
[null,"10:30:00",null,null,null,null,"10:30:00",null,null,null,null,"10:30:00",null,null,null,null,"10:30:00",null,null,null,null,"10:30:00",null,null,null,null,"10:30:00"]
[null,"10:45:00",null,null,null,null,"10:45:00",null,null,null,null,"10:45:00",null,null,null,null,"10:45:00",null,null,null,null,"10:45:00",null,null,null,null,"10:45:00"]
[null,"11:00:00",null,null,null,null,"11:00:00",null,null,null,null,"11:00:00",null,null,null,null,"11:00:00",null,null,null,null,"11:00:00",null,null,null,null,"11:00:00"]
[null,"11:15:00",null,null,null,null,"11:15:00",null,null,null,null,"11:15:00",null,null,null,null,"11:15:00",null,null,null,null,"11:15:00",null,null,null,null,"11:15:00"]
[null,"11:30:00",null,null,null,null,"11:30:00",null,null,null,null,"11:30:00",null,null,null,null,"11:30:00",null,null,null,null,"11:30:00",null,null,null,null,"11:30:00"]
[null,"11:45:00",null,null,null,null,"11:45:00",null,null,null,null,"11:45:00",null,null,null,null,"11:45:00",null,null,null,null,"11:45:00",null,null,null,null,"11:45:00"]
[null,"12:00:00",null,null,null,null,"12:00:00",null,null,null,null,"12:00:00",null,null,null,null,"12:00:00",null,null,null,null,"12:00:00",null,null,null,null,"12:00:00"]
[]
[null,null,"CHAUFFEUR","TACHE",null,null,null,"CHAUFFEUR","TACHE",null,null,null,"CHAUFFEUR","TACHE",null,null,null,"CHAUFFEUR","TACHE",null,null,null,"CHAUFFEUR","TACHE"]
[null,null,{"$f":"+C326","v":"CHAUFFEUR 1"},null,null,null,null,{"$f":"+H326","v":"CHAUFFEUR 1"},null,null,null,null,{"$f":"+M326","v":"CHAUFFEUR 1"},null,null,null,null,{"$f":"+R326","v":"CHAUFFEUR 1"},null,null,null,null,{"$f":"+W326","v":"CHAUFFEUR 1"}]
[null,null,{"$f":"+C327","v":"CHAUFFEUR 2"},null,null,null,null,{"$f":"+H327","v":"CHAUFFEUR 2"},null,null,null,null,{"$f":"+M327","v":"CHAUFFEUR 2"},null,null,null,null,{"$f":"+R327","v":"CHAUFFEUR 2"},null,null,null,null,{"$f":"+W327","v":"CHAUFFEUR 2"}]
[null,null,"CHAUFFEUR 3",null,null,null,null,"CHAUFFEUR 3",null,null,null,null,"CHAUFFEUR 3",null,null,null,null,"CHAUFFEUR 3",null,null,null,null,"CHAUFFEUR 3"]
[]
[null,"LUNDI A-P",null,{"$f":"+D330","v":"2020-01-27"},null,null,"MARDI A-P",null,{"$f":"+D359+1","v":"2020-01-28"},null,null,"MERCREDI A-P",null,{"$f":"+I359+1","v":"2020-01-29"},null,null,"JEUDI A-P",null,{"$f":"+N359+1","v":"2020-01-30"},null,null,"VENDREDI A-P",null,{"$f":"+S359+1","v":"2020-01-31"}]
[null,null,{"$f":"+$C$11","v":"CHAUFFEUR 1"},{"$f":"+$C$12","v":"CHAUFFEUR 2"},{"$f":"+$C$13","v":"CHAUFFEUR 3"},null,null,{"$f":"+$C$11","v":"CHAUFFEUR 1"},{"$f":"+$C$12","v":"CHAUFFEUR 2"},{"$f":"+$C$13","v":"CHAUFFEUR 3"},null,null,{"$f":"+$C$11","v":"CHAUFFEUR 1"},{"$f":"+$C$12","v":"CHAUFFEUR 2"},{"$f":"+$C$13","v":"CHAUFFEUR 3"},null,null,{"$f":"+$C$11","v":"CHAUFFEUR 1"},{"$f":"+$C$12","v":"CHAUFFEUR 2"},{"$f":"+$C$13","v":"CHAUFFEUR 3"},null,null,{"$f":"+$C$11","v":"CHAUFFEUR 1"},{"$f":"+$C$12","v":"CHAUFFEUR 2"},{"$f":"+$C$13","v":"CHAUFFEUR 3"}]
[null,"TACHE",{"$f":"+D355","v":0},{"$f":"+D356","v":0},{"$f":"+D357","v":0},null,"TACHE",{"$f":"+I355","v":0},{"$f":"+I356","v":0},{"$f":"+I357","v":0},null,"TACHE",{"$f":"+N355","v":0},{"$f":"+N356","v":0},{"$f":"+N357","v":0},null,"TACHE",{"$f":"+S355","v":0},{"$f":"+S356","v":0},{"$f":"+S357","v":0},null,"TACHE",{"$f":"+X355","v":0},{"$f":"+X356","v":0},{"$f":"+X357","v":0}]
[null,"DISPO:",{"$f":"IF(C361=\"TACHE 1\",\"CHAUFFEUR 1 dispo\",\"NON\")","v":"NON"},{"$f":"IF(D361=\"TACHE 1\",\"CHAUFFEUR 2 dispo\",\"NON\")","v":"NON"},{"$f":"IF(E361:E361=\"TACHE 1\",\"CHAUFFEUR 3 dispo\",\"NON\")","v":"NON"},null,"DISPO:",{"$f":"IF(H361=\"TACHE 1\",\"CHAUFFEUR 1 dispo\",\"NON\")","v":"NON"},{"$f":"IF(I361=\"TACHE 1\",\"CHAUFFEUR 2 dispo\",\"NON\")","v":"NON"},{"$f":"IF(J361:J361=\"TACHE 1\",\"CHAUFFEUR 3 dispo\",\"NON\")","v":"NON"},null,"DISPO:",{"$f":"IF(M361=\"TACHE 1\",\"CHAUFFEUR 1 dispo\",\"NON\")","v":"NON"},{"$f":"IF(N361=\"TACHE 1\",\"CHAUFFEUR 2 dispo\",\"NON\")","v":"NON"},{"$f":"IF(O361:O361=\"TACHE 1\",\"CHAUFFEUR 3 dispo\",\"NON\")","v":"NON"},null,"DISPO:",{"$f":"IF(R361=\"TACHE 1\",\"CHAUFFEUR 1 dispo\",\"NON\")","v":"NON"},{"$f":"IF(S361=\"TACHE 1\",\"CHAUFFEUR 2 dispo\",\"NON\")","v":"NON"},{"$f":"IF(T361:T361=\"TACHE 1\",\"CHAUFFEUR 3 dispo\",\"NON\")","v":"NON"},null,"DISPO:",{"$f":"IF(W361=\"TACHE 1\",\"CHAUFFEUR 1 dispo\",\"NON\")","v":"NON"},{"$f":"IF(X361=\"TACHE 1\",\"CHAUFFEUR 2 dispo\",\"NON\")","v":"NON"},{"$f":"IF(Y361:Y361=\"TACHE 1\",\"CHAUFFEUR 3 dispo\",\"NON\")","v":"NON"}]
[null,"13:30:00",null,null,null,null,"13:30:00",null,null,null,null,"13:30:00",null,null,null,null,"13:30:00",null,null,null,null,"13:30:00"]
[null,"13:45:00",null,null,null,null,"13:45:00",null,null,null,null,"13:45:00",null,null,null,null,"13:45:00",null,null,null,null,"13:45:00"]
[null,"14:00:00",null,null,null,null,"14:00:00",null,null,null,null,"14:00:00",null,null,null,null,"14:00:00",null,null,null,null,"14:00:00"]
[null,"14:15:00",null,null,null,null,"14:15:00",null,null,null,null,"14:15:00",null,null,null,null,"14:15:00",null,null,null,null,"14:15:00"]
[null,"14:30:00",null,null,null,null,"14:30:00",null,null,null,null,"14:30:00",null,null,null,null,"14:30:00",null,null,null,null,"14:30:00"]
[null,"14:45:00",null,null,null,null,"14:45:00",null,null,null,null,"14:45:00",null,null,null,null,"14:45:00",null,null,null,null,"14:45:00"]
[null,"15:00:00",null,null,null,null,"15:00:00",null,null,null,null,"15:00:00",null,null,null,null,"15:00:00",null,null,null,null,"15:00:00"]
[null,"15:15:00",null,null,null,null,"15:15:00",null,null,null,null,"15:15:00",null,null,null,null,"15:15:00",null,null,null,null,"15:15:00"]
[null,"15:30:00",null,null,null,null,"15:30:00",null,null,null,null,"15:30:00",null,null,null,null,"15:30:00",null,null,null,null,"15:30:00"]
[null,"15:45:00",null,null,null,null,"15:45:00",null,null,null,null,"15:45:00",null,null,null,null,"15:45:00",null,null,null,null,"15:45:00"]
[null,"16:00:00",null,null,null,null,"16:00:00",null,null,null,null,"16:00:00",null,null,null,null,"16:00:00",null,null,null,null,"16:00:00"]
[null,"16:15:00",null,null,null,null,"16:15:00",null,null,null,null,"16:15:00",null,null,null,null,"16:15:00",null,null,null,null,"16:15:00"]
[null,"16:30:00",null,null,null,null,"16:30:00",null,null,null,null,"16:30:00",null,null,null,null,"16:30:00",null,null,null,null,"16:30:00"]
[null,"16:45:00",null,null,null,null,"16:45:00",null,null,null,null,"16:45:00",null,null,null,null,"16:45:00",null,null,null,null,"16:45:00"]
[null,"17:00:00",null,null,null,null,"17:00:00",null,null,null,null,"17:00:00",null,null,null,null,"17:00:00",null,null,null,null,"17:00:00"]
[null,"17:15:00",null,null,null,null,"17:15:00",null,null,null,null,"17:15:00",null,null,null,null,"17:15:00",null,null,null,null,"17:15:00"]
[null,"17:30:00",null,null,null,null,"17:30:00",null,null,null,null,"17:30:00",null,null,null,null,"17:30:00",null,null,null,null,"17:30:00"]
[null,"17:45:00",null,null,null,null,"17:45:00",null,null,null,null,"17:45:00",null,null,null,null,"17:45:00",null,null,null,null,"17:45:00"]
[null,"18:00:00",null,null,null,null,"18:00:00",null,null,null,null,"18:00:00",null,null,null,null,"18:00:00",null,null,null,null,"18:00:00"]