{"text_format":"1","workbook":"xlsx","n_sheets":3,"sheets":["Feuil1","Feuil2","Feuil3"],"not_rendered":{"charts":0,"images":0,"macros":1,"external_links":0,"defined_names":1,"comments":0,"pivot_tables":0},"unopened":[],"bounds":{"document_bytes":16777216,"sheet_cells":100000,"rows_first":2000,"rows_last":500,"rows_between":2000,"halvings":0,"cell_chars":16384,"cell_head_chars":4096},"cells_cut":0,"cells_raw":0,"read":"whole","date_system":"1900"}

{"sheet":"Feuil1","index":0,"n_rows":780,"n_cols":14,"rows_kept":780,"cut":false,"hidden":false,"merged":[[0,7,0,8]]}
["QUINE","QUINE",null,"OPTION 1","OPTION 2","OPTION 3",3,"JEU ACTUEL",null,"Série",null,1,1,"QUINE"]
["QUINE 1","QUINE",null,"QUINE","QUINE","QUINE 1",{"$f":"IF(G1=1,1,IF(G1=2,181,IF(G1=3,481,FALSE)))","v":481},{"$f":"IFERROR(VLOOKUP(G4,$L$1:$N$780,3,FALSE),\"\")","v":"QUINE 1"},{"$f":"IFERROR(VLOOKUP(H2,A1:B8,2,FALSE),\"\")","v":"QUINE"},{"$f":"IFERROR(VLOOKUP(G4,$L$1:$N$780,2,FALSE),\"\")","v":1},null,2,1,"DOUBLE"]
["QUINE 2","QUINE",null,"DOUBLE","DOUBLE","QUINE 2",0,null,null,null,null,3,1,"CARTON"]
["DOUBLE","DOUBLE",null,"CARTON","CARTON 1","CARTON 1",{"$f":"G2+G3","v":481},null,null,null,null,4,2,"QUINE"]
["CARTON","CARTON",null,null,"CARTON 2","CARTON 2",null,null,null,null,null,5,2,"DOUBLE"]
["CARTON 1","CARTON",null,null,"CARTON 3","CARTON 3",null,null,null,null,null,6,2,"CARTON"]
["CARTON 2","CARTON",null,null,null,null,null,null,null,null,null,7,3,"QUINE"]
["CARTON 3","CARTON",null,null,null,null,null,null,null,null,null,8,3,"DOUBLE"]
[null,null,null,null,null,null,null,null,null,null,null,9,3,"CARTON"]
[null,null,null,null,null,null,null,null,null,null,null,10,4,"QUINE"]
[null,null,null,null,null,null,null,null,null,null,null,11,4,"DOUBLE"]
[null,null,null,null,null,null,null,null,null,null,null,12,4,"CARTON"]
[null,null,null,null,null,null,null,null,null,null,null,13,5,"QUINE"]
[null,null,null,null,null,null,null,null,null,null,null,14,5,"DOUBLE"]
[null,null,null,null,null,null,null,null,null,null,null,15,5,"CARTON"]
[null,null,null,null,null,null,null,null,null,null,null,16,6,"QUINE"]
[null,null,null,null,null,null,null,null,null,null,null,17,6,"DOUBLE"]
[null,null,null,null,null,null,null,null,null,null,null,18,6,"CARTON"]
[null,null,null,null,null,null,null,null,null,null,null,19,7,"QUINE"]
[null,null,null,null,null,null,null,null,null,null,null,20,7,"DOUBLE"]
[null,null,null,null,null,null,null,null,null,null,null,21,7,"CARTON"]
[null,null,null,null,null,null,null,null,null,null,null,22,8,"QUINE"]
[null,null,null,null,null,null,null,null,null,null,null,23,8,"DOUBLE"]
[null,null,null,null,null,null,null,null,null,null,null,24,8,"CARTON"]
[null,null,null,null,null,null,null,null,null,null,null,25,9,"QUINE"]
[null,null,null,null,null,null,null,null,null,null,null,26,9,"DOUBLE"]
[null,null,null,null,null,null,null,null,null,null,null,27,9,"CARTON"]
[null,null,null,null,null,null,null,null,null,null,null,28,10,"QUINE"]
[null,null,null,null,null,null,null,null,null,null,null,29,10,"DOUBLE"]
[null,null,null,null,null,null,null,null,null,null,null,30,10,"CARTON"]
[null,null,null,null,null,null,null,null,null,null,null,31,11,"QUINE"]
[null,null,null,null,null,null,null,null,null,null,null,32,11,"DOUBLE"]
[null,null,null,null,null,null,null,null,null,null,null,33,11,"CARTON"]
[null,null,null,null,null,null,null,null,null,null,null,34,12,"QUINE"]
[null,null,null,null,null,null,null,null,null,null,null,35,12,"DOUBLE"]
[null,null,null,null,null,null,null,null,null,null,null,36,12,"CARTON"]
[null,null,null,null,null,null,null,null,null,null,null,37,13,"QUINE"]
[null,null,null,null,null,null,null,null,null,null,null,38,13,"DOUBLE"]
[null,null,null,null,null,null,null,null,null,null,null,39,13,"CARTON"]
[null,null,null,null,null,null,null,null,null,null,null,40,14,"QUINE"]
[null,null,null,null,null,null,null,null,null,null,null,41,14,"DOUBLE"]
[null,null,null,null,null,null,null,null,null,null,null,42,14,"CARTON"]
[null,null,null,null,null,null,null,null,null,null,null,43,15,"QUINE"]
[null,null,null,null,null,null,null,null,null,null,null,44,15,"DOUBLE"]
[null,null,null,null,null,null,null,null,null,null,null,45,15,"CARTON"]
[null,null,null,null,null,null,null,null,null,null,null,46,16,"QUINE"]
[null,null,null,null,null,null,null,null,null,null,null,47,16,"DOUBLE"]
[null,null,null,null,null,null,null,null,null,null,null,48,16,"CARTON"]
[null,null,null,null,null,null,null,null,null,null,null,49,17,"QUINE"]
[null,null,null,null,null,null,null,null,null,null,null,50,17,"DOUBLE"]
[null,null,null,null,null,null,null,null,null,null,null,51,17,"CARTON"]
[null,null,null,null,null,null,null,null,null,null,null,52,18,"QUINE"]
[null,null,null,null,null,null,null,null,null,null,null,53,18,"DOUBLE"]
[null,null,null,null,null,null,null,null,null,null,null,54,18,"CARTON"]
[null,null,null,null,null,null,null,null,null,null,null,55,19,"QUINE"]
[null,null,null,null,null,null,null,null,null,null,null,56,19,"DOUBLE"]
[null,null,null,null,null,null,null,null,null,null,null,57,19,"CARTON"]
[null,null,null,null,null,null,null,null,null,null,null,58,20,"QUINE"]
[null,null,null,null,null,null,null,null,null,null,null,59,20,"DOUBLE"]
[null,null,null,null,null,null,null,null,null,null,null,60,20,"CARTON"]
[null,null,null,null,null,null,null,null,null,null,null,61,21,"QUINE"]
[null,null,null,null,null,null,null,null,null,null,null,62,21,"DOUBLE"]
[null,null,null,null,null,null,null,null,null,null,null,63,21,"CARTON"]
[null,null,null,null,null,null,null,null,null,null,null,64,22,"QUINE"]
[null,null,null,null,null,null,null,null,null,null,null,65,22,"DOUBLE"]
[null,null,null,null,null,null,null,null,null,null,null,66,22,"CARTON"]
[null,null,null,null,null,null,null,null,null,null,null,67,23,"QUINE"]
[null,null,null,null,null,null,null,null,null,null,null,68,23,"DOUBLE"]
[null,null,null,null,null,null,null,null,null,null,null,69,23,"CARTON"]
[null,null,null,null,null,null,null,null,null,null,null,70,24,"QUINE"]
[null,null,null,null,null,null,null,null,null,null,null,71,24,"DOUBLE"]
[null,null,null,null,null,null,null,null,null,null,null,72,24,"CARTON"]
[null,null,null,null,null,null,null,null,null,null,null,73,25,"QUINE"]
[null,null,null,null,null,null,null,null,null,null,null,74,25,"DOUBLE"]
[null,null,null,null,null,null,null,null,null,null,null,75,25,"CARTON"]
[null,null,null,null,null,null,null,null,null,null,null,76,26,"QUINE"]
[null,null,null,null,null,null,null,null,null,null,null,77,26,"DOUBLE"]
[null,null,null,null,null,null,null,null,null,null,null,78,26,"CARTON"]
[null,null,null,null,null,null,null,null,null,null,null,79,27,"QUINE"]
[null,null,null,null,null,null,null,null,null,null,null,80,27,"DOUBLE"]
[null,null,null,null,null,null,null,null,null,null,null,81,27,"CARTON"]
[null,null,null,null,null,null,null,null,null,null,null,82,28,"QUINE"]
[null,null,null,null,null,null,null,null,null,null,null,83,28,"DOUBLE"]
[null,null,null,null,null,null,null,null,null,null,null,84,28,"CARTON"]
[null,null,null,null,null,null,null,null,null,null,null,85,29,"QUINE"]
[null,null,null,null,null,null,null,null,null,null,null,86,29,"DOUBLE"]
[null,null,null,null,null,null,null,null,null,null,null,87,29,"CARTON"]
[null,null,null,null,null,null,null,null,null,null,null,88,30,"QUINE"]
[null,null,null,null,null,null,null,null,null,null,null,89,30,"DOUBLE"]
[null,null,null,null,null,null,null,null,null,null,null,90,30,"CARTON"]
[null,null,null,null,null,null,null,null,null,null,null,91,31,"QUINE"]
[null,null,null,null,null,null,null,null,null,null,null,92,31,"DOUBLE"]
[null,null,null,null,null,null,null,null,null,null,null,93,31,"CARTON"]
[null,null,null,null,null,null,null,null,null,null,null,94,32,"QUINE"]
[null,null,null,null,null,null,null,null,null,null,null,95,32,"DOUBLE"]
[null,null,null,null,null,null,null,null,null,null,null,96,32,"CARTON"]
[null,null,null,null,null,null,null,null,null,null,null,97,33,"QUINE"]
[null,null,null,null,null,null,null,null,null,null,null,98,33,"DOUBLE"]
[null,null,null,null,null,null,null,null,null,null,null,99,33,"CARTON"]
[null,null,null,null,null,null,null,null,null,null,null,100,34,"QUINE"]
[null,null,null,null,null,null,null,null,null,null,null,101,34,"DOUBLE"]
[null,null,null,null,null,null,null,null,null,null,null,102,34,"CARTON"]
[null,null,null,null,null,null,null,null,null,null,null,103,35,"QUINE"]
[null,null,null,null,null,null,null,null,null,null,null,104,35,"DOUBLE"]
[null,null,null,null,null,null,null,null,null,null,null,105,35,"CARTON"]
[null,null,null,null,null,null,null,null,null,null,null,106,36,"QUINE"]
[null,null,null,null,null,null,null,null,null,null,null,107,36,"DOUBLE"]
[null,null,null,null,null,null,null,null,null,null,null,108,36,"CARTON"]
[null,null,null,null,null,null,null,null,null,null,null,109,37,"QUINE"]
[null,null,null,null,null,null,null,null,null,null,null,110,37,"DOUBLE"]
[null,null,null,null,null,null,null,null,null,null,null,111,37,"CARTON"]
[null,null,null,null,null,null,null,null,null,null,null,112,38,"QUINE"]
[null,null,null,null,null,null,null,null,null,null,null,113,38,"DOUBLE"]
[null,null,null,null,null,null,null,null,null,null,null,114,38,"CARTON"]
[null,null,null,null,null,null,null,null,null,null,null,115,39,"QUINE"]
[null,null,null,null,null,null,null,null,null,null,null,116,39,"DOUBLE"]
[null,null,null,null,null,null,null,null,null,null,null,117,39,"CARTON"]
[null,null,null,null,null,null,null,null,null,null,null,118,40,"QUINE"]
[null,null,null,null,null,null,null,null,null,null,null,119,40,"DOUBLE"]
[null,null,null,null,null,null,null,null,null,null,null,120,40,"CARTON"]
[null,null,null,null,null,null,null,null,null,null,null,121,41,"QUINE"]
[null,null,null,null,null,null,null,null,null,null,null,122,41,"DOUBLE"]
[null,null,null,null,null,null,null,null,null,null,null,123,41,"CARTON"]
[null,null,null,null,null,null,null,null,null,null,null,124,42,"QUINE"]
[null,null,null,null,null,null,null,null,null,null,null,125,42,"DOUBLE"]
[null,null,null,null,null,null,null,null,null,null,null,126,42,"CARTON"]
[null,null,null,null,null,null,null,null,null,null,null,127,43,"QUINE"]
[null,null,null,null,null,null,null,null,null,null,null,128,43,"DOUBLE"]
[null,null,null,null,null,null,null,null,null,null,null,129,43,"CARTON"]
[null,null,null,null,null,null,null,null,null,null,null,130,44,"QUINE"]
[null,null,null,null,null,null,null,null,null,null,null,131,44,"DOUBLE"]
[null,null,null,null,null,null,null,null,null,null,null,132,44,"CARTON"]
[null,null,null,null,null,null,null,null,null,null,null,133,45,"QUINE"]
[null,null,null,null,null,null,null,null,null,null,null,134,45,"DOUBLE"]
[null,null,null,null,null,null,null,null,null,null,null,135,45,"CARTON"]
[null,null,null,null,null,null,null,null,null,null,null,136,46,"QUINE"]
[null,null,null,null,null,null,null,null,null,null,null,137,46,"DOUBLE"]
[null,null,null,null,null,null,null,null,null,null,null,138,46,"CARTON"]
[null,null,null,null,null,null,null,null,null,null,null,139,47,"QUINE"]
[null,null,null,null,null,null,null,null,null,null,null,140,47,"DOUBLE"]
[null,null,null,null,null,null,null,null,null,null,null,141,47,"CARTON"]
[null,null,null,null,null,null,null,null,null,null,null,142,48,"QUINE"]
[null,null,null,null,null,null,null,null,null,null,null,143,48,"DOUBLE"]
[null,null,null,null,null,null,null,null,null,null,null,144,48,"CARTON"]
[null,null,null,null,null,null,null,null,null,null,null,145,49,"QUINE"]
[null,null,null,null,null,null,null,null,null,null,null,146,49,"DOUBLE"]
[null,null,null,null,null,null,null,null,null,null,null,147,49,"CARTON"]
[null,null,null,null,null,null,null,null,null,null,null,148,50,"QUINE"]
[null,null,null,null,null,null,null,null,null,null,null,149,50,"DOUBLE"]
[null,null,null,null,null,null,null,null,null,null,null,150,50,"CARTON"]
[null,null,null,null,null,null,null,null,null,null,null,151,51,"QUINE"]
[null,null,null,null,null,null,null,null,null,null,null,152,51,"DOUBLE"]
[null,null,null,null,null,null,null,null,null,null,null,153,51,"CARTON"]
[null,null,null,null,null,null,null,null,null,null,null,154,52,"QUINE"]
[null,null,null,null,null,null,null,null,null,null,null,155,52,"DOUBLE"]
[null,null,null,null,null,null,null,null,null,null,null,156,52,"CARTON"]
[null,null,null,null,null,null,null,null,null,null,null,157,53,"QUINE"]
[null,null,null,null,null,null,null,null,null,null,null,158,53,"DOUBLE"]
[null,null,null,null,null,null,null,null,null,null,null,159,53,"CARTON"]
[null,null,null,null,null,null,null,null,null,null,null,160,54,"QUINE"]
[null,null,null,null,null,null,null,null,null,null,null,161,54,"DOUBLE"]
[null,null,null,null,null,null,null,null,null,null,null,162,54,"CARTON"]
[null,null,null,null,null,null,null,null,null,null,null,163,55,"QUINE"]
[null,null,null,null,null,null,null,null,null,null,null,164,55,"DOUBLE"]
[null,null,null,null,null,null,null,null,null,null,null,165,55,"CARTON"]
[null,null,null,null,null,null,null,null,null,null,null,166,56,"QUINE"]
[null,null,null,null,null,null,null,null,null,null,null,167,56,"DOUBLE"]
[null,null,null,null,null,null,null,null,null,null,null,168,56,"CARTON"]
[null,null,null,null,null,null,null,null,null,null,null,169,57,"QUINE"]
[null,null,null,null,null,null,null,null,null,null,null,170,57,"DOUBLE"]
[null,null,null,null,null,null,null,null,null,null,null,171,57,"CARTON"]
[null,null,null,null,null,null,null,null,null,null,null,172,58,"QUINE"]
[null,null,null,null,null,null,null,null,null,null,null,173,58,"DOUBLE"]
[null,null,null,null,null,null,null,null,null,null,null,174,58,"CARTON"]
[null,null,null,null,null,null,null,null,null,null,null,175,59,"QUINE"]
[null,null,null,null,null,null,null,null,null,null,null,176,59,"DOUBLE"]
[null,null,null,null,null,null,null,null,null,null,null,177,59,"CARTON"]
[null,null,null,null,null,null,null,null,null,null,null,178,60,"QUINE"]
[null,null,null,null,null,null,null,null,null,null,null,179,60,"DOUBLE"]
[null,null,null,null,null,null,null,null,null,null,null,180,60,"CARTON"]
[null,null,null,null,null,null,null,null,null,null,null,181,1,"QUINE"]
[null,null,null,null,null,null,null,null,null,null,null,182,1,"DOUBLE"]
[null,null,null,null,null,null,null,null,null,null,null,183,1,"CARTON 1"]
[null,null,null,null,null,null,null,null,null,null,null,184,1,"CARTON 2"]
[null,null,null,null,null,null,null,null,null,null,null,185,1,"CARTON 3"]
[null,null,null,null,null,null,null,null,null,null,null,186,2,"QUINE"]
[null,null,null,null,null,null,null,null,null,null,null,187,2,"DOUBLE"]
[null,null,null,null,null,null,null,null,null,null,null,188,2,"CARTON 1"]
[null,null,null,null,null,null,null,null,null,null,null,189,2,"CARTON 2"]
[null,null,null,null,null,null,null,null,null,null,null,190,2,"CARTON 3"]
[null,null,null,null,null,null,null,null,null,null,null,191,3,"QUINE"]
[null,null,null,null,null,null,null,null,null,null,null,192,3,"DOUBLE"]
[null,null,null,null,null,null,null,null,null,null,null,193,3,"CARTON 1"]
[null,null,null,null,null,null,null,null,null,null,null,194,3,"CARTON 2"]
[null,null,null,null,null,null,null,null,null,null,null,195,3,"CARTON 3"]
[null,null,null,null,null,null,null,null,null,null,null,196,4,"QUINE"]
[null,null,null,null,null,null,null,null,null,null,null,197,4,"DOUBLE"]
[null,null,null,null,null,null,null,null,null,null,null,198,4,"CARTON 1"]
[null,null,null,null,null,null,null,null,null,null,null,199,4,"CARTON 2"]
[null,null,null,null,null,null,null,null,null,null,null,200,4,"CARTON 3"]
{"$rows_left_out":581}
{"sheet":"Feuil2","index":1,"n_rows":1,"n_cols":1,"rows_kept":1,"cut":false,"hidden":false,"merged":[]}
[{"$f":"IFERROR(VLOOKUP(Feuil3!$C$1,Feuil3!$A$1:$B$90,2,FALSE),\"\")","v":41}]

{"sheet":"Feuil3","index":2,"n_rows":90,"n_cols":3,"rows_kept":90,"cut":false,"hidden":false,"merged":[]}
[1,16,{"$f":"COUNTA(B1:B90)","v":9}]
[2,18]
[3,33]
[4,45]
[5,88]
[6,36]
[7,90]
[8,77]
[9,41]
[10]
[11]
[12]
[13]
[14]
[15]
[16]
[17]
[18]
[19]
[20]
[21]
[22]
[23]
[24]
[25]
[26]
[27]
[28]
[29]
[30]
[31]
[32]
[33]
[34]
[35]
[36]
[37]
[38]
[39]
[40]
[41]
[42]
[43]
[44]
[45]
[46]
[47]
[48]
[49]
[50]
[51]
[52]
[53]
[54]
[55]
[56]
[57]
[58]
[59]
[60]
[61]
[62]
[63]
[64]
[65]
[66]
[67]
[68]
[69]
[70]
[71]
[72]
[73]
[74]
[75]
[76]
[77]
[78]
[79]
[80]
[81]
[82]
[83]
[84]
[85]
[86]
[87]
[88]
[89]
[90]