{"text_format":"1","workbook":"xlsx","n_sheets":3,"sheets":["feuil1","FEUIL2","Feuil3"],"not_rendered":{"charts":0,"images":0,"macros":1,"external_links":0,"defined_names":3,"comments":0,"pivot_tables":0},"unopened":[],"bounds":{"document_bytes":16777216,"sheet_cells":100000,"rows_first":2000,"rows_last":500,"rows_between":2000,"halvings":0,"cell_chars":16384,"cell_head_chars":4096},"cells_cut":0,"cells_raw":0,"read":"whole","date_system":"1900"}

{"sheet":"feuil1","index":0,"n_rows":59,"n_cols":15,"rows_kept":59,"cut":false,"hidden":false,"merged":[]}
["NUMDESTIN","DATEPM","MUTUELLE","DR","ASSURE","BENEF","NOM_PRENOM","CENTRE","REFERDECOMPTE","MOTIF","MONTANT","DETTES"]
["077","01/04/2019",null,"S",null,null,"bourdin","6751","6041","     6",-2252,195400]
["077","01/04/2019",null,"S","279","1301791",null,"6751","6041","     6",739.2]
["077","01/04/2019",null,"S","279","1301791",null,"6751","6041","     6",756.4]
["077","01/04/2019",null,"S","279","1301791",null,"6751","6041","     6",756.4]
["077","01/04/2019",null,"S","279","1301791",null,"6751","6041","     6",756.4]
["077","01/04/2019",null,"S","279","1301791",null,"6751","6041","     6",-756.4]
["077","01/04/2019",null,"S","279","1301791",null,"6751","6041","     6",756.4]
["077","01/04/2019",null,"S","279","1301791",null,"6751","6041","     6",-756.4]
["077","01/04/2019",null,"S","279","1301791",null,"6751","6041","     6",756.4]
["077","01/04/2019",null,"S","279","1301791",null,"6751","6041","     6",133.77000000000001]
["077","01/04/2019",null,"S","279","1301791",null,"6751","6041","     6",132.37]
["077","01/04/2019",null,"S","279","1301791",null,"6751","6041","     6",-739.2]
[]
[]
["087","01/04/2019",null,"TP","192","0512921","JULIEN","6751","6321 ","A",9.86,195201]
[]
[]
["0876","01/04/2019",null,"TP","175","0708751","DIMITRI","6751","6711 ",null,28,195421]
["0876","01/04/2019","756","TP","175","0708751",null,"6751","6711 ","M7",12]
[]
[]
["08767","01/04/2019",null,"TP","164","0611641","RAUQUEL","6751","6731 ","M",33.979999999999997,195362]
[]
[]
["193 ","01/04/2019",null,"A","19308","1908931",null,"6751","67511","  3",-2.5,195361]
["1 93 ","01/04/2019",null,"A","19308","1908931","JOSE","6751","67511","  3",6.5]
[]
[]
[194,"01/04/2019",null,"A","19405","0205941",null,"6751","67511 ",null,-20.5,195350]
[194,"01/04/2019",null,"A","19405","0205941","MARIA","6751","68111",null,28.19]
[]
[]
["2 93 ","01/04/2019",null,"A",2931,"2707931",null,"6751",6789,null,-9,195351]
["2 93 ","01/04/2019",null,"A","2931","2707931","PAUL","6751",6789,null,16.5]
["7823","2019-04-02",null,"S","183",2206831,"CHRISTOPHE",6751,1100,6,112.41]
["7823","2019-04-02",null,"S","279",1301791,null,6751,1100,6,18.91]
[]
[]
[161,"2019-04-02",null,"A","1610",409611,null,6401,4600,null,-4.5,195352]
[161,"2019-04-02",null,"A","1610975067011",409611,"PATRICK",6401,1300,null,982.13,null,null,null,0]
[]
[]
[168,"2019-04-02",null,"A",959178044,509681,"FRANCK",6401,3300,null,858.02,195353]
[]
[]
[1921,"2019-04-02",null,"A","19201",2601921,"FLORIEN",6751,4000,null,16.100000000000001,195354]
[]
[]
["2 93 ","2019-04-02",null,"A",22150,101901,"PAUL",8670,2900,null,46.36,195355]
["2 93 ","2019-04-02",756,"A",22150,101901,null,8670,2900,null,15.66]
[]
[]
[716,"2019-04-02",null,"A",3585,2112021,"MARTINE",6751,3900,6,7.5,195356]
[716,"2019-04-02",89893,"A",3585,2112021,null,6751,3900,6,17.5]
[]
[]
[831,"2019-04-02",null,"A",2529,3008041,"MICHEL",8670,1090,3,26.41,195357]
[813,"2019-04-02",998,"A",2529,3008041,"MICHEL",8670,1090,3,11.32]

{"sheet":"FEUIL2","index":1,"n_rows":250,"n_cols":9,"rows_kept":250,"cut":false,"hidden":false,"merged":[[0,7,0,8]]}
["NUMDESTIN","NOM_PRENOM","MOTIF","MONTANT","DETTES",null,null,"Récapitulatif du Mois"]
[null,{"$f":"IF(A2=\"\",\"\",+VLOOKUP(A2,feuil1!A2:L10023,7,FALSE))","v":""},{"$f":"IF(A2=\"\",\"\",VLOOKUP(A2,feuil1!A2:M10023,10,FALSE))","v":""},{"$f":"SUMIF(feuil1!A2:A10023,FEUIL2!A2,feuil1!K2:K10023)","v":0},{"$f":"IF(A2=\"\",\"\",VLOOKUP(A2,feuil1!A2:O10023,12,FALSE))","v":""},null,null,"Montant","Nbr de dettes"]
[null,{"$f":"IF(A3=\"\",\"\",+VLOOKUP(A3,feuil1!A3:L10024,7,FALSE))","v":""},{"$f":"IF(A3=\"\",\"\",VLOOKUP(A3,feuil1!A3:M10024,10,FALSE))","v":""},{"$f":"SUMIF(feuil1!A3:A10024,FEUIL2!A3,feuil1!K3:K10024)","v":0},{"$f":"IF(A3=\"\",\"\",VLOOKUP(A3,feuil1!A3:O10024,12,FALSE))","v":""},null,null,{"$f":"SUM(D2:D250)","v":0},{"$f":"COUNT(E2:E250)","v":0}]
[null,{"$f":"IF(A4=\"\",\"\",+VLOOKUP(A4,feuil1!A4:L10025,7,FALSE))","v":""},{"$f":"IF(A4=\"\",\"\",VLOOKUP(A4,feuil1!A4:M10025,10,FALSE))","v":""},{"$f":"SUMIF(feuil1!A4:A10025,FEUIL2!A4,feuil1!K4:K10025)","v":0},{"$f":"IF(A4=\"\",\"\",VLOOKUP(A4,feuil1!A4:O10025,12,FALSE))","v":""}]
[null,{"$f":"IF(A5=\"\",\"\",+VLOOKUP(A5,feuil1!A5:L10026,7,FALSE))","v":""},{"$f":"IF(A5=\"\",\"\",VLOOKUP(A5,feuil1!A5:M10026,10,FALSE))","v":""},{"$f":"SUMIF(feuil1!A5:A10026,FEUIL2!A5,feuil1!K5:K10026)","v":0},{"$f":"IF(A5=\"\",\"\",VLOOKUP(A5,feuil1!A5:O10026,12,FALSE))","v":""}]
[null,{"$f":"IF(A6=\"\",\"\",+VLOOKUP(A6,feuil1!A6:L10027,7,FALSE))","v":""},{"$f":"IF(A6=\"\",\"\",VLOOKUP(A6,feuil1!A6:M10027,10,FALSE))","v":""},{"$f":"SUMIF(feuil1!A6:A10027,FEUIL2!A6,feuil1!K6:K10027)","v":0},{"$f":"IF(A6=\"\",\"\",VLOOKUP(A6,feuil1!A6:O10027,12,FALSE))","v":""}]
[null,{"$f":"IF(A7=\"\",\"\",+VLOOKUP(A7,feuil1!A7:L10028,7,FALSE))","v":""},{"$f":"IF(A7=\"\",\"\",VLOOKUP(A7,feuil1!A7:M10028,10,FALSE))","v":""},{"$f":"SUMIF(feuil1!A7:A10028,FEUIL2!A7,feuil1!K7:K10028)","v":0},{"$f":"IF(A7=\"\",\"\",VLOOKUP(A7,feuil1!A7:O10028,12,FALSE))","v":""}]
[null,{"$f":"IF(A8=\"\",\"\",+VLOOKUP(A8,feuil1!A8:L10029,7,FALSE))","v":""},{"$f":"IF(A8=\"\",\"\",VLOOKUP(A8,feuil1!A8:M10029,10,FALSE))","v":""},{"$f":"SUMIF(feuil1!A8:A10029,FEUIL2!A8,feuil1!K8:K10029)","v":0},{"$f":"IF(A8=\"\",\"\",VLOOKUP(A8,feuil1!A8:O10029,12,FALSE))","v":""}]
[null,{"$f":"IF(A9=\"\",\"\",+VLOOKUP(A9,feuil1!A9:L10030,7,FALSE))","v":""},{"$f":"IF(A9=\"\",\"\",VLOOKUP(A9,feuil1!A9:M10030,10,FALSE))","v":""},{"$f":"SUMIF(feuil1!A9:A10030,FEUIL2!A9,feuil1!K9:K10030)","v":0},{"$f":"IF(A9=\"\",\"\",VLOOKUP(A9,feuil1!A9:O10030,12,FALSE))","v":""}]
[null,{"$f":"IF(A10=\"\",\"\",+VLOOKUP(A10,feuil1!A10:L10031,7,FALSE))","v":""},{"$f":"IF(A10=\"\",\"\",VLOOKUP(A10,feuil1!A10:M10031,10,FALSE))","v":""},{"$f":"SUMIF(feuil1!A10:A10031,FEUIL2!A10,feuil1!K10:K10031)","v":0},{"$f":"IF(A10=\"\",\"\",VLOOKUP(A10,feuil1!A10:O10031,12,FALSE))","v":""}]
[null,{"$f":"IF(A11=\"\",\"\",+VLOOKUP(A11,feuil1!A11:L10032,7,FALSE))","v":""},{"$f":"IF(A11=\"\",\"\",VLOOKUP(A11,feuil1!A11:M10032,10,FALSE))","v":""},{"$f":"SUMIF(feuil1!A11:A10032,FEUIL2!A11,feuil1!K11:K10032)","v":0},{"$f":"IF(A11=\"\",\"\",VLOOKUP(A11,feuil1!A11:O10032,12,FALSE))","v":""}]
[null,{"$f":"IF(A12=\"\",\"\",+VLOOKUP(A12,feuil1!A12:L10033,7,FALSE))","v":""},{"$f":"IF(A12=\"\",\"\",VLOOKUP(A12,feuil1!A12:M10033,10,FALSE))","v":""},{"$f":"SUMIF(feuil1!A12:A10033,FEUIL2!A12,feuil1!K12:K10033)","v":0},{"$f":"IF(A12=\"\",\"\",VLOOKUP(A12,feuil1!A12:O10033,12,FALSE))","v":""}]
[null,{"$f":"IF(A13=\"\",\"\",+VLOOKUP(A13,feuil1!A13:L10034,7,FALSE))","v":""},{"$f":"IF(A13=\"\",\"\",VLOOKUP(A13,feuil1!A13:M10034,10,FALSE))","v":""},{"$f":"SUMIF(feuil1!A13:A10034,FEUIL2!A13,feuil1!K13:K10034)","v":0},{"$f":"IF(A13=\"\",\"\",VLOOKUP(A13,feuil1!A13:O10034,12,FALSE))","v":""}]
[null,{"$f":"IF(A14=\"\",\"\",+VLOOKUP(A14,feuil1!A14:L10035,7,FALSE))","v":""},{"$f":"IF(A14=\"\",\"\",VLOOKUP(A14,feuil1!A14:M10035,10,FALSE))","v":""},{"$f":"SUMIF(feuil1!A14:A10035,FEUIL2!A14,feuil1!K14:K10035)","v":0},{"$f":"IF(A14=\"\",\"\",VLOOKUP(A14,feuil1!A14:O10035,12,FALSE))","v":""}]
[null,{"$f":"IF(A15=\"\",\"\",+VLOOKUP(A15,feuil1!A15:L10036,7,FALSE))","v":""},{"$f":"IF(A15=\"\",\"\",VLOOKUP(A15,feuil1!A15:M10036,10,FALSE))","v":""},{"$f":"SUMIF(feuil1!A15:A10036,FEUIL2!A15,feuil1!K15:K10036)","v":0},{"$f":"IF(A15=\"\",\"\",VLOOKUP(A15,feuil1!A15:O10036,12,FALSE))","v":""}]
[null,{"$f":"IF(A16=\"\",\"\",+VLOOKUP(A16,feuil1!A16:L10037,7,FALSE))","v":""},{"$f":"IF(A16=\"\",\"\",VLOOKUP(A16,feuil1!A16:M10037,10,FALSE))","v":""},{"$f":"SUMIF(feuil1!A16:A10037,FEUIL2!A16,feuil1!K16:K10037)","v":0},{"$f":"IF(A16=\"\",\"\",VLOOKUP(A16,feuil1!A16:O10037,12,FALSE))","v":""}]
[null,{"$f":"IF(A17=\"\",\"\",+VLOOKUP(A17,feuil1!A17:L10038,7,FALSE))","v":""},{"$f":"IF(A17=\"\",\"\",VLOOKUP(A17,feuil1!A17:M10038,10,FALSE))","v":""},{"$f":"SUMIF(feuil1!A17:A10038,FEUIL2!A17,feuil1!K17:K10038)","v":0},{"$f":"IF(A17=\"\",\"\",VLOOKUP(A17,feuil1!A17:O10038,12,FALSE))","v":""}]
[null,{"$f":"IF(A18=\"\",\"\",+VLOOKUP(A18,feuil1!A18:L10039,7,FALSE))","v":""},{"$f":"IF(A18=\"\",\"\",VLOOKUP(A18,feuil1!A18:M10039,10,FALSE))","v":""},{"$f":"SUMIF(feuil1!A18:A10039,FEUIL2!A18,feuil1!K18:K10039)","v":0},{"$f":"IF(A18=\"\",\"\",VLOOKUP(A18,feuil1!A18:O10039,12,FALSE))","v":""}]
[null,{"$f":"IF(A19=\"\",\"\",+VLOOKUP(A19,feuil1!A19:L10040,7,FALSE))","v":""},{"$f":"IF(A19=\"\",\"\",VLOOKUP(A19,feuil1!A19:M10040,10,FALSE))","v":""},{"$f":"SUMIF(feuil1!A19:A10040,FEUIL2!A19,feuil1!K19:K10040)","v":0},{"$f":"IF(A19=\"\",\"\",VLOOKUP(A19,feuil1!A19:O10040,12,FALSE))","v":""}]
[null,{"$f":"IF(A20=\"\",\"\",+VLOOKUP(A20,feuil1!A20:L10041,7,FALSE))","v":""},{"$f":"IF(A20=\"\",\"\",VLOOKUP(A20,feuil1!A20:M10041,10,FALSE))","v":""},{"$f":"SUMIF(feuil1!A20:A10041,FEUIL2!A20,feuil1!K20:K10041)","v":0},{"$f":"IF(A20=\"\",\"\",VLOOKUP(A20,feuil1!A20:O10041,12,FALSE))","v":""}]
[null,{"$f":"IF(A21=\"\",\"\",+VLOOKUP(A21,feuil1!A21:L10042,7,FALSE))","v":""},{"$f":"IF(A21=\"\",\"\",VLOOKUP(A21,feuil1!A21:M10042,10,FALSE))","v":""},{"$f":"SUMIF(feuil1!A21:A10042,FEUIL2!A21,feuil1!K21:K10042)","v":0},{"$f":"IF(A21=\"\",\"\",VLOOKUP(A21,feuil1!A21:O10042,12,FALSE))","v":""}]
[null,{"$f":"IF(A22=\"\",\"\",+VLOOKUP(A22,feuil1!A22:L10043,7,FALSE))","v":""},{"$f":"IF(A22=\"\",\"\",VLOOKUP(A22,feuil1!A22:M10043,10,FALSE))","v":""},{"$f":"SUMIF(feuil1!A22:A10043,FEUIL2!A22,feuil1!K22:K10043)","v":0},{"$f":"IF(A22=\"\",\"\",VLOOKUP(A22,feuil1!A22:O10043,12,FALSE))","v":""}]
[null,{"$f":"IF(A23=\"\",\"\",+VLOOKUP(A23,feuil1!A23:L10044,7,FALSE))","v":""},{"$f":"IF(A23=\"\",\"\",VLOOKUP(A23,feuil1!A23:M10044,10,FALSE))","v":""},{"$f":"SUMIF(feuil1!A23:A10044,FEUIL2!A23,feuil1!K23:K10044)","v":0},{"$f":"IF(A23=\"\",\"\",VLOOKUP(A23,feuil1!A23:O10044,12,FALSE))","v":""}]
[null,{"$f":"IF(A24=\"\",\"\",+VLOOKUP(A24,feuil1!A24:L10045,7,FALSE))","v":""},{"$f":"IF(A24=\"\",\"\",VLOOKUP(A24,feuil1!A24:M10045,10,FALSE))","v":""},{"$f":"SUMIF(feuil1!A24:A10045,FEUIL2!A24,feuil1!K24:K10045)","v":0},{"$f":"IF(A24=\"\",\"\",VLOOKUP(A24,feuil1!A24:O10045,12,FALSE))","v":""}]
[null,{"$f":"IF(A25=\"\",\"\",+VLOOKUP(A25,feuil1!A25:L10046,7,FALSE))","v":""},{"$f":"IF(A25=\"\",\"\",VLOOKUP(A25,feuil1!A25:M10046,10,FALSE))","v":""},{"$f":"SUMIF(feuil1!A25:A10046,FEUIL2!A25,feuil1!K25:K10046)","v":0},{"$f":"IF(A25=\"\",\"\",VLOOKUP(A25,feuil1!A25:O10046,12,FALSE))","v":""}]
[null,{"$f":"IF(A26=\"\",\"\",+VLOOKUP(A26,feuil1!A26:L10047,7,FALSE))","v":""},{"$f":"IF(A26=\"\",\"\",VLOOKUP(A26,feuil1!A26:M10047,10,FALSE))","v":""},{"$f":"SUMIF(feuil1!A26:A10047,FEUIL2!A26,feuil1!K26:K10047)","v":0},{"$f":"IF(A26=\"\",\"\",VLOOKUP(A26,feuil1!A26:O10047,12,FALSE))","v":""}]
[null,{"$f":"IF(A27=\"\",\"\",+VLOOKUP(A27,feuil1!A27:L10048,7,FALSE))","v":""},{"$f":"IF(A27=\"\",\"\",VLOOKUP(A27,feuil1!A27:M10048,10,FALSE))","v":""},{"$f":"SUMIF(feuil1!A27:A10048,FEUIL2!A27,feuil1!K27:K10048)","v":0},{"$f":"IF(A27=\"\",\"\",VLOOKUP(A27,feuil1!A27:O10048,12,FALSE))","v":""}]
[null,{"$f":"IF(A28=\"\",\"\",+VLOOKUP(A28,feuil1!A28:L10049,7,FALSE))","v":""},{"$f":"IF(A28=\"\",\"\",VLOOKUP(A28,feuil1!A28:M10049,10,FALSE))","v":""},{"$f":"SUMIF(feuil1!A28:A10049,FEUIL2!A28,feuil1!K28:K10049)","v":0},{"$f":"IF(A28=\"\",\"\",VLOOKUP(A28,feuil1!A28:O10049,12,FALSE))","v":""}]
[null,{"$f":"IF(A29=\"\",\"\",+VLOOKUP(A29,feuil1!A29:L10050,7,FALSE))","v":""},{"$f":"IF(A29=\"\",\"\",VLOOKUP(A29,feuil1!A29:M10050,10,FALSE))","v":""},{"$f":"SUMIF(feuil1!A29:A10050,FEUIL2!A29,feuil1!K29:K10050)","v":0},{"$f":"IF(A29=\"\",\"\",VLOOKUP(A29,feuil1!A29:O10050,12,FALSE))","v":""}]
[null,{"$f":"IF(A30=\"\",\"\",+VLOOKUP(A30,feuil1!A30:L10051,7,FALSE))","v":""},{"$f":"IF(A30=\"\",\"\",VLOOKUP(A30,feuil1!A30:M10051,10,FALSE))","v":""},{"$f":"SUMIF(feuil1!A30:A10051,FEUIL2!A30,feuil1!K30:K10051)","v":0},{"$f":"IF(A30=\"\",\"\",VLOOKUP(A30,feuil1!A30:O10051,12,FALSE))","v":""}]
[null,{"$f":"IF(A31=\"\",\"\",+VLOOKUP(A31,feuil1!A31:L10052,7,FALSE))","v":""},{"$f":"IF(A31=\"\",\"\",VLOOKUP(A31,feuil1!A31:M10052,10,FALSE))","v":""},{"$f":"SUMIF(feuil1!A31:A10052,FEUIL2!A31,feuil1!K31:K10052)","v":0},{"$f":"IF(A31=\"\",\"\",VLOOKUP(A31,feuil1!A31:O10052,12,FALSE))","v":""}]
[null,{"$f":"IF(A32=\"\",\"\",+VLOOKUP(A32,feuil1!A32:L10053,7,FALSE))","v":""},{"$f":"IF(A32=\"\",\"\",VLOOKUP(A32,feuil1!A32:M10053,10,FALSE))","v":""},{"$f":"SUMIF(feuil1!A32:A10053,FEUIL2!A32,feuil1!K32:K10053)","v":0},{"$f":"IF(A32=\"\",\"\",VLOOKUP(A32,feuil1!A32:O10053,12,FALSE))","v":""}]
[null,{"$f":"IF(A33=\"\",\"\",+VLOOKUP(A33,feuil1!A33:L10054,7,FALSE))","v":""},{"$f":"IF(A33=\"\",\"\",VLOOKUP(A33,feuil1!A33:M10054,10,FALSE))","v":""},{"$f":"SUMIF(feuil1!A33:A10054,FEUIL2!A33,feuil1!K33:K10054)","v":0},{"$f":"IF(A33=\"\",\"\",VLOOKUP(A33,feuil1!A33:O10054,12,FALSE))","v":""}]
[null,{"$f":"IF(A34=\"\",\"\",+VLOOKUP(A34,feuil1!A34:L10055,7,FALSE))","v":""},{"$f":"IF(A34=\"\",\"\",VLOOKUP(A34,feuil1!A34:M10055,10,FALSE))","v":""},{"$f":"SUMIF(feuil1!A34:A10055,FEUIL2!A34,feuil1!K34:K10055)","v":0},{"$f":"IF(A34=\"\",\"\",VLOOKUP(A34,feuil1!A34:O10055,12,FALSE))","v":""}]
[null,{"$f":"IF(A35=\"\",\"\",+VLOOKUP(A35,feuil1!A35:L10056,7,FALSE))","v":""},{"$f":"IF(A35=\"\",\"\",VLOOKUP(A35,feuil1!A35:M10056,10,FALSE))","v":""},{"$f":"SUMIF(feuil1!A35:A10056,FEUIL2!A35,feuil1!K35:K10056)","v":0},{"$f":"IF(A35=\"\",\"\",VLOOKUP(A35,feuil1!A35:O10056,12,FALSE))","v":""}]
[null,{"$f":"IF(A36=\"\",\"\",+VLOOKUP(A36,feuil1!A36:L10057,7,FALSE))","v":""},{"$f":"IF(A36=\"\",\"\",VLOOKUP(A36,feuil1!A36:M10057,10,FALSE))","v":""},{"$f":"SUMIF(feuil1!A36:A10057,FEUIL2!A36,feuil1!K36:K10057)","v":0},{"$f":"IF(A36=\"\",\"\",VLOOKUP(A36,feuil1!A36:O10057,12,FALSE))","v":""}]
[null,{"$f":"IF(A37=\"\",\"\",+VLOOKUP(A37,feuil1!A37:L10058,7,FALSE))","v":""},{"$f":"IF(A37=\"\",\"\",VLOOKUP(A37,feuil1!A37:M10058,10,FALSE))","v":""},{"$f":"SUMIF(feuil1!A37:A10058,FEUIL2!A37,feuil1!K37:K10058)","v":0},{"$f":"IF(A37=\"\",\"\",VLOOKUP(A37,feuil1!A37:O10058,12,FALSE))","v":""}]
[null,{"$f":"IF(A38=\"\",\"\",+VLOOKUP(A38,feuil1!A38:L10059,7,FALSE))","v":""},{"$f":"IF(A38=\"\",\"\",VLOOKUP(A38,feuil1!A38:M10059,10,FALSE))","v":""},{"$f":"SUMIF(feuil1!A38:A10059,FEUIL2!A38,feuil1!K38:K10059)","v":0},{"$f":"IF(A38=\"\",\"\",VLOOKUP(A38,feuil1!A38:O10059,12,FALSE))","v":""}]
[null,{"$f":"IF(A39=\"\",\"\",+VLOOKUP(A39,feuil1!A39:L10060,7,FALSE))","v":""},{"$f":"IF(A39=\"\",\"\",VLOOKUP(A39,feuil1!A39:M10060,10,FALSE))","v":""},{"$f":"SUMIF(feuil1!A39:A10060,FEUIL2!A39,feuil1!K39:K10060)","v":0},{"$f":"IF(A39=\"\",\"\",VLOOKUP(A39,feuil1!A39:O10060,12,FALSE))","v":""}]
[null,{"$f":"IF(A40=\"\",\"\",+VLOOKUP(A40,feuil1!A40:L10061,7,FALSE))","v":""},{"$f":"IF(A40=\"\",\"\",VLOOKUP(A40,feuil1!A40:M10061,10,FALSE))","v":""},{"$f":"SUMIF(feuil1!A40:A10061,FEUIL2!A40,feuil1!K40:K10061)","v":0},{"$f":"IF(A40=\"\",\"\",VLOOKUP(A40,feuil1!A40:O10061,12,FALSE))","v":""}]
[null,{"$f":"IF(A41=\"\",\"\",+VLOOKUP(A41,feuil1!A41:L10062,7,FALSE))","v":""},{"$f":"IF(A41=\"\",\"\",VLOOKUP(A41,feuil1!A41:M10062,10,FALSE))","v":""},{"$f":"SUMIF(feuil1!A41:A10062,FEUIL2!A41,feuil1!K41:K10062)","v":0},{"$f":"IF(A41=\"\",\"\",VLOOKUP(A41,feuil1!A41:O10062,12,FALSE))","v":""}]
[null,{"$f":"IF(A42=\"\",\"\",+VLOOKUP(A42,feuil1!A42:L10063,7,FALSE))","v":""},{"$f":"IF(A42=\"\",\"\",VLOOKUP(A42,feuil1!A42:M10063,10,FALSE))","v":""},{"$f":"SUMIF(feuil1!A42:A10063,FEUIL2!A42,feuil1!K42:K10063)","v":0},{"$f":"IF(A42=\"\",\"\",VLOOKUP(A42,feuil1!A42:O10063,12,FALSE))","v":""}]
[null,{"$f":"IF(A43=\"\",\"\",+VLOOKUP(A43,feuil1!A43:L10064,7,FALSE))","v":""},{"$f":"IF(A43=\"\",\"\",VLOOKUP(A43,feuil1!A43:M10064,10,FALSE))","v":""},{"$f":"SUMIF(feuil1!A43:A10064,FEUIL2!A43,feuil1!K43:K10064)","v":0},{"$f":"IF(A43=\"\",\"\",VLOOKUP(A43,feuil1!A43:O10064,12,FALSE))","v":""}]
[null,{"$f":"IF(A44=\"\",\"\",+VLOOKUP(A44,feuil1!A44:L10065,7,FALSE))","v":""},{"$f":"IF(A44=\"\",\"\",VLOOKUP(A44,feuil1!A44:M10065,10,FALSE))","v":""},{"$f":"SUMIF(feuil1!A44:A10065,FEUIL2!A44,feuil1!K44:K10065)","v":0},{"$f":"IF(A44=\"\",\"\",VLOOKUP(A44,feuil1!A44:O10065,12,FALSE))","v":""}]
[null,{"$f":"IF(A45=\"\",\"\",+VLOOKUP(A45,feuil1!A45:L10066,7,FALSE))","v":""},{"$f":"IF(A45=\"\",\"\",VLOOKUP(A45,feuil1!A45:M10066,10,FALSE))","v":""},{"$f":"SUMIF(feuil1!A45:A10066,FEUIL2!A45,feuil1!K45:K10066)","v":0},{"$f":"IF(A45=\"\",\"\",VLOOKUP(A45,feuil1!A45:O10066,12,FALSE))","v":""}]
[null,{"$f":"IF(A46=\"\",\"\",+VLOOKUP(A46,feuil1!A46:L10067,7,FALSE))","v":""},{"$f":"IF(A46=\"\",\"\",VLOOKUP(A46,feuil1!A46:M10067,10,FALSE))","v":""},{"$f":"SUMIF(feuil1!A46:A10067,FEUIL2!A46,feuil1!K46:K10067)","v":0},{"$f":"IF(A46=\"\",\"\",VLOOKUP(A46,feuil1!A46:O10067,12,FALSE))","v":""}]
[null,{"$f":"IF(A47=\"\",\"\",+VLOOKUP(A47,feuil1!A47:L10068,7,FALSE))","v":""},{"$f":"IF(A47=\"\",\"\",VLOOKUP(A47,feuil1!A47:M10068,10,FALSE))","v":""},{"$f":"SUMIF(feuil1!A47:A10068,FEUIL2!A47,feuil1!K47:K10068)","v":0},{"$f":"IF(A47=\"\",\"\",VLOOKUP(A47,feuil1!A47:O10068,12,FALSE))","v":""}]
[null,{"$f":"IF(A48=\"\",\"\",+VLOOKUP(A48,feuil1!A48:L10069,7,FALSE))","v":""},{"$f":"IF(A48=\"\",\"\",VLOOKUP(A48,feuil1!A48:M10069,10,FALSE))","v":""},{"$f":"SUMIF(feuil1!A48:A10069,FEUIL2!A48,feuil1!K48:K10069)","v":0},{"$f":"IF(A48=\"\",\"\",VLOOKUP(A48,feuil1!A48:O10069,12,FALSE))","v":""}]
[null,{"$f":"IF(A49=\"\",\"\",+VLOOKUP(A49,feuil1!A49:L10070,7,FALSE))","v":""},{"$f":"IF(A49=\"\",\"\",VLOOKUP(A49,feuil1!A49:M10070,10,FALSE))","v":""},{"$f":"SUMIF(feuil1!A49:A10070,FEUIL2!A49,feuil1!K49:K10070)","v":0},{"$f":"IF(A49=\"\",\"\",VLOOKUP(A49,feuil1!A49:O10070,12,FALSE))","v":""}]
[null,{"$f":"IF(A50=\"\",\"\",+VLOOKUP(A50,feuil1!A50:L10071,7,FALSE))","v":""},{"$f":"IF(A50=\"\",\"\",VLOOKUP(A50,feuil1!A50:M10071,10,FALSE))","v":""},{"$f":"SUMIF(feuil1!A50:A10071,FEUIL2!A50,feuil1!K50:K10071)","v":0},{"$f":"IF(A50=\"\",\"\",VLOOKUP(A50,feuil1!A50:O10071,12,FALSE))","v":""}]
[null,{"$f":"IF(A51=\"\",\"\",+VLOOKUP(A51,feuil1!A51:L10072,7,FALSE))","v":""},{"$f":"IF(A51=\"\",\"\",VLOOKUP(A51,feuil1!A51:M10072,10,FALSE))","v":""},{"$f":"SUMIF(feuil1!A51:A10072,FEUIL2!A51,feuil1!K51:K10072)","v":0},{"$f":"IF(A51=\"\",\"\",VLOOKUP(A51,feuil1!A51:O10072,12,FALSE))","v":""}]
[null,{"$f":"IF(A52=\"\",\"\",+VLOOKUP(A52,feuil1!A52:L10073,7,FALSE))","v":""},{"$f":"IF(A52=\"\",\"\",VLOOKUP(A52,feuil1!A52:M10073,10,FALSE))","v":""},{"$f":"SUMIF(feuil1!A52:A10073,FEUIL2!A52,feuil1!K52:K10073)","v":0},{"$f":"IF(A52=\"\",\"\",VLOOKUP(A52,feuil1!A52:O10073,12,FALSE))","v":""}]
[null,{"$f":"IF(A53=\"\",\"\",+VLOOKUP(A53,feuil1!A53:L10074,7,FALSE))","v":""},{"$f":"IF(A53=\"\",\"\",VLOOKUP(A53,feuil1!A53:M10074,10,FALSE))","v":""},{"$f":"SUMIF(feuil1!A53:A10074,FEUIL2!A53,feuil1!K53:K10074)","v":0},{"$f":"IF(A53=\"\",\"\",VLOOKUP(A53,feuil1!A53:O10074,12,FALSE))","v":""}]
[null,{"$f":"IF(A54=\"\",\"\",+VLOOKUP(A54,feuil1!A54:L10075,7,FALSE))","v":""},{"$f":"IF(A54=\"\",\"\",VLOOKUP(A54,feuil1!A54:M10075,10,FALSE))","v":""},{"$f":"SUMIF(feuil1!A54:A10075,FEUIL2!A54,feuil1!K54:K10075)","v":0},{"$f":"IF(A54=\"\",\"\",VLOOKUP(A54,feuil1!A54:O10075,12,FALSE))","v":""}]
[null,{"$f":"IF(A55=\"\",\"\",+VLOOKUP(A55,feuil1!A55:L10076,7,FALSE))","v":""},{"$f":"IF(A55=\"\",\"\",VLOOKUP(A55,feuil1!A55:M10076,10,FALSE))","v":""},{"$f":"SUMIF(feuil1!A55:A10076,FEUIL2!A55,feuil1!K55:K10076)","v":0},{"$f":"IF(A55=\"\",\"\",VLOOKUP(A55,feuil1!A55:O10076,12,FALSE))","v":""}]
[null,{"$f":"IF(A56=\"\",\"\",+VLOOKUP(A56,feuil1!A56:L10077,7,FALSE))","v":""},{"$f":"IF(A56=\"\",\"\",VLOOKUP(A56,feuil1!A56:M10077,10,FALSE))","v":""},{"$f":"SUMIF(feuil1!A56:A10077,FEUIL2!A56,feuil1!K56:K10077)","v":0},{"$f":"IF(A56=\"\",\"\",VLOOKUP(A56,feuil1!A56:O10077,12,FALSE))","v":""}]
[null,{"$f":"IF(A57=\"\",\"\",+VLOOKUP(A57,feuil1!A57:L10078,7,FALSE))","v":""},{"$f":"IF(A57=\"\",\"\",VLOOKUP(A57,feuil1!A57:M10078,10,FALSE))","v":""},{"$f":"SUMIF(feuil1!A57:A10078,FEUIL2!A57,feuil1!K57:K10078)","v":0},{"$f":"IF(A57=\"\",\"\",VLOOKUP(A57,feuil1!A57:O10078,12,FALSE))","v":""}]
[null,{"$f":"IF(A58=\"\",\"\",+VLOOKUP(A58,feuil1!A58:L10079,7,FALSE))","v":""},{"$f":"IF(A58=\"\",\"\",VLOOKUP(A58,feuil1!A58:M10079,10,FALSE))","v":""},{"$f":"SUMIF(feuil1!A58:A10079,FEUIL2!A58,feuil1!K58:K10079)","v":0},{"$f":"IF(A58=\"\",\"\",VLOOKUP(A58,feuil1!A58:O10079,12,FALSE))","v":""}]
[null,{"$f":"IF(A59=\"\",\"\",+VLOOKUP(A59,feuil1!A59:L10080,7,FALSE))","v":""},{"$f":"IF(A59=\"\",\"\",VLOOKUP(A59,feuil1!A59:M10080,10,FALSE))","v":""},{"$f":"SUMIF(feuil1!A59:A10080,FEUIL2!A59,feuil1!K59:K10080)","v":0},{"$f":"IF(A59=\"\",\"\",VLOOKUP(A59,feuil1!A59:O10080,12,FALSE))","v":""}]
[null,{"$f":"IF(A60=\"\",\"\",+VLOOKUP(A60,feuil1!A60:L10081,7,FALSE))","v":""},{"$f":"IF(A60=\"\",\"\",VLOOKUP(A60,feuil1!A60:M10081,10,FALSE))","v":""},{"$f":"SUMIF(feuil1!A60:A10081,FEUIL2!A60,feuil1!K60:K10081)","v":0},{"$f":"IF(A60=\"\",\"\",VLOOKUP(A60,feuil1!A60:O10081,12,FALSE))","v":""}]
{"$rows_left_out":191}
{"sheet":"Feuil3","index":2,"n_rows":0,"n_cols":0,"rows_kept":0,"cut":false,"hidden":false,"merged":[]}