{"text_format":"1","workbook":"xlsx","n_sheets":2,"sheets":["bilan","instalation"],"not_rendered":{"charts":0,"images":0,"macros":1,"external_links":0,"defined_names":0,"comments":1,"pivot_tables":0},"unopened":[],"bounds":{"document_bytes":16777216,"sheet_cells":100000,"rows_first":2000,"rows_last":500,"rows_between":2000,"halvings":0,"cell_chars":16384,"cell_head_chars":4096},"cells_cut":0,"cells_raw":0,"read":"whole","date_system":"1900"}

{"sheet":"bilan","index":0,"n_rows":267,"n_cols":13,"rows_kept":267,"cut":false,"hidden":false,"merged":[[5,3,5,4],[3,1,3,2],[17,6,17,8],[17,9,17,10],[0,1,1,13],[2,7,2,10],[6,3,6,4],[7,7,7,8],[11,1,11,11],[4,5,4,6],[5,5,5,6],[5,7,5,8],[5,9,5,10],[6,5,6,6],[16,6,16,8],[11,12,18,15],[12,1,13,1],[12,2,12,3],[12,9,12,10],[13,2,13,3],[13,9,13,10],[12,6,12,7],[13,6,13,7],[16,1,16,3],[27,1,27,11],[28,1,28,11],[29,1,29,11],[20,1,20,3],[21,5,21,11],[21,1,21,3],[23,1,23,11],[24,1,24,11],[25,1,25,11],[26,1,26,11],[19,5,19,10],[4,7,4,9],[2,11,2,12],[5,11,5,12],[2,13,3,13],[19,1,19,3],[17,1,17,3],[18,1,18,3],[18,6,18,8],[18,9,18,10],[6,7,6,8],[7,5,7,6],[14,1,14,3],[14,6,14,7],[14,9,16,9],[15,1,15,3],[15,6,15,8]]}
["acceuil!A1","bilan énergétique"]
[]
[null,null,null,null,null,null,null,"naissance",null,null,null,"signe astro occidental"]
[null,"heure  rendez vous",null,null,null,null,null,"jour","mois","année","heures","signe","ascendent"]
[null,"date",{"$f":"TODAY()","v":"2020-01-28"},"sexe",null,"date de naissance",null,null,null,null,null,{"$f":"IF(H5<>0,VLOOKUP(DATE(\"2020\",MONTH(H5),DAY(H5)),#REF!,2,1),\"\")","v":""},{"$f":"IF(C6<>0,IFERROR(INDEX(#REF!,MATCH(K5,#REF!,1)),\"\"),\"\")","v":""}]
[null,"mon","sdsgd","numeraux télephone",null,"profession",null,null,null,"horloge circadienne",null,"signe astro chinois"]
[null,"prenon",null,null,null,"situation familiale",null,null,null,"influence",{"$f":"IF(K5<>0,VLOOKUP(K5,#REF!,2),\"\")","v":""},"signe","ascendent"]
[null,"age",{"$f":"DATEDIF(H5,TODAY(),\"Y\")","v":120},"ans",null,"loisir",null,null,null,"opposer",{"$f":"IF(K5<>0,VLOOKUP(K5,#REF!,3),\"\")","v":""},{"$f":"IFERROR(INDEX(#REF!,MATCH(H5,#REF!,1)),\"\")","v":""},{"$f":"IFERROR(INDEX(#REF!,MATCH(H5,#REF!,1)),\"\")","v":""}]
[null,null,null,null,null,null,null,null,null,"influence",{"$f":"IF(D4<>0,VLOOKUP(D4,#REF!,2),\"\")","v":""}]
[null,null,null,null,null,null,null,null,null,"opposer",{"$f":"IF(D4<>0,VLOOKUP(D4,#REF!,3),\"\")","v":""}]
[]
[null,"questionnaires ",null,null,null,null,null,null,null,null,null,null,{"$f":"IF(L14=\"agité\",\"meridiens de la vessie sur les jambes en remontant pour calmer\",IF(L14=\"nerveux\",\"meridiens de la vessie sur les jambes en remontant pour calmer\",\"\"))","v":""}]
[null,"prise","médicament ",null,null,"stress",null,null,null,"corpulence"]
[null,null,"drogue",null,null,"douleur",null,null,null,"comportement"]
[null,"fracture opérations recente(- de 1 ans)",null,null,null,{"$f":"IF(G14<>0,\"localisation\",\"\")","v":""},null,null,null,"teint ","peaux"]
[null,"prothèses",null,null,null,"fatigue",null,null,null,null,"yeux"]
[null,"varices",null,null,null,"appétit",null,null,null,null,"ongles"]
[null,"lentilles",null,null,null,"sommeil",null,null,null,"respiration"]
[null,"tatouages recents (- de 3 semaines)",null,null,null,{"$f":"IF(E5=\"F\",\"cycle \",\"\")","v":""},null,null,null,"état émotif"]
[null,"cancers",null,null,null,{"$f":"IF(G14<>0,\"si mal en haut detendre le bas si mal a droite detendre a gauche\",\"\")","v":""}]
[null,{"$f":"IF(E5=\"F\",\"menstruation (1 et 2 em jour à éviter)\",\"\")","v":""}]
[null,{"$f":"IF(E5=\"F\",\"femme enceintes (attention point abortifs)\",\"\")","v":""},null,null,null,{"$f":"IF(E22=\"oui\",\"points abortifs 21VB   4GI   6R  9R  60V  67V\",\"\")","v":""}]
[]
[null,"remarques"]
[]
[]
[]
[]
[]
[]
[]
[]
[]
[]
[]
[]
[]
[]
[]
[]
[]
[]
[]
[]
[]
[]
[]
[]
[]
[]
[]
[]
[]
[]
[]
[]
[]
[]
[]
[]
[]
[]
[]
[]
[]
[]
[]
[]
[]
[]
[]
[]
[]
[]
[]
[]
[]
[]
[]
[]
[]
[]
[]
[]
[]
[]
[]
[]
[]
[]
[]
[]
[]
[]
[]
[]
[]
[]
[]
[]
[]
[]
[]
[]
[]
[]
[]
[]
[]
[]
[]
[]
[]
[]
[]
[]
[]
[]
[]
[]
[]
[]
[]
[]
[]
[]
[]
[]
[]
[]
[]
[]
[]
[]
[]
[]
[]
[]
[]
[]
[]
[]
[]
[]
[]
[]
[]
[]
[]
[]
[]
[]
[]
[]
[]
[]
[]
[]
[]
[]
[]
[]
[]
[]
[]
[]
[]
[]
[]
[]
[]
[]
[]
[null,null,null,null,null,null,null,"feu"]
[null,null,null,null,null,null,null,"metal"]
[]
[]
[]
[]
[]
[]
[]
[]
[]
[]
[]
[]
[]
[]
[]
[]
[]
[]
[]
[]
[]
[]
[]
[]
[]
[]
[]
[]
[]
[]
[]
[]
[]
[]
[]
[]
[]
[]
[]
[]
[]
[]
[]
[]
[]
[]
[]
[]
[]
[]
[]
[]
[]
[]
[]
[]
[]
[]
[]
[]
[]
[]
[]
[]
[]
[]
[]
[]
[]
[]
[]
[]
[]
[]
[]
[]
[]
[]
[]
[]
[]
[]
[]
[]
[]
[]
[]
[]
[]
[]
[null,null,null,null,null,null,null,"metal"]
[null,null,null,null,null,null,null,"eau"]

{"sheet":"instalation","index":1,"n_rows":0,"n_cols":0,"rows_kept":0,"cut":false,"hidden":false,"merged":[]}