{"text_format":"1","workbook":"xlsx","n_sheets":5,"sheets":["INFO","CIP","Plan","Dynamique","Inser"],"not_rendered":{"charts":0,"images":31,"macros":1,"external_links":0,"defined_names":4,"comments":2,"pivot_tables":0},"unopened":[],"bounds":{"document_bytes":16777216,"sheet_cells":100000,"rows_first":2000,"rows_last":500,"rows_between":2000,"halvings":0,"cell_chars":16384,"cell_head_chars":4096},"cells_cut":0,"cells_raw":0,"read":"whole","date_system":"1900"}

{"sheet":"INFO","index":0,"n_rows":2,"n_cols":2,"rows_kept":2,"cut":false,"hidden":false,"merged":[[1,1,2,4]]}
[]
[null,"500 calibres référencés"]

{"sheet":"CIP","index":1,"n_rows":1006,"n_cols":82,"rows_kept":1006,"cut":false,"hidden":false,"merged":[]}
["ORD1","ORD2","Calibre","L1","L2","L3","L4","L5","L6","R","R1","R3","E","E1","EMIN","DELTA","F","BETA","P1","P2","ALPHA","S","R1MIN","R2","H1","H2","G1","G2","L3PG","PO","TYPE","AM","SH","COL","PIL","PMAX","PK","PE","M","EE","FC","ZC","B","N","U","ORIG","MS","ARME",null,null,null,null,null,null,null,null,null,null,null,null,null,null,null,null,null,null,null,null,null,null,null,null,null,null,null,null,null,null,null,"(Source C.I.P.)"]
[1,287,"4 Bore Rifle",null,null,101.5,null,null,119.3,1.5,31.3,null,null,27.8,0.5,null,null,null,28,null,null,null,null,null,null,27.15,25.4,18,115.1,"US","b",null,null,null,null,2500,2875,3125,25,10500,24.91,25.4,6.5,8,null,"C.I.P.","pouce","carabine",null,null,null,null,null,null,null,null,null,null,null,null,null,null,null,null,null,null,null,null,null,null,null,null,null,null,null,null,null,null,null,"SYNONYMES","CALIBRES","INFO"]
[2,326,"4,6 x 30",23.02,26.03,30.5,null,null,38.5,1.1000000000000001,8,null,2.87,6.8,0.9,"35°",0.25,"45°",8.02,7.75,"44°07'37\"",32.85,1.7,2,5.31,5.31,4.6500000000000004,null,37.549999999999997,"DE","p /g",null,null,null,null,4000,4600,5200,17.5,null,4.5199999999999996,4.6500000000000004,1.21,6,160,"C.I.P.","metrique","revolvers et pistolets",null,null,null,null,null,null,null,null,null,null,null,null,null,null,null,null,null,null,null,null,null,null,null,null,null,null,null,null,null,null,null,"10 x 38","401 Win. SL"]
[3,1,"5 mm /35 SMc",27.51,31.72,39.520000000000003,null,null,53.34,1.37,12.01,null,3.85,10.39,1.4,"36°",0.4,"45°",11.96,11.6,null,null,null,0.32,5.95,5.94,5.18,null,44.75,"US","g",null,null,null,null,4400,5060,5500,17.5,1650,5.05,5.18,1.3,6,305,"C.I.P.","metrique","carabine",null,null,null,null,null,null,null,null,null,null,null,null,null,null,null,null,null,null,null,null,null,null,null,null,null,null,null,null,null,null,null,"10 x 65,5","405 Win."]
[4,null,"5.2 x 68 Mondragón",62.3,64.460000000000008,68.010000000000005,null,null,77.290000000000006,1.63,12.54,null,3.73,10.3,0.6,null,0.5,"45°",12.48,11.39,null,null,null,null,6.31,6.08,5.24,null,null,null,"b",null,null,null,null,null,null,null,null,null,null,null,null,null,null,"E.C.R.A.",null,null,null,null,null,null,null,null,null,null,null,null,null,null,null,null,null,null,null,null,null,null,null,null,null,null,null,null,null,null,null,null,null,"10,2 x 76 R","400 Purdey 3‘‘"]
[5,2,"5,45 x 39",30,34,39.82,null,null,57,1.5,10,null,3.2,8.6,1,"45°",0.5,"45°",10,9.25,"40°36'32\"",42.5,null,null,6.29,6.29,5.6,null,44.79,"SU","g",null,null,null,null,3800,4370,4750,17.5,1505,5.4,5.6,2.6,4,255,"C.I.P.","metrique","carabine",null,null,null,null,null,null,null,null,null,null,null,null,null,null,null,null,null,null,null,null,null,null,null,null,null,null,null,null,null,null,null,"10,3 mm M 30 Schweiz","10,3 x 60 R"]
[6,327,"5,45 x 18",12.07,14,18.03,null,null,25,1.1299999999999999,7.64,null,2.9,6.58,null,"16°40'10\"",null,null,7.64,7.4,"32°54'28\"",24.6,null,null,6.26,6.26,5.63,null,21.89,"SU","p /g",null,null,null,null,1750,2013,2275,9,null,5.45,5.6,2,6,270,"C.I.P.","metrique","revolvers et pistolets",null,null,null,null,null,null,null,null,null,null,null,null,null,null,null,null,null,null,null,null,null,null,null,null,null,null,null,null,null,null,null,"10,3 x 38","401 Win. SL"]
[7,156,"5,6 x 35 R",20,25,35.5,null,null,43.5,1.4,8.85,null,null,null,null,null,null,null,7.55,7.05,"8°00'29\"",70.36,0.5,0.5,6.35,6.33,5.63,null,55.3,"DE","b",null,null,null,null,2700,3105,3510,17.5,855,5.35,5.58,2.4,4,360,"C.I.P.","metrique","carabine",null,null,null,null,null,null,null,null,null,null,null,null,null,null,null,null,null,null,null,null,null,null,null,null,null,null,null,null,null,null,null,"10,3 x 60 R Schw.","10,3 x 60 R"]
[8,3,"5,6 x 39",27,32.200000000000003,38.700000000000003,null,null,48.7,1.5,11.35,null,3.2,9.56,1,"51°58'13\"",null,null,11.35,10.199999999999999,"41°12'31\"",40.57,0.5,2,6.29,6.29,5.67,null,49.01,"RU","g",null,null,null,null,3500,4025,4375,17.5,2100,5.45,5.59,2,6,420,"C.I.P.","metrique","carabine",null,null,null,null,null,null,null,null,null,null,null,null,null,null,null,null,null,null,null,null,null,null,null,null,null,null,null,null,null,null,null,"10,3 x 60 R Schweiz M 30","10,3 x 60 R"]
[9,7,"5,7 x 28",23.15,24.27,28.9,null,31.44,40.5,1.1399999999999999,7.8,null,3.38,6.6,0.79,"25°",0.28000000000000003,"45°",7.95,7.95,"70°03'10\"",28.82,null,1,6.38,6.38,5.7,5.26,35.35,"BE","g",null,null,null,null,3450,3968,4313,12,1500,5.53,5.62,1.63,8,228.6,"C.I.P.","metrique","carabine",null,null,null,null,null,null,null,null,null,null,null,null,null,null,null,null,null,null,null,null,null,null,null,null,null,null,null,null,null,null,null,"10,3 x 60 R Swiss","10,3 x 60 R"]
[10,4,"5,6 x 50 Mag.",40.26,43.23,50,null,null,61.3,1.1399999999999999,9.6,null,3.1,8.44,0.8,"25°45'",0.5,"45°",9.56,9,"45°58'38\"",50.87,0.5,0.5,6.48,6.48,5.7,null,51.8,"DE","g",null,null,null,null,3800,4370,4750,25,1915,5.56,5.69,2,6,350,"C.I.P.","metrique","carabine",null,null,null,null,null,null,null,null,null,null,null,null,null,null,null,null,null,null,null,null,null,null,null,null,null,null,null,null,null,null,null,"10,5 x 17 - 442 kurz","442 Webley","N"]
[11,157,"5,6 x 50 R Mag.",40.26,43.23,50,null,null,61,1.4,10.9,null,null,null,null,null,0.5,"45°",9.59,9,"45°58'38\"",50.87,0.5,0.5,6.48,6.48,5.7,null,51.8,"DE","b",null,null,null,null,3400,3910,4250,25,1950,5.56,5.69,2,6,350,"C.I.P.","metrique","carabine",null,null,null,null,null,null,null,null,null,null,null,null,null,null,null,null,null,null,null,null,null,null,null,null,null,null,null,null,null,null,null,"10,5 x 65 R","405 Win."]
[12,161,"5,6 x 70 R",59.84,61.12,70,null,null,87,1.52,10.7,null,null,null,null,null,0.3,"45°",9.0299999999999994,7.52,"40°",70.17,0.5,0.5,6.59,6.59,5.7,null,74.06,"DE","b",null,null,null,null,2600,2990,3250,25,1785,5.56,5.69,2,6,290,"C.I.P.","metrique","carabine",null,null,null,null,null,null,null,null,null,null,null,null,null,null,null,null,null,null,null,null,null,null,null,null,null,null,null,null,null,null,null,"10,5 x 74","416 Rigby"]
[13,5,"5,6 x 57",44.51,50.41,56.7,null,null,69,1.3,11.95,null,3.2,10.5,1,"37°52'48\"",0.3,"45°",11.9,10.94,"34°49'06\"",61.95,0.5,0.5,7.24,7.1,5.7,null,67.5,"DE","g",null,null,null,null,4400,5060,5500,25,2725,5.54,5.69,2,6,250,"C.I.P.","metrique","carabine",null,null,null,null,null,null,null,null,null,null,null,null,null,null,null,null,null,null,null,null,null,null,null,null,null,null,null,null,null,null,null,"10,75 (10,5) mm Mauser","10,75 x 68"]
[14,159,"5,6 x 57 R",44.37,50.28,56.7,null,null,69,1.4,13.32,null,null,null,null,null,0.3,"45°",11.94,10.94,"34°49'05\"",61.82,0.5,0.5,7.24,7.1,5.7,null,67.5,"DE","b",null,null,null,null,4400,5060,5500,25,2720,5.54,5.69,2,6,250,"C.I.P.","metrique","carabine",null,null,null,null,null,null,null,null,null,null,null,null,null,null,null,null,null,null,null,null,null,null,null,null,null,null,null,null,null,null,null,"10,75 mm Mauser","10,75 x 68"]
[15,160,"5,6 x 61 R SE v. H.",44,53.05,61,null,null,80,1.6,13.6,null,null,null,null,null,0.3,"45°",12.22,11.6,"30°",65.650000000000006,0.5,0.5,6.75,6.68,5.76,null,76,"DE","b",null,null,null,null,3800,4370,4750,25,2945,5.58,5.76,2.6,4,220,"C.I.P.","metrique","carabine",null,null,null,null,null,null,null,null,null,null,null,null,null,null,null,null,null,null,null,null,null,null,null,null,null,null,null,null,null,null,null,"10,75 x 33,3 USA Win.Rep.","44-40 Win."]
[16,328,"5,75 Velodog",null,null,29.6,32.799999999999997,null,35.6,1.3,7.8,null,null,null,null,null,0.3,"45°",6.42,null,null,null,null,null,null,6.3,5.79,5.65,32.6,"FR","p /b",null,null,null,null,680,782,884,17.5,null,5.5,5.75,2.2999999999999998,4,454,"C.I.P.","metrique","revolvers et pistolets",null,null,null,null,null,null,null,null,null,null,null,null,null,null,null,null,null,null,null,null,null,null,null,null,null,null,null,null,null,null,null,"10,75 x 68 Mauser","10,75 x 68"]
[17,158,"5,6 x 52 R",35.03,41.62,52,null,null,63.75,1.6,12.5,null,null,null,null,null,0.3,"45°",10.62,9.1999999999999993,"23°59'16\"",56.68,0.5,0.5,6.4,6.4,5.79,null,70,"DE","b",null,null,null,null,3300,3795,4125,25,1830,5.55,5.75,2,6,270,"C.I.P.","metrique","carabine",null,null,null,null,null,null,null,null,null,null,null,null,null,null,null,null,null,null,null,null,null,null,null,null,null,null,null,null,null,null,null,"10,75 x 73","404 Riml. N.E."]
[18,6,"5,6 x 61 SE.v.H.",44.01,53.06,61,null,null,80,1.5,12.2,null,3,10.5,1,"59°31'48\"",0.3,"45°",12.2,11.6,"30°00'02\"",65.66,0.5,0.5,6.75,6.68,5.79,null,75.5,"DE","g",null,null,null,null,4400,5060,5500,25,3005,5.58,5.76,2,6,220,"C.I.P.","metrique","carabine",null,null,null,null,null,null,null,null,null,null,null,null,null,null,null,null,null,null,null,null,null,null,null,null,null,null,null,null,null,null,null,"10,9 x 17,5 - R.N. 442 k","442 Webley","N"]
[19,466,"6 mm PPC ITA",27.3,31,37.9,null,null,55.7,1.5,11.18,null,3.5,9.6,1.2,"43°43'12\"",0.4,"35°",11.13,10.92,"60°",36.76,1.52,1.52,6.63,6.63,6.17,null,42.08,"ITA","g",null,null,null,null,4050,4658,5265,17.5,2250,6.02,6.17,2.29,6,551,"C.I.P.","metrique","carabine",null,null,null,null,null,null,null,null,null,null,null,null,null,null,null,null,null,null,null,null,null,null,null,null,null,null,null,null,null,null,null,"10.4 x 22 mm","41 ACT EXP"]
{"$rows_left_out":987}
{"sheet":"Plan","index":2,"n_rows":66,"n_cols":31,"rows_kept":66,"cut":false,"hidden":false,"merged":[[11,16,12,20],[9,16,10,16],[14,16,15,22],[2,15,3,16]]}
[null,{"$f":"MATCH(D4, LISTE, 0)","v":409},"Rang dans la liste déroulante ci-dessous",null,null,null,null,null,null,null,null,null,null,null,null,null,null,null,null,null,null,null,null,null,null,null,null,null,null,null,"a"]
[null,null,null,null,null,null,null,null,null,null,null,null,null,null,null,null,null,null,null,null,null,null,null,null,null,null,null,null,null,null,"a"]
[null,null,null,null,null,null,null,null,null,null,null,null,null,null,null,"Press ENTER pour renseigner le schéma type.",null,null,"g","à gorge"]
[null,null,null,"338 Win. Mag.",null,null,null,null,null,null,null,null,null,null,null,null,null,null,"b","à bourrelet"]
[null,null,null,null,null,null,null,null,null,null,null,null,null,null,null,null,null,null,"m","magnum"]
[null,null,null,"Schema Type",null,null,null,null,null,null,null,null,null,null,null,null,null,null,"p /g","arme de poing / à gorge"]
[null,null,null,null,null,"Valeur en m/m",null,null,null,null,null,null,null,null,{"$f":"D4","v":"338 Win. Mag."},null,null,null,"p /b","arme de poing / à bourrelet"]
[null,"F",null,null,null,null,null,null,null,null,null,null,"L1",{"$f":"VLOOKUP($D$4,TABLE,2,FALSE)","v":51.82},"Distance entre la face arrière du culot et diamètre P2"]
[null,null,null,null,null,null,null,null,null,null,null,null,"L2",{"$f":"VLOOKUP($D$4,TABLE,3,FALSE)","v":55.11},"Distance entre la face arrière et le diamètre H1 du collet"]
[null,null,null,null,null,null,null,null,null,null,null,null,"L3",{"$f":"VLOOKUP($D$4,TABLE,4,FALSE)","v":63.5},"Longueur totale de la douille",null,"RESULTAT"]
[null,"G2",{"$f":"N32","v":8.3800000000000008},null,null,null,null,null,null,null,null,null,"L4",{"$f":"VLOOKUP($D$4,TABLE,5,FALSE)","v":0},"Distance entre la face arrière du culot et le diamètre G2"]
[null,null,null,null,null,null,null,null,null,null,null,null,"L5",{"$f":"VLOOKUP($D$4,TABLE,6,FALSE)","v":69.849999999999994},"Distance entre la face arrière du culot et le diamètre F",null,"223 Rem."]
[null,null,null,null,null,null,null,null,null,null,null,null,"L6",{"$f":"VLOOKUP($D$4,TABLE,7,FALSE)","v":84.84},"Longueur totale de la cartouche"]
[null,"G1",{"$f":"N31","v":8.61},null,null,null,null,null,null,null,null,null,"R",{"$f":"VLOOKUP($D$4,TABLE,8,FALSE)","v":1.27},"Epaisseur du bourrelet"]
[null,null,null,null,null,null,null,null,null,null,null,null,"R1",{"$f":"VLOOKUP($D$4,TABLE,9,FALSE)","v":13.51},"Diamètre du bourrelet",null,"5,56 Mle F"]
[null,"H2",{"$f":"N30","v":9.3699999999999992},null,null,null,null,null,null,null,null,null,"R3",{"$f":"VLOOKUP($D$4,TABLE,10,FALSE)","v":13.51},"Diamètre du culot magnum"]
[null,null,null,null,null,null,null,null,null,null,null,null,"E",{"$f":"VLOOKUP($D$4,TABLE,11,FALSE)","v":5.59},"Hauteur du culot"]
[null,null,null,null,null,null,null,null,null,null,null,null,"E1",{"$f":"VLOOKUP($D$4,TABLE,12,FALSE)","v":12.07},"Diamètre de la gorge"]
[null,null,null,null,null,null,null,null,null,null,null,null,"Emin",{"$f":"VLOOKUP($D$4,TABLE,13,FALSE)","v":0.94},"Largeur de la gorge"]
[null,null,null,null,null,null,null,null,null,null,null,null,"DELTA",{"$f":"VLOOKUP($D$4,TABLE,14,FALSE)","v":"35°"},"Demi angle de la gorge (entre E1 et P1)"]
{"$rows_left_out":47}
{"sheet":"Dynamique","index":3,"n_rows":56,"n_cols":29,"rows_kept":56,"cut":false,"hidden":false,"merged":[[6,8,6,11],[22,8,22,11]]}
[{"$f":"VLOOKUP($D5,TABLE,2,FALSE)","v":55.78},{"$f":"VLOOKUP($D5,TABLE,3,FALSE)","v":59.85},{"$f":"VLOOKUP($D5,TABLE,4,FALSE)","v":66.55},{"$f":"VLOOKUP($D5,TABLE,5,FALSE)","v":0},{"$f":"VLOOKUP($D5,TABLE,6,FALSE)","v":0},{"$f":"VLOOKUP($D5,TABLE,7,FALSE)","v":84.84},{"$f":"VLOOKUP($D5,TABLE,8,FALSE)","v":1.27},{"$f":"VLOOKUP($D5,TABLE,9,FALSE)","v":13.51},{"$f":"VLOOKUP($D5,TABLE,10,FALSE)","v":13.51},{"$f":"VLOOKUP($D5,TABLE,11,FALSE)","v":5.59},{"$f":"VLOOKUP($D5,TABLE,12,FALSE)","v":12.07},{"$f":"VLOOKUP($D5,TABLE,13,FALSE)","v":0.94},{"$f":"VLOOKUP($D5,TABLE,14,FALSE)","v":"35°"},{"$f":"VLOOKUP($D5,TABLE,15,FALSE)","v":0.41},{"$f":"VLOOKUP($D5,TABLE,16,FALSE)","v":"35°"},{"$f":"VLOOKUP($D5,TABLE,17,FALSE)","v":13.03},{"$f":"VLOOKUP($D5,TABLE,18,FALSE)","v":12.42},{"$f":"VLOOKUP($D5,TABLE,19,FALSE)","v":"50°"},{"$f":"VLOOKUP($D5,TABLE,20,FALSE)","v":69.099999999999994},{"$f":"VLOOKUP($D5,TABLE,21,FALSE)","v":1.02},{"$f":"VLOOKUP($D5,TABLE,22,FALSE)","v":2.54},{"$f":"VLOOKUP($D5,TABLE,23,FALSE)","v":8.6300000000000008},{"$f":"VLOOKUP($D5,TABLE,24,FALSE)","v":8.6300000000000008},{"$f":"VLOOKUP($D5,TABLE,25,FALSE)","v":7.85},{"$f":"VLOOKUP($D5,TABLE,26,FALSE)","v":0},{"$f":"VLOOKUP($D5,TABLE,29,FALSE)","v":"m"},{"$f":"MATCH(D5, LISTE, 0)","v":372},{"$f":"MATCH(LOOKUP(\"z\",CIP!C:C),CIP!C:C,0)","v":501},6]
[{"$f":"VLOOKUP($P5,TABLE,2,FALSE)","v":27.51},{"$f":"VLOOKUP($P5,TABLE,3,FALSE)","v":31.72},{"$f":"VLOOKUP($P5,TABLE,4,FALSE)","v":39.520000000000003},{"$f":"VLOOKUP($P5,TABLE,5,FALSE)","v":0},{"$f":"VLOOKUP($P5,TABLE,6,FALSE)","v":0},{"$f":"VLOOKUP($P5,TABLE,7,FALSE)","v":53.34},{"$f":"VLOOKUP($P5,TABLE,8,FALSE)","v":1.37},{"$f":"VLOOKUP($P5,TABLE,9,FALSE)","v":12.01},{"$f":"VLOOKUP($P5,TABLE,10,FALSE)","v":0},{"$f":"VLOOKUP($P5,TABLE,11,FALSE)","v":3.85},{"$f":"VLOOKUP($P5,TABLE,12,FALSE)","v":10.39},{"$f":"VLOOKUP($P5,TABLE,13,FALSE)","v":1.4},{"$f":"VLOOKUP($P5,TABLE,14,FALSE)","v":"36°"},{"$f":"VLOOKUP($P5,TABLE,15,FALSE)","v":0.4},{"$f":"VLOOKUP($P5,TABLE,16,FALSE)","v":"45°"},{"$f":"VLOOKUP($P5,TABLE,17,FALSE)","v":11.96},{"$f":"VLOOKUP($P5,TABLE,18,FALSE)","v":11.6},{"$f":"VLOOKUP($P5,TABLE,19,FALSE)","v":0},{"$f":"VLOOKUP($P5,TABLE,20,FALSE)","v":0},{"$f":"VLOOKUP($P5,TABLE,21,FALSE)","v":0},{"$f":"VLOOKUP($P5,TABLE,22,FALSE)","v":0.32},{"$f":"VLOOKUP($P5,TABLE,23,FALSE)","v":5.95},{"$f":"VLOOKUP($P5,TABLE,24,FALSE)","v":5.94},{"$f":"VLOOKUP($P5,TABLE,25,FALSE)","v":5.18},{"$f":"VLOOKUP($P5,TABLE,26,FALSE)","v":0},{"$f":"VLOOKUP($P5,TABLE,29,FALSE)","v":"g"},{"$f":"MATCH(P5, LISTE, 0)","v":3}]
["L1","L2","L3","L4","L5","L6","R","R1","R3","E","E1","EMIN","DELTA","F","BETA","P1","P2","ALPHA","S","R1MIN","R2","H1","H2","G1","G2","TYPE"]
[null,null,null,{"$f":"IF(VLOOKUP($D5,TABLE,44,FALSE)=0,\"Non renseigné\",VLOOKUP($D5,TABLE,44,FALSE))","v":"C.I.P."},null,null,null,null,null,null,null,null,null,null,null,{"$f":"IF(VLOOKUP($P5,TABLE,44,FALSE)=0,\"Non renseigné\",VLOOKUP($P5,TABLE,44,FALSE))","v":"C.I.P."}]
[null,null,null,"300 Win. Mag.",null,null,null,null,null,"ZOOM",5,null,null,null,null,"5 mm /35 SMc"]
[]
[]
[]
[]
[]
[]
[]
[]
[]
[]
[]
[]
[]
[]
[]
{"$rows_left_out":37}
{"sheet":"Inser","index":4,"n_rows":53,"n_cols":52,"rows_kept":53,"cut":false,"hidden":false,"merged":[[1,2,2,10],[18,17,19,23],[22,26,22,31],[25,17,26,23],[41,7,41,9],[41,4,41,6],[39,3,39,15],[39,46,39,48],[52,9,52,10],[51,9,51,10],[47,6,47,7],[47,10,47,11],[46,10,46,11],[51,4,51,6],[52,4,52,6],[43,4,43,6],[42,7,42,9],[43,7,43,9],[46,6,46,7],[44,4,44,6]]}
[]
[null,null,"MISE EN PLACE D'UN NOUVEAU CALIBRE (Dans l'onglet CIP)",null,null,null,null,null,null,null,null,null,null,null,null,null,null,null,null,null,"Format Texte"]
[null,null,null,null,null,null,null,null,null,null,null,null,null,null,null,null,null,null,null,null,"xx°xx'xx\" ou xx°"]
[null,null,"Calibre","L1","L2","L3","L4","L5","L6","R","R1","R3","E","E1","EMIN","DELTA","F","BETA","P1","P2","ALPHA","S","R1MIN","R2","H1","H2","G1","G2","L3PG","PO","TYPE","AM","SH","COL","PIL","PMAX","PK","PE","M","EE","FC","ZC","B","N","U","ORIG","MS","ARME"]
[null,null,"356 TSW",null,null,21.59,null,null,29.46,1.27,10.01,null,2.95,8.81,0.89,"35°",0.38,"35°",9.92,null,null,null,null,null,null,9.66,9.0399999999999991,null,null,null,"p /g",null,null,null,null,null,null,null,null,null,null,null,null,null,null,"SAAMI","pouce","revolvers et pistolets"]
[null,null,"Remplire les cases ci-dessus"]
[]
[]
[]
[]
[null,null,null,null,null,null,null,null,null,null,null,null,null,null,null,null,null,null,null,null,null,null,null,null,null,null,null,null,null,null,null,null,null,null,null,null,null,null,null,null,null,null,null,null,null,null,null,null,null,null,"Calcul de E"]
[null,null,null,null,null,null,null,null,null,null,null,null,null,null,null,null,null,null,null,null,null,null,null,null,null,null,null,null,null,null,null,null,null,null,null,null,null,null,null,null,null,null,null,null,null,null,null,null,null,null,{"$f":"(E48-F48)/2","v":0.55499999999999972}]
[null,null,null,null,null,null,null,null,null,null,null,null,null,null,null,null,null,null,null,null,null,null,null,null,null,null,null,null,null,null,null,null,null,null,null,null,null,null,null,null,null,null,null,null,null,null,null,null,null,null,{"$f":"MID(G48,1,2)*1","v":35}]
[null,null,null,null,null,null,null,null,null,null,null,null,null,null,null,null,null,null,null,null,null,null,null,null,null,null,null,null,null,null,null,null,null,null,null,null,null,null,null,null,null,null,null,null,null,null,null,null,null,null,{"$f":"IF(ISERROR((MID(G48,4,2))/60),\"\",MID(G48,4,2)/60)","v":""}]
[null,null,null,null,null,null,null,null,null,null,null,null,null,null,null,null,null,null,null,null,null,null,null,null,null,null,null,null,null,"Etui à bourlet :","g",null,null,null,null,null,null,null,null,null,null,null,null,null,null,null,null,null,null,null,{"$f":"IF(ISERROR((MID(G48,7,2))/60),\"\",MID(G48,7,2)/3600)","v":""}]
[null,null,null,null,"COMMENT OBTENIR LE DESSIN DE L'ETUI",null,null,null,null,null,null,null,null,null,null,null,null,"PLACER LA LIGNE AVANT / SUPPRIMER CETTE LIGNE",null,null,null,null,null,null,null,null,null,null,null,"Etui à gorge :","b",null,null,null,null,null,null,null,null,null,null,null,null,null,null,null,null,null,null,null,{"$f":"SUM(AY13:AY15)","v":35}]
[null,null,null,null,null,null,null,null,null,null,null,null,null,null,null,null,null,null,null,null,null,null,null,null,null,null,null,null,null,"Arme de poing à bourlet :","p /b",null,null,null,null,null,null,null,null,null,null,null,null,null,null,null,null,null,null,null,{"$f":"90-AY16","v":55}]
[null,null,null,null,null," Valeur indispensable pour un étui droit à bourlet (Dessin de base).",null,null,null,null,null,null,null,null,null,null,null,null,null,null,null,null,null,null,null,null,null,null,null,"Arme de poing à gorge :","p /g",null,null,null,null,null,null,null,null,null,null,null,null,null,null,null,null,null,null,null,{"$f":"PI()*AY17/180","v":0.95993108859688125}]
[null,null,null,null,null,null,null,null,null,null,null,null,null,null,null,null,null,null,null,null,null,null,null,null,null,null,null,null,null,"Magnum :","m",null,null,null,null,null,null,null,null,null,null,null,null,null,null,null,null,null,null,null,{"$f":"TAN(AY18)","v":1.4281480067421144}]
[null,null,null,null,null,"Valeur indispensable pour un étui droit à gorge.",null,null,null,null,null,null,null,null,null,null,null,null,null,null,null,null,null,null,null,null,null,null,null,null,null,null,null,null,null,null,null,null,null,null,null,null,null,null,null,null,null,null,null,null,{"$f":"AY19*AY12","v":0.79262214374187312}]
{"$rows_left_out":33}