{"text_format":"1","workbook":"xlsx","n_sheets":25,"sheets":["Album Photos","Champions","Écuries","Pilotes","Melbourne","Bahrein","Chine","Pays-Bas","Espagne","Monaco","Azerbaïdjan","Canada","France","Autriche","GB","Hongrie","Belgique","Italie","Singapour","Russie","Japon","USA","Mexique","Brésil","Abu Dabi"],"not_rendered":{"charts":0,"images":56,"macros":1,"external_links":1,"defined_names":1,"comments":0,"pivot_tables":0},"unopened":[],"bounds":{"document_bytes":16777216,"sheet_cells":100000,"rows_first":2000,"rows_last":500,"rows_between":2000,"halvings":0,"cell_chars":16384,"cell_head_chars":4096},"cells_cut":0,"cells_raw":0,"read":"whole","date_system":"1900"}

{"sheet":"Album Photos","index":0,"n_rows":81,"n_cols":9,"rows_kept":81,"cut":false,"hidden":false,"merged":[[15,6,18,6],[76,3,79,4],[80,3,83,4],[39,7,42,7],[39,6,42,6],[35,6,38,6],[32,3,35,4],[36,3,39,4],[40,3,43,4],[44,3,47,4],[48,3,51,4],[80,1,83,1],[76,1,79,1],[72,1,75,1],[68,1,71,1],[64,1,67,1],[64,2,67,2],[68,2,71,2],[72,2,75,2],[76,2,79,2],[80,2,83,2],[56,2,59,2],[52,1,55,1],[56,1,59,1],[60,1,63,1],[60,2,63,2],[44,1,47,1],[48,1,51,1],[48,2,51,2],[44,2,47,2],[52,2,55,2],[32,1,35,1],[32,2,35,2],[36,1,39,1],[36,2,39,2],[40,2,43,2],[40,1,43,1],[1,6,1,8],[31,8,34,8],[35,8,38,8],[39,8,42,8],[3,8,6,8],[7,8,10,8],[11,8,14,8],[15,8,18,8],[19,8,22,8],[23,8,26,8],[27,8,30,8],[52,3,55,4],[56,3,59,4],[60,3,63,4],[64,3,67,4],[68,3,71,4],[72,3,75,4],[24,2,27,2],[24,1,27,1],[2,3,2,4],[1,1,1,4],[11,2,15,2],[28,2,31,2],[28,1,31,1],[11,3,15,4],[16,3,19,4],[20,3,23,4],[24,3,27,4],[28,3,31,4],[11,1,15,1],[7,2,10,2],[3,2,6,2],[7,1,10,1],[3,1,6,1],[3,3,6,4],[7,3,10,4],[31,7,34,7],[35,7,38,7],[3,6,6,6],[3,7,6,7],[7,6,10,6],[11,6,14,6],[7,7,10,7],[11,7,14,7],[31,6,34,6],[27,7,30,7],[27,6,30,6],[23,7,26,7],[23,6,26,6],[19,7,22,7],[19,6,22,6],[15,7,18,7],[20,1,23,1],[20,2,23,2],[16,1,19,1],[16,2,19,2]]}
[]
[null,"Photos Pilotes",null,null,null,null,"Photos F1"]
[null,"Noms","Emplacement","Photos",null,null,"Noms","Emplacement","Photos"]
[null,"Lewis HAMILTON",{"$f":"\"Album Photos!\"&ADDRESS(ROW(C4),COLUMN(D4))","v":"Album Photos!$D$4"},null,null,null,"Mercedes",{"$f":"\"Album Photos!\"&ADDRESS(ROW(H4),COLUMN(I4))","v":"Album Photos!$I$4"}]
[]
[]
[]
[null,"Valterri BOTTAS",{"$f":"\"Album Photos!\"&ADDRESS(ROW(C8),COLUMN(D8))","v":"Album Photos!$D$8"},null,null,null,"Ferrari",{"$f":"\"Album Photos!\"&ADDRESS(ROW(H8),COLUMN(I8))","v":"Album Photos!$I$8"}]
[]
[]
[]
[null,"Charles LECLERC",{"$f":"\"Album Photos!\"&ADDRESS(ROW(C12),COLUMN(D12))","v":"Album Photos!$D$12"},null,null,null,"Red Bull",{"$f":"\"Album Photos!\"&ADDRESS(ROW(H12),COLUMN(I12))","v":"Album Photos!$I$12"}]
[]
[]
[]
[null,null,null,null,null,null,"Racing Point",{"$f":"\"Album Photos!\"&ADDRESS(ROW(H16),COLUMN(I16))","v":"Album Photos!$I$16"}]
[null,"Sebastian VETTEL",{"$f":"\"Album Photos!\"&ADDRESS(ROW(C17),COLUMN(D16))","v":"Album Photos!$D$17"}]
[]
[]
[null,null,null,null,null,null,"Williams",{"$f":"\"Album Photos!\"&ADDRESS(ROW(H20),COLUMN(I20))","v":"Album Photos!$I$20"}]
[null,"Max VERSTAPPEN ","Album Photos!$D$21"]
[]
[]
[null,null,null,null,null,null,"Renault",{"$f":"\"Album Photos!\"&ADDRESS(ROW(H24),COLUMN(I24))","v":"Album Photos!$I$24"}]
[null,"Alexander ABON","Album Photos!$D$25"]
[]
[]
[null,null,null,null,null,null,"Toro Rosso",{"$f":"\"Album Photos!\"&ADDRESS(ROW(H28),COLUMN(I28))","v":"Album Photos!$I$28"}]
[null,"Sergio PEREZ","Album Photos!$D$29"]
[]
[]
[null,null,null,null,null,null,"Hass",{"$f":"\"Album Photos!\"&ADDRESS(ROW(H32),COLUMN(I32))","v":"Album Photos!$I$32"}]
[null,"Lance Stroll","Album Photos!$D$33"]
[]
[]
[null,null,null,null,null,null,"Mac Laren",{"$f":"\"Album Photos!\"&ADDRESS(ROW(H36),COLUMN(I36))","v":"Album Photos!$I$36"}]
[null,"George Russel ","Album Photos!$D$37"]
[]
[]
[null,null,null,null,null,null,"Alfa Roméo",{"$f":"\"Album Photos!\"&ADDRESS(ROW(H40),COLUMN(I40))","v":"Album Photos!$I$40"}]
[null,"Nicholas LATIFI","Album Photos!$D$41"]
[]
[]
[]
[null,"Daniel RICCIARDO","Album Photos!$D$45"]
[]
[]
[]
[null,"Esteban OCON","Album Photos!$D$49"]
[]
[]
[]
[null,"Daniil KVYAT","Album Photos!$D$53"]
[]
[]
[]
[null,"Pierre GASLY","Album Photos!$D$57"]
[]
[]
[]
[null,"Romain GROSJEAN","Album Photos!$D$61"]
[]
[]
[]
[null,"Kevin MAGNUSSEN","Album Photos!$D$65"]
[]
[]
[]
[null,"Lando NORRIS","Album Photos!$D$69"]
[]
[]
[]
[null,"Carlos SAINZ",{"$f":"\"Album Photos!\"&ADDRESS(ROW(C73),COLUMN(D72))","v":"Album Photos!$D$73"}]
[]
[]
[]
[null,"Kimi RAIKKONEN","Album Photos!$D$77"]
[]
[]
[]
[null,"antonio GIOVANIZZI","Album Photos!$D$81"]

{"sheet":"Champions","index":1,"n_rows":23,"n_cols":10,"rows_kept":23,"cut":false,"hidden":false,"merged":[[23,1,27,3],[20,5,24,7],[23,9,27,11],[21,1,21,3],[22,1,22,3],[21,9,21,11],[22,9,22,11],[1,2,1,10],[15,2,15,10],[18,5,18,7],[19,5,19,7],[3,5,3,7],[4,5,4,7],[6,1,6,3],[7,1,7,3],[6,9,6,11],[7,9,7,11],[5,5,9,7],[8,9,12,11],[8,1,12,3]]}
[]
[null,null,"CHAMPIONNAT PILOTES 2020"]
[]
[null,null,null,null,null,"CHAMPION 2019"]
[null,null,null,null,null,{"$f":"IF(Pilotes!G5=1,Pilotes!B5,\"\")","v":"Sebastian VETTEL"}]
[]
[null,"DEUXIÈME",null,null,null,null,null,null,null,"TROIXIÈME"]
[null,{"$f":"IF(Pilotes!G6=2,Pilotes!B6,\"\")","v":"Daniel RICCIARDO"},null,null,null,null,null,null,null,{"$f":"IF(Pilotes!G7=3,Pilotes!B7,\"\")","v":""}]
[]
[]
[]
[]
[]
[]
[]
[null,null,"CHAMPIONNAT CONSTRUCTEURS 2020"]
[]
[]
[null,null,null,null,null,"CHAMPION 2019"]
[null,null,null,null,null,{"$f":"IF(Écuries!F4=1,Écuries!B4,\"\")","v":"FERRARI"}]
[]
[null,"DEUXIÈME",null,null,null,null,null,null,null,"TROIXIÈME"]
[null,{"$f":"IF(Écuries!F5=2,Écuries!B5,\"\")","v":"RENAULT"},null,null,null,null,null,null,null,{"$f":"IF(Écuries!F6=3,Écuries!B6,\"\")","v":""}]

{"sheet":"Écuries","index":2,"n_rows":13,"n_cols":6,"rows_kept":13,"cut":false,"hidden":false,"merged":[[0,1,0,5]]}
[]
[]
[null,"ÉCURIES","POINTS","Écart/premier","Écart/précédent","RANG"]
[null,"FERRARI",{"$f":"SUM('Melbourne:Abu Dabi'!J6)","v":25},null,null,{"$f":"IF(C4=0,0,(RANK(C4,$C$4:$C$13)))+COUNTIF(C$4:C4,C4)-1","v":1}]
[null,"RENAULT",{"$f":"SUM('Melbourne:Abu Dabi'!J10)","v":15},{"$f":"C5-C4","v":-10},{"$f":"C5-C4","v":-10},{"$f":"IF(C5=0,0,(RANK(C5,$C$4:$C$13)))+COUNTIF(C$4:C5,C5)-1","v":2}]
[null,"RED BULL",{"$f":"SUM('Melbourne:Abu Dabi'!J7)","v":0},{"$f":"C6-C4","v":-25},{"$f":"C6-C5","v":-15},{"$f":"IF(C6=0,0,(RANK(C6,$C$4:$C$13)))+COUNTIF(C$4:C6,C6)-1","v":0}]
[null,"MERCEDES",{"$f":"SUM('Melbourne:Abu Dabi'!J5)","v":0},{"$f":"C7-C4","v":-25},0,{"$f":"IF(C7=0,0,(RANK(C7,$C$4:$C$13)))+COUNTIF(C$4:C7,C7)-1","v":1}]
[null,"RACING POINT",{"$f":"SUM('Melbourne:Abu Dabi'!J8)","v":0},{"$f":"C8-C4","v":-25},0,{"$f":"IF(C8=0,0,(RANK(C8,$C$4:$C$13)))+COUNTIF(C$4:C8,C8)-1","v":2}]
[null,"WILLIAMS",{"$f":"SUM('Melbourne:Abu Dabi'!J9)","v":0},{"$f":"C9-C4","v":-25},0,{"$f":"IF(C9=0,0,(RANK(C9,$C$4:$C$13)))+COUNTIF(C$4:C9,C9)-1","v":3}]
[null,"TORO ROSSO",{"$f":"SUM('Melbourne:Abu Dabi'!J11)","v":0},{"$f":"C10-C4","v":-25},0,{"$f":"IF(C10=0,0,(RANK(C10,$C$4:$C$13)))+COUNTIF(C$4:C10,C10)-1","v":4}]
[null,"ALFA ROMÉO",{"$f":"SUM('Melbourne:Abu Dabi'!J14)","v":0},{"$f":"C11-C4","v":-25},0,{"$f":"IF(C11=0,0,(RANK(C11,$C$4:$C$13)))+COUNTIF(C$4:C11,C11)-1","v":5}]
[null,"HASS",{"$f":"SUM('Melbourne:Abu Dabi'!J112)","v":0},{"$f":"C12-C4","v":-25},0,{"$f":"IF(C12=0,0,(RANK(C12,$C$4:$C$13)))+COUNTIF(C$4:C12,C12)-1","v":6}]
[null,"Mc LAREN",{"$f":"SUM('Melbourne:Abu Dabi'!J13)","v":0},{"$f":"C13-C4","v":-25},0,{"$f":"IF(C13=0,0,(RANK(C13,$C$4:$C$13)))+COUNTIF(C$4:C13,C13)-1","v":7}]

{"sheet":"Pilotes","index":3,"n_rows":24,"n_cols":18,"rows_kept":24,"cut":false,"hidden":false,"merged":[[8,11,8,13],[7,11,7,13],[11,12,11,14],[12,12,12,14],[3,10,3,12],[4,10,4,12],[0,0,0,7],[2,1,3,1],[2,2,3,2],[2,6,3,6],[2,3,3,3],[2,4,3,4],[2,5,3,5]]}
[]
[null,null,null,null,null,null,null,null,null,null,null,null,null,null,null,null,null,1]
[null,"PILOTES","Points","Écart-premier","Écart/précédent","Pôle Position","Place",8,null,null,null,null,null,null,null,null,null,2]
[null,null,{"$f":"IFERROR(SUM(Melbourne!G33,[1]Bahreïn!F33),\"\")","v":0},null,null,null,{"$f":"IF(C4=0,\"\",(RANK(C4,C1:C4)))","v":""},"Pos.Saison",null,null,null,null,null,null,null,null,null,3]
[null,"Sebastian VETTEL",{"$f":"SUM('Melbourne:Abu Dabi'!G8)","v":25},null,null,{"$f":"SUM('Melbourne:Abu Dabi'!E5)","v":0},{"$f":"IF(C5=0,0,(RANK(C5,$C$5:$C$24)))+COUNTIF(C$5:C5,C5)-1","v":1},{"$f":"IF(OR(Melbourne!D5=$H$3,Bahrein!D5=$H$3,Chine!D5=$H$3,Azerbaïdjan!D5=$H$3,Espagne!D5=$H$3,Monaco!D5=$H$3,Canada!D5=$H$3,France!D5=$H$3),SUM(Melbourne!D5=$H$3,Bahrein!D5=$H$3,Chine!D5=$H$3,Azerbaïdjan!D5=$H$3,Espagne!D5=$H$3,Monaco!D5=$H$3,Canada!D5=$H$3,France!D5=$H$3,I5),I5)","v":""},{"$f":"IF(OR(Autriche!D5=$H$3,GB!D5=$H$3,'Pays-Bas'!D5=$H$3,Hongrie!D5=$H$3,Belgique!D5=$H$3,Italie!D5=$H$3,Singapour!D5=$H$3,Russie!D5=$H$3,Japon!D5=$H$3,Mexique!D5=$H$3,USA!D5=$H$3,Brésil!D5=$H$3,'Abu Dabi'!D5=$H$3),SUM(Autriche!D5=$H$3,GB!D5=$H$3,'Pays-Bas'!D5=$H$3,Hongrie!D5=$H$3,Belgique!D5=$H$3,Italie!D5=$H$3,Singapour!D5=$H$3,Russie!D5=$H$3,Japon!D5=$H$3,Mexique!D5=$H$3,USA!D5=$H$3,Brésil!D5=$H$3,'Abu Dabi'!D5=$H$3),\"\")","v":""},null,null,null,null,null,null,null,null,4]
[null,"Daniel RICCIARDO",{"$f":"SUM('Melbourne:Abu Dabi'!G20)","v":15},{"$f":"C6-C5","v":-10},{"$f":"C5-C6","v":10},{"$f":"SUM('Melbourne:Abu Dabi'!E9)","v":0},{"$f":"IF(C6=0,0,(RANK(C6,$C$5:$C$24)))+COUNTIF(C$5:C6,C6)-1","v":2},{"$f":"IF(OR(Melbourne!D6=$H$3,Bahrein!D6=$H$3,Chine!D6=$H$3,Azerbaïdjan!D6=$H$3,Espagne!D6=$H$3,Monaco!D6=$H$3,Canada!D6=$H$3,France!D6=$H$3),SUM(Melbourne!D6=$H$3,Bahrein!D6=$H$3,Chine!D6=$H$3,Azerbaïdjan!D6=$H$3,Espagne!D6=$H$3,Monaco!D6=$H$3,Canada!D6=$H$3,France!D6=$H$3,I6),I6)","v":""},{"$f":"IF(OR(Autriche!D6=$H$3,GB!D6=$H$3,'Pays-Bas'!D6=$H$3,Hongrie!D6=$H$3,Belgique!D6=$H$3,Italie!D6=$H$3,Singapour!D6=$H$3,Russie!D6=$H$3,Japon!D6=$H$3,Mexique!D6=$H$3,USA!D6=$H$3,Brésil!D6=$H$3,'Abu Dabi'!D6=$H$3),SUM(Autriche!D6=$H$3,GB!D6=$H$3,'Pays-Bas'!D6=$H$3,Hongrie!D6=$H$3,Belgique!D6=$H$3,Italie!D6=$H$3,Singapour!D6=$H$3,Russie!D6=$H$3,Japon!D6=$H$3,Mexique!D6=$H$3,USA!D6=$H$3,Brésil!D6=$H$3,'Abu Dabi'!D6=$H$3),\"\")","v":""},null,null,null,null,null,null,null,null,5]
[null,"Max VERSTAPPEN",{"$f":"SUM('Melbourne:Abu Dabi'!G11)","v":0},{"$f":"C7-C5","v":-25},{"$f":"C6-C7","v":15},{"$f":"SUM('Melbourne:Abu Dabi'!E11)","v":0},{"$f":"IF(C7=0,0,(RANK(C7,$C$5:$C$24)))+COUNTIF(C$5:C7,C7)-1","v":0},{"$f":"IF(OR(Melbourne!D7=$H$3,Bahrein!D7=$H$3,Chine!D7=$H$3,Azerbaïdjan!D7=$H$3,Espagne!D7=$H$3,Monaco!D7=$H$3,Canada!D7=$H$3,France!D7=$H$3),SUM(Melbourne!D7=$H$3,Bahrein!D7=$H$3,Chine!D7=$H$3,Azerbaïdjan!D7=$H$3,Espagne!D7=$H$3,Monaco!D7=$H$3,Canada!D7=$H$3,France!D7=$H$3,I7),I7)","v":""},{"$f":"IF(OR(Autriche!D11=$H$3,GB!D11=$H$3,'Pays-Bas'!D11=$H$3,Hongrie!D11=$H$3,Belgique!D11=$H$3,Italie!D11=$H$3,Singapour!D11=$H$3,Russie!D11=$H$3,Japon!D11=$H$3,Mexique!D11=$H$3,USA!D11=$H$3,Brésil!D11=$H$3,'Abu Dabi'!D11=$H$3),SUM(Autriche!D11=$H$3,GB!D11=$H$3,'Pays-Bas'!D11=$H$3,Hongrie!D11=$H$3,Belgique!D11=$H$3,Italie!D11=$H$3,Singapour!D11=$H$3,Russie!D11=$H$3,Japon!D11=$H$3,Mexique!D11=$H$3,USA!D11=$H$3,Brésil!D11=$H$3,'Abu Dabi'!D11=$H$3),\"\")","v":""},null,null,null,null,null,null,null,null,6]
[null,"Charles LECLERC",{"$f":"SUM('Melbourne:Abu Dabi'!G9)","v":0},{"$f":"C8-C5","v":-25},{"$f":"C7-C8","v":0},{"$f":"SUM('Melbourne:Abu Dabi'!E6)","v":0},{"$f":"IF(C8=0,0,(RANK(C8,$C$5:$C$24)))+COUNTIF(C$5:C8,C8)-1","v":1},{"$f":"IF(OR(Melbourne!D8=$H$3,Bahrein!D8=$H$3,Chine!D8=$H$3,Azerbaïdjan!D8=$H$3,Espagne!D8=$H$3,Monaco!D8=$H$3,Canada!D8=$H$3,France!D8=$H$3),SUM(Melbourne!D8=$H$3,Bahrein!D8=$H$3,Chine!D8=$H$3,Azerbaïdjan!D8=$H$3,Espagne!D8=$H$3,Monaco!D8=$H$3,Canada!D8=$H$3,France!D8=$H$3,I8),I8)","v":""},{"$f":"IF(OR(Autriche!D8=$H$3,GB!D8=$H$3,'Pays-Bas'!D8=$H$3,Hongrie!D8=$H$3,Belgique!D8=$H$3,Italie!D8=$H$3,Singapour!D8=$H$3,Russie!D8=$H$3,Japon!D8=$H$3,Mexique!D8=$H$3,USA!D8=$H$3,Brésil!D8=$H$3,'Abu Dabi'!D8=$H$3),SUM(Autriche!D8=$H$3,GB!D8=$H$3,'Pays-Bas'!D8=$H$3,Hongrie!D8=$H$3,Belgique!D8=$H$3,Italie!D8=$H$3,Singapour!D8=$H$3,Russie!D8=$H$3,Japon!D8=$H$3,Mexique!D8=$H$3,USA!D8=$H$3,Brésil!D8=$H$3,'Abu Dabi'!D8=$H$3),\"\")","v":""},null,null,"DEUXIÈME",null,null,null,null,null,7]
[null,"Valterii BOTTAS",{"$f":"SUM('Melbourne:Abu Dabi'!G6)","v":0},{"$f":"C9-C5","v":-25},{"$f":"C8-C9","v":0},{"$f":"SUM('Melbourne:Abu Dabi'!E8)","v":0},{"$f":"IF(C9=0,0,(RANK(C9,$C$5:$C$24)))+COUNTIF(C$5:C9,C9)-1","v":2},{"$f":"IF(OR(Melbourne!D9=$H$3,Bahrein!D9=$H$3,Chine!D9=$H$3,Azerbaïdjan!D9=$H$3,Espagne!D9=$H$3,Monaco!D9=$H$3,Canada!D9=$H$3,France!D9=$H$3),SUM(Melbourne!D9=$H$3,Bahrein!D9=$H$3,Chine!D9=$H$3,Azerbaïdjan!D9=$H$3,Espagne!D9=$H$3,Monaco!D9=$H$3,Canada!D9=$H$3,France!D9=$H$3,I9),I9)","v":""},{"$f":"IF(OR(Autriche!D9=$H$3,GB!D9=$H$3,'Pays-Bas'!D9=$H$3,Hongrie!D9=$H$3,Belgique!D9=$H$3,Italie!D9=$H$3,Singapour!D9=$H$3,Russie!D9=$H$3,Japon!D9=$H$3,Mexique!D9=$H$3,USA!D9=$H$3,Brésil!D9=$H$3,'Abu Dabi'!D9=$H$3),SUM(Autriche!D9=$H$3,GB!D9=$H$3,'Pays-Bas'!D9=$H$3,Hongrie!D9=$H$3,Belgique!D9=$H$3,Italie!D9=$H$3,Singapour!D9=$H$3,Russie!D9=$H$3,Japon!D9=$H$3,Mexique!D9=$H$3,USA!D9=$H$3,Brésil!D9=$H$3,'Abu Dabi'!D9=$H$3),\"\")","v":""},null,null,{"$f":"IF(G6=2,B6,\"\")","v":"Daniel RICCIARDO"},null,null,null,null,null,8]
[null,"Lewis HAMILTON",{"$f":"SUM('Melbourne:Abu Dabi'!G5)","v":0},{"$f":"C10-C5","v":-25},{"$f":"C9-C10","v":0},{"$f":"SUM('Melbourne:Abu Dabi'!E12)","v":0},{"$f":"IF(C10=0,0,(RANK(C10,$C$5:$C$24)))+COUNTIF(C$5:C10,C10)-1","v":3},{"$f":"IF(OR(Melbourne!D10=$H$3,Bahrein!D10=$H$3,Chine!D10=$H$3,Azerbaïdjan!D10=$H$3,Espagne!D10=$H$3,Monaco!D10=$H$3,Canada!D10=$H$3,France!D10=$H$3),SUM(Melbourne!D10=$H$3,Bahrein!D10=$H$3,Chine!D10=$H$3,Azerbaïdjan!D10=$H$3,Espagne!D10=$H$3,Monaco!D10=$H$3,Canada!D10=$H$3,France!D10=$H$3,I10),I10)","v":""},{"$f":"IF(OR(Autriche!D12=$H$3,GB!D12=$H$3,'Pays-Bas'!D12=$H$3,Hongrie!D12=$H$3,Belgique!D12=$H$3,Italie!D12=$H$3,Singapour!D12=$H$3,Russie!D12=$H$3,Japon!D12=$H$3,Mexique!D12=$H$3,USA!D12=$H$3,Brésil!D12=$H$3,'Abu Dabi'!D12=$H$3),SUM(Autriche!D12=$H$3,GB!D12=$H$3,'Pays-Bas'!D12=$H$3,Hongrie!D12=$H$3,Belgique!D12=$H$3,Italie!D12=$H$3,Singapour!D12=$H$3,Russie!D12=$H$3,Japon!D12=$H$3,Mexique!D12=$H$3,USA!D12=$H$3,Brésil!D12=$H$3,'Abu Dabi'!D12=$H$3),\"\")","v":""},null,null,null,null,null,null,null,null,9]
[null,"Lance STROLL",{"$f":"SUM('Melbourne:Abu Dabi'!G15)","v":0},{"$f":"C11-C5","v":-25},{"$f":"C10-C11","v":0},{"$f":"SUM('Melbourne:Abu Dabi'!E24)","v":0},{"$f":"IF(C11=0,0,(RANK(C11,$C$5:$C$24)))+COUNTIF(C$5:C11,C11)-1","v":4},{"$f":"IF(OR(Melbourne!D11=$H$3,Bahrein!D11=$H$3,Chine!D11=$H$3,Azerbaïdjan!D11=$H$3,Espagne!D11=$H$3,Monaco!D11=$H$3,Canada!D11=$H$3,France!D11=$H$3),SUM(Melbourne!D11=$H$3,Bahrein!D11=$H$3,Chine!D11=$H$3,Azerbaïdjan!D11=$H$3,Espagne!D11=$H$3,Monaco!D11=$H$3,Canada!D11=$H$3,France!D11=$H$3,I11),I11)","v":""},{"$f":"IF(OR(Autriche!D30=$H$3,GB!D30=$H$3,'Pays-Bas'!D30=$H$3,Hongrie!D30=$H$3,Belgique!D30=$H$3,Italie!D30=$H$3,Singapour!D30=$H$3,Russie!D30=$H$3,Japon!D30=$H$3,Mexique!D30=$H$3,USA!D30=$H$3,Brésil!D30=$H$3,'Abu Dabi'!D30=$H$3),SUM(Autriche!D30=$H$3,GB!D30=$H$3,'Pays-Bas'!D30=$H$3,Hongrie!D30=$H$3,Belgique!D30=$H$3,Italie!D30=$H$3,Singapour!D30=$H$3,Russie!D30=$H$3,Japon!D30=$H$3,Mexique!D30=$H$3,USA!D30=$H$3,Brésil!D30=$H$3,'Abu Dabi'!D30=$H$3),\"\")","v":""},null,null,null,null,null,null,null,null,10]
[null,"Pierre GASLY",{"$f":"SUM('Melbourne:Abu Dabi'!G12)+SUM('Melbourne:Abu Dabi'!G25)","v":0},{"$f":"C12-C5","v":-25},0,{"$f":"SUM('Melbourne:Abu Dabi'!E20)","v":0},{"$f":"IF(C12=0,0,(RANK(C12,$C$5:$C$24)))+COUNTIF(C$5:C12,C12)-1","v":5},{"$f":"IF(OR(Melbourne!D12=$H$3,Bahrein!D12=$H$3,Chine!D12=$H$3,Azerbaïdjan!D12=$H$3,Espagne!D12=$H$3,Monaco!D12=$H$3,Canada!D12=$H$3,France!D12=$H$3),SUM(Melbourne!D12=$H$3,Bahrein!D12=$H$3,Chine!D12=$H$3,Azerbaïdjan!D12=$H$3,Espagne!D12=$H$3,Monaco!D12=$H$3,Canada!D12=$H$3,France!D12=$H$3,I12),I12)","v":""},{"$f":"IF(OR(Autriche!D32=$H$3,GB!D32=$H$3,'Pays-Bas'!D32=$H$3,Hongrie!D32=$H$3,Belgique!D32=$H$3,Italie!D32=$H$3,Singapour!D32=$H$3,Russie!D32=$H$3,Japon!D32=$H$3,Mexique!D32=$H$3,USA!D32=$H$3,Brésil!D32=$H$3,'Abu Dabi'!D32=$H$3),SUM(Autriche!D32=$H$3,GB!D32=$H$3,'Pays-Bas'!D32=$H$3,Hongrie!D32=$H$3,Belgique!D32=$H$3,Italie!D32=$H$3,Singapour!D32=$H$3,Russie!D32=$H$3,Japon!D32=$H$3,Mexique!D32=$H$3,USA!D32=$H$3,Brésil!D32=$H$3,'Abu Dabi'!D32=$H$3),\"\")","v":""},null,null,null,"TROIXIÈME",null,null,null,null,11]
[null,"Esteban OCON",{"$f":"SUM('Melbourne:Abu Dabi'!G21)","v":0},{"$f":"C13-C5","v":-25},0,{"$f":"SUM('Melbourne:Abu Dabi'!E29)","v":0},{"$f":"IF(C13=0,0,(RANK(C13,$C$5:$C$24)))+COUNTIF(C$5:C13,C13)-1","v":6},{"$f":"IF(OR(Melbourne!D13=$H$3,Bahrein!D13=$H$3,Chine!D13=$H$3,Azerbaïdjan!D13=$H$3,Espagne!D13=$H$3,Monaco!D13=$H$3,Canada!D13=$H$3,France!D13=$H$3),SUM(Melbourne!D13=$H$3,Bahrein!D13=$H$3,Chine!D13=$H$3,Azerbaïdjan!D13=$H$3,Espagne!D13=$H$3,Monaco!D13=$H$3,Canada!D13=$H$3,France!D13=$H$3,I13),I13)","v":""},{"$f":"IF(OR(Autriche!D23=$H$3,GB!D23=$H$3,'Pays-Bas'!D23=$H$3,Hongrie!D23=$H$3,Belgique!D23=$H$3,Italie!D23=$H$3,Singapour!D23=$H$3,Russie!D23=$H$3,Japon!D23=$H$3,Mexique!D23=$H$3,USA!D23=$H$3,Brésil!D23=$H$3,'Abu Dabi'!D23=$H$3),SUM(Autriche!D23=$H$3,GB!D23=$H$3,'Pays-Bas'!D23=$H$3,Hongrie!D23=$H$3,Belgique!D23=$H$3,Italie!D23=$H$3,Singapour!D23=$H$3,Russie!D23=$H$3,Japon!D23=$H$3,Mexique!D23=$H$3,USA!D23=$H$3,Brésil!D23=$H$3,'Abu Dabi'!D23=$H$3),\"\")","v":""},null,null,null,{"$f":"IF(G7=3,B7,\"\")","v":""},null,null,null,null,12]
[null,"Nicholas LATIFI",{"$f":"SUM('Melbourne:Abu Dabi'!G18)","v":0},{"$f":"C14-C5","v":-25},0,{"$f":"SUM('Melbourne:Abu Dabi'!E30)","v":0},{"$f":"IF(C14=0,0,(RANK(C14,$C$5:$C$24)))+COUNTIF(C$5:C14,C14)-1","v":7},{"$f":"IF(OR(Melbourne!D14=$H$3,Bahrein!D14=$H$3,Chine!D14=$H$3,Azerbaïdjan!D14=$H$3,Espagne!D14=$H$3,Monaco!D14=$H$3,Canada!D14=$H$3,France!D14=$H$3),SUM(Melbourne!D14=$H$3,Bahrein!D14=$H$3,Chine!D14=$H$3,Azerbaïdjan!D14=$H$3,Espagne!D14=$H$3,Monaco!D14=$H$3,Canada!D14=$H$3,France!D14=$H$3,I14),I14)","v":""},{"$f":"IF(OR(Autriche!D29=$H$3,GB!D29=$H$3,'Pays-Bas'!D29=$H$3,Hongrie!D29=$H$3,Belgique!D29=$H$3,Italie!D29=$H$3,Singapour!D29=$H$3,Russie!D29=$H$3,Japon!D29=$H$3,Mexique!D29=$H$3,USA!D29=$H$3,Brésil!D29=$H$3,'Abu Dabi'!D29=$H$3),SUM(Autriche!D29=$H$3,GB!D29=$H$3,'Pays-Bas'!D29=$H$3,Hongrie!D29=$H$3,Belgique!D29=$H$3,Italie!D29=$H$3,Singapour!D29=$H$3,Russie!D29=$H$3,Japon!D29=$H$3,Mexique!D29=$H$3,USA!D29=$H$3,Brésil!D29=$H$3,'Abu Dabi'!D29=$H$3),\"\")","v":""},null,null,null,null,null,null,null,null,13]
[null,"Alexander ALBON",{"$f":"SUM('Melbourne:Abu Dabi'!G24)+SUM('Melbourne:Abu Dabi'!G13)","v":0},{"$f":"C15-C5","v":-25},0,{"$f":"SUM('Melbourne:Abu Dabi'!E21)","v":0},{"$f":"IF(C15=0,0,(RANK(C15,$C$5:$C$24)))+COUNTIF(C$5:C15,C15)-1","v":8},{"$f":"IF(OR(Melbourne!D15=$H$3,Bahrein!D15=$H$3,Chine!D15=$H$3,Azerbaïdjan!D15=$H$3,Espagne!D15=$H$3,Monaco!D15=$H$3,Canada!D15=$H$3,France!D15=$H$3),SUM(Melbourne!D15=$H$3,Bahrein!D15=$H$3,Chine!D15=$H$3,Azerbaïdjan!D15=$H$3,Espagne!D15=$H$3,Monaco!D15=$H$3,Canada!D15=$H$3,France!D15=$H$3,I15),I15)","v":""},{"$f":"IF(OR(Autriche!D15=$H$3,GB!D15=$H$3,'Pays-Bas'!D15=$H$3,Hongrie!D15=$H$3,Belgique!D15=$H$3,Italie!D15=$H$3,Singapour!D15=$H$3,Russie!D15=$H$3,Japon!D15=$H$3,Mexique!D15=$H$3,USA!D15=$H$3,Brésil!D15=$H$3,'Abu Dabi'!D15=$H$3),SUM(Autriche!D15=$H$3,GB!D15=$H$3,'Pays-Bas'!D15=$H$3,Hongrie!D15=$H$3,Belgique!D15=$H$3,Italie!D15=$H$3,Singapour!D15=$H$3,Russie!D15=$H$3,Japon!D15=$H$3,Mexique!D15=$H$3,USA!D15=$H$3,Brésil!D15=$H$3,'Abu Dabi'!D15=$H$3),\"\")","v":""},null,null,null,null,null,null,null,null,14]
[null,"Kimi RAÏKKONEN",{"$f":"SUM('Melbourne:Abu Dabi'!G32)","v":0},{"$f":"C16-C5","v":-25},0,{"$f":"SUM('Melbourne:Abu Dabi'!E14)","v":0},{"$f":"IF(C16=0,0,(RANK(C16,$C$5:$C$24)))+COUNTIF(C$5:C16,C16)-1","v":9},{"$f":"IF(OR(Melbourne!D16=$H$3,Bahrein!D16=$H$3,Chine!D16=$H$3,Azerbaïdjan!D16=$H$3,Espagne!D16=$H$3,Monaco!D16=$H$3,Canada!D16=$H$3,France!D16=$H$3),SUM(Melbourne!D16=$H$3,Bahrein!D16=$H$3,Chine!D16=$H$3,Azerbaïdjan!D16=$H$3,Espagne!D16=$H$3,Monaco!D16=$H$3,Canada!D16=$H$3,France!D16=$H$3,I16),I16)","v":""},{"$f":"IF(OR(Autriche!D15=$H$3,GB!D15=$H$3,'Pays-Bas'!D15=$H$3,Hongrie!D15=$H$3,Belgique!D15=$H$3,Italie!D15=$H$3,Singapour!D15=$H$3,Russie!D15=$H$3,Japon!D15=$H$3,Mexique!D15=$H$3,USA!D15=$H$3,Brésil!D15=$H$3,'Abu Dabi'!D15=$H$3),SUM(Autriche!D15=$H$3,GB!D15=$H$3,'Pays-Bas'!D15=$H$3,Hongrie!D15=$H$3,Belgique!D15=$H$3,Italie!D15=$H$3,Singapour!D15=$H$3,Russie!D15=$H$3,Japon!D15=$H$3,Mexique!D15=$H$3,USA!D15=$H$3,Brésil!D15=$H$3,'Abu Dabi'!D15=$H$3),\"\")","v":""},null,null,null,null,null,null,null,null,15]
[null,"George RUSSEL",{"$f":"SUM('Melbourne:Abu Dabi'!G17)","v":0},{"$f":"C17-C5","v":-25},0,{"$f":"SUM('Melbourne:Abu Dabi'!E15)","v":0},{"$f":"IF(C17=0,0,(RANK(C17,$C$5:$C$24)))+COUNTIF(C$5:C17,C17)-1","v":10},{"$f":"IF(OR(Melbourne!D17=$H$3,Bahrein!D17=$H$3,Chine!D17=$H$3,Azerbaïdjan!D17=$H$3,Espagne!D17=$H$3,Monaco!D17=$H$3,Canada!D17=$H$3,France!D17=$H$3),SUM(Melbourne!D17=$H$3,Bahrein!D17=$H$3,Chine!D17=$H$3,Azerbaïdjan!D17=$H$3,Espagne!D17=$H$3,Monaco!D17=$H$3,Canada!D17=$H$3,France!D17=$H$3,I17),I17)","v":""},{"$f":"IF(OR(Autriche!D27=$H$3,GB!D27=$H$3,'Pays-Bas'!D27=$H$3,Hongrie!D27=$H$3,Belgique!D27=$H$3,Italie!D27=$H$3,Singapour!D27=$H$3,Russie!D27=$H$3,Japon!D27=$H$3,Mexique!D27=$H$3,USA!D27=$H$3,Brésil!D27=$H$3,'Abu Dabi'!D27=$H$3),SUM(Autriche!D27=$H$3,GB!D27=$H$3,'Pays-Bas'!D27=$H$3,Hongrie!D27=$H$3,Belgique!D27=$H$3,Italie!D27=$H$3,Singapour!D27=$H$3,Russie!D27=$H$3,Japon!D27=$H$3,Mexique!D27=$H$3,USA!D27=$H$3,Brésil!D27=$H$3,'Abu Dabi'!D27=$H$3),\"\")","v":""},null,null,null,null,null,null,null,null,16]
[null,"Antonio GIOVANIZZI",{"$f":"SUM('Melbourne:Abu Dabi'!G33)","v":0},{"$f":"C18-C5","v":-25},0,{"$f":"SUM('Melbourne:Abu Dabi'!E23)","v":0},{"$f":"IF(C18=0,0,(RANK(C18,$C$5:$C$24)))+COUNTIF(C$5:C18,C18)-1","v":11},{"$f":"IF(OR(Melbourne!D18=$H$3,Bahrein!D18=$H$3,Chine!D18=$H$3,Azerbaïdjan!D18=$H$3,Espagne!D18=$H$3,Monaco!D18=$H$3,Canada!D18=$H$3,France!D18=$H$3),SUM(Melbourne!D18=$H$3,Bahrein!D18=$H$3,Chine!D18=$H$3,Azerbaïdjan!D18=$H$3,Espagne!D18=$H$3,Monaco!D18=$H$3,Canada!D18=$H$3,France!D18=$H$3,I18),I18)","v":""},{"$f":"IF(OR(Autriche!D21=$H$3,GB!D21=$H$3,'Pays-Bas'!D21=$H$3,Hongrie!D21=$H$3,Belgique!D21=$H$3,Italie!D21=$H$3,Singapour!D21=$H$3,Russie!D21=$H$3,Japon!D21=$H$3,Mexique!D21=$H$3,USA!D21=$H$3,Brésil!D21=$H$3,'Abu Dabi'!D21=$H$3),SUM(Autriche!D21=$H$3,GB!D21=$H$3,'Pays-Bas'!D21=$H$3,Hongrie!D21=$H$3,Belgique!D21=$H$3,Italie!D21=$H$3,Singapour!D21=$H$3,Russie!D21=$H$3,Japon!D21=$H$3,Mexique!D21=$H$3,USA!D21=$H$3,Brésil!D21=$H$3,'Abu Dabi'!D21=$H$3),\"\")","v":""},null,null,null,null,null,null,null,null,17]
[null,"Kevin MAGNUSSEN",{"$f":"SUM('Melbourne:Abu Dabi'!G27)","v":0},{"$f":"C19-C5","v":-25},0,{"$f":"SUM('Melbourne:Abu Dabi'!E27)","v":0},{"$f":"IF(C19=0,0,(RANK(C19,$C$5:$C$24)))+COUNTIF(C$5:C19,C19)-1","v":12},{"$f":"IF(OR(Melbourne!D19=$H$3,Bahrein!D19=$H$3,Chine!D19=$H$3,Azerbaïdjan!D19=$H$3,Espagne!D19=$H$3,Monaco!D19=$H$3,Canada!D19=$H$3,France!D19=$H$3),SUM(Melbourne!D19=$H$3,Bahrein!D19=$H$3,Chine!D19=$H$3,Azerbaïdjan!D19=$H$3,Espagne!D19=$H$3,Monaco!D19=$H$3,Canada!D19=$H$3,France!D19=$H$3,I19),I19)","v":""},{"$f":"IF(OR(Autriche!D24=$H$3,GB!D24=$H$3,'Pays-Bas'!D24=$H$3,Hongrie!D24=$H$3,Belgique!D24=$H$3,Italie!D24=$H$3,Singapour!D24=$H$3,Russie!D24=$H$3,Japon!D24=$H$3,Mexique!D24=$H$3,USA!D24=$H$3,Brésil!D24=$H$3,'Abu Dabi'!D24=$H$3),SUM(Autriche!D24=$H$3,GB!D24=$H$3,'Pays-Bas'!D24=$H$3,Hongrie!D24=$H$3,Belgique!D24=$H$3,Italie!D24=$H$3,Singapour!D24=$H$3,Russie!D24=$H$3,Japon!D24=$H$3,Mexique!D24=$H$3,USA!D24=$H$3,Brésil!D24=$H$3,'Abu Dabi'!D24=$H$3),\"\")","v":""},null,null,null,null,null,null,null,null,18]
[null,"Daniil KVYAT",{"$f":"SUM('Melbourne:Abu Dabi'!G23)","v":0},{"$f":"C20-C5","v":-25},0,{"$f":"SUM('Melbourne:Abu Dabi'!E33)","v":0},{"$f":"IF(C20=0,0,(RANK(C20,$C$5:$C$24)))+COUNTIF(C$5:C20,C20)-1","v":13},{"$f":"IF(OR(Melbourne!D20=$H$3,Bahrein!D20=$H$3,Chine!D20=$H$3,Azerbaïdjan!D20=$H$3,Espagne!D20=$H$3,Monaco!D20=$H$3,Canada!D20=$H$3,France!D20=$H$3),SUM(Melbourne!D20=$H$3,Bahrein!D20=$H$3,Chine!D20=$H$3,Azerbaïdjan!D20=$H$3,Espagne!D20=$H$3,Monaco!D20=$H$3,Canada!D20=$H$3,France!D20=$H$3,I20),I20)","v":""},{"$f":"IF(OR(Autriche!D14=$H$3,GB!D14=$H$3,'Pays-Bas'!D14=$H$3,Hongrie!D14=$H$3,Belgique!D14=$H$3,Italie!D14=$H$3,Singapour!D14=$H$3,Russie!D14=$H$3,Japon!D14=$H$3,Mexique!D14=$H$3,USA!D14=$H$3,Brésil!D14=$H$3,'Abu Dabi'!D14=$H$3),SUM(Autriche!D14=$H$3,GB!D14=$H$3,'Pays-Bas'!D14=$H$3,Hongrie!D14=$H$3,Belgique!D14=$H$3,Italie!D14=$H$3,Singapour!D14=$H$3,Russie!D14=$H$3,Japon!D14=$H$3,Mexique!D14=$H$3,USA!D14=$H$3,Brésil!D14=$H$3,'Abu Dabi'!D14=$H$3),\"\")","v":""},null,null,null,null,null,null,null,null,19]
[null,"Lando NORRIS",{"$f":"SUM('Melbourne:Abu Dabi'!G29)","v":0},{"$f":"C21-C5","v":-25},0,{"$f":"SUM('Melbourne:Abu Dabi'!E32)","v":0},{"$f":"IF(C21=0,0,(RANK(C21,$C$5:$C$24)))+COUNTIF(C$5:C21,C21)-1","v":14},{"$f":"IF(OR(Melbourne!D21=$H$3,Bahrein!D21=$H$3,Chine!D21=$H$3,Azerbaïdjan!D21=$H$3,Espagne!D21=$H$3,Monaco!D21=$H$3,Canada!D21=$H$3,France!D21=$H$3),SUM(Melbourne!D21=$H$3,Bahrein!D21=$H$3,Chine!D21=$H$3,Azerbaïdjan!D21=$H$3,Espagne!D21=$H$3,Monaco!D21=$H$3,Canada!D21=$H$3,France!D21=$H$3,I21),I21)","v":""},{"$f":"IF(OR(Autriche!D26=$H$3,GB!D26=$H$3,'Pays-Bas'!D26=$H$3,Hongrie!D26=$H$3,Belgique!D26=$H$3,Italie!D26=$H$3,Singapour!D26=$H$3,Russie!D26=$H$3,Japon!D26=$H$3,Mexique!D26=$H$3,USA!D26=$H$3,Brésil!D26=$H$3,'Abu Dabi'!D26=$H$3),SUM(Autriche!D26=$H$3,GB!D26=$H$3,'Pays-Bas'!D26=$H$3,Hongrie!D26=$H$3,Belgique!D26=$H$3,Italie!D26=$H$3,Singapour!D26=$H$3,Russie!D26=$H$3,Japon!D26=$H$3,Mexique!D26=$H$3,USA!D26=$H$3,Brésil!D26=$H$3,'Abu Dabi'!D26=$H$3),\"\")","v":""},null,null,null,null,null,null,null,null,20]
[null,"Sergio PEREZ",{"$f":"SUM('Melbourne:Abu Dabi'!G14)","v":0},{"$f":"C22-C5","v":-25},0,{"$f":"SUM('Melbourne:Abu Dabi'!E26)","v":0},{"$f":"IF(C22=0,0,(RANK(C22,$C$5:$C$24)))+COUNTIF(C$5:C22,C22)-1","v":15},{"$f":"IF(OR(Melbourne!D22=$H$3,Bahrein!D22=$H$3,Chine!D22=$H$3,Azerbaïdjan!D22=$H$3,Espagne!D22=$H$3,Monaco!D22=$H$3,Canada!D22=$H$3,France!D22=$H$3),SUM(Melbourne!D22=$H$3,Bahrein!D22=$H$3,Chine!D22=$H$3,Azerbaïdjan!D22=$H$3,Espagne!D22=$H$3,Monaco!D22=$H$3,Canada!D22=$H$3,France!D22=$H$3,I22),I22)","v":""},{"$f":"IF(OR(Autriche!D33=$H$3,GB!D33=$H$3,'Pays-Bas'!D33=$H$3,Hongrie!D33=$H$3,Belgique!D33=$H$3,Italie!D33=$H$3,Singapour!D33=$H$3,Russie!D33=$H$3,Japon!D33=$H$3,Mexique!D33=$H$3,USA!D33=$H$3,Brésil!D33=$H$3,'Abu Dabi'!D33=$H$3),SUM(Autriche!D33=$H$3,GB!D33=$H$3,'Pays-Bas'!D33=$H$3,Hongrie!D33=$H$3,Belgique!D33=$H$3,Italie!D33=$H$3,Singapour!D33=$H$3,Russie!D33=$H$3,Japon!D33=$H$3,Mexique!D33=$H$3,USA!D33=$H$3,Brésil!D33=$H$3,'Abu Dabi'!D33=$H$3),\"\")","v":""},null,null,null,null,null,null,null,null,"OUT"]
[null,"Carlos SAINZ",{"$f":"SUM('Melbourne:Abu Dabi'!G30)","v":0},{"$f":"C23-C5","v":-25},{"$f":"C22-C23","v":0},{"$f":"SUM('Melbourne:Abu Dabi'!E18)","v":0},{"$f":"IF(C23=0,0,(RANK(C23,$C$5:$C$24)))+COUNTIF(C$5:C23,C23)-1","v":16},{"$f":"IF(OR(Melbourne!D23=$H$3,Bahrein!D23=$H$3,Chine!D23=$H$3,Azerbaïdjan!D23=$H$3,Espagne!D23=$H$3,Monaco!D23=$H$3,Canada!D23=$H$3,France!D23=$H$3),SUM(Melbourne!D23=$H$3,Bahrein!D23=$H$3,Chine!D23=$H$3,Azerbaïdjan!D23=$H$3,Espagne!D23=$H$3,Monaco!D23=$H$3,Canada!D23=$H$3,France!D23=$H$3,I23),I23)","v":""},{"$f":"IF(OR(Autriche!D18=$H$3,GB!D18=$H$3,'Pays-Bas'!D18=$H$3,Hongrie!D18=$H$3,Belgique!D18=$H$3,Italie!D18=$H$3,Singapour!D18=$H$3,Russie!D18=$H$3,Japon!D18=$H$3,Mexique!D18=$H$3,USA!D18=$H$3,Brésil!D18=$H$3,'Abu Dabi'!D18=$H$3),SUM(Autriche!D18=$H$3,GB!D18=$H$3,'Pays-Bas'!D18=$H$3,Hongrie!D18=$H$3,Belgique!D18=$H$3,Italie!D18=$H$3,Singapour!D18=$H$3,Russie!D18=$H$3,Japon!D18=$H$3,Mexique!D18=$H$3,USA!D18=$H$3,Brésil!D18=$H$3,'Abu Dabi'!D18=$H$3),\"\")","v":""}]
[null,"Romain GROSJEAN",{"$f":"SUM('Melbourne:Abu Dabi'!G26)","v":0},{"$f":"C24-C5","v":-25},0,{"$f":"SUM('Melbourne:Abu Dabi'!E17)","v":0},{"$f":"IF(C24=0,0,(RANK(C24,$C$5:$C$24)))+COUNTIF(C$5:C24,C24)-1","v":17},{"$f":"IF(OR(Melbourne!D24=$H$3,Bahrein!D24=$H$3,Chine!D24=$H$3,Azerbaïdjan!D24=$H$3,Espagne!D24=$H$3,Monaco!D24=$H$3,Canada!D24=$H$3,France!D24=$H$3),SUM(Melbourne!D24=$H$3,Bahrein!D24=$H$3,Chine!D24=$H$3,Azerbaïdjan!D24=$H$3,Espagne!D24=$H$3,Monaco!D24=$H$3,Canada!D24=$H$3,France!D24=$H$3,I24),I24)","v":""},{"$f":"IF(OR(Autriche!D17=$H$3,GB!D17=$H$3,'Pays-Bas'!D17=$H$3,Hongrie!D17=$H$3,Belgique!D17=$H$3,Italie!D17=$H$3,Singapour!D17=$H$3,Russie!D17=$H$3,Japon!D17=$H$3,Mexique!D17=$H$3,USA!D17=$H$3,Brésil!D17=$H$3,'Abu Dabi'!D17=$H$3),SUM(Autriche!D17=$H$3,GB!D17=$H$3,'Pays-Bas'!D17=$H$3,Hongrie!D17=$H$3,Belgique!D17=$H$3,Italie!D17=$H$3,Singapour!D17=$H$3,Russie!D17=$H$3,Japon!D17=$H$3,Mexique!D17=$H$3,USA!D17=$H$3,Brésil!D17=$H$3,'Abu Dabi'!D17=$H$3),\"\")","v":""}]

{"sheet":"Melbourne","index":4,"n_rows":34,"n_cols":11,"rows_kept":34,"cut":false,"hidden":false,"merged":[[7,1,9,1],[7,2,9,2],[10,1,12,1],[10,2,12,2],[0,0,1,14],[4,1,6,1],[4,2,6,2],[2,0,3,0],[2,8,2,10],[2,1,3,1],[2,2,3,2],[2,3,3,3],[2,5,3,5],[2,6,3,6],[2,4,3,4],[31,1,33,1],[31,2,33,2],[13,1,15,1],[13,2,15,2],[16,1,18,1],[16,2,18,2],[19,1,21,1],[19,2,21,2],[28,1,30,1],[28,2,30,2],[25,2,27,2],[22,1,24,1],[22,2,24,2],[25,1,27,1]]}
["AUSTRALIE - 15 MARS 2020"]
[]
["PILOTES","ECURIES","VOITURES","Finish","Pôle","Pt tour","Points",null,"CLASSEMENT"]
[null,null,null,null,null,null,null,null,"ÉCURIES","POINTS","RANG"]
["HAMILTON Lewis","MERCEDES",null,null,null,null,{"$f":"IFERROR(CHOOSE(D5,25,18,15,12,10,8,6,4,2,1)+(F5=1),\"\")","v":""},null,"MERCEDES",{"$f":"SUM(G5:G7)","v":0},{"$f":"IF(J5=\"\",0,(RANK(J5,$J$5:$J$14)))+COUNTIF(J$5:J5,J5)-1","v":3}]
["BOTTAS Valterri",null,null,null,null,null,"",null,"FERRARI",{"$f":"SUM(G8:G10)","v":25},{"$f":"IF(J6=\"\",0,(RANK(J6,$J$5:$J$14)))+COUNTIF(J$5:J6,J6)-1","v":1}]
[null,null,null,null,null,null,"",null,"RED BULL",{"$f":"SUM(G11:G13)","v":0},{"$f":"IF(J7=\"\",0,(RANK(J7,$J$5:$J$14)))+COUNTIF(J$5:J7,J7)-1","v":4}]
["VETTEL Sebastian","FERRARI",null,1,null,null,25,null,"RACING POINT",{"$f":"SUM(G14:G16)","v":0},{"$f":"IF(J8=\"\",0,(RANK(J8,$J$5:$J$14)))+COUNTIF(J$5:J8,J8)-1","v":5}]
["LECLERC Charles",null,null,null,null,null,"",null,"WILLIAMS",{"$f":"SUM(G17:G19)","v":0},{"$f":"IF(J9=\"\",0,(RANK(J9,$J$5:$J$14)))+COUNTIF(J$5:J9,J9)-1","v":6}]
[null,null,null,null,null,null,"",null,"RENAULT",{"$f":"SUM(G20:G22)","v":15},{"$f":"IF(J10=\"\",0,(RANK(J10,$J$5:$J$14)))+COUNTIF(J$5:J10,J10)-1","v":2}]
["VERSTAPPEN Max","RED BULL",null,null,null,null,"",null,"TORO ROSSO",{"$f":"SUM(G23:G25)","v":0},{"$f":"IF(J11=\"\",0,(RANK(J11,$J$5:$J$14)))+COUNTIF(J$5:J11,J11)-1","v":7}]
["ALBON Alexander ",null,null,null,null,null,"",null,"HAAS",{"$f":"SUM(G26:G28)","v":0},{"$f":"IF(J12=\"\",0,(RANK(J12,$J$5:$J$14)))+COUNTIF(J$5:J12,J12)-1","v":8}]
[null,null,null,null,null,null,"",null,"Mc LAREN",{"$f":"SUM(G29:G31)","v":0},{"$f":"IF(J13=\"\",0,(RANK(J13,$J$5:$J$14)))+COUNTIF(J$5:J13,J13)-1","v":9}]
["PEREZ Sergio","RACING\nPOINT",null,null,null,null,"",null,"ALFA ROMEO",{"$f":"SUM(G32:G34)","v":0},{"$f":"IF(J14=\"\",0,(RANK(J14,$J$5:$J$14)))+COUNTIF(J$5:J14,J14)-1","v":10}]
["STROLL Lance",null,null,null,null,null,""]
[null,null,null,null,null,null,""]
["RUSSELL George","WILLIAMS",null,null,null,null,""]
[" LATIFI Nicholas",null,null,null,null,null,""]
[null,null,null,null,null,null,""]
["RICCIARDO Daniel","RENAULT",null,3,null,null,15]
["OCON Esteban ",null,null,null,null,null,""]
[null,null,null,null,null,null,""]
["KVYAT Daniil","TORO ROSSO",null,null,null,null,""]
[" GASLY Pierre",null,null,null,null,null,""]
[null,null,null,null,null,null,""]
["GROSJEAN Romain","HAAS",null,null,null,null,""]
["MAGNUSSEN Kevin",null,null,null,null,null,""]
[null,null,null,null,null,null,""]
["NORRIS Lando","McLAREN",null,null,null,null,""]
["SAINZ.Jr Carlos",null,null,null,null,null,""]
[null,null,null,null,null,null,""]
["RAÏKKÖNEN Kimi","ALFA ROMEO",null,null,null,null,""]
["GIOVANIZZI Antonio",null,null,null,null,null,""]
[null,null,null,null,null,null,""]

{"sheet":"Bahrein","index":5,"n_rows":34,"n_cols":12,"rows_kept":34,"cut":false,"hidden":false,"merged":[[0,0,1,14],[2,1,3,1],[2,2,3,2],[2,3,3,3],[2,5,3,5],[2,6,3,6],[2,8,2,10],[2,4,3,4],[4,1,6,1],[4,2,6,2],[7,1,9,1],[7,2,9,2],[10,1,12,1],[10,2,12,2],[13,1,15,1],[13,2,15,2],[16,1,18,1],[16,2,18,2],[19,1,21,1],[19,2,21,2],[31,1,33,1],[31,2,33,2],[22,1,24,1],[22,2,24,2],[25,1,27,1],[25,2,27,2],[28,1,30,1],[28,2,30,2]]}
["BAHREÏN - 22 MARS 2020"]
[]
["PILOTES","ECURIES","VOITURES","Finish","Pôle","Pt tour","Points",null,"CLASSEMENT"]
[null,null,null,null,null,null,null,{"$f":"IF(G4=\"\",\"\",(RANK(G4,G4:G23)))","v":""},"ÉCURIES","POINTS","RANG","TOTAL"]
["HAMILTON Lewis","MERCEDES",null,null,null,null,{"$f":"IFERROR(CHOOSE(D5,25,18,15,12,10,8,6,4,2,1)+(F5=1),\"\")","v":""},null,"MERCEDES",{"$f":"SUM(G5:G7)","v":0},{"$f":"IF(J5=\"\",0,(RANK(J5,$J$5:$J$14)))+COUNTIF(J$5:J5,J5)-1","v":1},{"$f":"IF(J5=0,0,J5+Melbourne!J5)","v":0}]
["BOTTAS Valterri",null,null,null,null,null,{"$f":"IFERROR(CHOOSE(D6,25,18,15,12,10,8,6,4,2,1)+(F6=1),\"\")","v":""},null,"FERRARI",{"$f":"SUM(G8:G10)","v":0},{"$f":"IF(J6=\"\",0,(RANK(J6,$J$5:$J$14)))+COUNTIF(J$5:J6,J6)-1","v":2},{"$f":"IF(J6=0,0,J6+Melbourne!J6)","v":0}]
[null,null,null,null,null,null,"",null,"RED BULL",{"$f":"SUM(G11:G13)","v":0},{"$f":"IF(J7=\"\",0,(RANK(J7,$J$5:$J$14)))+COUNTIF(J$5:J7,J7)-1","v":3},{"$f":"IF(J7=0,0,J7+Melbourne!J7)","v":0}]
["VETTEL Sebastian","FERRARI",null,null,null,null,"",null,"RACING POINT",{"$f":"SUM(G14:G16)","v":0},{"$f":"IF(J8=\"\",0,(RANK(J8,$J$5:$J$14)))+COUNTIF(J$5:J8,J8)-1","v":4},{"$f":"IF(J8=0,0,J8+Melbourne!J8)","v":0}]
["LECLERC Charles",null,null,null,null,null,"",null,"WILLIAMS",{"$f":"SUM(G17:G19)","v":0},{"$f":"IF(J9=\"\",0,(RANK(J9,$J$5:$J$14)))+COUNTIF(J$5:J9,J9)-1","v":5},{"$f":"IF(J9=0,0,J9+Melbourne!J9)","v":0}]
[null,null,null,null,null,null,"",null,"RENAULT",{"$f":"SUM(G20:G22)","v":0},{"$f":"IF(J10=\"\",0,(RANK(J10,$J$5:$J$14)))+COUNTIF(J$5:J10,J10)-1","v":6},{"$f":"IF(J10=0,0,J10+Melbourne!J10)","v":0}]
["VERSTAPPEN Max","RED BULL",null,null,null,null,"",null,"TORO ROSSO",{"$f":"SUM(G23:G25)","v":0},{"$f":"IF(J11=\"\",0,(RANK(J11,$J$5:$J$14)))+COUNTIF(J$5:J11,J11)-1","v":7},{"$f":"IF(J11=0,0,J11+Melbourne!J11)","v":0}]
["ALBON Alexander",null,null,null,null,null,"",null,"HAAS",{"$f":"SUM(G26:G28)","v":0},{"$f":"IF(J12=\"\",0,(RANK(J12,$J$5:$J$14)))+COUNTIF(J$5:J12,J12)-1","v":8},{"$f":"IF(J12=0,0,J12+Melbourne!J12)","v":0}]
[null,null,null,null,null,null,"",null,"Mc LAREN",{"$f":"SUM(G29:G31)","v":0},{"$f":"IF(J13=\"\",0,(RANK(J13,$J$5:$J$14)))+COUNTIF(J$5:J13,J13)-1","v":9},{"$f":"IF(J13=0,0,J13+Melbourne!J13)","v":0}]
["PEREZ Sergio","RACING\nPOINT",null,null,null,null,"",null,"ALFA ROMEO",{"$f":"SUM(G32:G34)","v":0},{"$f":"IF(J14=\"\",0,(RANK(J14,$J$5:$J$14)))+COUNTIF(J$5:J14,J14)-1","v":10},{"$f":"IF(J14=0,0,J14+Melbourne!J14)","v":0}]
["STROLL Lance",null,null,null,null,null,""]
[null,null,null,null,null,null,""]
["RUSSELL George","WILLIAMS",null,null,null,null,""]
["LATIFI Nicholas",null,null,null,null,null,""]
[null,null,null,null,null,null,""]
["RICCIARDO Daniel","RENAULT",null,null,null,null,""]
["OCON Esteban",null,null,null,null,null,""]
[null,null,null,null,null,null,""]
["KVYAT Daniil","TORO ROSSO",null,null,null,null,""]
["GASLY Pierre",null,null,null,null,null,""]
[null,null,null,null,null,null,""]
["GROSJEAN Romain","HAAS",null,null,null,null,""]
["MAGNUSSEN Kevin",null,null,null,null,null,""]
[null,null,null,null,null,null,""]
["NORRIS Lando","McLAREN",null,null,null,null,""]
["SAINZ.Jr Carlos",null,null,null,null,null,""]
[null,null,null,null,null,null,""]
["RAÏKKÖNEN Kimi","ALFA ROMEO",null,null,null,null,""]
["GIOVANIZZI Antonio",null,null,null,null,null,""]
[null,null,null,null,null,null,""]

{"sheet":"Chine","index":6,"n_rows":34,"n_cols":12,"rows_kept":34,"cut":false,"hidden":false,"merged":[[0,0,1,14],[2,1,3,1],[2,2,3,2],[2,3,3,3],[2,5,3,5],[2,6,3,6],[2,8,2,10],[2,4,3,4],[4,1,6,1],[4,2,6,2],[7,1,9,1],[7,2,9,2],[10,1,12,1],[10,2,12,2],[13,1,15,1],[13,2,15,2],[16,1,18,1],[16,2,18,2],[19,1,21,1],[19,2,21,2],[31,1,33,1],[31,2,33,2],[22,1,24,1],[22,2,24,2],[25,1,27,1],[25,2,27,2],[28,1,30,1],[28,2,30,2]]}
["CHINE - 19 AVRIL 2020"]
[]
["PILOTES","ECURIES","VOITURES","Finish","Pôle","Pt tour","Points",null,"CLASSEMENT"]
[null,null,null,null,null,null,null,{"$f":"IF(G4=\"\",\"\",(RANK(G4,G4:G23)))","v":""},"ÉCURIES","POINTS","RANG","TOTAL"]
["HAMILTON Lewis","MERCEDES",null,null,null,null,{"$f":"IFERROR(CHOOSE(D5,25,18,15,12,10,8,6,4,2,1)+(F5=1),\"\")","v":""},null,"MERCEDES",{"$f":"SUM(G5:G7)","v":0},{"$f":"IF(J5=\"\",0,(RANK(J5,$J$5:$J$14)))+COUNTIF(J$5:J5,J5)-1","v":1},{"$f":"IF(J5=0,0,J5+Bahrein!L5)","v":0}]
["BOTTAS Valterri",null,null,null,null,null,{"$f":"IFERROR(CHOOSE(D6,25,18,15,12,10,8,6,4,2,1)+(F6=1),\"\")","v":""},null,"FERRARI",{"$f":"SUM(G8:G10)","v":0},{"$f":"IF(J6=\"\",0,(RANK(J6,$J$5:$J$14)))+COUNTIF(J$5:J6,J6)-1","v":2},{"$f":"IF(J6=0,0,J6+Bahrein!L6)","v":0}]
[null,null,null,null,null,null,"",null,"RED BULL",{"$f":"SUM(G11:G13)","v":0},{"$f":"IF(J7=\"\",0,(RANK(J7,$J$5:$J$14)))+COUNTIF(J$5:J7,J7)-1","v":3},{"$f":"IF(J7=0,0,J7+Bahrein!L7)","v":0}]
["VETTEL Sebastian","FERRARI",null,null,null,null,"",null,"RACING POINT",{"$f":"SUM(G14:G16)","v":0},{"$f":"IF(J8=\"\",0,(RANK(J8,$J$5:$J$14)))+COUNTIF(J$5:J8,J8)-1","v":4},{"$f":"IF(J8=0,0,J8+Bahrein!L8)","v":0}]
["LECLERC Charles",null,null,null,null,null,"",null,"WILLIAMS",{"$f":"SUM(G17:G19)","v":0},{"$f":"IF(J9=\"\",0,(RANK(J9,$J$5:$J$14)))+COUNTIF(J$5:J9,J9)-1","v":5},{"$f":"IF(J9=0,0,J9+Bahrein!L9)","v":0}]
[null,null,null,null,null,null,"",null,"RENAULT",{"$f":"SUM(G20:G22)","v":0},{"$f":"IF(J10=\"\",0,(RANK(J10,$J$5:$J$14)))+COUNTIF(J$5:J10,J10)-1","v":6},{"$f":"IF(J10=0,0,J10+Bahrein!L10)","v":0}]
["VERSTAPPEN Max","RED BULL",null,null,null,null,"",null,"TORO ROSSO",{"$f":"SUM(G23:G25)","v":0},{"$f":"IF(J11=\"\",0,(RANK(J11,$J$5:$J$14)))+COUNTIF(J$5:J11,J11)-1","v":7},{"$f":"IF(J11=0,0,J11+Bahrein!L11)","v":0}]
["ALBON Alexander",null,null,null,null,null,"",null,"HAAS",{"$f":"SUM(G26:G28)","v":0},{"$f":"IF(J12=\"\",0,(RANK(J12,$J$5:$J$14)))+COUNTIF(J$5:J12,J12)-1","v":8},{"$f":"IF(J12=0,0,J12+Bahrein!L12)","v":0}]
[null,null,null,null,null,null,"",null,"Mc LAREN",{"$f":"SUM(G29:G31)","v":0},{"$f":"IF(J13=\"\",0,(RANK(J13,$J$5:$J$14)))+COUNTIF(J$5:J13,J13)-1","v":9},{"$f":"IF(J13=0,0,J13+Bahrein!L13)","v":0}]
["PEREZ Sergio","RACING\nPOINT",null,null,null,null,"",null,"ALFA ROMEO",{"$f":"SUM(G32:G34)","v":0},{"$f":"IF(J14=\"\",0,(RANK(J14,$J$5:$J$14)))+COUNTIF(J$5:J14,J14)-1","v":10},{"$f":"IF(J14=0,0,J14+Bahrein!L14)","v":0}]
["STROLL Lance",null,null,null,null,null,""]
[null,null,null,null,null,null,""]
["RUSSELL George","WILLIAMS",null,null,null,null,""]
["LATIFI Nicholas",null,null,null,null,null,""]
[null,null,null,null,null,null,""]
["RICCIARDO Daniel","RENAULT",null,null,null,null,""]
["OCON Esteban",null,null,null,null,null,""]
[null,null,null,null,null,null,""]
["KVYAT Daniil","TORO ROSSO",null,null,null,null,""]
["GASLY Pierre",null,null,null,null,null,""]
[null,null,null,null,null,null,""]
["GROSJEAN Romain","HAAS",null,null,null,null,""]
["MAGNUSSEN Kevin",null,null,null,null,null,""]
[null,null,null,null,null,null,""]
["NORRIS Lando","McLAREN",null,null,null,null,""]
["SAINZ.Jr Carlos",null,null,null,null,null,""]
[null,null,null,null,null,null,""]
["RAÏKKÖNEN Kimi","ALFA ROMEO",null,null,null,null,""]
["GIOVANIZZI Antonio",null,null,null,null,null,""]
[null,null,null,null,null,null,""]

{"sheet":"Pays-Bas","index":7,"n_rows":34,"n_cols":12,"rows_kept":34,"cut":false,"hidden":false,"merged":[[0,0,1,14],[2,1,3,1],[2,2,3,2],[2,3,3,3],[2,5,3,5],[2,6,3,6],[2,8,2,10],[2,4,3,4],[4,1,6,1],[4,2,6,2],[7,1,9,1],[7,2,9,2],[10,1,12,1],[10,2,12,2],[13,1,15,1],[13,2,15,2],[16,1,18,1],[16,2,18,2],[19,1,21,1],[19,2,21,2],[31,1,33,1],[31,2,33,2],[22,1,24,1],[22,2,24,2],[25,1,27,1],[25,2,27,2],[28,1,30,1],[28,2,30,2]]}
["PAYS-BAS 3 MAI 2020"]
[]
["PILOTES","ECURIES","VOITURES","Finish","Pôle","Pt tour","Points",null,"CLASSEMENT"]
[null,null,null,null,null,null,null,{"$f":"IF(G4=\"\",\"\",(RANK(G4,G4:G23)))","v":""},"ÉCURIES","POINTS","RANG","TOTAL"]
["HAMILTON Lewis","MERCEDES",null,null,null,null,{"$f":"IFERROR(CHOOSE(D5,25,18,15,12,10,8,6,4,2,1)+(F5=1),\"\")","v":""},null,"MERCEDES",{"$f":"SUM(G5:G7)","v":0},{"$f":"IF(J5=\"\",0,(RANK(J5,$J$5:$J$14)))+COUNTIF(J$5:J5,J5)-1","v":1},{"$f":"IF(J5=0,0,J5+GB!L5)","v":0}]
["BOTTAS Valterri",null,null,null,null,null,{"$f":"IFERROR(CHOOSE(D6,25,18,15,12,10,8,6,4,2,1)+(F6=1),\"\")","v":""},null,"FERRARI",{"$f":"SUM(G8:G10)","v":0},{"$f":"IF(J6=\"\",0,(RANK(J6,$J$5:$J$14)))+COUNTIF(J$5:J6,J6)-1","v":2},{"$f":"IF(J6=0,0,J6+GB!L6)","v":0}]
[null,null,null,null,null,null,"",null,"RED BULL",{"$f":"SUM(G11:G13)","v":0},{"$f":"IF(J7=\"\",0,(RANK(J7,$J$5:$J$14)))+COUNTIF(J$5:J7,J7)-1","v":3},{"$f":"IF(J7=0,0,J7+GB!L7)","v":0}]
["VETTEL Sebastian","FERRARI",null,null,null,null,"",null,"RACING POINT",{"$f":"SUM(G14:G16)","v":0},{"$f":"IF(J8=\"\",0,(RANK(J8,$J$5:$J$14)))+COUNTIF(J$5:J8,J8)-1","v":4},{"$f":"IF(J8=0,0,J8+GB!L8)","v":0}]
["LECLERC Charles",null,null,null,null,null,"",null,"WILLIAMS",{"$f":"SUM(G17:G19)","v":0},{"$f":"IF(J9=\"\",0,(RANK(J9,$J$5:$J$14)))+COUNTIF(J$5:J9,J9)-1","v":5},{"$f":"IF(J9=0,0,J9+GB!L9)","v":0}]
[null,null,null,null,null,null,"",null,"RENAULT",{"$f":"SUM(G20:G22)","v":0},{"$f":"IF(J10=\"\",0,(RANK(J10,$J$5:$J$14)))+COUNTIF(J$5:J10,J10)-1","v":6},{"$f":"IF(J10=0,0,J10+GB!L10)","v":0}]
["VERSTAPPEN Max","RED BULL",null,null,null,null,"",null,"TORO ROSSO",{"$f":"SUM(G23:G25)","v":0},{"$f":"IF(J11=\"\",0,(RANK(J11,$J$5:$J$14)))+COUNTIF(J$5:J11,J11)-1","v":7},{"$f":"IF(J11=0,0,J11+GB!L11)","v":0}]
["ALBON Alexander",null,null,null,null,null,"",null,"HAAS",{"$f":"SUM(G26:G28)","v":0},{"$f":"IF(J12=\"\",0,(RANK(J12,$J$5:$J$14)))+COUNTIF(J$5:J12,J12)-1","v":8},{"$f":"IF(J12=0,0,J12+GB!L12)","v":0}]
[null,null,null,null,null,null,"",null,"Mc LAREN",{"$f":"SUM(G29:G31)","v":0},{"$f":"IF(J13=\"\",0,(RANK(J13,$J$5:$J$14)))+COUNTIF(J$5:J13,J13)-1","v":9},{"$f":"IF(J13=0,0,J13+GB!L13)","v":0}]
["PEREZ Sergio","RACING\nPOINT",null,null,null,null,"",null,"ALFA ROMEO",{"$f":"SUM(G32:G34)","v":0},{"$f":"IF(J14=\"\",0,(RANK(J14,$J$5:$J$14)))+COUNTIF(J$5:J14,J14)-1","v":10},{"$f":"IF(J14=0,0,J14+GB!L14)","v":0}]
["STROLL Lance",null,null,null,null,null,""]
[null,null,null,null,null,null,""]
["RUSSELL George","WILLIAMS",null,null,null,null,""]
["LATIFI Nicholas",null,null,null,null,null,""]
[null,null,null,null,null,null,""]
["RICCIARDO Daniel","RENAULT",null,null,null,null,""]
["OCON Esteban",null,null,null,null,null,""]
[null,null,null,null,null,null,""]
["KVYAT Daniil","TORO ROSSO",null,null,null,null,""]
["GASLY Pierre",null,null,null,null,null,""]
[null,null,null,null,null,null,""]
["GROSJEAN Romain","HAAS",null,null,null,null,""]
["MAGNUSSEN Kevin",null,null,null,null,null,""]
[null,null,null,null,null,null,""]
["NORRIS Lando","McLAREN",null,null,null,null,""]
["SAINZ.Jr Carlos",null,null,null,null,null,""]
[null,null,null,null,null,null,""]
["RAÏKKÖNEN Kimi","ALFA ROMEO",null,null,null,null,""]
["GIOVANIZZI Antonio",null,null,null,null,null,""]
[null,null,null,null,null,null,""]

{"sheet":"Espagne","index":8,"n_rows":34,"n_cols":12,"rows_kept":34,"cut":false,"hidden":false,"merged":[[0,0,1,14],[2,1,3,1],[2,2,3,2],[2,3,3,3],[2,5,3,5],[2,6,3,6],[2,8,2,10],[2,4,3,4],[4,1,6,1],[4,2,6,2],[7,1,9,1],[7,2,9,2],[10,1,12,1],[10,2,12,2],[13,1,15,1],[13,2,15,2],[16,1,18,1],[16,2,18,2],[19,1,21,1],[19,2,21,2],[31,1,33,1],[31,2,33,2],[22,1,24,1],[22,2,24,2],[25,1,27,1],[25,2,27,2],[28,1,30,1],[28,2,30,2]]}
["ESPAGNE - 10 MAI 2020"]
[]
["PILOTES","ECURIES","VOITURES","Finish","Pôle","Pt tour","Points",null,"CLASSEMENT"]
[null,null,null,null,null,null,null,{"$f":"IF(G4=\"\",\"\",(RANK(G4,G4:G23)))","v":""},"ÉCURIES","POINTS","RANG","TOTAL"]
["HAMILTON Lewis","MERCEDES",null,null,null,null,{"$f":"IFERROR(CHOOSE(D5,25,18,15,12,10,8,6,4,2,1)+(F5=1),\"\")","v":""},null,"MERCEDES",{"$f":"SUM(G5:G7)","v":0},{"$f":"IF(J5=\"\",0,(RANK(J5,$J$5:$J$14)))+COUNTIF(J$5:J5,J5)-1","v":1},{"$f":"IF(J5=0,0,J5+Azerbaïdjan!L5)","v":0}]
["BOTTAS Valterri",null,null,null,null,null,{"$f":"IFERROR(CHOOSE(D6,25,18,15,12,10,8,6,4,2,1)+(F6=1),\"\")","v":""},null,"FERRARI",{"$f":"SUM(G8:G10)","v":0},{"$f":"IF(J6=\"\",0,(RANK(J6,$J$5:$J$14)))+COUNTIF(J$5:J6,J6)-1","v":2},{"$f":"IF(J6=0,0,J6+Azerbaïdjan!L6)","v":0}]
[null,null,null,null,null,null,"",null,"RED BULL",{"$f":"SUM(G11:G13)","v":0},{"$f":"IF(J7=\"\",0,(RANK(J7,$J$5:$J$14)))+COUNTIF(J$5:J7,J7)-1","v":3},{"$f":"IF(J7=0,0,J7+Azerbaïdjan!L7)","v":0}]
["VETTEL Sebastian","FERRARI",null,null,null,null,"",null,"RACING POINT",{"$f":"SUM(G14:G16)","v":0},{"$f":"IF(J8=\"\",0,(RANK(J8,$J$5:$J$14)))+COUNTIF(J$5:J8,J8)-1","v":4},{"$f":"IF(J8=0,0,J8+Azerbaïdjan!L8)","v":0}]
["LECLERC Charles",null,null,null,null,null,"",null,"WILLIAMS",{"$f":"SUM(G17:G19)","v":0},{"$f":"IF(J9=\"\",0,(RANK(J9,$J$5:$J$14)))+COUNTIF(J$5:J9,J9)-1","v":5},{"$f":"IF(J9=0,0,J9+Azerbaïdjan!L9)","v":0}]
[null,null,null,null,null,null,"",null,"RENAULT",{"$f":"SUM(G20:G22)","v":0},{"$f":"IF(J10=\"\",0,(RANK(J10,$J$5:$J$14)))+COUNTIF(J$5:J10,J10)-1","v":6},{"$f":"IF(J10=0,0,J10+Azerbaïdjan!L10)","v":0}]
["VERSTAPPEN Max","RED BULL",null,null,null,null,"",null,"TORO ROSSO",{"$f":"SUM(G23:G25)","v":0},{"$f":"IF(J11=\"\",0,(RANK(J11,$J$5:$J$14)))+COUNTIF(J$5:J11,J11)-1","v":7},{"$f":"IF(J11=0,0,J11+Azerbaïdjan!L11)","v":0}]
["ALBON Alexander",null,null,null,null,null,"",null,"HAAS",{"$f":"SUM(G26:G28)","v":0},{"$f":"IF(J12=\"\",0,(RANK(J12,$J$5:$J$14)))+COUNTIF(J$5:J12,J12)-1","v":8},{"$f":"IF(J12=0,0,J12+Azerbaïdjan!L12)","v":0}]
[null,null,null,null,null,null,"",null,"Mc LAREN",{"$f":"SUM(G29:G31)","v":0},{"$f":"IF(J13=\"\",0,(RANK(J13,$J$5:$J$14)))+COUNTIF(J$5:J13,J13)-1","v":9},{"$f":"IF(J13=0,0,J13+Azerbaïdjan!L13)","v":0}]
["PEREZ Sergio","RACING\nPOINT",null,null,null,null,"",null,"ALFA ROMEO",{"$f":"SUM(G32:G34)","v":0},{"$f":"IF(J14=\"\",0,(RANK(J14,$J$5:$J$14)))+COUNTIF(J$5:J14,J14)-1","v":10},{"$f":"IF(J14=0,0,J14+Azerbaïdjan!L14)","v":0}]
["STROLL Lance",null,null,null,null,null,""]
[null,null,null,null,null,null,""]
["RUSSELL George","WILLIAMS",null,null,null,null,""]
["LATIFI Nicholas",null,null,null,null,null,""]
[null,null,null,null,null,null,""]
["RICCIARDO Daniel","RENAULT",null,null,null,null,""]
["OCON Esteban",null,null,null,null,null,""]
[null,null,null,null,null,null,""]
["KVYAT Daniil","TORO ROSSO",null,null,null,null,""]
["GASLY Pierre",null,null,null,null,null,""]
[null,null,null,null,null,null,""]
["GROSJEAN Romain","HAAS",null,null,null,null,""]
["MAGNUSSEN Kevin",null,null,null,null,null,""]
[null,null,null,null,null,null,""]
["NORRIS Lando","McLAREN",null,null,null,null,""]
["SAINZ.Jr Carlos",null,null,null,null,null,""]
[null,null,null,null,null,null,""]
["RAÏKKÖNEN Kimi","ALFA ROMEO",null,null,null,null,""]
["GIOVANIZZI Antonio",null,null,null,null,null,""]
[null,null,null,null,null,null,""]

{"sheet":"Monaco","index":9,"n_rows":34,"n_cols":12,"rows_kept":34,"cut":false,"hidden":false,"merged":[[0,0,1,14],[2,1,3,1],[2,2,3,2],[2,3,3,3],[2,5,3,5],[2,6,3,6],[2,8,2,10],[2,4,3,4],[4,1,6,1],[4,2,6,2],[7,1,9,1],[7,2,9,2],[10,1,12,1],[10,2,12,2],[13,1,15,1],[13,2,15,2],[16,1,18,1],[16,2,18,2],[19,1,21,1],[19,2,21,2],[31,1,33,1],[31,2,33,2],[22,1,24,1],[22,2,24,2],[25,1,27,1],[25,2,27,2],[28,1,30,1],[28,2,30,2]]}
["MONACO - 24 MAI 2020"]
[]
["PILOTES","ECURIES","VOITURES","Finish","Pôle","Pt tour","Points",null,"CLASSEMENT"]
[null,null,null,null,null,null,null,{"$f":"IF(G4=\"\",\"\",(RANK(G4,G4:G23)))","v":""},"ÉCURIES","POINTS","RANG","TOTAL"]
["HAMILTON Lewis","MERCEDES",null,null,null,null,{"$f":"IFERROR(CHOOSE(D5,25,18,15,12,10,8,6,4,2,1)+(F5=1),\"\")","v":""},null,"MERCEDES",{"$f":"SUM(G5:G7)","v":0},{"$f":"IF(J5=\"\",0,(RANK(J5,$J$5:$J$14)))+COUNTIF(J$5:J5,J5)-1","v":1},{"$f":"IF(J5=0,0,J5+Espagne!L5)","v":0}]
["BOTTAS Valterri",null,null,null,null,null,{"$f":"IFERROR(CHOOSE(D6,25,18,15,12,10,8,6,4,2,1)+(F6=1),\"\")","v":""},null,"FERRARI",{"$f":"SUM(G8:G10)","v":0},{"$f":"IF(J6=\"\",0,(RANK(J6,$J$5:$J$14)))+COUNTIF(J$5:J6,J6)-1","v":2},{"$f":"IF(J6=0,0,J6+Espagne!L6)","v":0}]
[null,null,null,null,null,null,"",null,"RED BULL",{"$f":"SUM(G11:G13)","v":0},{"$f":"IF(J7=\"\",0,(RANK(J7,$J$5:$J$14)))+COUNTIF(J$5:J7,J7)-1","v":3},{"$f":"IF(J7=0,0,J7+Espagne!L7)","v":0}]
["VETTEL Sebastian","FERRARI",null,null,null,null,"",null,"RACING POINT",{"$f":"SUM(G14:G16)","v":0},{"$f":"IF(J8=\"\",0,(RANK(J8,$J$5:$J$14)))+COUNTIF(J$5:J8,J8)-1","v":4},{"$f":"IF(J8=0,0,J8+Espagne!L8)","v":0}]
["LECLERC Charles",null,null,null,null,null,"",null,"WILLIAMS",{"$f":"SUM(G17:G19)","v":0},{"$f":"IF(J9=\"\",0,(RANK(J9,$J$5:$J$14)))+COUNTIF(J$5:J9,J9)-1","v":5},{"$f":"IF(J9=0,0,J9+Espagne!L9)","v":0}]
[null,null,null,null,null,null,"",null,"RENAULT",{"$f":"SUM(G20:G22)","v":0},{"$f":"IF(J10=\"\",0,(RANK(J10,$J$5:$J$14)))+COUNTIF(J$5:J10,J10)-1","v":6},{"$f":"IF(J10=0,0,J10+Espagne!L10)","v":0}]
["VERSTAPPEN Max","RED BULL",null,null,null,null,"",null,"TORO ROSSO",{"$f":"SUM(G23:G25)","v":0},{"$f":"IF(J11=\"\",0,(RANK(J11,$J$5:$J$14)))+COUNTIF(J$5:J11,J11)-1","v":7},{"$f":"IF(J11=0,0,J11+Espagne!L11)","v":0}]
["ALBON Alexander",null,null,null,null,null,"",null,"HAAS",{"$f":"SUM(G26:G28)","v":0},{"$f":"IF(J12=\"\",0,(RANK(J12,$J$5:$J$14)))+COUNTIF(J$5:J12,J12)-1","v":8},{"$f":"IF(J12=0,0,J12+Espagne!L12)","v":0}]
[null,null,null,null,null,null,"",null,"Mc LAREN",{"$f":"SUM(G29:G31)","v":0},{"$f":"IF(J13=\"\",0,(RANK(J13,$J$5:$J$14)))+COUNTIF(J$5:J13,J13)-1","v":9},{"$f":"IF(J13=0,0,J13+Espagne!L13)","v":0}]
["PEREZ Sergio","RACING\nPOINT",null,null,null,null,"",null,"ALFA ROMEO",{"$f":"SUM(G32:G34)","v":0},{"$f":"IF(J14=\"\",0,(RANK(J14,$J$5:$J$14)))+COUNTIF(J$5:J14,J14)-1","v":10},{"$f":"IF(J14=0,0,J14+Espagne!L14)","v":0}]
["STROLL Lance",null,null,null,null,null,""]
[null,null,null,null,null,null,""]
["RUSSELL George","WILLIAMS",null,null,null,null,""]
["LATIFI Nicholas",null,null,null,null,null,""]
[null,null,null,null,null,null,""]
["RICCIARDO Daniel","RENAULT",null,null,null,null,""]
["OCON Esteban",null,null,null,null,null,""]
[null,null,null,null,null,null,""]
["KVYAT Daniil","TORO ROSSO",null,null,null,null,""]
["GASLY Pierre",null,null,null,null,null,""]
[null,null,null,null,null,null,""]
["GROSJEAN Romain","HAAS",null,null,null,null,""]
["MAGNUSSEN Kevin",null,null,null,null,null,""]
[null,null,null,null,null,null,""]
["NORRIS Lando","McLAREN",null,null,null,null,""]
["SAINZ.Jr Carlos",null,null,null,null,null,""]
[null,null,null,null,null,null,""]
["RAÏKKÖNEN Kimi","ALFA ROMEO",null,null,null,null,""]
["GIOVANIZZI Antonio",null,null,null,null,null,""]
[null,null,null,null,null,null,""]

{"sheet":"Azerbaïdjan","index":10,"n_rows":34,"n_cols":19,"rows_kept":34,"cut":false,"hidden":false,"merged":[[0,0,1,14],[2,1,3,1],[2,2,3,2],[2,3,3,3],[2,5,3,5],[2,6,3,6],[2,8,2,10],[2,4,3,4],[4,1,6,1],[4,2,6,2],[7,1,9,1],[7,2,9,2],[10,1,12,1],[10,2,12,2],[13,1,15,1],[13,2,15,2],[16,1,18,1],[16,2,18,2],[19,1,21,1],[19,2,21,2],[31,1,33,1],[31,2,33,2],[22,1,24,1],[22,2,24,2],[25,1,27,1],[25,2,27,2],[28,1,30,1],[28,2,30,2]]}
["AZERBAÏDJAN - 7 JUIN AVRIL 2020"]
[]
["PILOTES","ECURIES","VOITURES","Finish","Pôle","Pt tour","Points",null,"CLASSEMENT"]
[null,null,null,null,null,null,null,{"$f":"IF(G4=\"\",\"\",(RANK(G4,G4:G23)))","v":""},"ÉCURIES","POINTS","RANG","TOTAL"]
["HAMILTON Lewis","MERCEDES",null,null,null,null,{"$f":"IFERROR(CHOOSE(D5,25,18,15,12,10,8,6,4,2,1)+(F5=1),\"\")","v":""},null,"MERCEDES",{"$f":"SUM(G5:G7)","v":0},{"$f":"IF(J5=\"\",0,(RANK(J5,$J$5:$J$14)))+COUNTIF(J$5:J5,J5)-1","v":1},{"$f":"IF(J5=0,0,J5+Chine!L5)","v":0}]
["BOTTAS Valterri",null,null,null,null,null,{"$f":"IFERROR(CHOOSE(D6,25,18,15,12,10,8,6,4,2,1)+(F6=1),\"\")","v":""},null,"FERRARI",{"$f":"SUM(G8:G10)","v":0},{"$f":"IF(J6=\"\",0,(RANK(J6,$J$5:$J$14)))+COUNTIF(J$5:J6,J6)-1","v":2},{"$f":"IF(J6=0,0,J6+Chine!L6)","v":0}]
[null,null,null,null,null,null,"",null,"RED BULL",{"$f":"SUM(G11:G13)","v":0},{"$f":"IF(J7=\"\",0,(RANK(J7,$J$5:$J$14)))+COUNTIF(J$5:J7,J7)-1","v":3},{"$f":"IF(J7=0,0,J7+Chine!L7)","v":0}]
["VETTEL Sebastian","FERRARI",null,null,null,null,"",null,"RACING POINT",{"$f":"SUM(G14:G16)","v":0},{"$f":"IF(J8=\"\",0,(RANK(J8,$J$5:$J$14)))+COUNTIF(J$5:J8,J8)-1","v":4},{"$f":"IF(J8=0,0,J8+Chine!L8)","v":0}]
["LECLERC Charles",null,null,null,null,null,"",null,"WILLIAMS",{"$f":"SUM(G17:G19)","v":0},{"$f":"IF(J9=\"\",0,(RANK(J9,$J$5:$J$14)))+COUNTIF(J$5:J9,J9)-1","v":5},{"$f":"IF(J9=0,0,J9+Chine!L9)","v":0}]
[null,null,null,null,null,null,"",null,"RENAULT",{"$f":"SUM(G20:G22)","v":0},{"$f":"IF(J10=\"\",0,(RANK(J10,$J$5:$J$14)))+COUNTIF(J$5:J10,J10)-1","v":6},{"$f":"IF(J10=0,0,J10+Chine!L10)","v":0}]
["VERSTAPPEN Max","RED BULL",null,null,null,null,"",null,"TORO ROSSO",{"$f":"SUM(G23:G25)","v":0},{"$f":"IF(J11=\"\",0,(RANK(J11,$J$5:$J$14)))+COUNTIF(J$5:J11,J11)-1","v":7},{"$f":"IF(J11=0,0,J11+Chine!L11)","v":0}]
["ALBON Alexander",null,null,null,null,null,"",null,"HAAS",{"$f":"SUM(G26:G28)","v":0},{"$f":"IF(J12=\"\",0,(RANK(J12,$J$5:$J$14)))+COUNTIF(J$5:J12,J12)-1","v":8},{"$f":"IF(J12=0,0,J12+Chine!L12)","v":0}]
[null,null,null,null,null,null,"",null,"Mc LAREN",{"$f":"SUM(G29:G31)","v":0},{"$f":"IF(J13=\"\",0,(RANK(J13,$J$5:$J$14)))+COUNTIF(J$5:J13,J13)-1","v":9},{"$f":"IF(J13=0,0,J13+Chine!L13)","v":0}]
["PEREZ Sergio","RACING\nPOINT",null,null,null,null,"",null,"ALFA ROMEO",{"$f":"SUM(G32:G34)","v":0},{"$f":"IF(J14=\"\",0,(RANK(J14,$J$5:$J$14)))+COUNTIF(J$5:J14,J14)-1","v":10},{"$f":"IF(J14=0,0,J14+Chine!L14)","v":0}]
["STROLL Lance",null,null,null,null,null,""]
[null,null,null,null,null,null,""]
["RUSSELL George","WILLIAMS",null,null,null,null,""]
["LATIFI Nicholas",null,null,null,null,null,"",null,null,null,null,null,null,null,null,null,null,null,{"$f":"IF(R18=\"\",0,(RANK(R18,$J$5:$J$14)))+COUNTIF(R$5:R18,R18)-1","v":-1}]
[null,null,null,null,null,null,""]
["RICCIARDO Daniel","RENAULT",null,null,null,null,""]
["OCON Esteban",null,null,null,null,null,""]
[null,null,null,null,null,null,""]
["KVYAT Daniil","TORO ROSSO",null,null,null,null,""]
["GASLY Pierre",null,null,null,null,null,""]
[null,null,null,null,null,null,""]
["GROSJEAN Romain","HAAS",null,null,null,null,""]
["MAGNUSSEN Kevin",null,null,null,null,null,""]
[null,null,null,null,null,null,""]
["NORRIS Lando","McLAREN",null,null,null,null,""]
["SAINZ.Jr Carlos",null,null,null,null,null,""]
[null,null,null,null,null,null,""]
["RAÏKKÖNEN Kimi","ALFA ROMEO",null,null,null,null,""]
["GIOVANIZZI Antonio",null,null,null,null,null,""]
[null,null,null,null,null,null,{"$f":"IFERROR(CHOOSE(D34,25,18,15,12,10,8,6,4,2,1)+(F34=1),\"\")","v":""}]

{"sheet":"Canada","index":11,"n_rows":34,"n_cols":12,"rows_kept":34,"cut":false,"hidden":false,"merged":[[0,0,1,14],[2,1,3,1],[2,2,3,2],[2,3,3,3],[2,5,3,5],[2,6,3,6],[2,8,2,10],[2,4,3,4],[4,1,6,1],[4,2,6,2],[7,1,9,1],[7,2,9,2],[10,1,12,1],[10,2,12,2],[13,1,15,1],[13,2,15,2],[16,1,18,1],[16,2,18,2],[19,1,21,1],[19,2,21,2],[31,1,33,1],[31,2,33,2],[22,1,24,1],[22,2,24,2],[25,1,27,1],[25,2,27,2],[28,1,30,1],[28,2,30,2]]}
["CANADA - 14 JUIN 2020"]
[]
["PILOTES","ECURIES","VOITURES","Finish","Pôle","Pt tour","Points",null,"CLASSEMENT"]
[null,null,null,null,null,null,null,{"$f":"IF(G4=\"\",\"\",(RANK(G4,G4:G23)))","v":""},"ÉCURIES","POINTS","RANG","TOTAL"]
["HAMILTON Lewis","MERCEDES",null,null,null,null,{"$f":"IFERROR(CHOOSE(D5,25,18,15,12,10,8,6,4,2,1)+(F5=1),\"\")","v":""},null,"MERCEDES",{"$f":"SUM(G5:G7)","v":0},{"$f":"IF(J5=\"\",0,(RANK(J5,$J$5:$J$14)))+COUNTIF(J$5:J5,J5)-1","v":1},{"$f":"IF(J5=0,0,J5+Monaco!L5)","v":0}]
["BOTTAS Valterri",null,null,null,null,null,{"$f":"IFERROR(CHOOSE(D6,25,18,15,12,10,8,6,4,2,1)+(F6=1),\"\")","v":""},null,"FERRARI",{"$f":"SUM(G8:G10)","v":0},{"$f":"IF(J6=\"\",0,(RANK(J6,$J$5:$J$14)))+COUNTIF(J$5:J6,J6)-1","v":2},{"$f":"IF(J6=0,0,J6+Monaco!L6)","v":0}]
[null,null,null,null,null,null,"",null,"RED BULL",{"$f":"SUM(G11:G13)","v":0},{"$f":"IF(J7=\"\",0,(RANK(J7,$J$5:$J$14)))+COUNTIF(J$5:J7,J7)-1","v":3},{"$f":"IF(J7=0,0,J7+Monaco!L7)","v":0}]
["VETTEL Sebastian","FERRARI",null,null,null,null,"",null,"RACING POINT",{"$f":"SUM(G14:G16)","v":0},{"$f":"IF(J8=\"\",0,(RANK(J8,$J$5:$J$14)))+COUNTIF(J$5:J8,J8)-1","v":4},{"$f":"IF(J8=0,0,J8+Monaco!L8)","v":0}]
["LECLERC Charles",null,null,null,null,null,"",null,"WILLIAMS",{"$f":"SUM(G17:G19)","v":0},{"$f":"IF(J9=\"\",0,(RANK(J9,$J$5:$J$14)))+COUNTIF(J$5:J9,J9)-1","v":5},{"$f":"IF(J9=0,0,J9+Monaco!L9)","v":0}]
[null,null,null,null,null,null,"",null,"RENAULT",{"$f":"SUM(G20:G22)","v":0},{"$f":"IF(J10=\"\",0,(RANK(J10,$J$5:$J$14)))+COUNTIF(J$5:J10,J10)-1","v":6},{"$f":"IF(J10=0,0,J10+Monaco!L10)","v":0}]
["VERSTAPPEN Max","RED BULL",null,null,null,null,"",null,"TORO ROSSO",{"$f":"SUM(G23:G25)","v":0},{"$f":"IF(J11=\"\",0,(RANK(J11,$J$5:$J$14)))+COUNTIF(J$5:J11,J11)-1","v":7},{"$f":"IF(J11=0,0,J11+Monaco!L11)","v":0}]
["ALBON Alexander",null,null,null,null,null,"",null,"HAAS",{"$f":"SUM(G26:G28)","v":0},{"$f":"IF(J12=\"\",0,(RANK(J12,$J$5:$J$14)))+COUNTIF(J$5:J12,J12)-1","v":8},{"$f":"IF(J12=0,0,J12+Monaco!L12)","v":0}]
[null,null,null,null,null,null,"",null,"Mc LAREN",{"$f":"SUM(G29:G31)","v":0},{"$f":"IF(J13=\"\",0,(RANK(J13,$J$5:$J$14)))+COUNTIF(J$5:J13,J13)-1","v":9},{"$f":"IF(J13=0,0,J13+Monaco!L13)","v":0}]
["PEREZ Sergio","RACING\nPOINT",null,null,null,null,"",null,"ALFA ROMEO",{"$f":"SUM(G32:G34)","v":0},{"$f":"IF(J14=\"\",0,(RANK(J14,$J$5:$J$14)))+COUNTIF(J$5:J14,J14)-1","v":10},{"$f":"IF(J14=0,0,J14+Monaco!L14)","v":0}]
["STROLL Lance",null,null,null,null,null,""]
[null,null,null,null,null,null,""]
["RUSSELL George","WILLIAMS",null,null,null,null,""]
["LATIFI Nicholas",null,null,null,null,null,""]
[null,null,null,null,null,null,""]
["RICCIARDO Daniel","RENAULT",null,null,null,null,""]
["OCON Esteban",null,null,null,null,null,""]
[null,null,null,null,null,null,""]
["KVYAT Daniil","TORO ROSSO",null,null,null,null,""]
["GASLY Pierre",null,null,null,null,null,""]
[null,null,null,null,null,null,""]
["GROSJEAN Romain","HAAS",null,null,null,null,""]
["MAGNUSSEN Kevin",null,null,null,null,null,""]
[null,null,null,null,null,null,""]
["NORRIS Lando","McLAREN",null,null,null,null,""]
["SAINZ.Jr Carlos",null,null,null,null,null,""]
[null,null,null,null,null,null,""]
["RAÏKKÖNEN Kimi","ALFA ROMEO",null,null,null,null,""]
["GIOVANIZZI Antonio",null,null,null,null,null,""]
[null,null,null,null,null,null,""]

{"sheet":"France","index":12,"n_rows":34,"n_cols":12,"rows_kept":34,"cut":false,"hidden":false,"merged":[[0,0,1,14],[2,1,3,1],[2,2,3,2],[2,3,3,3],[2,5,3,5],[2,6,3,6],[2,8,2,10],[2,4,3,4],[4,1,6,1],[4,2,6,2],[7,1,9,1],[7,2,9,2],[10,1,12,1],[10,2,12,2],[13,1,15,1],[13,2,15,2],[16,1,18,1],[16,2,18,2],[19,1,21,1],[19,2,21,2],[31,1,33,1],[31,2,33,2],[22,1,24,1],[22,2,24,2],[25,1,27,1],[25,2,27,2],[28,1,30,1],[28,2,30,2]]}
["FRANCE - 28 JUIN 2020"]
[]
["PILOTES","ECURIES","VOITURES","Finish","Pôle","Pt tour","Points",null,"CLASSEMENT"]
[null,null,null,null,null,null,null,{"$f":"IF(G4=\"\",\"\",(RANK(G4,G4:G23)))","v":""},"ÉCURIES","POINTS","RANG","TOTAL"]
["HAMILTON Lewis","MERCEDES",null,null,null,null,{"$f":"IFERROR(CHOOSE(D5,25,18,15,12,10,8,6,4,2,1)+(F5=1),\"\")","v":""},null,"MERCEDES",{"$f":"SUM(G5:G7)","v":0},{"$f":"IF(J5=\"\",0,(RANK(J5,$J$5:$J$14)))+COUNTIF(J$5:J5,J5)-1","v":1},{"$f":"IF(J5=0,0,J5+Canada!L5)","v":0}]
["BOTTAS Valterri",null,null,null,null,null,{"$f":"IFERROR(CHOOSE(D6,25,18,15,12,10,8,6,4,2,1)+(F6=1),\"\")","v":""},null,"FERRARI",{"$f":"SUM(G8:G10)","v":0},{"$f":"IF(J6=\"\",0,(RANK(J6,$J$5:$J$14)))+COUNTIF(J$5:J6,J6)-1","v":2},{"$f":"IF(J6=0,0,J6+Canada!L6)","v":0}]
[null,null,null,null,null,null,"",null,"RED BULL",{"$f":"SUM(G11:G13)","v":0},{"$f":"IF(J7=\"\",0,(RANK(J7,$J$5:$J$14)))+COUNTIF(J$5:J7,J7)-1","v":3},{"$f":"IF(J7=0,0,J7+Canada!L7)","v":0}]
["VETTEL Sebastian","FERRARI",null,null,null,null,"",null,"RACING POINT",{"$f":"SUM(G14:G16)","v":0},{"$f":"IF(J8=\"\",0,(RANK(J8,$J$5:$J$14)))+COUNTIF(J$5:J8,J8)-1","v":4},{"$f":"IF(J8=0,0,J8+Canada!L8)","v":0}]
["LECLERC Charles",null,null,null,null,null,"",null,"WILLIAMS",{"$f":"SUM(G17:G19)","v":0},{"$f":"IF(J9=\"\",0,(RANK(J9,$J$5:$J$14)))+COUNTIF(J$5:J9,J9)-1","v":5},{"$f":"IF(J9=0,0,J9+Canada!L9)","v":0}]
[null,null,null,null,null,null,"",null,"RENAULT",{"$f":"SUM(G20:G22)","v":0},{"$f":"IF(J10=\"\",0,(RANK(J10,$J$5:$J$14)))+COUNTIF(J$5:J10,J10)-1","v":6},{"$f":"IF(J10=0,0,J10+Canada!L10)","v":0}]
["VERSTAPPEN Max","RED BULL",null,null,null,null,"",null,"TORO ROSSO",{"$f":"SUM(G23:G25)","v":0},{"$f":"IF(J11=\"\",0,(RANK(J11,$J$5:$J$14)))+COUNTIF(J$5:J11,J11)-1","v":7},{"$f":"IF(J11=0,0,J11+Canada!L11)","v":0}]
["ALBON Alexander",null,null,null,null,null,"",null,"HAAS",{"$f":"SUM(G26:G28)","v":0},{"$f":"IF(J12=\"\",0,(RANK(J12,$J$5:$J$14)))+COUNTIF(J$5:J12,J12)-1","v":8},{"$f":"IF(J12=0,0,J12+Canada!L12)","v":0}]
[null,null,null,null,null,null,"",null,"Mc LAREN",{"$f":"SUM(G29:G31)","v":0},{"$f":"IF(J13=\"\",0,(RANK(J13,$J$5:$J$14)))+COUNTIF(J$5:J13,J13)-1","v":9},{"$f":"IF(J13=0,0,J13+Canada!L13)","v":0}]
["PEREZ Sergio","RACING\nPOINT",null,null,null,null,"",null,"ALFA ROMEO",{"$f":"SUM(G32:G34)","v":0},{"$f":"IF(J14=\"\",0,(RANK(J14,$J$5:$J$14)))+COUNTIF(J$5:J14,J14)-1","v":10},{"$f":"IF(J14=0,0,J14+Canada!L14)","v":0}]
["STROLL Lance",null,null,null,null,null,""]
[null,null,null,null,null,null,""]
["RUSSELL George","WILLIAMS",null,null,null,null,""]
["LATIFI Nicholas",null,null,null,null,null,""]
[null,null,null,null,null,null,""]
["RICCIARDO Daniel","RENAULT",null,null,null,null,""]
["OCON Esteban",null,null,null,null,null,""]
[null,null,null,null,null,null,""]
["KVYAT Daniil","TORO ROSSO",null,null,null,null,""]
["GASLY Pierre",null,null,null,null,null,""]
[null,null,null,null,null,null,""]
["GROSJEAN Romain","HAAS",null,null,null,null,""]
["MAGNUSSEN Kevin",null,null,null,null,null,""]
[null,null,null,null,null,null,""]
["NORRIS Lando","McLAREN",null,null,null,null,""]
["SAINZ.Jr Carlos",null,null,null,null,null,""]
[null,null,null,null,null,null,""]
["RAÏKKÖNEN Kimi","ALFA ROMEO",null,null,null,null,""]
["GIOVANIZZI Antonio",null,null,null,null,null,""]
[null,null,null,null,null,null,""]

{"sheet":"Autriche","index":13,"n_rows":34,"n_cols":12,"rows_kept":34,"cut":false,"hidden":false,"merged":[[0,0,1,14],[2,1,3,1],[2,2,3,2],[2,3,3,3],[2,5,3,5],[2,6,3,6],[2,8,2,10],[2,4,3,4],[4,1,6,1],[4,2,6,2],[7,1,9,1],[7,2,9,2],[10,1,12,1],[10,2,12,2],[13,1,15,1],[13,2,15,2],[16,1,18,1],[16,2,18,2],[19,1,21,1],[19,2,21,2],[31,1,33,1],[31,2,33,2],[22,1,24,1],[22,2,24,2],[25,1,27,1],[25,2,27,2],[28,1,30,1],[28,2,30,2]]}
["AUTRICHE - 5 JUILLET 2020"]
[]
["PILOTES","ECURIES","VOITURES","Finish","Pôle","Pt tour","Points",null,"CLASSEMENT"]
[null,null,null,null,null,null,null,{"$f":"IF(G4=\"\",\"\",(RANK(G4,G4:G23)))","v":""},"ÉCURIES","POINTS","RANG","TOTAL"]
["HAMILTON Lewis","MERCEDES",null,null,null,null,{"$f":"IFERROR(CHOOSE(D5,25,18,15,12,10,8,6,4,2,1)+(F5=1),\"\")","v":""},null,"MERCEDES",{"$f":"SUM(G5:G7)","v":0},{"$f":"IF(J5=\"\",0,(RANK(J5,$J$5:$J$14)))+COUNTIF(J$5:J5,J5)-1","v":1},{"$f":"IF(J5=0,0,J5+France!L5)","v":0}]
["BOTTAS Valterri",null,null,null,null,null,{"$f":"IFERROR(CHOOSE(D6,25,18,15,12,10,8,6,4,2,1)+(F6=1),\"\")","v":""},null,"FERRARI",{"$f":"SUM(G8:G10)","v":0},{"$f":"IF(J6=\"\",0,(RANK(J6,$J$5:$J$14)))+COUNTIF(J$5:J6,J6)-1","v":2},{"$f":"IF(J6=0,0,J6+France!L6)","v":0}]
[null,null,null,null,null,null,"",null,"RED BULL",{"$f":"SUM(G11:G13)","v":0},{"$f":"IF(J7=\"\",0,(RANK(J7,$J$5:$J$14)))+COUNTIF(J$5:J7,J7)-1","v":3},{"$f":"IF(J7=0,0,J7+France!L7)","v":0}]
["VETTEL Sebastian","FERRARI",null,null,null,null,"",null,"RACING POINT",{"$f":"SUM(G14:G16)","v":0},{"$f":"IF(J8=\"\",0,(RANK(J8,$J$5:$J$14)))+COUNTIF(J$5:J8,J8)-1","v":4},{"$f":"IF(J8=0,0,J8+France!L8)","v":0}]
["LECLERC Charles",null,null,null,null,null,"",null,"WILLIAMS",{"$f":"SUM(G17:G19)","v":0},{"$f":"IF(J9=\"\",0,(RANK(J9,$J$5:$J$14)))+COUNTIF(J$5:J9,J9)-1","v":5},{"$f":"IF(J9=0,0,J9+France!L9)","v":0}]
[null,null,null,null,null,null,"",null,"RENAULT",{"$f":"SUM(G20:G22)","v":0},{"$f":"IF(J10=\"\",0,(RANK(J10,$J$5:$J$14)))+COUNTIF(J$5:J10,J10)-1","v":6},{"$f":"IF(J10=0,0,J10+France!L10)","v":0}]
["VERSTAPPEN Max","RED BULL",null,null,null,null,"",null,"TORO ROSSO",{"$f":"SUM(G23:G25)","v":0},{"$f":"IF(J11=\"\",0,(RANK(J11,$J$5:$J$14)))+COUNTIF(J$5:J11,J11)-1","v":7},{"$f":"IF(J11=0,0,J11+France!L11)","v":0}]
["ALBON Alexander",null,null,null,null,null,"",null,"HAAS",{"$f":"SUM(G26:G28)","v":0},{"$f":"IF(J12=\"\",0,(RANK(J12,$J$5:$J$14)))+COUNTIF(J$5:J12,J12)-1","v":8},{"$f":"IF(J12=0,0,J12+France!L12)","v":0}]
[null,null,null,null,null,null,"",null,"Mc LAREN",{"$f":"SUM(G29:G31)","v":0},{"$f":"IF(J13=\"\",0,(RANK(J13,$J$5:$J$14)))+COUNTIF(J$5:J13,J13)-1","v":9},{"$f":"IF(J13=0,0,J13+France!L13)","v":0}]
["PEREZ Sergio","RACING\nPOINT",null,null,null,null,"",null,"ALFA ROMEO",{"$f":"SUM(G32:G34)","v":0},{"$f":"IF(J14=\"\",0,(RANK(J14,$J$5:$J$14)))+COUNTIF(J$5:J14,J14)-1","v":10},{"$f":"IF(J14=0,0,J14+France!L14)","v":0}]
["STROLL Lance",null,null,null,null,null,""]
[null,null,null,null,null,null,""]
["RUSSELL George","WILLIAMS",null,null,null,null,""]
["LATIFI Nicholas",null,null,null,null,null,""]
[null,null,null,null,null,null,""]
["RICCIARDO Daniel","RENAULT",null,null,null,null,""]
["OCON Esteban",null,null,null,null,null,""]
[null,null,null,null,null,null,""]
["KVYAT Daniil","TORO ROSSO",null,null,null,null,""]
["GASLY Pierre",null,null,null,null,null,""]
[null,null,null,null,null,null,""]
["GROSJEAN Romain","HAAS",null,null,null,null,""]
["MAGNUSSEN Kevin",null,null,null,null,null,""]
[null,null,null,null,null,null,""]
["NORRIS Lando","McLAREN",null,null,null,null,""]
["SAINZ.Jr Carlos",null,null,null,null,null,""]
[null,null,null,null,null,null,""]
["RAÏKKÖNEN Kimi","ALFA ROMEO",null,null,null,null,""]
["GIOVANIZZI Antonio",null,null,null,null,null,""]
[null,null,null,null,null,null,""]

{"sheet":"GB","index":14,"n_rows":34,"n_cols":12,"rows_kept":34,"cut":false,"hidden":false,"merged":[[0,0,1,14],[2,1,3,1],[2,2,3,2],[2,3,3,3],[2,5,3,5],[2,6,3,6],[2,8,2,10],[2,4,3,4],[4,1,6,1],[4,2,6,2],[7,1,9,1],[7,2,9,2],[10,1,12,1],[10,2,12,2],[13,1,15,1],[13,2,15,2],[16,1,18,1],[16,2,18,2],[19,1,21,1],[19,2,21,2],[31,1,33,1],[31,2,33,2],[22,1,24,1],[22,2,24,2],[25,1,27,1],[25,2,27,2],[28,1,30,1],[28,2,30,2]]}
["ANGLETERRE - 19 JUILLET 2020"]
[]
["PILOTES","ECURIES","VOITURES","Finish","Pôle","Pt tour","Points",null,"CLASSEMENT"]
[null,null,null,null,null,null,null,{"$f":"IF(G4=\"\",\"\",(RANK(G4,G4:G23)))","v":""},"ÉCURIES","POINTS","RANG","TOTAL"]
["HAMILTON Lewis","MERCEDES",null,null,null,null,{"$f":"IFERROR(CHOOSE(D5,25,18,15,12,10,8,6,4,2,1)+(F5=1),\"\")","v":""},null,"MERCEDES",{"$f":"SUM(G5:G7)","v":0},{"$f":"IF(J5=\"\",0,(RANK(J5,$J$5:$J$14)))+COUNTIF(J$5:J5,J5)-1","v":1},{"$f":"IF(J5=0,0,J5+Autriche!L5)","v":0}]
["BOTTAS Valterri",null,null,null,null,null,{"$f":"IFERROR(CHOOSE(D6,25,18,15,12,10,8,6,4,2,1)+(F6=1),\"\")","v":""},null,"FERRARI",{"$f":"SUM(G8:G10)","v":0},{"$f":"IF(J6=\"\",0,(RANK(J6,$J$5:$J$14)))+COUNTIF(J$5:J6,J6)-1","v":2},{"$f":"IF(J6=0,0,J6+Autriche!L6)","v":0}]
[null,null,null,null,null,null,"",null,"RED BULL",{"$f":"SUM(G11:G13)","v":0},{"$f":"IF(J7=\"\",0,(RANK(J7,$J$5:$J$14)))+COUNTIF(J$5:J7,J7)-1","v":3},{"$f":"IF(J7=0,0,J7+Autriche!L7)","v":0}]
["VETTEL Sebastian","FERRARI",null,null,null,null,"",null,"RACING POINT",{"$f":"SUM(G14:G16)","v":0},{"$f":"IF(J8=\"\",0,(RANK(J8,$J$5:$J$14)))+COUNTIF(J$5:J8,J8)-1","v":4},{"$f":"IF(J8=0,0,J8+Autriche!L8)","v":0}]
["LECLERC Charles",null,null,null,null,null,"",null,"WILLIAMS",{"$f":"SUM(G17:G19)","v":0},{"$f":"IF(J9=\"\",0,(RANK(J9,$J$5:$J$14)))+COUNTIF(J$5:J9,J9)-1","v":5},{"$f":"IF(J9=0,0,J9+Autriche!L9)","v":0}]
[null,null,null,null,null,null,"",null,"RENAULT",{"$f":"SUM(G20:G22)","v":0},{"$f":"IF(J10=\"\",0,(RANK(J10,$J$5:$J$14)))+COUNTIF(J$5:J10,J10)-1","v":6},{"$f":"IF(J10=0,0,J10+Autriche!L10)","v":0}]
["VERSTAPPEN Max","RED BULL",null,null,null,null,"",null,"TORO ROSSO",{"$f":"SUM(G23:G25)","v":0},{"$f":"IF(J11=\"\",0,(RANK(J11,$J$5:$J$14)))+COUNTIF(J$5:J11,J11)-1","v":7},{"$f":"IF(J11=0,0,J11+Autriche!L11)","v":0}]
["ALBON Alexander",null,null,null,null,null,"",null,"HAAS",{"$f":"SUM(G26:G28)","v":0},{"$f":"IF(J12=\"\",0,(RANK(J12,$J$5:$J$14)))+COUNTIF(J$5:J12,J12)-1","v":8},{"$f":"IF(J12=0,0,J12+Autriche!L12)","v":0}]
[null,null,null,null,null,null,"",null,"Mc LAREN",{"$f":"SUM(G29:G31)","v":0},{"$f":"IF(J13=\"\",0,(RANK(J13,$J$5:$J$14)))+COUNTIF(J$5:J13,J13)-1","v":9},{"$f":"IF(J13=0,0,J13+Autriche!L13)","v":0}]
["PEREZ Sergio","RACING\nPOINT",null,null,null,null,"",null,"ALFA ROMEO",{"$f":"SUM(G32:G34)","v":0},{"$f":"IF(J14=\"\",0,(RANK(J14,$J$5:$J$14)))+COUNTIF(J$5:J14,J14)-1","v":10},{"$f":"IF(J14=0,0,J14+Autriche!L14)","v":0}]
["STROLL Lance",null,null,null,null,null,""]
[null,null,null,null,null,null,""]
["RUSSELL George","WILLIAMS",null,null,null,null,""]
["LATIFI Nicholas",null,null,null,null,null,""]
[null,null,null,null,null,null,""]
["RICCIARDO Daniel","RENAULT",null,null,null,null,""]
["OCON Esteban",null,null,null,null,null,""]
[null,null,null,null,null,null,""]
["KVYAT Daniil","TORO ROSSO",null,null,null,null,""]
["GASLY Pierre",null,null,null,null,null,""]
[null,null,null,null,null,null,""]
["GROSJEAN Romain","HAAS",null,null,null,null,""]
["MAGNUSSEN Kevin",null,null,null,null,null,""]
[null,null,null,null,null,null,""]
["NORRIS Lando","McLAREN",null,null,null,null,""]
["SAINZ.Jr Carlos",null,null,null,null,null,""]
[null,null,null,null,null,null,""]
["RAÏKKÖNEN Kimi","ALFA ROMEO",null,null,null,null,""]
["GIOVANIZZI Antonio",null,null,null,null,null,""]
[null,null,null,null,null,null,""]

{"sheet":"Hongrie","index":15,"n_rows":34,"n_cols":12,"rows_kept":34,"cut":false,"hidden":false,"merged":[[0,0,1,14],[2,1,3,1],[2,2,3,2],[2,3,3,3],[2,5,3,5],[2,6,3,6],[2,8,2,10],[2,4,3,4],[4,1,6,1],[4,2,6,2],[7,1,9,1],[7,2,9,2],[10,1,12,1],[10,2,12,2],[13,1,15,1],[13,2,15,2],[16,1,18,1],[16,2,18,2],[19,1,21,1],[19,2,21,2],[31,1,33,1],[31,2,33,2],[22,1,24,1],[22,2,24,2],[25,1,27,1],[25,2,27,2],[28,1,30,1],[28,2,30,2]]}
["HONGRIE - 2 AOUT 2020"]
[]
["PILOTES","ECURIES","VOITURES","Finish","Pôle","Pt tour","Points",null,"CLASSEMENT"]
[null,null,null,null,null,null,null,{"$f":"IF(G4=\"\",\"\",(RANK(G4,G4:G23)))","v":""},"ÉCURIES","POINTS","RANG","TOTAL"]
["HAMILTON Lewis","MERCEDES",null,null,null,null,{"$f":"IFERROR(CHOOSE(D5,25,18,15,12,10,8,6,4,2,1)+(F5=1),\"\")","v":""},null,"MERCEDES",{"$f":"SUM(G5:G7)","v":0},{"$f":"IF(J5=\"\",0,(RANK(J5,$J$5:$J$14)))+COUNTIF(J$5:J5,J5)-1","v":1},{"$f":"IF(J5=0,0,J5+'Pays-Bas'!L5)","v":0}]
["BOTTAS Valterri",null,null,null,null,null,{"$f":"IFERROR(CHOOSE(D6,25,18,15,12,10,8,6,4,2,1)+(F6=1),\"\")","v":""},null,"FERRARI",{"$f":"SUM(G8:G10)","v":0},{"$f":"IF(J6=\"\",0,(RANK(J6,$J$5:$J$14)))+COUNTIF(J$5:J6,J6)-1","v":2},{"$f":"IF(J6=0,0,J6+'Pays-Bas'!L6)","v":0}]
[null,null,null,null,null,null,"",null,"RED BULL",{"$f":"SUM(G11:G13)","v":0},{"$f":"IF(J7=\"\",0,(RANK(J7,$J$5:$J$14)))+COUNTIF(J$5:J7,J7)-1","v":3},{"$f":"IF(J7=0,0,J7+'Pays-Bas'!L7)","v":0}]
["VETTEL Sebastian","FERRARI",null,null,null,null,"",null,"RACING POINT",{"$f":"SUM(G14:G16)","v":0},{"$f":"IF(J8=\"\",0,(RANK(J8,$J$5:$J$14)))+COUNTIF(J$5:J8,J8)-1","v":4},{"$f":"IF(J8=0,0,J8+'Pays-Bas'!L8)","v":0}]
["LECLERC Charles",null,null,null,null,null,"",null,"WILLIAMS",{"$f":"SUM(G17:G19)","v":0},{"$f":"IF(J9=\"\",0,(RANK(J9,$J$5:$J$14)))+COUNTIF(J$5:J9,J9)-1","v":5},{"$f":"IF(J9=0,0,J9+'Pays-Bas'!L9)","v":0}]
[null,null,null,null,null,null,"",null,"RENAULT",{"$f":"SUM(G20:G22)","v":0},{"$f":"IF(J10=\"\",0,(RANK(J10,$J$5:$J$14)))+COUNTIF(J$5:J10,J10)-1","v":6},{"$f":"IF(J10=0,0,J10+'Pays-Bas'!L10)","v":0}]
["VERSTAPPEN Max","RED BULL",null,null,null,null,"",null,"TORO ROSSO",{"$f":"SUM(G23:G25)","v":0},{"$f":"IF(J11=\"\",0,(RANK(J11,$J$5:$J$14)))+COUNTIF(J$5:J11,J11)-1","v":7},{"$f":"IF(J11=0,0,J11+'Pays-Bas'!L11)","v":0}]
["ALBON Alexander",null,null,null,null,null,"",null,"HAAS",{"$f":"SUM(G26:G28)","v":0},{"$f":"IF(J12=\"\",0,(RANK(J12,$J$5:$J$14)))+COUNTIF(J$5:J12,J12)-1","v":8},{"$f":"IF(J12=0,0,J12+'Pays-Bas'!L12)","v":0}]
[null,null,null,null,null,null,"",null,"Mc LAREN",{"$f":"SUM(G29:G31)","v":0},{"$f":"IF(J13=\"\",0,(RANK(J13,$J$5:$J$14)))+COUNTIF(J$5:J13,J13)-1","v":9},{"$f":"IF(J13=0,0,J13+'Pays-Bas'!L13)","v":0}]
["PEREZ Sergio","RACING\nPOINT",null,null,null,null,"",null,"ALFA ROMEO",{"$f":"SUM(G32:G34)","v":0},{"$f":"IF(J14=\"\",0,(RANK(J14,$J$5:$J$14)))+COUNTIF(J$5:J14,J14)-1","v":10},{"$f":"IF(J14=0,0,J14+'Pays-Bas'!L14)","v":0}]
["STROLL Lance",null,null,null,null,null,""]
[null,null,null,null,null,null,""]
["RUSSELL George","WILLIAMS",null,null,null,null,""]
["LATIFI Nicholas",null,null,null,null,null,""]
[null,null,null,null,null,null,""]
["RICCIARDO Daniel","RENAULT",null,null,null,null,""]
["OCON Esteban",null,null,null,null,null,""]
[null,null,null,null,null,null,""]
["KVYAT Daniil","TORO ROSSO",null,null,null,null,""]
["GASLY Pierre",null,null,null,null,null,""]
[null,null,null,null,null,null,""]
["GROSJEAN Romain","HAAS",null,null,null,null,""]
["MAGNUSSEN Kevin",null,null,null,null,null,""]
[null,null,null,null,null,null,""]
["NORRIS Lando","McLAREN",null,null,null,null,""]
["SAINZ.Jr Carlos",null,null,null,null,null,""]
[null,null,null,null,null,null,""]
["RAÏKKÖNEN Kimi","ALFA ROMEO",null,null,null,null,""]
["GIOVANIZZI Antonio",null,null,null,null,null,""]
[null,null,null,null,null,null,""]

{"sheet":"Belgique","index":16,"n_rows":34,"n_cols":12,"rows_kept":34,"cut":false,"hidden":false,"merged":[[0,0,1,14],[2,1,3,1],[2,2,3,2],[2,3,3,3],[2,5,3,5],[2,6,3,6],[2,8,2,10],[2,4,3,4],[4,1,6,1],[4,2,6,2],[7,1,9,1],[7,2,9,2],[10,1,12,1],[10,2,12,2],[13,1,15,1],[13,2,15,2],[16,1,18,1],[16,2,18,2],[19,1,21,1],[19,2,21,2],[31,1,33,1],[31,2,33,2],[22,1,24,1],[22,2,24,2],[25,1,27,1],[25,2,27,2],[28,1,30,1],[28,2,30,2]]}
["BELGIQUE - 30 AOUT 2020"]
[]
["PILOTES","ECURIES","VOITURES","Finish","Pôle","Pt tour","Points",null,"CLASSEMENT"]
[null,null,null,null,null,null,null,{"$f":"IF(G4=\"\",\"\",(RANK(G4,G4:G23)))","v":""},"ÉCURIES","POINTS","RANG","TOTAL"]
["HAMILTON Lewis","MERCEDES",null,null,null,null,{"$f":"IFERROR(CHOOSE(D5,25,18,15,12,10,8,6,4,2,1)+(F5=1),\"\")","v":""},null,"MERCEDES",{"$f":"SUM(G5:G7)","v":0},{"$f":"IF(J5=\"\",0,(RANK(J5,$J$5:$J$14)))+COUNTIF(J$5:J5,J5)-1","v":1},{"$f":"IF(J5=0,0,J5+Hongrie!L5)","v":0}]
["BOTTAS Valterri",null,null,null,null,null,{"$f":"IFERROR(CHOOSE(D6,25,18,15,12,10,8,6,4,2,1)+(F6=1),\"\")","v":""},null,"FERRARI",{"$f":"SUM(G8:G10)","v":0},{"$f":"IF(J6=\"\",0,(RANK(J6,$J$5:$J$14)))+COUNTIF(J$5:J6,J6)-1","v":2},{"$f":"IF(J6=0,0,J6+Hongrie!L6)","v":0}]
[null,null,null,null,null,null,"",null,"RED BULL",{"$f":"SUM(G11:G13)","v":0},{"$f":"IF(J7=\"\",0,(RANK(J7,$J$5:$J$14)))+COUNTIF(J$5:J7,J7)-1","v":3},{"$f":"IF(J7=0,0,J7+Hongrie!L7)","v":0}]
["VETTEL Sebastian","FERRARI",null,null,null,null,"",null,"RACING POINT",{"$f":"SUM(G14:G16)","v":0},{"$f":"IF(J8=\"\",0,(RANK(J8,$J$5:$J$14)))+COUNTIF(J$5:J8,J8)-1","v":4},{"$f":"IF(J8=0,0,J8+Hongrie!L8)","v":0}]
["LECLERC Charles",null,null,null,null,null,"",null,"WILLIAMS",{"$f":"SUM(G17:G19)","v":0},{"$f":"IF(J9=\"\",0,(RANK(J9,$J$5:$J$14)))+COUNTIF(J$5:J9,J9)-1","v":5},{"$f":"IF(J9=0,0,J9+Hongrie!L9)","v":0}]
[null,null,null,null,null,null,"",null,"RENAULT",{"$f":"SUM(G20:G22)","v":0},{"$f":"IF(J10=\"\",0,(RANK(J10,$J$5:$J$14)))+COUNTIF(J$5:J10,J10)-1","v":6},{"$f":"IF(J10=0,0,J10+Hongrie!L10)","v":0}]
["VERSTAPPEN Max","RED BULL",null,null,null,null,"",null,"TORO ROSSO",{"$f":"SUM(G23:G25)","v":0},{"$f":"IF(J11=\"\",0,(RANK(J11,$J$5:$J$14)))+COUNTIF(J$5:J11,J11)-1","v":7},{"$f":"IF(J11=0,0,J11+Hongrie!L11)","v":0}]
["ALBON Alexander",null,null,null,null,null,"",null,"HAAS",{"$f":"SUM(G26:G28)","v":0},{"$f":"IF(J12=\"\",0,(RANK(J12,$J$5:$J$14)))+COUNTIF(J$5:J12,J12)-1","v":8},{"$f":"IF(J12=0,0,J12+Hongrie!L12)","v":0}]
[null,null,null,null,null,null,"",null,"Mc LAREN",{"$f":"SUM(G29:G31)","v":0},{"$f":"IF(J13=\"\",0,(RANK(J13,$J$5:$J$14)))+COUNTIF(J$5:J13,J13)-1","v":9},{"$f":"IF(J13=0,0,J13+Hongrie!L13)","v":0}]
["PEREZ Sergio","RACING\nPOINT",null,null,null,null,"",null,"ALFA ROMEO",{"$f":"SUM(G32:G34)","v":0},{"$f":"IF(J14=\"\",0,(RANK(J14,$J$5:$J$14)))+COUNTIF(J$5:J14,J14)-1","v":10},{"$f":"IF(J14=0,0,J14+Hongrie!L14)","v":0}]
["STROLL Lance",null,null,null,null,null,""]
[null,null,null,null,null,null,""]
["RUSSELL George","WILLIAMS",null,null,null,null,""]
["LATIFI Nicholas",null,null,null,null,null,""]
[null,null,null,null,null,null,""]
["RICCIARDO Daniel","RENAULT",null,null,null,null,""]
["OCON Esteban",null,null,null,null,null,""]
[null,null,null,null,null,null,""]
["KVYAT Daniil","TORO ROSSO",null,null,null,null,""]
["GASLY Pierre",null,null,null,null,null,""]
[null,null,null,null,null,null,""]
["GROSJEAN Romain","HAAS",null,null,null,null,""]
["MAGNUSSEN Kevin",null,null,null,null,null,""]
[null,null,null,null,null,null,""]
["NORRIS Lando","McLAREN",null,null,null,null,""]
["SAINZ.Jr Carlos",null,null,null,null,null,""]
[null,null,null,null,null,null,""]
["RAÏKKÖNEN Kimi","ALFA ROMEO",null,null,null,null,""]
["GIOVANIZZI Antonio",null,null,null,null,null,""]
[null,null,null,null,null,null,""]

{"sheet":"Italie","index":17,"n_rows":34,"n_cols":12,"rows_kept":34,"cut":false,"hidden":false,"merged":[[0,0,1,14],[2,1,3,1],[2,2,3,2],[2,3,3,3],[2,5,3,5],[2,6,3,6],[2,8,2,10],[2,4,3,4],[4,1,6,1],[4,2,6,2],[7,1,9,1],[7,2,9,2],[10,1,12,1],[10,2,12,2],[13,1,15,1],[13,2,15,2],[16,1,18,1],[16,2,18,2],[19,1,21,1],[19,2,21,2],[31,1,33,1],[31,2,33,2],[22,1,24,1],[22,2,24,2],[25,1,27,1],[25,2,27,2],[28,1,30,1],[28,2,30,2]]}
["ITALIE - 6 SEPTEMBRE 2020"]
[]
["PILOTES","ECURIES","VOITURES","Finish","Pôle","Pt tour","Points",null,"CLASSEMENT"]
[null,null,null,null,null,null,null,{"$f":"IF(G4=\"\",\"\",(RANK(G4,G4:G23)))","v":""},"ÉCURIES","POINTS","RANG","TOTAL"]
["HAMILTON Lewis","MERCEDES",null,null,null,null,{"$f":"IFERROR(CHOOSE(D5,25,18,15,12,10,8,6,4,2,1)+(F5=1),\"\")","v":""},null,"MERCEDES",{"$f":"SUM(G5:G7)","v":0},{"$f":"IF(J5=\"\",0,(RANK(J5,$J$5:$J$14)))+COUNTIF(J$5:J5,J5)-1","v":1},{"$f":"IF(J5=0,0,J5+Belgique!L5)","v":0}]
["BOTTAS Valterri",null,null,null,null,null,{"$f":"IFERROR(CHOOSE(D6,25,18,15,12,10,8,6,4,2,1)+(F6=1),\"\")","v":""},null,"FERRARI",{"$f":"SUM(G8:G10)","v":0},{"$f":"IF(J6=\"\",0,(RANK(J6,$J$5:$J$14)))+COUNTIF(J$5:J6,J6)-1","v":2},{"$f":"IF(J6=0,0,J6+Belgique!L6)","v":0}]
[null,null,null,null,null,null,"",null,"RED BULL",{"$f":"SUM(G11:G13)","v":0},{"$f":"IF(J7=\"\",0,(RANK(J7,$J$5:$J$14)))+COUNTIF(J$5:J7,J7)-1","v":3},{"$f":"IF(J7=0,0,J7+Belgique!L7)","v":0}]
["VETTEL Sebastian","FERRARI",null,null,null,null,"",null,"RACING POINT",{"$f":"SUM(G14:G16)","v":0},{"$f":"IF(J8=\"\",0,(RANK(J8,$J$5:$J$14)))+COUNTIF(J$5:J8,J8)-1","v":4},{"$f":"IF(J8=0,0,J8+Belgique!L8)","v":0}]
["LECLERC Charles",null,null,null,null,null,"",null,"WILLIAMS",{"$f":"SUM(G17:G19)","v":0},{"$f":"IF(J9=\"\",0,(RANK(J9,$J$5:$J$14)))+COUNTIF(J$5:J9,J9)-1","v":5},{"$f":"IF(J9=0,0,J9+Belgique!L9)","v":0}]
[null,null,null,null,null,null,"",null,"RENAULT",{"$f":"SUM(G20:G22)","v":0},{"$f":"IF(J10=\"\",0,(RANK(J10,$J$5:$J$14)))+COUNTIF(J$5:J10,J10)-1","v":6},{"$f":"IF(J10=0,0,J10+Belgique!L10)","v":0}]
["VERSTAPPEN Max","RED BULL",null,null,null,null,"",null,"TORO ROSSO",{"$f":"SUM(G23:G25)","v":0},{"$f":"IF(J11=\"\",0,(RANK(J11,$J$5:$J$14)))+COUNTIF(J$5:J11,J11)-1","v":7},{"$f":"IF(J11=0,0,J11+Belgique!L11)","v":0}]
["ALBON Alexander",null,null,null,null,null,"",null,"HAAS",{"$f":"SUM(G26:G28)","v":0},{"$f":"IF(J12=\"\",0,(RANK(J12,$J$5:$J$14)))+COUNTIF(J$5:J12,J12)-1","v":8},{"$f":"IF(J12=0,0,J12+Belgique!L12)","v":0}]
[null,null,null,null,null,null,"",null,"Mc LAREN",{"$f":"SUM(G29:G31)","v":0},{"$f":"IF(J13=\"\",0,(RANK(J13,$J$5:$J$14)))+COUNTIF(J$5:J13,J13)-1","v":9},{"$f":"IF(J13=0,0,J13+Belgique!L13)","v":0}]
["PEREZ Sergio","RACING\nPOINT",null,null,null,null,"",null,"ALFA ROMEO",{"$f":"SUM(G32:G34)","v":0},{"$f":"IF(J14=\"\",0,(RANK(J14,$J$5:$J$14)))+COUNTIF(J$5:J14,J14)-1","v":10},{"$f":"IF(J14=0,0,J14+Belgique!L14)","v":0}]
["STROLL Lance",null,null,null,null,null,""]
[null,null,null,null,null,null,""]
["RUSSELL George","WILLIAMS",null,null,null,null,""]
["LATIFI Nicholas",null,null,null,null,null,""]
[null,null,null,null,null,null,""]
["RICCIARDO Daniel","RENAULT",null,null,null,null,""]
["OCON Esteban",null,null,null,null,null,""]
[null,null,null,null,null,null,""]
["KVYAT Daniil","TORO ROSSO",null,null,null,null,""]
["GASLY Pierre",null,null,null,null,null,""]
[null,null,null,null,null,null,""]
["GROSJEAN Romain","HAAS",null,null,null,null,""]
["MAGNUSSEN Kevin",null,null,null,null,null,""]
[null,null,null,null,null,null,""]
["NORRIS Lando","McLAREN",null,null,null,null,""]
["SAINZ.Jr Carlos",null,null,null,null,null,""]
[null,null,null,null,null,null,""]
["RAÏKKÖNEN Kimi","ALFA ROMEO",null,null,null,null,""]
["GIOVANIZZI Antonio",null,null,null,null,null,""]
[null,null,null,null,null,null,""]

{"sheet":"Singapour","index":18,"n_rows":34,"n_cols":12,"rows_kept":34,"cut":false,"hidden":false,"merged":[[0,0,1,14],[2,1,3,1],[2,2,3,2],[2,3,3,3],[2,5,3,5],[2,6,3,6],[2,8,2,10],[2,4,3,4],[4,1,6,1],[4,2,6,2],[7,1,9,1],[7,2,9,2],[10,1,12,1],[10,2,12,2],[13,1,15,1],[13,2,15,2],[16,1,18,1],[16,2,18,2],[19,1,21,1],[19,2,21,2],[31,1,33,1],[31,2,33,2],[22,1,24,1],[22,2,24,2],[25,1,27,1],[25,2,27,2],[28,1,30,1],[28,2,30,2]]}
["SINGAPOUR- 20 SEPTEMBRE 2020"]
[]
["PILOTES","ECURIES","VOITURES","Finish","Pôle","Pt tour","Points",null,"CLASSEMENT"]
[null,null,null,null,null,null,null,{"$f":"IF(G4=\"\",\"\",(RANK(G4,G4:G23)))","v":""},"ÉCURIES","POINTS","RANG","TOTAL"]
["HAMILTON Lewis","MERCEDES",null,null,null,null,{"$f":"IFERROR(CHOOSE(D5,25,18,15,12,10,8,6,4,2,1)+(F5=1),\"\")","v":""},null,"MERCEDES",{"$f":"SUM(G5:G7)","v":0},{"$f":"IF(J5=\"\",0,(RANK(J5,$J$5:$J$14)))+COUNTIF(J$5:J5,J5)-1","v":1},{"$f":"IF(J5=0,0,J5+Italie!L5)","v":0}]
["BOTTAS Valterri",null,null,null,null,null,{"$f":"IFERROR(CHOOSE(D6,25,18,15,12,10,8,6,4,2,1)+(F6=1),\"\")","v":""},null,"FERRARI",{"$f":"SUM(G8:G10)","v":0},{"$f":"IF(J6=\"\",0,(RANK(J6,$J$5:$J$14)))+COUNTIF(J$5:J6,J6)-1","v":2},{"$f":"IF(J6=0,0,J6+Italie!L6)","v":0}]
[null,null,null,null,null,null,"",null,"RED BULL",{"$f":"SUM(G11:G13)","v":0},{"$f":"IF(J7=\"\",0,(RANK(J7,$J$5:$J$14)))+COUNTIF(J$5:J7,J7)-1","v":3},{"$f":"IF(J7=0,0,J7+Italie!L7)","v":0}]
["VETTEL Sebastian","FERRARI",null,null,null,null,"",null,"RACING POINT",{"$f":"SUM(G14:G16)","v":0},{"$f":"IF(J8=\"\",0,(RANK(J8,$J$5:$J$14)))+COUNTIF(J$5:J8,J8)-1","v":4},{"$f":"IF(J8=0,0,J8+Italie!L8)","v":0}]
["LECLERC Charles",null,null,null,null,null,"",null,"WILLIAMS",{"$f":"SUM(G17:G19)","v":0},{"$f":"IF(J9=\"\",0,(RANK(J9,$J$5:$J$14)))+COUNTIF(J$5:J9,J9)-1","v":5},{"$f":"IF(J9=0,0,J9+Italie!L9)","v":0}]
[null,null,null,null,null,null,"",null,"RENAULT",{"$f":"SUM(G20:G22)","v":0},{"$f":"IF(J10=\"\",0,(RANK(J10,$J$5:$J$14)))+COUNTIF(J$5:J10,J10)-1","v":6},{"$f":"IF(J10=0,0,J10+Italie!L10)","v":0}]
["VERSTAPPEN Max","RED BULL",null,null,null,null,"",null,"TORO ROSSO",{"$f":"SUM(G23:G25)","v":0},{"$f":"IF(J11=\"\",0,(RANK(J11,$J$5:$J$14)))+COUNTIF(J$5:J11,J11)-1","v":7},{"$f":"IF(J11=0,0,J11+Italie!L11)","v":0}]
["ALBON Alexander",null,null,null,null,null,"",null,"HAAS",{"$f":"SUM(G26:G28)","v":0},{"$f":"IF(J12=\"\",0,(RANK(J12,$J$5:$J$14)))+COUNTIF(J$5:J12,J12)-1","v":8},{"$f":"IF(J12=0,0,J12+Italie!L12)","v":0}]
[null,null,null,null,null,null,"",null,"Mc LAREN",{"$f":"SUM(G29:G31)","v":0},{"$f":"IF(J13=\"\",0,(RANK(J13,$J$5:$J$14)))+COUNTIF(J$5:J13,J13)-1","v":9},{"$f":"IF(J13=0,0,J13+Italie!L13)","v":0}]
["PEREZ Sergio","RACING\nPOINT",null,null,null,null,"",null,"ALFA ROMEO",{"$f":"SUM(G32:G34)","v":0},{"$f":"IF(J14=\"\",0,(RANK(J14,$J$5:$J$14)))+COUNTIF(J$5:J14,J14)-1","v":10},{"$f":"IF(J14=0,0,J14+Italie!L14)","v":0}]
["STROLL Lance",null,null,null,null,null,""]
[null,null,null,null,null,null,""]
["RUSSELL George","WILLIAMS",null,null,null,null,""]
["LATIFI Nicholas",null,null,null,null,null,""]
[null,null,null,null,null,null,""]
["RICCIARDO Daniel","RENAULT",null,null,null,null,""]
["OCON esteban",null,null,null,null,null,""]
[null,null,null,null,null,null,""]
["KVYAT Daniil","TORO ROSSO",null,null,null,null,""]
["GASLY Pierre",null,null,null,null,null,""]
[null,null,null,null,null,null,""]
["GROSJEAN Romain","HAAS",null,null,null,null,""]
["MAGNUSSEN Kevin",null,null,null,null,null,""]
[null,null,null,null,null,null,""]
["NORRIS Lando","McLAREN",null,null,null,null,""]
["SAINZ.Jr Carlos",null,null,null,null,null,""]
[null,null,null,null,null,null,""]
["RAÏKKÖNEN Kimi","ALFA ROMEO",null,null,null,null,""]
["GIOVANIZZI Antonio",null,null,null,null,null,""]
[null,null,null,null,null,null,""]

{"sheet":"Russie","index":19,"n_rows":34,"n_cols":12,"rows_kept":34,"cut":false,"hidden":false,"merged":[[0,0,1,14],[2,1,3,1],[2,2,3,2],[2,3,3,3],[2,5,3,5],[2,6,3,6],[2,8,2,10],[2,4,3,4],[4,1,6,1],[4,2,6,2],[7,1,9,1],[7,2,9,2],[10,1,12,1],[10,2,12,2],[13,1,15,1],[13,2,15,2],[16,1,18,1],[16,2,18,2],[19,1,21,1],[19,2,21,2],[31,1,33,1],[31,2,33,2],[22,1,24,1],[22,2,24,2],[25,1,27,1],[25,2,27,2],[28,1,30,1],[28,2,30,2]]}
["RUSSIE- 27 SEPTEMBRE 2020"]
[]
["PILOTES","ECURIES","VOITURES","Finish","Pôle","Pt tour","Points",null,"CLASSEMENT"]
[null,null,null,null,null,null,null,{"$f":"IF(G4=\"\",\"\",(RANK(G4,G4:G23)))","v":""},"ÉCURIES","POINTS","RANG","TOTAL"]
["HAMILTON Lewis","MERCEDES",null,null,null,null,{"$f":"IFERROR(CHOOSE(D5,25,18,15,12,10,8,6,4,2,1)+(F5=1),\"\")","v":""},null,"MERCEDES",{"$f":"SUM(G5:G7)","v":0},{"$f":"IF(J5=\"\",0,(RANK(J5,$J$5:$J$14)))+COUNTIF(J$5:J5,J5)-1","v":1},{"$f":"IF(J5=0,0,J5+Singapour!L5)","v":0}]
["BOTTAS Valterri",null,null,null,null,null,{"$f":"IFERROR(CHOOSE(D6,25,18,15,12,10,8,6,4,2,1)+(F6=1),\"\")","v":""},null,"FERRARI",{"$f":"SUM(G8:G10)","v":0},{"$f":"IF(J6=\"\",0,(RANK(J6,$J$5:$J$14)))+COUNTIF(J$5:J6,J6)-1","v":2},{"$f":"IF(J6=0,0,J6+Singapour!L6)","v":0}]
[null,null,null,null,null,null,"",null,"RED BULL",{"$f":"SUM(G11:G13)","v":0},{"$f":"IF(J7=\"\",0,(RANK(J7,$J$5:$J$14)))+COUNTIF(J$5:J7,J7)-1","v":3},{"$f":"IF(J7=0,0,J7+Singapour!L7)","v":0}]
["VETTEL Sebastian","FERRARI",null,null,null,null,"",null,"RACING POINT",{"$f":"SUM(G14:G16)","v":0},{"$f":"IF(J8=\"\",0,(RANK(J8,$J$5:$J$14)))+COUNTIF(J$5:J8,J8)-1","v":4},{"$f":"IF(J8=0,0,J8+Singapour!L8)","v":0}]
["LECLERC Charles",null,null,null,null,null,"",null,"WILLIAMS",{"$f":"SUM(G17:G19)","v":0},{"$f":"IF(J9=\"\",0,(RANK(J9,$J$5:$J$14)))+COUNTIF(J$5:J9,J9)-1","v":5},{"$f":"IF(J9=0,0,J9+Singapour!L9)","v":0}]
[null,null,null,null,null,null,"",null,"RENAULT",{"$f":"SUM(G20:G22)","v":0},{"$f":"IF(J10=\"\",0,(RANK(J10,$J$5:$J$14)))+COUNTIF(J$5:J10,J10)-1","v":6},{"$f":"IF(J10=0,0,J10+Singapour!L10)","v":0}]
["VERSTAPPEN Max","RED BULL",null,null,null,null,"",null,"TORO ROSSO",{"$f":"SUM(G23:G25)","v":0},{"$f":"IF(J11=\"\",0,(RANK(J11,$J$5:$J$14)))+COUNTIF(J$5:J11,J11)-1","v":7},{"$f":"IF(J11=0,0,J11+Singapour!L11)","v":0}]
["ALBON Alexander",null,null,null,null,null,"",null,"HASS",{"$f":"SUM(G26:G28)","v":0},{"$f":"IF(J12=\"\",0,(RANK(J12,$J$5:$J$14)))+COUNTIF(J$5:J12,J12)-1","v":8},{"$f":"IF(J12=0,0,J12+Singapour!L12)","v":0}]
[null,null,null,null,null,null,"",null,"Mc LAREN",{"$f":"SUM(G29:G31)","v":0},{"$f":"IF(J13=\"\",0,(RANK(J13,$J$5:$J$14)))+COUNTIF(J$5:J13,J13)-1","v":9},{"$f":"IF(J13=0,0,J13+Singapour!L13)","v":0}]
["PEREZ Sergio","RACING\nPOINT",null,null,null,null,"",null,"ALFA ROMÉO",{"$f":"SUM(G32:G34)","v":0},{"$f":"IF(J14=\"\",0,(RANK(J14,$J$5:$J$14)))+COUNTIF(J$5:J14,J14)-1","v":10},{"$f":"IF(J14=0,0,J14+Singapour!L14)","v":0}]
["STROLL Lance",null,null,null,null,null,""]
[null,null,null,null,null,null,""]
["RUSSELL George","WILLIAMS",null,null,null,null,""]
["LATIFI NICHOLAS",null,null,null,null,null,""]
[null,null,null,null,null,null,""]
["RICCIARDO Daniel","RENAULT",null,null,null,null,""]
["OCON Esteban",null,null,null,null,null,""]
[null,null,null,null,null,null,""]
["KVYAT Daniil","TORO ROSSO",null,null,null,null,""]
["GASLY Pierre",null,null,null,null,null,""]
[null,null,null,null,null,null,""]
["GROSJEAN Romain","HAAS",null,null,null,null,""]
["MAGNUSSEN Kevin",null,null,null,null,null,""]
[null,null,null,null,null,null,""]
["NORRIS Lando","McLAREN",null,null,null,null,""]
["SAINZ.Jr Carlos",null,null,null,null,null,""]
[null,null,null,null,null,null,""]
["RAÏKKÖNEN Kimi","ALFA ROMEO",null,null,null,null,""]
["GIOVANIZZI Antonio",null,null,null,null,null,""]
[null,null,null,null,null,null,""]

{"sheet":"Japon","index":20,"n_rows":34,"n_cols":12,"rows_kept":34,"cut":false,"hidden":false,"merged":[[0,0,1,14],[2,1,3,1],[2,2,3,2],[2,3,3,3],[2,5,3,5],[2,6,3,6],[2,8,2,10],[2,4,3,4],[4,1,6,1],[4,2,6,2],[7,1,9,1],[7,2,9,2],[10,1,12,1],[10,2,12,2],[13,1,15,1],[13,2,15,2],[16,1,18,1],[16,2,18,2],[19,1,21,1],[19,2,21,2],[31,1,33,1],[31,2,33,2],[22,1,24,1],[22,2,24,2],[25,1,27,1],[25,2,27,2],[28,1,30,1],[28,2,30,2]]}
["JAPON - 25 OCTOBRE 2020"]
[]
["PILOTES","ECURIES","VOITURES","Finish","Pôle","Pt tour","Points",null,"CLASSEMENT"]
[null,null,null,null,null,null,null,{"$f":"IF(G4=\"\",\"\",(RANK(G4,G4:G23)))","v":""},"ÉCURIES","POINTS","RANG","TOTAL"]
["HAMILTON Lewis","MERCEDES",null,null,null,null,{"$f":"IFERROR(CHOOSE(D5,25,18,15,12,10,8,6,4,2,1)+(F5=1),\"\")","v":""},null,"MERCEDES",{"$f":"SUM(G5:G7)","v":0},{"$f":"IF(J5=\"\",0,(RANK(J5,$J$5:$J$14)))+COUNTIF(J$5:J5,J5)-1","v":1},{"$f":"IF(J5=0,0,J5+Russie!L5)","v":0}]
["BOTTAS Valterri",null,null,null,null,null,{"$f":"IFERROR(CHOOSE(D6,25,18,15,12,10,8,6,4,2,1)+(F6=1),\"\")","v":""},null,"FERRARI",{"$f":"SUM(G8:G10)","v":0},{"$f":"IF(J6=\"\",0,(RANK(J6,$J$5:$J$14)))+COUNTIF(J$5:J6,J6)-1","v":2},{"$f":"IF(J6=0,0,J6+Russie!L6)","v":0}]
[null,null,null,null,null,null,"",null,"RED BULL",{"$f":"SUM(G11:G13)","v":0},{"$f":"IF(J7=\"\",0,(RANK(J7,$J$5:$J$14)))+COUNTIF(J$5:J7,J7)-1","v":3},{"$f":"IF(J7=0,0,J7+Russie!L7)","v":0}]
["VETTEL Sebastian","FERRARI",null,null,null,null,"",null,"RACING POINT",{"$f":"SUM(G14:G16)","v":0},{"$f":"IF(J8=\"\",0,(RANK(J8,$J$5:$J$14)))+COUNTIF(J$5:J8,J8)-1","v":4},{"$f":"IF(J8=0,0,J8+Russie!L8)","v":0}]
["LECLERC Charles",null,null,null,null,null,"",null,"WILLIAMS",{"$f":"SUM(G17:G19)","v":0},{"$f":"IF(J9=\"\",0,(RANK(J9,$J$5:$J$14)))+COUNTIF(J$5:J9,J9)-1","v":5},{"$f":"IF(J9=0,0,J9+Russie!L9)","v":0}]
[null,null,null,null,null,null,"",null,"RENAULT",{"$f":"SUM(G20:G22)","v":0},{"$f":"IF(J10=\"\",0,(RANK(J10,$J$5:$J$14)))+COUNTIF(J$5:J10,J10)-1","v":6},{"$f":"IF(J10=0,0,J10+Russie!L10)","v":0}]
["VERSTAPPEN Max","RED BULL",null,null,null,null,"",null,"TORO ROSSO",{"$f":"SUM(G23:G25)","v":0},{"$f":"IF(J11=\"\",0,(RANK(J11,$J$5:$J$14)))+COUNTIF(J$5:J11,J11)-1","v":7},{"$f":"IF(J11=0,0,J11+Russie!L11)","v":0}]
["ALBON Alexander",null,null,null,null,null,"",null,"HASS",{"$f":"SUM(G26:G28)","v":0},{"$f":"IF(J12=\"\",0,(RANK(J12,$J$5:$J$14)))+COUNTIF(J$5:J12,J12)-1","v":8},{"$f":"IF(J12=0,0,J12+Russie!L12)","v":0}]
[null,null,null,null,null,null,"",null,"Mc LAREN",{"$f":"SUM(G29:G31)","v":0},{"$f":"IF(J13=\"\",0,(RANK(J13,$J$5:$J$14)))+COUNTIF(J$5:J13,J13)-1","v":9},{"$f":"IF(J13=0,0,J13+Russie!L13)","v":0}]
["PEREZ Sergio","RACING\nPOINT",null,null,null,null,"",null,"ALFA ROMÉO",{"$f":"SUM(G32:G34)","v":0},{"$f":"IF(J14=\"\",0,(RANK(J14,$J$5:$J$14)))+COUNTIF(J$5:J14,J14)-1","v":10},{"$f":"IF(J14=0,0,J14+Russie!L14)","v":0}]
["STROLL Lance",null,null,null,null,null,""]
[null,null,null,null,null,null,""]
["RUSSELL George","WILLIAMS",null,null,null,null,""]
["latifi Nicholas",null,null,null,null,null,""]
[null,null,null,null,null,null,""]
["RICCIARDO Daniel","RENAULT",null,null,null,null,""]
["OCON Esteban",null,null,null,null,null,""]
[null,null,null,null,null,null,""]
["KVYAT Daniil","TORO ROSSO",null,null,null,null,""]
["GASLY Pierre",null,null,null,null,null,""]
[null,null,null,null,null,null,""]
["GROSJEAN Romain","HAAS",null,null,null,null,{"$f":"IFERROR(CHOOSE(D26,25,18,15,12,10,8,6,4,2,1)+(F26=1),\"\")","v":""}]
["MAGNUSSEN Kevin",null,null,null,null,null,""]
[null,null,null,null,null,null,""]
["NORRIS Lando","McLAREN",null,null,null,null,""]
["SAINZ.Jr Carlos",null,null,null,null,null,""]
[null,null,null,null,null,null,""]
["RAÏKKÖNEN Kimi","ALFA ROMEO",null,null,null,null,""]
["GIOVANIZZI Antonio",null,null,null,null,null,""]
[null,null,null,null,null,null,""]

{"sheet":"USA","index":21,"n_rows":34,"n_cols":12,"rows_kept":34,"cut":false,"hidden":false,"merged":[[0,0,1,14],[2,1,3,1],[2,2,3,2],[2,3,3,3],[2,5,3,5],[2,6,3,6],[2,8,2,10],[2,4,3,4],[4,1,6,1],[4,2,6,2],[7,1,9,1],[7,2,9,2],[10,1,12,1],[10,2,12,2],[13,1,15,1],[13,2,15,2],[16,1,18,1],[16,2,18,2],[19,1,21,1],[19,2,21,2],[31,1,33,1],[31,2,33,2],[22,1,24,1],[22,2,24,2],[25,1,27,1],[25,2,27,2],[28,1,30,1],[28,2,30,2]]}
["USA - 25 OCTOBRE 2020"]
[]
["PILOTES","ECURIES","VOITURES","Finish","Pôle","Pt tour","Points",null,"CLASSEMENT"]
[null,null,null,null,null,null,null,{"$f":"IF(G4=\"\",\"\",(RANK(G4,G4:G23)))","v":""},"ÉCURIES","POINTS","RANG","TOTAL"]
["HAMILTON Lewis","MERCEDES",null,null,null,null,{"$f":"IFERROR(CHOOSE(D5,25,18,15,12,10,8,6,4,2,1)+(F5=1),\"\")","v":""},null,"MERCEDES",{"$f":"SUM(G5:G7)","v":0},{"$f":"IF(J5=\"\",0,(RANK(J5,$J$5:$J$14)))+COUNTIF(J$5:J5,J5)-1","v":1},{"$f":"IF(J5=0,0,J5+Mexique!L5)","v":0}]
["BOTTAS Valterri",null,null,null,null,null,{"$f":"IFERROR(CHOOSE(D6,25,18,15,12,10,8,6,4,2,1)+(F6=1),\"\")","v":""},null,"FERRARI",{"$f":"SUM(G8:G10)","v":0},{"$f":"IF(J6=\"\",0,(RANK(J6,$J$5:$J$14)))+COUNTIF(J$5:J6,J6)-1","v":2},{"$f":"IF(J6=0,0,J6+Mexique!L6)","v":0}]
[null,null,null,null,null,null,"",null,"RED BULL",{"$f":"SUM(G11:G13)","v":0},{"$f":"IF(J7=\"\",0,(RANK(J7,$J$5:$J$14)))+COUNTIF(J$5:J7,J7)-1","v":3},{"$f":"IF(J7=0,0,J7+Mexique!L7)","v":0}]
["VETTEL Sebastian","FERRARI",null,null,null,null,"",null,"RACING POINT",{"$f":"SUM(G14:G16)","v":0},{"$f":"IF(J8=\"\",0,(RANK(J8,$J$5:$J$14)))+COUNTIF(J$5:J8,J8)-1","v":4},{"$f":"IF(J8=0,0,J8+Mexique!L8)","v":0}]
["LECLERC Charles",null,null,null,null,null,"",null,"WILLIAMS",{"$f":"SUM(G17:G19)","v":0},{"$f":"IF(J9=\"\",0,(RANK(J9,$J$5:$J$14)))+COUNTIF(J$5:J9,J9)-1","v":5},{"$f":"IF(J9=0,0,J9+Mexique!L9)","v":0}]
[null,null,null,null,null,null,"",null,"RENAULT",{"$f":"SUM(G20:G22)","v":0},{"$f":"IF(J10=\"\",0,(RANK(J10,$J$5:$J$14)))+COUNTIF(J$5:J10,J10)-1","v":6},{"$f":"IF(J10=0,0,J10+Mexique!L10)","v":0}]
["VERSTAPPEN Max","RED BULL",null,null,null,null,"",null,"TORO ROSSO",{"$f":"SUM(G23:G25)","v":0},{"$f":"IF(J11=\"\",0,(RANK(J11,$J$5:$J$14)))+COUNTIF(J$5:J11,J11)-1","v":7},{"$f":"IF(J11=0,0,J11+Mexique!L11)","v":0}]
["ALBON Alexander",null,null,null,null,null,"",null,"HASS",{"$f":"SUM(G26:G28)","v":0},{"$f":"IF(J12=\"\",0,(RANK(J12,$J$5:$J$14)))+COUNTIF(J$5:J12,J12)-1","v":8},{"$f":"IF(J12=0,0,J12+Mexique!L12)","v":0}]
[null,null,null,null,null,null,"",null,"Mc LAREN",{"$f":"SUM(G29:G31)","v":0},{"$f":"IF(J13=\"\",0,(RANK(J13,$J$5:$J$14)))+COUNTIF(J$5:J13,J13)-1","v":9},{"$f":"IF(J13=0,0,J13+Mexique!L13)","v":0}]
["PEREZ Sergio","RACING\nPOINT",null,null,null,null,"",null,"ALFA ROMÉO",{"$f":"SUM(G32:G34)","v":0},{"$f":"IF(J14=\"\",0,(RANK(J14,$J$5:$J$14)))+COUNTIF(J$5:J14,J14)-1","v":10},{"$f":"IF(J14=0,0,J14+Mexique!L14)","v":0}]
["STROLL Lance",null,null,null,null,null,""]
[null,null,null,null,null,null,""]
["RUSSELL George","WILLIAMS",null,null,null,null,""]
["LATIFI Nicholas",null,null,null,null,null,""]
[null,null,null,null,null,null,""]
["RICCIARDO Daniel","RENAULT",null,null,null,null,""]
["OCON Esteban",null,null,null,null,null,""]
[null,null,null,null,null,null,""]
["KVYAT Daniil","TORO ROSSO",null,null,null,null,""]
["GASLY Pierre",null,null,null,null,null,""]
[null,null,null,null,null,null,""]
["GROSJEAN Romain","HAAS",null,null,null,null,""]
["MAGNUSSEN Kevin",null,null,null,null,null,""]
[null,null,null,null,null,null,""]
["NORRIS Lando","McLAREN",null,null,null,null,""]
["SAINZ.Jr Carlos",null,null,null,null,null,""]
[null,null,null,null,null,null,""]
["RAÏKKÖNEN Kimi","ALFA ROMEO",null,null,null,null,""]
["GIOVANIZZI Antonio",null,null,null,null,null,""]
[null,null,null,null,null,null,""]

{"sheet":"Mexique","index":22,"n_rows":34,"n_cols":12,"rows_kept":34,"cut":false,"hidden":false,"merged":[[0,0,1,14],[2,1,3,1],[2,2,3,2],[2,3,3,3],[2,5,3,5],[2,6,3,6],[2,8,2,10],[2,4,3,4],[4,1,6,1],[4,2,6,2],[7,1,9,1],[7,2,9,2],[10,1,12,1],[10,2,12,2],[13,1,15,1],[13,2,15,2],[16,1,18,1],[16,2,18,2],[19,1,21,1],[19,2,21,2],[31,1,33,1],[31,2,33,2],[22,1,24,1],[22,2,24,2],[25,1,27,1],[25,2,27,2],[28,1,30,1],[28,2,30,2]]}
["MEXIQUE - 1er NOVEMBRE 2020"]
[]
["PILOTES","ECURIES","VOITURES","Finish","Pôle","Pt tour","Points",null,"CLASSEMENT"]
[null,null,null,null,null,null,null,{"$f":"IF(G4=\"\",\"\",(RANK(G4,G4:G23)))","v":""},"ÉCURIES","POINTS","RANG","TOTAL"]
["HAMILTON Lewis","MERCEDES",null,null,null,null,{"$f":"IFERROR(CHOOSE(D5,25,18,15,12,10,8,6,4,2,1)+(F5=1),\"\")","v":""},null,"MERCEDES",{"$f":"SUM(G5:G7)","v":0},{"$f":"IF(J5=\"\",0,(RANK(J5,$J$5:$J$14)))+COUNTIF(J$5:J5,J5)-1","v":1},{"$f":"IF(J5=0,0,J5+Japon!L5)","v":0}]
["BOTTAS Valterri",null,null,null,null,null,{"$f":"IFERROR(CHOOSE(D6,25,18,15,12,10,8,6,4,2,1)+(F6=1),\"\")","v":""},null,"FERRARI",{"$f":"SUM(G8:G10)","v":0},{"$f":"IF(J6=\"\",0,(RANK(J6,$J$5:$J$14)))+COUNTIF(J$5:J6,J6)-1","v":2},{"$f":"IF(J6=0,0,J6+Japon!L6)","v":0}]
[null,null,null,null,null,null,"",null,"RED BULL",{"$f":"SUM(G11:G13)","v":0},{"$f":"IF(J7=\"\",0,(RANK(J7,$J$5:$J$14)))+COUNTIF(J$5:J7,J7)-1","v":3},{"$f":"IF(J7=0,0,J7+Japon!L7)","v":0}]
["VETTEL Sebastian","FERRARI",null,null,null,null,"",null,"RACING POINT",{"$f":"SUM(G14:G16)","v":0},{"$f":"IF(J8=\"\",0,(RANK(J8,$J$5:$J$14)))+COUNTIF(J$5:J8,J8)-1","v":4},{"$f":"IF(J8=0,0,J8+Japon!L8)","v":0}]
["LECLERC Charles",null,null,null,null,null,"",null,"WILLIAMS",{"$f":"SUM(G17:G19)","v":0},{"$f":"IF(J9=\"\",0,(RANK(J9,$J$5:$J$14)))+COUNTIF(J$5:J9,J9)-1","v":5},{"$f":"IF(J9=0,0,J9+Japon!L9)","v":0}]
[null,null,null,null,null,null,"",null,"RENAULT",{"$f":"SUM(G20:G22)","v":0},{"$f":"IF(J10=\"\",0,(RANK(J10,$J$5:$J$14)))+COUNTIF(J$5:J10,J10)-1","v":6},{"$f":"IF(J10=0,0,J10+Japon!L10)","v":0}]
["VERSTAPPEN Max","RED BULL",null,null,null,null,"",null,"TORO ROSSO",{"$f":"SUM(G23:G25)","v":0},{"$f":"IF(J11=\"\",0,(RANK(J11,$J$5:$J$14)))+COUNTIF(J$5:J11,J11)-1","v":7},{"$f":"IF(J11=0,0,J11+Japon!L11)","v":0}]
["ALBON Alexander",null,null,null,null,null,"",null,"HASS",{"$f":"SUM(G26:G28)","v":0},{"$f":"IF(J12=\"\",0,(RANK(J12,$J$5:$J$14)))+COUNTIF(J$5:J12,J12)-1","v":8},{"$f":"IF(J12=0,0,J12+Japon!L12)","v":0}]
[null,null,null,null,null,null,"",null,"Mc LAREN",{"$f":"SUM(G29:G31)","v":0},{"$f":"IF(J13=\"\",0,(RANK(J13,$J$5:$J$14)))+COUNTIF(J$5:J13,J13)-1","v":9},{"$f":"IF(J13=0,0,J13+Japon!L13)","v":0}]
["PEREZ Sergio","RACING\nPOINT",null,null,null,null,"",null,"ALFA ROMÉO",{"$f":"SUM(G32:G34)","v":0},{"$f":"IF(J14=\"\",0,(RANK(J14,$J$5:$J$14)))+COUNTIF(J$5:J14,J14)-1","v":10},{"$f":"IF(J14=0,0,J14+Japon!L14)","v":0}]
["STROLL Lance",null,null,null,null,null,""]
[null,null,null,null,null,null,""]
["RUSSELL George","WILLIAMS",null,null,null,null,""]
["LATIFI Nicholas",null,null,null,null,null,""]
[null,null,null,null,null,null,""]
["RICCIARDO Daniel","RENAULT",null,null,null,null,""]
["OCON Esteban",null,null,null,null,null,""]
[null,null,null,null,null,null,""]
["KVYAT Daniil","TORO ROSSO",null,null,null,null,""]
["GASLY Pierre",null,null,null,null,null,""]
[null,null,null,null,null,null,""]
["GROSJEAN Romain","HAAS",null,null,null,null,""]
["MAGNUSSEN Kevin",null,null,null,null,null,""]
[null,null,null,null,null,null,""]
["NORRIS Lando","McLAREN",null,null,null,null,""]
["SAINZ.Jr Carlos",null,null,null,null,null,""]
[null,null,null,null,null,null,""]
["RAÏKKÖNEN Kimi","ALFA ROMEO",null,null,null,null,""]
["GIOVANIZZI Antonio",null,null,null,null,null,""]
[null,null,null,null,null,null,""]

{"sheet":"Brésil","index":23,"n_rows":34,"n_cols":12,"rows_kept":34,"cut":false,"hidden":false,"merged":[[0,0,1,14],[2,1,3,1],[2,2,3,2],[2,3,3,3],[2,5,3,5],[2,6,3,6],[2,8,2,10],[2,4,3,4],[4,1,6,1],[4,2,6,2],[7,1,9,1],[7,2,9,2],[10,1,12,1],[10,2,12,2],[13,1,15,1],[13,2,15,2],[16,1,18,1],[16,2,18,2],[19,1,21,1],[19,2,21,2],[31,1,33,1],[31,2,33,2],[22,1,24,1],[22,2,24,2],[25,1,27,1],[25,2,27,2],[28,1,30,1],[28,2,30,2]]}
["BRÉSIL - 15 NOVEMBRE 2020"]
[]
["PILOTES","ECURIES","VOITURES","Finish","Pôle","Pt tour","Points",null,"CLASSEMENT"]
[null,null,null,null,null,null,null,{"$f":"IF(G4=\"\",\"\",(RANK(G4,G4:G23)))","v":""},"ÉCURIES","POINTS","RANG","TOTAL"]
["HAMILTON Lewis","MERCEDES",null,null,null,null,{"$f":"IFERROR(CHOOSE(D5,25,18,15,12,10,8,6,4,2,1)+(F5=1),\"\")","v":""},null,"MERCEDES",{"$f":"SUM(G5:G7)","v":0},{"$f":"IF(J5=\"\",0,(RANK(J5,$J$5:$J$14)))+COUNTIF(J$5:J5,J5)-1","v":1},{"$f":"IF(J5=0,0,J5+USA!L5)","v":0}]
["BOTTAS Valterri",null,null,null,null,null,{"$f":"IFERROR(CHOOSE(D6,25,18,15,12,10,8,6,4,2,1)+(F6=1),\"\")","v":""},null,"FERRARI",{"$f":"SUM(G8:G10)","v":0},{"$f":"IF(J6=\"\",0,(RANK(J6,$J$5:$J$14)))+COUNTIF(J$5:J6,J6)-1","v":2},{"$f":"IF(J6=0,0,J6+USA!L6)","v":0}]
[null,null,null,null,null,null,"",null,"RED BULL",{"$f":"SUM(G11:G13)","v":0},{"$f":"IF(J7=\"\",0,(RANK(J7,$J$5:$J$14)))+COUNTIF(J$5:J7,J7)-1","v":3},{"$f":"IF(J7=0,0,J7+USA!L7)","v":0}]
["VETTEL Sebastian","FERRARI",null,null,null,null,"",null,"RACING POINT",{"$f":"SUM(G14:G16)","v":0},{"$f":"IF(J8=\"\",0,(RANK(J8,$J$5:$J$14)))+COUNTIF(J$5:J8,J8)-1","v":4},{"$f":"IF(J8=0,0,J8+USA!L8)","v":0}]
["LECLERC Charles",null,null,null,null,null,"",null,"WILLIAMS",{"$f":"SUM(G17:G19)","v":0},{"$f":"IF(J9=\"\",0,(RANK(J9,$J$5:$J$14)))+COUNTIF(J$5:J9,J9)-1","v":5},{"$f":"IF(J9=0,0,J9+USA!L9)","v":0}]
[null,null,null,null,null,null,"",null,"RENAULT",{"$f":"SUM(G20:G22)","v":0},{"$f":"IF(J10=\"\",0,(RANK(J10,$J$5:$J$14)))+COUNTIF(J$5:J10,J10)-1","v":6},{"$f":"IF(J10=0,0,J10+USA!L10)","v":0}]
["VERSTAPPEN Max","RED BULL",null,null,null,null,"",null,"TORO ROSSO",{"$f":"SUM(G23:G25)","v":0},{"$f":"IF(J11=\"\",0,(RANK(J11,$J$5:$J$14)))+COUNTIF(J$5:J11,J11)-1","v":7},{"$f":"IF(J11=0,0,J11+USA!L11)","v":0}]
["ALBON Alexander",null,null,null,null,null,"",null,"HASS",{"$f":"SUM(G26:G28)","v":0},{"$f":"IF(J12=\"\",0,(RANK(J12,$J$5:$J$14)))+COUNTIF(J$5:J12,J12)-1","v":8},{"$f":"IF(J12=0,0,J12+USA!L12)","v":0}]
[null,null,null,null,null,null,"",null,"Mc LAREN",{"$f":"SUM(G29:G31)","v":0},{"$f":"IF(J13=\"\",0,(RANK(J13,$J$5:$J$14)))+COUNTIF(J$5:J13,J13)-1","v":9},{"$f":"IF(J13=0,0,J13+USA!L13)","v":0}]
["PEREZ Sergio","RACING\nPOINT",null,null,null,null,"",null,"ALFA ROMÉO",{"$f":"SUM(G32:G34)","v":0},{"$f":"IF(J14=\"\",0,(RANK(J14,$J$5:$J$14)))+COUNTIF(J$5:J14,J14)-1","v":10},{"$f":"IF(J14=0,0,J14+USA!L14)","v":0}]
["STROLL Lance",null,null,null,null,null,""]
[null,null,null,null,null,null,""]
["RUSSELL George","WILLIAMS",null,null,null,null,""]
["LATIFI Nicholas",null,null,null,null,null,""]
[null,null,null,null,null,null,""]
["RICCIARDO Daniel","RENAULT",null,null,null,null,""]
["OCON Esteban",null,null,null,null,null,""]
[null,null,null,null,null,null,""]
["KVYAT Daniil","TORO ROSSO",null,null,null,null,""]
["GASLY Pierre",null,null,null,null,null,""]
[null,null,null,null,null,null,""]
["GROSJEAN Romain","HAAS",null,null,null,null,""]
["MAGNUSSEN Kevin",null,null,null,null,null,""]
[null,null,null,null,null,null,""]
["NORRIS Lando","McLAREN",null,null,null,null,""]
["SAINZ.Jr Carlos",null,null,null,null,null,""]
[null,null,null,null,null,null,""]
["RAÏKKÖNEN Kimi","ALFA ROMEO",null,null,null,null,""]
["GIOVANIZZI Antonio",null,null,null,null,null,""]
[null,null,null,null,null,null,""]

{"sheet":"Abu Dabi","index":24,"n_rows":34,"n_cols":12,"rows_kept":34,"cut":false,"hidden":false,"merged":[[0,0,1,14],[2,1,3,1],[2,2,3,2],[2,3,3,3],[2,5,3,5],[2,6,3,6],[2,8,2,10],[2,4,3,4],[4,1,6,1],[4,2,6,2],[7,1,9,1],[7,2,9,2],[10,1,12,1],[10,2,12,2],[13,1,15,1],[13,2,15,2],[16,1,18,1],[16,2,18,2],[19,1,21,1],[19,2,21,2],[31,1,33,1],[31,2,33,2],[22,1,24,1],[22,2,24,2],[25,1,27,1],[25,2,27,2],[28,1,30,1],[28,2,30,2]]}
["ABU DAHBI - 29 NOVEMBRE 2020"]
[]
["PILOTES","ECURIES","VOITURES","Finish","Pôle","Pt tour","Points",null,"CLASSEMENT"]
[null,null,null,null,null,null,null,{"$f":"IF(G4=\"\",\"\",(RANK(G4,G4:G23)))","v":""},"ÉCURIES","POINTS","RANG","TOTAL"]
["HAMILTON Lewis","MERCEDES",null,null,null,null,{"$f":"IFERROR(CHOOSE(D5,25,18,15,12,10,8,6,4,2,1)+(F5=1),\"\")","v":""},null,"MERCEDES",{"$f":"SUM(G5:G7)","v":0},{"$f":"IF(J5=\"\",0,(RANK(J5,$J$5:$J$14)))+COUNTIF(J$5:J5,J5)-1","v":1},{"$f":"IF(J5=0,0,J5+Brésil!L5)","v":0}]
["BOTTAS Valterri",null,null,null,null,null,{"$f":"IFERROR(CHOOSE(D6,25,18,15,12,10,8,6,4,2,1)+(F6=1),\"\")","v":""},null,"FERRARI",{"$f":"SUM(G8:G10)","v":0},{"$f":"IF(J6=\"\",0,(RANK(J6,$J$5:$J$14)))+COUNTIF(J$5:J6,J6)-1","v":2},{"$f":"IF(J6=0,0,J6+Brésil!L6)","v":0}]
[null,null,null,null,null,null,"",null,"RED BULL",{"$f":"SUM(G11:G13)","v":0},{"$f":"IF(J7=\"\",0,(RANK(J7,$J$5:$J$14)))+COUNTIF(J$5:J7,J7)-1","v":3},{"$f":"IF(J7=0,0,J7+Brésil!L7)","v":0}]
["VETTEL Sebastian","FERRARI",null,null,null,null,"",null,"RACING POINT",{"$f":"SUM(G14:G16)","v":0},{"$f":"IF(J8=\"\",0,(RANK(J8,$J$5:$J$14)))+COUNTIF(J$5:J8,J8)-1","v":4},{"$f":"IF(J8=0,0,J8+Brésil!L8)","v":0}]
["LECLERC Charles",null,null,null,null,null,"",null,"WILLIAMS",{"$f":"SUM(G17:G19)","v":0},{"$f":"IF(J9=\"\",0,(RANK(J9,$J$5:$J$14)))+COUNTIF(J$5:J9,J9)-1","v":5},{"$f":"IF(J9=0,0,J9+Brésil!L9)","v":0}]
[null,null,null,null,null,null,"",null,"RENAULT",{"$f":"SUM(G20:G22)","v":0},{"$f":"IF(J10=\"\",0,(RANK(J10,$J$5:$J$14)))+COUNTIF(J$5:J10,J10)-1","v":6},{"$f":"IF(J10=0,0,J10+Brésil!L10)","v":0}]
["VERSTAPPEN Max","RED BULL",null,null,null,null,"",null,"TORO ROSSO",{"$f":"SUM(G23:G25)","v":0},{"$f":"IF(J11=\"\",0,(RANK(J11,$J$5:$J$14)))+COUNTIF(J$5:J11,J11)-1","v":7},{"$f":"IF(J11=0,0,J11+Brésil!L11)","v":0}]
["ALBON Alexander",null,null,null,null,null,"",null,"HASS",{"$f":"SUM(G26:G28)","v":0},{"$f":"IF(J12=\"\",0,(RANK(J12,$J$5:$J$14)))+COUNTIF(J$5:J12,J12)-1","v":8},{"$f":"IF(J12=0,0,J12+Brésil!L12)","v":0}]
[null,null,null,null,null,null,"",null,"Mc LAREN",{"$f":"SUM(G29:G31)","v":0},{"$f":"IF(J13=\"\",0,(RANK(J13,$J$5:$J$14)))+COUNTIF(J$5:J13,J13)-1","v":9},{"$f":"IF(J13=0,0,J13+Brésil!L13)","v":0}]
["PEREZ Sergio","RACING\nPOINT",null,null,null,null,"",null,"ALFA ROMÉO",{"$f":"SUM(G32:G34)","v":0},{"$f":"IF(J14=\"\",0,(RANK(J14,$J$5:$J$14)))+COUNTIF(J$5:J14,J14)-1","v":10},{"$f":"IF(J14=0,0,J14+Brésil!L14)","v":0}]
["STROLL Lance",null,null,null,null,null,""]
[null,null,null,null,null,null,""]
["RUSSELL George","WILLIAMS",null,null,null,null,""]
["LATIFI Nicholas",null,null,null,null,null,""]
[null,null,null,null,null,null,""]
["RICCIARDO Daniel","RENAULT",null,null,null,null,""]
["OCON Esteban",null,null,null,null,null,""]
[null,null,null,null,null,null,""]
["KVYAT Daniil","TORO ROSSO",null,null,null,null,""]
["GASLY Pierre",null,null,null,null,null,""]
[null,null,null,null,null,null,""]
["GROSJEAN Romain","HAAS",null,null,null,null,""]
["MAGNUSSEN Kevin",null,null,null,null,null,""]
[null,null,null,null,null,null,""]
["NORRIS Lando","McLAREN",null,null,null,null,""]
["SAINZ.Jr Carlos",null,null,null,null,null,""]
[null,null,null,null,null,null,""]
["RAÏKKÖNEN Kimi","ALFA ROMEO",null,null,null,null,""]
["GIOVANIZZI Antonio",null,null,null,null,null,""]
[null,null,null,null,null,null,""]