{"text_format":"1","workbook":"xlsx","n_sheets":13,"sheets":["Menu","IMPORTS","Setup&WS","Recap Saison","Testing","Tables","CR DE COURSE","Tracks","Tyre&Fuel","Qualif","ReverseCalc","PMA","Calc"],"not_rendered":{"charts":1,"images":16,"macros":1,"external_links":0,"defined_names":46,"comments":1,"pivot_tables":0},"unopened":[],"bounds":{"document_bytes":16777216,"sheet_cells":100000,"rows_first":2000,"rows_last":500,"rows_between":2000,"halvings":0,"cell_chars":16384,"cell_head_chars":4096},"cells_cut":0,"cells_raw":0,"read":"whole","date_system":"1900"}

{"sheet":"Menu","index":0,"n_rows":62,"n_cols":13,"rows_kept":62,"cut":false,"hidden":false,"merged":[[58,1,58,2],[58,3,58,9],[58,11,61,11],[59,1,59,2],[59,3,59,9],[60,1,60,2],[60,3,60,9],[61,1,61,2],[61,3,61,9],[54,1,54,2],[54,3,54,9],[54,11,57,11],[55,1,55,2],[55,3,55,9],[56,1,56,2],[56,3,56,9],[57,1,57,2],[57,3,57,9],[50,1,50,2],[50,3,50,9],[50,11,53,11],[51,1,51,2],[51,3,51,9],[52,1,52,2],[52,3,52,9],[53,1,53,2],[53,3,53,9],[46,1,46,2],[46,3,46,9],[46,11,49,11],[47,1,47,2],[47,3,47,9],[48,1,48,2],[48,3,48,9],[49,1,49,2],[49,3,49,9],[40,1,40,12],[41,1,41,2],[41,3,41,9],[42,1,42,2],[42,3,42,9],[42,11,45,11],[43,1,43,2],[43,3,43,9],[44,1,44,2],[44,3,44,9],[45,1,45,2],[45,3,45,9],[18,9,19,9],[18,10,19,10],[14,11,17,12],[18,11,19,12],[14,7,17,10],[18,7,19,7],[18,8,19,8],[35,16,36,16],[37,16,38,16],[35,17,36,17],[37,17,38,17],[35,13,36,14],[37,13,38,14],[35,15,36,15],[37,15,38,15]]}
[]
[]
[]
[]
[]
[]
[]
[]
[]
[]
[]
[]
[]
[]
[null,null,null,null,null,null,null,{"$f":"+'Recap Saison'!AO55","v":61460114},null,null,null,{"$f":"SUM(L21:L37)","v":0}]
[]
[]
[]
[null,null,null,null,null,null,null,"gp","Liste","Q","R","Points"]
[]
[null,null,null,null,null,null,null,1,"Adelaide",{"$f":"+'Recap Saison'!K5","v":41},{"$f":"+'Recap Saison'!L5","v":41},{"$f":"IF(K21=1,10,IF(K21=2,8,IF(K21=3,6,IF(K21=4,5,IF(K21=5,4,IF(K21=6,3,IF(K21=7,2,IF(K21=8,1,0))))))))","v":0}]
[null,null,null,null,null,null,null,2,"Irungattukottai",{"$f":"+'Recap Saison'!K6","v":41},{"$f":"+'Recap Saison'!L6","v":41},{"$f":"IF(K22=1,10,IF(K22=2,8,IF(K22=3,6,IF(K22=4,5,IF(K22=5,4,IF(K22=6,3,IF(K22=7,2,IF(K22=8,1,0))))))))","v":0}]
[null,null,null,null,null,null,null,3,"Singapore",{"$f":"+'Recap Saison'!K7","v":41},{"$f":"+'Recap Saison'!L7","v":41},0]
[null,null,null,null,null,null,null,4,"Grobnik",{"$f":"+'Recap Saison'!K8","v":41},{"$f":"+'Recap Saison'!L8","v":41},0]
[null,null,null,null,null,null,null,5,"Bucharest Ring",{"$f":"+'Recap Saison'!K9","v":41},{"$f":"+'Recap Saison'!L9","v":41},0]
[null,null,null,null,null,null,null,6,"Jyllands-Ringen",{"$f":"+'Recap Saison'!K10","v":41},{"$f":"+'Recap Saison'!L10","v":41},0]
[null,null,null,null,null,null,null,7,"Zandvoort",{"$f":"+'Recap Saison'!K11","v":41},{"$f":"+'Recap Saison'!L11","v":41},0]
[null,null,null,null,null,null,null,8,"Valencia",{"$f":"+'Recap Saison'!K12","v":41},{"$f":"+'Recap Saison'!L12","v":41},0]
[null,null,null,null,null,null,null,9,"Portimao",{"$f":"+'Recap Saison'!K13","v":41},{"$f":"+'Recap Saison'!L13","v":41},0]
[null,null,null,null,null,null,null,10,"Indianapolis Oval",{"$f":"+'Recap Saison'!K14","v":41},{"$f":"+'Recap Saison'!L14","v":41},0]
[null,null,null,null,null,null,null,11,"Mexico City",{"$f":"+'Recap Saison'!K15","v":41},{"$f":"+'Recap Saison'!L15","v":41},0]
[null,null,null,null,null,null,null,12,"Brasilia",{"$f":"+'Recap Saison'!K16","v":41},{"$f":"+'Recap Saison'!L16","v":41},0]
[null,null,null,null,null,null,null,13,"Sakhir",{"$f":"+'Recap Saison'!K17","v":41},{"$f":"+'Recap Saison'!L17","v":41},0]
[null,null,null,null,null,null,null,14,"Fuji",{"$f":"+'Recap Saison'!K18","v":41},{"$f":"+'Recap Saison'!L18","v":41},0]
[null,null,null,null,null,null,null,15,"Yeongam",{"$f":"+'Recap Saison'!K19","v":41},{"$f":"+'Recap Saison'!L19","v":41},0]
[null,null,null,null,null,null,null,16,"Fiorano",{"$f":"+'Recap Saison'!K20","v":41},{"$f":"+'Recap Saison'!L20","v":41},0]
[null,null,null,null,null,null,null,17,"Brands Hatch",{"$f":"+'Recap Saison'!K21","v":41},{"$f":"+'Recap Saison'!L21","v":41},0]
[]
[]
[]
[null,"Commentaires   du   Pilote"]
[null,"Pieces",null,"Divers Reglages - Info Pilotes",null,null,null,null,null,null,"+ / -","HR","AJUST"]
[null,"Ailerons",null,"Je manque un peu d'adhérence dans les courbes",null,null,null,null,null,null,0.5,{"$f":"IMPORTS!F38","v":86.200000000000017},{"$f":"K43*$L$43","v":43.100000000000009}]
[null,"Ailerons",null,"La voiture est très instable dans de nombreux virages",null,null,null,null,null,null,1,null,{"$f":"K44*$L$43","v":86.200000000000017}]
[null,"Ailerons",null,"La voiture manque un peu de vitesse dans les lignes droites",null,null,null,null,null,null,-2,null,{"$f":"K45*$L$43","v":-172.40000000000003}]
[null,"Ailerons",null,"La voiture pourrait avoir un peu plus de vitesse dans les lignes droites",null,null,null,null,null,null,-0.5,null,{"$f":"K46*$L$43","v":-43.100000000000009}]
[null,"Moteur",null,"Essayez de favoriser un peu plus les bas régimes",null,null,null,null,null,null,-0.5,{"$f":"IMPORTS!F39","v":86.200000000000017},{"$f":"K47*$L$47","v":-43.100000000000009}]
[null,"Moteur",null,"Les tours du moteur sont trop élevés",null,null,null,null,null,null,-1,null,{"$f":"K48*$L$47","v":-86.200000000000017}]
[null,"Moteur",null,"La puissance du moteur dans les lignes droites n'est pas suffisante",null,null,null,null,null,null,2,null,{"$f":"K49*$L$47","v":172.40000000000003}]
[null,"Moteur",null,"Je pense que je n'ai pas assez de puissance du moteur dans les lignes droites",null,null,null,null,null,null,1,null,{"$f":"K50*$L$47","v":86.200000000000017}]
[null,"Freins",null,"Mettez l'équilibre un peu plus à l'arrière",null,null,null,null,null,null,-0.5,{"$f":"IMPORTS!F40","v":86.200000000000017},{"$f":"K51*$L$51","v":-43.100000000000009}]
[null,"Freins",null,"Je pense que l'efficacité des freins pourrait être plus élevé si l'on déplace l'équilibre à l'arrière",null,null,null,null,null,null,-1.5,null,{"$f":"K52*$L$51","v":-129.30000000000001}]
[null,"Freins",null,"Je voudrais avoir l'équilibre un peu plus à l'avant ",null,null,null,null,null,null,0.5,null,{"$f":"K53*$L$51","v":43.100000000000009}]
[null,"Freins",null,"Je pense que l'efficacité des freins pourrait être plus élevé si l'on déplace l'équilibre à l'avant",null,null,null,null,null,null,1.5,null,{"$f":"K54*$L$51","v":129.30000000000001}]
[null,"Boite de vitesse",null,"Je suis très souvent dans le rouge. Mettez le rapport de boite un peu plus élevé",null,null,null,null,null,null,0.5,{"$f":"IMPORTS!F41","v":86.200000000000017},{"$f":"K55*$L$55","v":43.100000000000009}]
[null,"Boite de vitesse",null,"Le rapport de boite est trop élevé",null,null,null,null,null,null,-1,null,{"$f":"K56*$L$55","v":-86.200000000000017}]
[null,"Boite de vitesse",null,"Je ne peux pas profiter de la puissance du moteur. Raccourcissez les rapports de boite ",null,null,null,null,null,null,-0.5,null,{"$f":"K57*$L$55","v":-43.100000000000009}]
[null,"Boite de vitesse",null,"On dirait que le moteur va exploser. Mettez un espace beaucoup plus élevé entre les vitesses",null,null,null,null,null,null,1.5,null,{"$f":"K58*$L$55","v":129.30000000000001}]
[null,"Suspension",null,"Je pense qu'avec une suspension un peu plus rigide, je serai plus rapide ",null,null,null,null,null,null,1,{"$f":"IMPORTS!F42","v":86.200000000000017},{"$f":"K59*$L$59","v":86.200000000000017}]
[null,"Suspension",null,"La voiture est trop rigide. Baissez un peu la rigidité",null,null,null,null,null,null,-0.5,null,{"$f":"K60*$L$59","v":-43.100000000000009}]
[null,"Suspension",null,"La rigidité de suspension est trop élevé",null,null,null,null,null,null,-1,null,{"$f":"K61*$L$59","v":-86.200000000000017}]
[null,"Suspension",null,"La rigidité de suspension est trop faible",null,null,null,null,null,null,1.5,null,{"$f":"K62*$L$59","v":129.30000000000001}]

{"sheet":"IMPORTS","index":1,"n_rows":42,"n_cols":19,"rows_kept":42,"cut":false,"hidden":true,"merged":[[35,4,35,5],[23,12,23,15],[24,12,24,15],[25,12,25,15],[26,12,26,15],[27,12,27,15],[28,12,28,15]]}
[]
[]
["Compétences du pilote",null,null,null,"Personnel et installations",null,null,"Compétences du DT",null,null,"Caractéristiques actuelles de la voiture"]
[0.75,null,null,null,"Niveau global:",19,null,"Niveau global:",0,null,"Puissance","Maniabilité","Accélération"]
["Niveau global:",147,null,null,null,null,null,null,null,null,96,98,94]
[null,null,null,null,"Compétences du personnel",null,null,"Leadership:",0,null,"Historique des caractéristiques de la voiture"]
["Concentration:",205,null,null,"Expérience:",15]
[null,null,null,null,null,null,null,"R&D en mécanique:",0,null,"Pièces","Niveau","Action","Usure"," ","Nouveau niveau","Nouvelle usure"]
["Talent:",210,null,null,"Motivation:",9,null,null,null,null,"Châssis:",7,null,0.71,null,7,0.71,{"$f":"+'Tyre&Fuel'!T25/100","v":0.92725696766591392},{"$f":"+'Setup&WS'!D26","v":"NON OK "}]
[null,null,null,null,null,null,null,"R&D en électronique:",0,null,"Moteur:",7,null,0,null,7,0,{"$f":"+'Tyre&Fuel'!T26/100","v":0.12792465518727955},{"$f":"+'Setup&WS'!D27","v":"NON OK "}]
["Agressivité:",0,null,null,"Compétence technique:",19,null,null,null,null,"Aileron avant:",7,null,0.31,null,7,0.31,{"$f":"+'Tyre&Fuel'!T27/100","v":0.53976187787612162},{"$f":"+'Setup&WS'!D28","v":"NON OK "}]
[null,null,null,null,null,null,null,"R&D en aérodynamique:",0,null,"Aileron arrière:",7,null,0.34,null,7,0.34,{"$f":"+'Tyre&Fuel'!T28/100","v":0.61050368210937833},{"$f":"+'Setup&WS'!D29","v":"NON OK "}]
["Expérience:",131,null,null,"Gestion du stress:",19,null,null,null,null,"Fond plat:",7,null,0,null,7,0,{"$f":"+'Tyre&Fuel'!T29/100","v":0.24524606853733244},{"$f":"+'Setup&WS'!D30","v":"NON OK "}]
[null,null,null,null,null,null,null,"Expérience:",0,null,"Pontons latéraux:",7,null,0.28000000000000003,null,7,0.28000000000000003,{"$f":"+'Tyre&Fuel'!T30/100","v":0.42807081467801017},{"$f":"+'Setup&WS'!D31","v":"NON OK "}]
["Connaissances tech.:",119,null,null,"Concentration:",19,null,null,null,null,"Refroidissement:",7,null,0.2,null,7,0.2,{"$f":"+'Tyre&Fuel'!T31/100","v":0.37285589247252743},{"$f":"+'Setup&WS'!D32","v":"NON OK "}]
[null,null,null,null,null,null,null,"Coordination arrêts aux stands:",0,null,"Boîte de vitesse:",6,null,0.33,null,6,0.33,{"$f":"+'Tyre&Fuel'!T32/100","v":0.49446986028886625},{"$f":"+'Setup&WS'!D33","v":"NON OK "}]
["Endurance:",96,null,null,"Efficacité:",19,null,null,null,null,"Freins:",7,null,0,null,7,0,{"$f":"+'Tyre&Fuel'!T33/100","v":0.13648216286569345},{"$f":"+'Setup&WS'!D34","v":"NON OK "}]
[null,null,null,null,null,null,null,"Motivation:",0,null,"Suspension:",7,null,0.4,null,7,0.4,{"$f":"+'Tyre&Fuel'!T34/100","v":0.48603608729880099},{"$f":"+'Setup&WS'!D35","v":"NON OK "}]
["Charisme:",63,null,null,"Niveau de l'installation",null,null,null,null,null,"Électronique:",7,null,0,null,7,0,{"$f":"+'Tyre&Fuel'!T35/100","v":0.12363149476948941},{"$f":"+'Setup&WS'!D36","v":"NON OK "}]
[null,null,null,null,"Soufflerie: ",20,null," "]
["Motivation:",244,null,null,null,null,null," "]
[null,null,null,null,"Centre d'entraînement aux arrêts aux stands: ",29,null,"Age:",0]
["Réputation:",0]
[null,null,null,null,"Atelier de R&D: ",19,null,null,null,null,null,null,"Cout des entrainements  Pilote",null,null,null,-750000]
["Poids (kg):",56,null,null,null,null,null,null,null,null,null,null,"Cout des entrainements  Staff",null,null,null,0]
[null,null,null,null,"Centre de design R&D: ",19,null,null,null,null,null,null,"Cout des contrats pilote et Staff",null,null,null,0]
["Âge:",25,null,null,null,null,null,null,null,null,null,null,"Cout des Testings",null,null,null,0]
[null,null,null,null,"Atelier d'ingénierie: ",19,null,null,null,null,null,null,"Cout des Ameliorations Installations",null,null,null,0]
[null,null,null,null,null,null,null,null,null,null,null,null,"Couts des Réparations",null,null,null,-19697269]
[null,null,null,null,"Laboratoire de chimie et alliages: ",19]
[]
[null,null,null,null,"Commerce: ",29]
[]
[]
[]
[null,null,null,null,"Happy Range"]
[null,null,null,null,"Pilote",{"$f":"135 - (0.1*B13) - (0.3 *B15)","v":86.200000000000017}]
[null,null,null,null,"Aileron ",{"$f":"F37-(0.390817*I12)-(0.0425979*I14)","v":86.200000000000017}]
[null,null,null,null,"Moteur",{"$f":"F37-(0.148625*I8)-(0.218959*I10)-(0.042665*I14)","v":86.200000000000017}]
[null,null,null,null,"Freins",{"$f":"F37-(0.24292*I8)-(0.009791*I12)-(0.06499*I14)-(0.08916*I10)","v":86.200000000000017}]
[null,null,null,null,"Boite de Vitesse",{"$f":"F37-(0.291894*I10)-(0.062533*I14)-(0.065017*I8)","v":86.200000000000017}]
[null,null,null,null,"Suspension",{"$f":"F37-(0.259221*I8)-(0.073354*I14)-(0.092522*I12)","v":86.200000000000017}]

{"sheet":"Setup&WS","index":2,"n_rows":43,"n_cols":29,"rows_kept":43,"cut":false,"hidden":true,"merged":[[42,1,42,2],[46,2,46,3],[41,10,41,11],[37,1,37,2],[38,1,38,2],[39,1,39,2],[40,1,40,2],[41,0,41,2],[36,9,36,10],[36,12,36,13],[37,9,37,10],[37,12,37,13],[38,9,38,10],[38,12,38,13],[35,12,35,13],[34,12,34,13],[33,12,33,13],[32,12,32,13],[31,12,31,13],[14,0,14,1],[14,4,14,6],[15,0,15,1],[11,0,11,1],[11,4,11,6],[6,9,6,13],[6,4,6,7],[12,0,12,1],[12,4,12,7],[13,0,13,1],[13,4,13,6],[6,0,6,2],[10,0,10,1],[17,20,17,22],[35,4,35,5],[32,4,32,5],[33,4,33,5],[34,4,34,5],[31,4,31,5],[35,9,35,10],[30,12,30,13],[29,9,29,10],[29,12,29,13],[34,9,34,10],[33,9,33,10],[32,9,32,10],[31,9,31,10],[30,9,30,10],[29,4,29,7],[17,0,17,1],[21,8,23,8],[6,16,6,27],[7,0,7,1],[7,4,7,6],[8,21,8,23],[8,24,9,24],[8,25,8,27],[9,0,9,1],[9,4,9,6],[8,0,8,1],[8,4,8,6],[8,17,9,17],[8,18,8,20],[8,13,13,13],[10,4,10,6],[8,15,9,15],[15,15,16,15],[22,15,23,15],[20,0,20,2],[21,0,21,1],[22,0,22,1],[23,0,23,1],[15,13,20,13],[22,13,27,13],[16,0,16,1],[16,4,16,7],[17,5,17,7],[18,0,18,1],[22,4,22,7],[23,4,23,5],[23,6,23,7]]}
[]
[]
[]
[]
[]
[]
["Driver",null,null,null,"Tech director",null,null,null,null,"Perfect Setups",null,null,null,null,null,null,"Setup Factor Calculations"]
["OA",null,{"$f":"Tables!D43","v":147.12319999999997},null,"R&D mechanics",null,null,{"$f":"IMPORTS!I8","v":0},null,{"$f":"+'Tyre&Fuel'!C11","v":"Hard"},"Low","Setup","High"]
["Concentration",null,{"$f":"IMPORTS!B7","v":205},null,"R&D electronics",null,null,{"$f":"IMPORTS!I10","v":0},null,"Front Wings",{"$f":"ROUND($Z$11,0)-IF($H$11=0,$R19/2,$S19/2)+U20","v":600.53340621896905},{"$f":"ROUND(Z11+U20,0)","v":644},{"$f":"ROUND($Z$11,0)+IF($H$11=0,$R19/2,$S19/2)+U20","v":688.53340621896905},"Q1",{"$f":"IF(AC9>1,P9+(999-P9),P9-(999-P9))","v":422},{"$f":"+AVERAGE(L9:L10)","v":710.5},null,"Track Base","Weather",null,null,"Driver",null,null,"Car","Setups",null,null,{"$f":"+U20","v":-66.466593781030952}]
["Talent",null,{"$f":"IMPORTS!B9","v":210},null,"R&D aerodynamics",null,null,{"$f":"IMPORTS!I12","v":0},null,"Rear Wings",{"$f":"ROUND($Z$11,0)-IF($H$11=0,$R19/2,$S19/2)-U20","v":733.46659378103095},{"$f":"ROUND(Z11-U20,0)","v":777},{"$f":"ROUND($Z$11,0)+IF($H$11=0,$R19/2,$S19/2)-U20","v":821.46659378103095},null,{"$f":"IF(AC10<1,P10-(999-P10),P10+(999-P10))","v":999},null,null,null,"Q1","Q2","Race","Q1","Q2","Race",null,"Q1","Q2","Race",{"$f":"-U20","v":66.466593781030952}]
["Aggressiveness",null,{"$f":"IMPORTS!B11","v":0},null,"Experience",null,null,{"$f":"IMPORTS!I14","v":0},null,"Engine",{"$f":"L11-IF($H$11=0,$R20/2,$S20/2)","v":590},{"$f":"ROUND(Z12,0)","v":633},{"$f":"L11+IF($H$11=0,$R20/2,$S20/2)","v":676},null,null,null,"Wings",{"$f":"VLOOKUP($F$18,Tracks!$A$3:$W$889,19,0)*2","v":1263.8},{"$f":"IF($H$20=\"Dry\",Tables!D4*$F$20,Tables!B4*$F$20+Tables!C4)*2","v":480},{"$f":"IF($H$21=\"Dry\",Tables!D4*$F$21,Tables!B4*$F$21+Tables!C4)*2","v":420},{"$f":"IF($H$22=\"Dry\",Tables!D4*$F$22,Tables!B4*$F$22+Tables!C4)*2","v":388},{"$f":"($C$10*FLOOR(($R$11+S11),1)*(-0.001349079032746))*IF($F$18<>\"Indianapolis Oval\",1,0.39)","v":-493.80339835601836},{"$f":"($C$10*FLOOR(($R$11+T11),1)*(-0.001349079032746))*IF($F$18<>\"Indianapolis Oval\",1,0.39)","v":-476.80500254341877},{"$f":"($C$10*FLOOR(($R$11+U11),1)*(-0.001349079032746))*IF($F$18<>\"Indianapolis Oval\",1,0.39)","v":-467.73919144336566},{"$f":"Tables!M13+Tables!M19","v":171.77},{"$f":"(R11+S11+V11+Y11)/2","v":710.88330082199082},{"$f":"(R11+T11+W11+Y11)/2","v":689.38249872829056},{"$f":"(R11+U11+X11+Y11)/2","v":677.91540427831717}]
["Experience",null,{"$f":"IMPORTS!B13","v":131},null,"Pit coordination",null,null,{"$f":"IMPORTS!I16","v":0},null,"Brake",{"$f":"L12-IF($H$11=0,$R21/2,$S21/2)","v":322},{"$f":"ROUND(Z13,0)","v":365},{"$f":"L12+IF($H$11=0,$R21/2,$S21/2)","v":408},null,null,null,"Engine",{"$f":"VLOOKUP($F$18,Tracks!$A$3:$W$889,20,0)","v":496.9},{"$f":"IF($H$20=\"Dry\",Tables!D5*$F$20,Tables!B5*$F$20+Tables!C5)","v":-120},{"$f":"IF($H$21=\"Dry\",Tables!D5*$F$21,Tables!B5*$F$21+Tables!C5)","v":-105},{"$f":"IF($H$22=\"Dry\",Tables!D5*$F$22,Tables!B5*$F$22+Tables!C5)","v":-97},{"$f":"Tables!$G$28+($C$12*(($R$12+S12)*0.001655723+0.0469416263186552))*IF($F$18<>\"Indianapolis Oval\",1,0.39)","v":87.898854877443824},{"$f":"(Tables!$G$28+$C$12*(($R$12+T12)*0.001655723+0.0469416263186552))*IF($F$18<>\"Indianapolis Oval\",1,0.39)","v":91.152350572443822},{"$f":"(Tables!$G$28+$C$12*(($R$12+U12)*0.001655723+0.0469416263186552))*IF($F$18<>\"Indianapolis Oval\",1,0.39)","v":92.887548276443823},{"$f":"Tables!M14+Tables!M20","v":168.16},{"$f":"R12+S12+V12+Y12","v":632.95885487744374},{"$f":"R12+T12+W12+Y12","v":651.21235057244382},{"$f":"R12+U12+X12+Y12","v":660.94754827644374}]
["Technical insight",null,{"$f":"IMPORTS!B15","v":119},null,"Staff",null,null,null,null,"Gears",{"$f":"L13-IF($H$11=0,$R22/2,$S22/2)","v":302},{"$f":"ROUND(Z14,0)","v":345},{"$f":"L13+IF($H$11=0,$R22/2,$S22/2)","v":388},null,null,null,"Brake",{"$f":"VLOOKUP($F$18,Tracks!$A$3:$W$889,21,0)","v":358.33},{"$f":"IF($H$20=\"Dry\",Tables!D6*$F$20,Tables!B6*$F$20+Tables!C6)","v":240},{"$f":"IF($H$21=\"Dry\",Tables!D6*$F$21,Tables!B6*$F$21+Tables!C6)","v":210},{"$f":"IF($H$22=\"Dry\",Tables!D6*$F$22,Tables!B6*$F$22+Tables!C6)","v":194},{"$f":"Tables!G29","v":-104.58},{"$f":"Tables!G29","v":-104.58},{"$f":"Tables!G29","v":-104.58},{"$f":"Tables!M15+Tables!M21","v":-128.87},{"$f":"R13+S13+V13+Y13","v":364.87999999999994},{"$f":"R13+T13+W13+Y13","v":334.87999999999994},{"$f":"R13+U13+X13+Y13","v":318.87999999999994}]
["Stamina",null,{"$f":"IMPORTS!B17","v":96},null,"Stress handling",null,null,{"$f":"IMPORTS!F13","v":19},null,"Suspension",{"$f":"L14-IF($H$11=0,$R23/2,$S23/2)","v":649},{"$f":"ROUND(Z15,0)","v":692},{"$f":"L14+IF($H$11=0,$R23/2,$S23/2)","v":735},null,null,null,"Gears",{"$f":"VLOOKUP($F$18,Tracks!$A$3:$W$889,22,0)","v":549.99},{"$f":"IF($H$20=\"Dry\",Tables!D7*$F$20,Tables!B7*$F$20+Tables!C7)","v":-160},{"$f":"IF($H$21=\"Dry\",Tables!D7*$F$21,Tables!B7*$F$21+Tables!C7)","v":-140},{"$f":"IF($H$22=\"Dry\",Tables!D7*$F$22,Tables!B7*$F$22+Tables!C7)","v":-129.33333333333334},{"$f":"Tables!G30","v":102.5},{"$f":"Tables!G30","v":102.5},{"$f":"Tables!G30","v":102.5},{"$f":"Tables!M16+Tables!M22","v":-147.03},{"$f":"R14+S14+V14+Y14","v":345.46000000000004},{"$f":"R14+T14+W14+Y14","v":365.46000000000004},{"$f":"R14+U14+X14+Y14","v":376.12666666666667}]
["Charisma",null,{"$f":"IMPORTS!B19","v":63},null,"Concentration",null,null,{"$f":"IMPORTS!F15","v":19},null,null,null,null,null,null,null,null,"Suspension",{"$f":"VLOOKUP($F$18,Tracks!$A$3:$W$889,23,0)","v":652.04999999999995},{"$f":"IF($H$20=\"Dry\",Tables!D8*$F$20,Tables!B8*$F$20+Tables!C8)","v":-240},{"$f":"IF($H$21=\"Dry\",Tables!D8*$F$21,Tables!B8*$F$21+Tables!C8)","v":-210},{"$f":"IF($H$22=\"Dry\",Tables!D8*$F$22,Tables!B8*$F$22+Tables!C8)","v":-194},{"$f":"Tables!G31","v":210.25},{"$f":"Tables!G31","v":210.25},{"$f":"Tables!G31","v":210.25},{"$f":"Tables!M17+Tables!M23","v":70.06},{"$f":"R15+S15+V15+Y15","v":692.3599999999999},{"$f":"R15+T15+W15+Y15","v":722.3599999999999},{"$f":"R15+U15+X15+Y15","v":738.3599999999999}]
["Motivation",null,{"$f":"IMPORTS!B21","v":244},null,null,null,null,null,null,"Front Wings",{"$f":"ROUND($AA$11,0)-IF($H$11=0,$R19/2,$S19/2)+V20","v":580.73619000205485},{"$f":"ROUND(AA11+V20,0)","v":625},{"$f":"ROUND($AA$11,0)+IF($H$11=0,$R19/2,$S19/2)+V20","v":668.73619000205485},"Q2",{"$f":"IF(AC16>1,P16+(999-P16),P16-(999-P16))","v":380},{"$f":"AVERAGE(L16:L17)","v":689.5},null,null,null,null,null,null,null,null,null,null,null,null,{"$f":"+V20","v":-64.263809997945131}]
["Reputation",null,{"$f":"IMPORTS!B23","v":0},null,"Stint Details",null,null,null,{"$f":"+PMA!L15","v":24.555589629629623},"Rear Wings",{"$f":"ROUND($AA$11,0)-IF($H$11=0,$R19/2,$S19/2)-V20","v":709.26380999794515},{"$f":"ROUND(AA11-V20,0)","v":754},{"$f":"ROUND($AA$11,0)+IF($H$11=0,$R19/2,$S19/2)-V20","v":797.26380999794515},null,{"$f":"IF(AC17<1,P17-(999-P17),P17+(999-P17))","v":999},null,null,null,null,null,null,null,null,null,null,null,null,null,{"$f":"-V20","v":64.263809997945131}]
["Weight(kg)",null,{"$f":"IMPORTS!B25","v":56},null,"Track","Adelaide",null,null,"PMA","Engine",{"$f":"L18-IF($H$11=0,$R20/2,$S20/2)","v":608},{"$f":"ROUND(AA12,0)","v":651},{"$f":"L18+IF($H$11=0,$R20/2,$S20/2)","v":694},null,null,null,"Happy Range","Generic","TD",null,"Wing Split"]
["Age",null,{"$f":"IMPORTS!B27","v":25},null,null,"Temp","Hum","Weather",{"$f":"PMA!H16","v":82.512171851851861},"Brake",{"$f":"L19-IF($H$11=0,$R21/2,$S21/2)","v":292},{"$f":"ROUND(AA13,0)","v":335},{"$f":"L19+IF($H$11=0,$R21/2,$S21/2)","v":378},null,null,null,"Wings",{"$f":"ROUND($C$12*-0.051+$C$13*-0.153+67.594,0)*2+2","v":88},{"$f":"MAX(2,ROUND($C$12*-0.051+$C$13*-0.153+69.592+$H$11*-0.031+$H$10*-0.203,0)*2)","v":90},null,"Q1","Q2","Race"]
[null,null,null,null,"Q1",40,10,"Dry",{"$f":"PMA!I16","v":92.826193333333336},"Gears",{"$f":"L20-IF($H$11=0,$R22/2,$S22/2)","v":322},{"$f":"ROUND(AA14,0)","v":365},{"$f":"L20+IF($H$11=0,$R22/2,$S22/2)","v":408},null,"Fuel",null,"Engine",{"$f":"ROUND($C$12*-0.051+$C$13*-0.153+67.594,0)*2","v":86},{"$f":"MAX(2,ROUND($C$12*-0.051+$C$13*-0.153+69.592+$H$11*-0.031+$H$8*-0.076+$H$9*-0.123,0)*2)","v":90},null,{"$f":"VLOOKUP($F$18,Tracks!$A$3:$Y$889,25,0)+$C$10*-0.246534498671854+3.69107049712848*($B$28+$B$29)/2+$Z$11*-0.189968386659174+$F$20*0.376337780506523+IF($H$20=\"Wet\",58.8818967363256,0)","v":-66.466593781030952},{"$f":"VLOOKUP($F$18,Tracks!$A$3:$Y$889,25,0)+$C$10*-0.246534498671854+3.69107049712848*($B$28+$B$29)/2+$AA$11*-0.189968386659174+$F$21*0.376337780506523+IF($H$21=\"Wet\",58.8818967363256,0)","v":-64.263809997945131},{"$f":"VLOOKUP($F$18,Tracks!$A$3:$Y$889,25,0)+$C$10*-0.246534498671854+3.69107049712848*($B$28+$B$29)/2+$AB$11*-0.189968386659174+$F$22*0.376337780506523+IF($H$22=\"Wet\",58.8818967363256,0)","v":-63.088991980299383}]
["Car",null,null,"reel","Q2",35,5,"Dry",{"$f":"PMA!J16","v":103.14021481481481},"Suspension",{"$f":"L21-IF($H$11=0,$R23/2,$S23/2)","v":679},{"$f":"ROUND(AA15,0)","v":722},{"$f":"L21+IF($H$11=0,$R23/2,$S23/2)","v":765},null,{"$f":"+'Tyre&Fuel'!H27","v":94},null,"Brake",{"$f":"ROUND($C$12*-0.051+$C$13*-0.153+67.594,0)*2","v":86},{"$f":"MAX(2,ROUND($C$12*-0.051+$C$13*-0.153+69.592+$H$11*-0.031+$H$8*-0.12+$H$9*-0.075,0)*2)","v":90}]
["Power",null,{"$f":"IMPORTS!K5","v":96},{"$f":"PMA!H20","v":93.585450000000009},"Race",{"$f":"AVERAGE(E25:F27)","v":32.333333333333336},{"$f":"AVERAGE(G25:H28)","v":5.625},"Dry","34°",null,null,null,null,null,null,null,"Gears",{"$f":"ROUND($C$12*-0.051+$C$13*-0.153+67.594,0)*2","v":86},{"$f":"MAX(2,ROUND($C$12*-0.051+$C$13*-0.153+69.594+$H$11*-0.031+$H$8*-0.0418+$H$9*-0.157,0)*2)","v":90}]
["Handling",null,{"$f":"IMPORTS!L5","v":98},{"$f":"PMA!I20","v":94.030709999999999},"Race Weather Details",null,null,null,null,"Front Wings",{"$f":"ROUND($AB$11,0)-IF($H$11=0,$R19/2,$S19/2)+W20","v":570.9110080197006},{"$f":"ROUND(AB11+W20,0)","v":615},{"$f":"ROUND($AB$11,0)+IF($H$11=0,$R19/2,$S19/2)+W20","v":658.9110080197006},"RACE",{"$f":"IF(AC23>1,P23+(999-P23),P23-(999-P23))","v":357},{"$f":"AVERAGE(L23:L24)","v":678},"Suspension",{"$f":"ROUND($C$12*-0.051+$C$13*-0.153+67.594,0)*2","v":86},{"$f":"MAX(2,ROUND($C$12*-0.051+$C$13*-0.153+69.594+$H$11*-0.031+$H$8*-0.134+$H$10*-0.061,0)*2)","v":90},null,null,null,null,null,null,null,null,null,{"$f":"W20","v":-63.088991980299383}]
["Acceleration",null,{"$f":"IMPORTS!M5","v":94},{"$f":"PMA!J20","v":90.86242},"Temp",null,"Hum",null,null,"Rear Wings",{"$f":"ROUND($AB$11,0)-IF($H$11=0,$R19/2,$S19/2)-W20","v":697.0889919802994},{"$f":"ROUND(AB11-W20,0)","v":741},{"$f":"ROUND($AB$11,0)+IF($H$11=0,$R19/2,$S19/2)-W20","v":785.0889919802994},null,{"$f":"IF(AC24<1,P24-(999-P24),P24+(999-P24))","v":999},null,null,null,null,null,null,null,null,null,null,null,null,null,{"$f":"-W20","v":63.088991980299383}]
[null,"Level","Wear","contrôle",32,37,4,12,null,"Engine",{"$f":"L25-IF($H$11=0,$R20/2,$S20/2)","v":618},{"$f":"ROUND(AB12,0)","v":661},{"$f":"L25+IF($H$11=0,$R20/2,$S20/2)","v":704}]
["Chassis",{"$f":"+IMPORTS!P9","v":7},{"$f":"+IMPORTS!Q9*100","v":71},{"$f":"+'Tyre&Fuel'!U25","v":"NON OK "},29,32,2,12,null,"Brake",{"$f":"L26-IF($H$11=0,$R21/2,$S21/2)","v":276},{"$f":"ROUND(AB13,0)","v":319},{"$f":"L26+IF($H$11=0,$R21/2,$S21/2)","v":362}]
["Engine",{"$f":"+IMPORTS!P10","v":7},{"$f":"+IMPORTS!Q10*100","v":0},{"$f":"+'Tyre&Fuel'!U26","v":"NON OK "},30,34,0,7,null,"Gears",{"$f":"L27-IF($H$11=0,$R22/2,$S22/2)","v":333},{"$f":"ROUND(AB14,0)","v":376},{"$f":"L27+IF($H$11=0,$R22/2,$S22/2)","v":419}]
["Front wing",{"$f":"+IMPORTS!P11","v":7},{"$f":"+IMPORTS!Q11*100","v":31},{"$f":"+'Tyre&Fuel'!U27","v":"NON OK "},32,36,2,6,null,"Suspension",{"$f":"L28-IF($H$11=0,$R23/2,$S23/2)","v":695},{"$f":"ROUND(AB15,0)","v":738},{"$f":"L28+IF($H$11=0,$R23/2,$S23/2)","v":781}]
["Rear wing",{"$f":"+IMPORTS!P12","v":7},{"$f":"+IMPORTS!Q12*100","v":34},{"$f":"+'Tyre&Fuel'!U28","v":"NON OK "}]
["Underbody",{"$f":"+IMPORTS!P13","v":7},{"$f":"+IMPORTS!Q13*100","v":0},{"$f":"+'Tyre&Fuel'!U29","v":"NON OK "},"Determine track Base Values",null,null,null,null,"Marques",null,"Durabilité","Montant"]
["Sidepods",{"$f":"+IMPORTS!P14","v":7},{"$f":"+IMPORTS!Q14*100","v":28.000000000000004},{"$f":"+'Tyre&Fuel'!U30","v":"NON OK "},"Balance",{"$f":"U20","v":-66.466593781030952},"Q1 Setup","Track Base",null,"Avonn",null,8,1200000]
["Cooling",{"$f":"+IMPORTS!P15","v":7},{"$f":"+IMPORTS!Q15*100","v":20},{"$f":"+'Tyre&Fuel'!U31","v":"NON OK "},"(FW+RW)/2",null,{"$f":"AVERAGE(L9:L10)","v":710.5},{"$f":"((2*G32-Y11-S11*(1-IF($F$18<>\"Indianapolis Oval\",1,0.39)*C10*0.001349079032746))/(1-IF($F$18<>\"Indianapolis Oval\",1,0.39)*C10*0.001349079032746))/2","v":631.52330030936014},null,"Badyear",null,7,3400000]
["Gearbox",{"$f":"+IMPORTS!P16","v":6},{"$f":"+IMPORTS!Q16*100","v":33},{"$f":"+'Tyre&Fuel'!U32","v":"NON OK "},"Engine",null,{"$f":"+L11","v":633},{"$f":"(G33-S12-Y12-IF($F$18<>\"Indianapolis Oval\",1,0.39)*C11*0.29521804804429-IF($F$18<>\"Indianapolis Oval\",1,0.39)*C12*S12*0.001655723-IF($F$18<>\"Indianapolis Oval\",1,0.39)*C12*0.0469416263186552)/(1+IF($F$18<>\"Indianapolis Oval\",1,0.39)*C12*0.001655723)","v":496.93381143254175},null,"Bridgerock",null,7,8400000]
["Brakes",{"$f":"+IMPORTS!P17","v":7},{"$f":"+IMPORTS!Q17*100","v":0},{"$f":"+'Tyre&Fuel'!U33","v":"NON OK "},"Brake",null,900,{"$f":"G34-S13-V13-Y13","v":893.45},null,"Contimental",null,8,2400000]
["Suspension",{"$f":"+IMPORTS!P18","v":7},{"$f":"+IMPORTS!Q18*100","v":40},{"$f":"+'Tyre&Fuel'!U34","v":"NON OK "},"Gears",null,{"$f":"+L13","v":345},{"$f":"G35-S14-V14-Y14","v":549.53},null,"Dunnolop",null,4,2700000]
["Electronics",{"$f":"+IMPORTS!P19","v":7},{"$f":"+IMPORTS!Q19*100","v":0},{"$f":"+'Tyre&Fuel'!U35","v":"NON OK "},"Suspension",null,{"$f":"+L14","v":692},{"$f":"G36-S15-V15-Y15","v":651.69000000000005},null,"Hancock",null,1,5600000]
[null,null,null,null,null,null,null,null,null,"Michelini",null,5,6000000]
["Equilibre","Chrono en secondes",null,null,null,null,null,null,null,"Pipirelli",null,1,250000]
[{"$f":"U20*2","v":-132.9331875620619},93.206000000000003,null,null,null,null,null,null,null,"Yokomama",null,3,1500000]
[{"$f":"+A39+30","v":-102.9331875620619},93.204999999999998,null,null,null,null,null,"Origine",-30,30,"M","Sec","Centieme"]
[{"$f":"+A39-30","v":-162.9331875620619},93.206999999999994,null,null,null,null,"Front Wings",{"$f":"ROUND(Z11+U20,0)","v":644},{"$f":"+H41+15","v":659},{"$f":"+H41-15","v":629},1,33,206]
["Meilleure valeur trouvée",null,null,null,null,null,"Rear Wings",{"$f":"ROUND(Z11-U20,0)","v":777},{"$f":"+H42-15","v":762},{"$f":"+H42+15","v":792},{"$f":"(K41*60)+L41","v":93},null,{"$f":"M41","v":206}]
[{"$f":"IF(Calc!F3<Calc!F2,Calc!H400,LOOKUP(D63,A39:A41))","v":-42.333187562063351},{"$f":"IF(Calc!F3<Calc!F2,Calc!J11,MIN(D59:E61))","v":93.202999999999832}]

{"sheet":"Recap Saison","index":3,"n_rows":84,"n_cols":43,"rows_kept":84,"cut":false,"hidden":true,"merged":[[44,42,44,43],[30,45,30,46],[80,0,80,4],[80,6,80,8],[81,6,81,8],[81,0,81,5],[72,0,72,5],[76,0,76,5],[76,6,76,7],[68,6,68,7],[69,6,69,7],[68,0,68,5],[69,0,69,5],[64,6,64,7],[65,6,65,7],[66,6,66,7],[67,6,67,7],[60,6,60,7],[64,0,64,5],[65,0,65,5],[67,0,67,5],[66,0,66,5],[63,0,63,5],[41,18,41,19],[83,0,83,5],[83,6,83,8],[82,0,82,5],[82,6,82,8],[57,8,58,8],[77,6,77,7],[59,6,59,7],[63,6,63,7],[58,0,58,5],[73,6,73,7],[74,6,74,7],[75,6,75,7],[73,0,73,5],[74,0,74,5],[75,0,75,5],[77,0,77,5],[79,6,79,8],[78,6,78,8],[78,0,79,5],[72,6,72,7],[70,6,70,7],[71,6,71,7],[70,0,70,5],[71,0,71,5],[0,0,0,61],[24,28,24,29],[24,30,24,31],[24,34,24,35],[24,36,24,37],[24,40,24,41],[24,22,24,23],[24,24,24,25],[24,0,24,6],[24,8,24,9],[24,10,24,11],[24,20,24,21],[24,26,24,27],[24,38,24,39],[2,15,2,24],[21,0,21,4],[21,8,21,9],[1,0,1,7],[2,8,3,8],[2,9,3,9],[2,0,3,0],[2,1,2,7],[2,10,2,11],[2,12,2,14],[58,6,58,7],[61,6,61,7],[62,6,62,7],[57,0,57,7],[59,0,59,5],[60,0,60,5],[61,0,61,5],[62,0,62,5],[42,14,42,15],[49,8,49,9],[48,8,48,9],[47,8,47,9],[50,8,50,9],[49,0,49,7],[55,0,55,7],[55,8,55,9],[51,0,51,7],[52,0,52,7],[54,0,54,7],[53,0,53,7],[55,14,55,15],[55,12,55,13],[55,10,55,11],[50,10,50,11],[50,0,50,7],[32,8,32,9],[35,0,35,7],[36,0,36,7],[40,0,40,7],[32,0,32,7],[39,0,39,7],[38,0,38,7],[37,0,37,7],[47,0,47,7],[48,0,48,7],[40,8,40,9],[41,0,41,7],[37,8,37,9],[42,0,42,7],[43,0,43,7],[45,0,45,7],[46,0,46,7],[44,0,44,7],[35,8,35,9],[36,8,36,9],[33,8,33,9],[40,10,40,11],[2,25,3,25],[38,18,38,19],[39,18,39,19],[39,22,39,23],[39,24,39,25],[38,26,38,27],[38,30,38,31],[39,26,39,27],[39,30,39,31],[24,18,24,19],[25,18,25,19],[30,18,30,19],[31,18,31,19],[32,18,32,19],[25,20,25,21],[26,20,26,21],[27,20,27,21],[30,20,30,21],[31,20,31,21],[32,20,32,21],[32,28,32,29],[32,26,32,27],[34,26,34,27],[2,27,3,27],[41,10,41,11],[38,10,38,11],[38,8,38,9],[39,8,39,9],[41,8,41,9],[45,8,45,9],[46,8,46,9],[39,10,39,11],[44,8,44,9],[46,10,46,11],[43,10,43,11],[42,8,42,9],[42,10,42,11],[30,12,30,13],[30,10,30,11],[31,10,31,11],[32,10,32,11],[35,10,35,11],[36,10,36,11],[25,10,25,11],[26,10,26,11],[27,10,27,11],[33,10,33,11],[25,8,25,9],[30,8,30,9],[37,10,37,11],[34,8,34,9],[34,10,34,11],[31,12,31,13],[54,40,54,41],[55,38,55,39],[55,40,55,41],[51,24,51,25],[51,30,51,31],[54,22,54,23],[52,26,52,27],[53,26,53,27],[54,26,54,27],[54,28,54,29],[52,32,52,33],[53,32,53,33],[54,32,54,33],[53,24,53,25],[54,24,54,25],[52,40,52,41],[53,40,53,41],[52,38,52,39],[53,38,53,39],[54,38,54,39],[53,36,53,37],[54,36,54,37],[55,36,55,37],[24,12,24,13],[25,12,25,13],[26,12,26,13],[27,12,27,13],[24,14,24,15],[25,14,25,15],[26,14,26,15],[27,14,27,15],[27,18,27,19],[26,18,26,19],[24,16,24,17],[25,16,25,17],[26,16,26,17],[27,16,27,17],[55,32,55,33],[55,34,55,35],[55,30,55,31],[52,30,52,31],[53,30,53,31],[51,8,51,9],[51,18,51,19],[51,32,51,33],[52,10,52,11],[53,10,53,11],[54,10,54,11],[51,28,51,29],[51,20,51,21],[52,22,52,23],[51,22,51,23],[52,8,52,9],[53,8,53,9],[54,8,54,9],[53,14,53,15],[54,14,54,15],[51,10,51,11],[51,14,51,15],[51,12,51,13],[52,12,52,13],[53,12,53,13],[54,12,54,13],[51,26,51,27],[52,18,52,19],[52,20,52,21],[54,34,54,35],[55,20,55,21],[55,16,55,17],[51,16,51,17],[52,16,52,17],[53,16,53,17],[43,12,43,13],[55,28,55,29],[52,28,52,29],[53,28,53,29],[54,16,54,17],[52,14,52,15],[45,12,45,13],[47,12,47,13],[50,12,50,13],[45,14,45,15],[47,14,47,15],[50,14,50,15],[53,20,53,21],[55,22,55,23],[55,26,55,27],[54,20,54,21],[53,22,53,23],[54,30,54,31],[55,18,55,19],[50,20,50,21],[43,20,43,21],[43,16,43,17],[54,18,54,19],[55,24,55,25],[52,24,52,25],[40,18,40,19],[40,22,40,23],[41,22,41,23],[53,18,53,19],[47,16,47,17],[46,16,46,17],[42,16,42,17],[44,14,44,15],[44,16,44,17],[44,18,44,19],[44,20,44,21],[50,16,50,17],[50,24,50,25],[50,22,50,23],[44,22,44,23],[48,20,48,21],[48,22,48,23],[42,12,42,13],[43,8,43,9],[50,18,50,19],[45,16,45,17],[45,18,45,19],[47,18,47,19],[46,18,46,19],[49,18,49,19],[49,10,49,11],[48,12,48,13],[48,10,48,11],[49,12,49,13],[49,14,49,15],[49,16,49,17],[45,10,45,11],[47,10,47,11],[44,10,44,11],[44,12,44,13],[46,12,46,13],[48,18,48,19],[43,14,43,15],[46,14,46,15],[42,18,42,19],[43,18,43,19],[36,18,36,19],[35,22,35,23],[36,22,36,23],[32,12,32,13],[35,12,35,13],[36,12,36,13],[37,12,37,13],[38,12,38,13],[38,22,38,23],[35,20,35,21],[36,20,36,21],[38,20,38,21],[33,12,33,13],[33,14,33,15],[33,16,33,17],[38,16,38,17],[35,18,35,19],[34,12,34,13],[37,22,37,23],[32,14,32,15],[35,14,35,15],[32,16,32,17],[34,14,34,15],[34,16,34,17],[37,18,37,19],[37,20,37,21],[40,20,40,21],[40,14,40,15],[49,28,49,29],[45,26,45,27],[41,24,41,25],[42,24,42,25],[42,26,42,27],[42,28,42,29],[43,22,43,23],[39,20,39,21],[46,20,46,21],[42,20,42,21],[45,20,45,21],[47,20,47,21],[46,26,46,27],[47,26,47,27],[37,26,37,27],[37,24,37,25],[46,22,46,23],[48,14,48,15],[47,22,47,23],[48,16,48,17],[40,12,40,13],[41,12,41,13],[35,16,35,17],[36,16,36,17],[36,14,36,15],[37,14,37,15],[38,14,38,15],[39,12,39,13],[37,16,37,17],[39,14,39,15],[39,16,39,17],[41,16,41,17],[41,14,41,15],[40,16,40,17],[24,32,24,33],[25,32,25,33],[26,32,26,33],[27,32,27,33],[30,32,30,33],[31,32,31,33],[32,32,32,33],[25,22,25,23],[26,22,26,23],[27,22,27,23],[30,22,30,23],[31,22,31,23],[25,24,25,25],[26,24,26,25],[32,22,32,23],[27,24,27,25],[25,26,25,27],[26,26,26,27],[32,24,32,25],[26,28,26,29],[27,28,27,29],[27,26,27,27],[30,26,30,27],[25,0,25,7],[25,38,25,39],[26,38,26,39],[27,38,27,39],[30,38,30,39],[25,36,25,37],[26,36,26,37],[50,30,50,31],[42,38,42,39],[38,38,38,39],[39,38,39,39],[34,34,34,35],[50,34,50,35],[45,38,45,39],[45,36,45,37],[46,36,46,37],[50,38,50,39],[46,38,46,39],[47,38,47,39],[39,34,39,35],[50,32,50,33],[49,30,49,31],[49,32,49,33],[38,32,38,33],[30,14,30,15],[30,16,30,17],[30,28,30,29],[30,0,30,5],[27,0,27,7],[26,0,26,7],[26,8,26,9],[30,24,30,25],[34,20,34,21],[34,22,34,23],[31,24,31,25],[31,16,31,17],[27,8,27,9],[31,14,31,15],[31,0,31,7],[34,18,34,19],[33,18,33,19],[33,20,33,21],[33,24,33,25],[33,26,33,27],[33,22,33,23],[31,8,31,9],[33,0,33,7],[34,0,34,7],[48,34,48,35],[48,36,48,37],[40,34,40,35],[43,36,43,37],[41,32,41,33],[41,30,41,31],[42,30,42,31],[43,30,43,31],[45,32,45,33],[46,32,46,33],[47,32,47,33],[44,32,44,33],[45,34,45,35],[42,34,42,35],[44,34,44,35],[44,36,44,37],[44,30,44,31],[45,30,45,31],[46,30,46,31],[47,30,47,31],[50,28,50,29],[47,24,47,25],[43,24,43,25],[49,24,49,25],[49,26,49,27],[48,24,48,25],[48,26,48,27],[48,28,48,29],[44,24,44,25],[44,26,44,27],[46,28,46,29],[45,28,45,29],[43,28,43,29],[47,28,47,29],[44,28,44,29],[50,26,50,27],[43,26,43,27],[45,24,45,25],[46,24,46,25],[44,38,44,39],[41,38,41,39],[43,38,43,39],[36,38,36,39],[37,38,37,39],[2,37,3,38],[4,37,4,38],[5,37,5,38],[6,37,6,38],[7,37,7,38],[8,37,8,38],[9,37,9,38],[10,37,10,38],[11,37,11,38],[21,37,21,38],[2,39,3,40],[4,39,4,40],[35,36,35,37],[38,36,38,37],[39,36,39,37],[40,36,40,37],[33,36,33,37],[40,38,40,39],[41,36,41,37],[45,42,45,43],[46,42,46,43],[47,42,47,43],[33,40,33,41],[41,40,41,41],[25,40,25,41],[26,40,26,41],[27,40,27,41],[30,40,30,41],[31,40,31,41],[32,40,32,41],[34,40,34,41],[43,40,43,41],[37,40,37,41],[42,40,42,41],[35,40,35,41],[45,40,45,41],[46,40,46,41],[40,40,40,41],[38,40,38,41],[44,40,44,41],[39,40,39,41],[32,42,32,43],[33,42,33,43],[53,42,53,43],[50,42,50,43],[51,42,51,43],[52,42,52,43],[49,34,49,35],[49,36,49,37],[49,38,49,39],[47,34,47,35],[47,40,47,41],[50,40,50,41],[51,36,51,37],[51,34,51,35],[49,40,49,41],[51,38,51,39],[49,42,49,43],[51,40,51,41],[48,42,48,43],[48,38,48,39],[48,40,48,41],[47,36,47,37],[50,36,50,37],[52,34,52,35],[53,34,53,35],[52,36,52,37],[33,38,33,39],[35,38,35,39],[36,36,36,37],[37,36,37,37],[34,36,34,37],[34,38,34,39],[33,30,33,31],[36,30,36,31],[37,30,37,31],[36,34,36,35],[37,34,37,35],[40,26,40,27],[31,36,31,37],[32,36,32,37],[31,30,31,31],[35,34,35,35],[37,32,37,33],[46,34,46,35],[38,34,38,35],[49,20,49,21],[49,22,49,23],[45,22,45,23],[41,26,41,27],[41,28,41,29],[42,22,42,23],[41,20,41,21],[35,26,35,27],[36,26,36,27],[35,24,35,25],[36,24,36,25],[38,24,38,25],[40,24,40,25],[42,36,42,37],[48,30,48,31],[48,32,48,33],[2,28,2,30],[2,31,2,33],[2,26,3,26],[2,34,2,36],[27,36,27,37],[30,36,30,37],[33,28,33,29],[38,28,38,29],[34,28,34,29],[37,28,37,29],[25,30,25,31],[26,30,26,31],[27,30,27,31],[34,30,34,31],[35,30,35,31],[34,32,34,33],[35,32,35,33],[36,32,36,33],[31,26,31,27],[31,28,31,29],[31,34,31,35],[29,0,29,41],[30,6,30,7],[34,24,34,25],[26,34,26,35],[27,34,27,35],[33,34,33,35],[33,32,33,33],[25,28,25,29],[43,32,43,33],[40,32,40,33],[42,32,42,33],[30,30,30,31],[30,34,30,35],[25,34,25,35],[32,30,32,31],[32,34,32,35],[36,28,36,29],[35,28,35,29],[39,28,39,29],[40,28,40,29],[39,32,39,33],[40,30,40,31],[43,34,43,35],[41,34,41,35],[16,37,16,38],[17,37,17,38],[18,37,18,38],[19,37,19,38],[20,37,20,38],[5,39,5,40],[6,39,6,40],[7,39,7,40],[8,39,8,40],[9,39,9,40],[10,39,10,40],[11,39,11,40],[12,39,12,40],[13,39,13,40],[14,39,14,40],[15,39,15,40],[16,39,16,40],[17,39,17,40],[18,39,18,40],[19,39,19,40],[20,39,20,40],[15,37,15,38],[2,41,3,42],[4,41,4,42],[5,41,5,42],[6,41,6,42],[7,41,7,42],[8,41,8,42],[9,41,9,42],[10,41,10,42],[11,41,11,42],[34,42,34,43],[35,42,35,43],[36,42,36,43],[37,42,37,43],[21,41,21,42],[12,41,12,42],[13,41,13,42],[14,41,14,42],[15,41,15,42],[16,41,16,42],[17,41,17,42],[18,41,18,42],[19,41,19,42],[20,41,20,42],[25,42,25,43],[26,42,26,43],[27,42,27,43],[36,40,36,41],[21,39,21,40],[31,38,31,39],[32,38,32,39],[12,37,12,38],[13,37,13,38],[14,37,14,38]]}
[]
["reprise  des  Donnees des qualifs  &  Compte Rendu de course",null,null,null,null,null,null,null,{"$f":"'CR DE COURSE'!C18","v":30},null,{"$f":"'CR DE COURSE'!A35","v":2},{"$f":"'CR DE COURSE'!B35","v":3},null,{"$f":"'CR DE COURSE'!P36","v":11.2},{"$f":"+'CR DE COURSE'!P34","v":9.7100000000000009},{"$f":"'CR DE COURSE'!B22","v":146},{"$f":"'CR DE COURSE'!C22","v":205},{"$f":"'CR DE COURSE'!D22","v":210},{"$f":"'CR DE COURSE'!E22","v":0},{"$f":"'CR DE COURSE'!F22","v":130},{"$f":"'CR DE COURSE'!G22","v":117},{"$f":"'CR DE COURSE'!H22","v":90},{"$f":"'CR DE COURSE'!I22","v":62},{"$f":"'CR DE COURSE'!J22","v":244},{"$f":"+'Setup&WS'!C19","v":25},{"$f":"'CR DE COURSE'!AC39","v":3},{"$f":"'CR DE COURSE'!T51","v":1},{"$f":"+'Tyre&Fuel'!H29","v":3},{"$f":"'CR DE COURSE'!S45","v":119.68068799418297},{"$f":"'CR DE COURSE'!S42","v":-31.400000000000006},{"$f":"'CR DE COURSE'!M50","v":false},{"$f":"'CR DE COURSE'!A27-'CR DE COURSE'!C27","v":5.0000000000000044E-2},{"$f":"'CR DE COURSE'!A29-'CR DE COURSE'!C29","v":4.0000000000000036E-2},{"$f":"'CR DE COURSE'!A31-'CR DE COURSE'!C31","v":0.62},{"$f":"'CR DE COURSE'!A38","v":90},{"$f":"'CR DE COURSE'!B38","v":95},{"$f":"'CR DE COURSE'!C38","v":92}]
[null,"Caracteristique du Circuit",null,null,null,null,null,null,"Risk","Fumette","Resultat",null,"Course",null,null,"Pilote",null,null,null,null,null,null,null,null,null,"Nbre de Pit","Nbre de DM","Boost","Contrôle",null,null,"Energy",null,null,"Caisse",null,null,"Gains",null,"Couts",null,"Balance"]
[null,"Nbre","Total","Km / Tour","GP","Usure Fuel","Usure Pneu","Depassem°",null,null,"Q","Race","Meteo","T°","Taux Humide","NG","Con","Talent","agres","exp","tech","End","Motiv","Poids","Age",null,null,null,"Pneus","Fuel","Piece","Q1","Q2","Race","P","M","A"]
[1,{"$f":"LOOKUP(E5,Tracks!$A$3:$A$62,Tracks!$H$3:$H$62)","v":79},{"$f":"LOOKUP(E5,Tracks!$A$3:$A$62,Tracks!$I$3:$I$62)","v":298.60000000000002},{"$f":"C5/B5","v":3.7797468354430381},{"$f":"+Menu!I21","v":"Adelaide"},{"$f":"LOOKUP(E5,Tracks!$A$3:$A$62,Tracks!$E$3:$E$62)","v":"Low"},{"$f":"LOOKUP(E5,Tracks!$A$3:$A$62,Tracks!$F$3:$F$62)","v":"Medium"},{"$f":"LOOKUP(E5,Tracks!$A$3:$A$62,Tracks!$C$3:$C$62)","v":"Hard"},null,null,41,41,null,null,null,null,null,null,null,null,null,null,null,null,null,null,null,null,null,null,null,null,null,null,null,null,null,{"$f":"I42","v":0},null,{"$f":"I$47+SUM(I$33:I$40)","v":0},null,{"$f":"+AL5+AN5","v":0}]
[2,{"$f":"LOOKUP(E6,Tracks!$A$3:$A$62,Tracks!$H$3:$H$62)","v":79},{"$f":"LOOKUP(E6,Tracks!$A$3:$A$62,Tracks!$I$3:$I$62)","v":293.60000000000002},3.7164556962025319,{"$f":"+Menu!I22","v":"Irungattukottai"},{"$f":"LOOKUP(E6,Tracks!$A$3:$A$62,Tracks!$E$3:$E$62)","v":"Medium"},{"$f":"LOOKUP(E6,Tracks!$A$3:$A$62,Tracks!$F$3:$F$62)","v":"High"},{"$f":"LOOKUP(E6,Tracks!$A$3:$A$62,Tracks!$C$3:$C$62)","v":"Easy"},null,null,41,41,null,null,null,null,null,null,null,null,null,null,null,null,null,null,null,null,null,null,null,null,null,null,null,null,null,{"$f":"K42","v":0},null,{"$f":"K$47+SUM(K$33:K$40)","v":0},null,0]
[3,{"$f":"LOOKUP(E7,Tracks!$A$3:$A$62,Tracks!$H$3:$H$62)","v":61},{"$f":"LOOKUP(E7,Tracks!$A$3:$A$62,Tracks!$I$3:$I$62)","v":309.10000000000002},5.0672131147540984,{"$f":"+Menu!I23","v":"Singapore"},{"$f":"LOOKUP(E7,Tracks!$A$3:$A$62,Tracks!$E$3:$E$62)","v":"Medium"},{"$f":"LOOKUP(E7,Tracks!$A$3:$A$62,Tracks!$F$3:$F$62)","v":"High"},{"$f":"LOOKUP(E7,Tracks!$A$3:$A$62,Tracks!$C$3:$C$62)","v":"Hard"},null,null,41,41,null,null,null,null,null,null,null,null,null,null,null,null,null,null,null,null,null,null,null,null,null,null,null,null,null,{"$f":"M42","v":0},null,{"$f":"M$47+SUM(M$33:M$40)","v":0},null,0]
[4,{"$f":"LOOKUP(E8,Tracks!$A$3:$A$62,Tracks!$H$3:$H$62)","v":74},{"$f":"LOOKUP(E8,Tracks!$A$3:$A$62,Tracks!$M$3:$M$62)","v":0},0,{"$f":"+Menu!I24","v":"Grobnik"},{"$f":"LOOKUP(E8,Tracks!$A$3:$A$62,Tracks!$E$3:$E$62)","v":"Low"},{"$f":"LOOKUP(E8,Tracks!$A$3:$A$62,Tracks!$F$3:$F$62)","v":"Medium"},{"$f":"LOOKUP(E8,Tracks!$A$3:$A$62,Tracks!$C$3:$C$62)","v":"Hard"},null,null,41,41,null,null,null,null,null,null,null,null,null,null,null,null,null,null,null,null,null,null,null,null,null,null,null,null,null,{"$f":"O42","v":0},null,{"$f":"O$47+SUM(O$33:O$40)","v":0},null,0]
[5,{"$f":"LOOKUP(E9,Tracks!$A$3:$A$62,Tracks!$H$3:$H$62)","v":80},{"$f":"LOOKUP(E9,Tracks!$A$3:$A$62,Tracks!$I$3:$I$62)","v":245.7},3.07125,{"$f":"+Menu!I25","v":"Bucharest Ring"},{"$f":"LOOKUP(E9,Tracks!$A$3:$A$62,Tracks!$E$3:$E$62)","v":"Very High"},{"$f":"LOOKUP(E9,Tracks!$A$3:$A$62,Tracks!$F$3:$F$62)","v":"Low"},{"$f":"LOOKUP(E9,Tracks!$A$3:$A$62,Tracks!$C$3:$C$62)","v":"Easy"},null,null,41,41,null,null,null,null,null,null,null,null,null,null,null,null,null,null,null,null,null,null,null,null,null,null,null,null,null,{"$f":"+Q42","v":0},null,{"$f":"Q$47+SUM(Q$33:Q$40)","v":0},null,0]
[6,{"$f":"LOOKUP(E10,Tracks!$A$3:$A$62,Tracks!$H$3:$H$62)","v":136},{"$f":"LOOKUP(E10,Tracks!$A$3:$A$62,Tracks!$I$3:$I$62)","v":312.8},2.3000000000000003,{"$f":"+Menu!I26","v":"Jyllands-Ringen"},{"$f":"LOOKUP(E10,Tracks!$A$3:$A$62,Tracks!$E$3:$E$62)","v":"Low"},{"$f":"LOOKUP(E10,Tracks!$A$3:$A$62,Tracks!$F$3:$F$62)","v":"High"},{"$f":"LOOKUP(E10,Tracks!$A$3:$A$62,Tracks!$C$3:$C$62)","v":"Normal"},null,null,41,41,null,null,null,null,null,null,null,null,null,null,null,null,null,null,null,null,null,null,null,null,null,null,null,null,null,{"$f":"+S42","v":0},null,{"$f":"S$47+SUM(S$33:S$40)","v":0},null,0]
[7,{"$f":"LOOKUP(E11,Tracks!$A$3:$A$62,Tracks!$H$3:$H$62)","v":71},{"$f":"LOOKUP(E11,Tracks!$A$3:$A$62,Tracks!$I$3:$I$62)","v":301.8},4.2507042253521128,{"$f":"+Menu!I27","v":"Zandvoort"},{"$f":"LOOKUP(E11,Tracks!$A$3:$A$62,Tracks!$E$3:$E$62)","v":"Low"},{"$f":"LOOKUP(E11,Tracks!$A$3:$A$62,Tracks!$F$3:$F$62)","v":"Medium"},{"$f":"LOOKUP(E11,Tracks!$A$3:$A$62,Tracks!$C$3:$C$62)","v":"Normal"},null,null,41,41,null,null,null,null,null,null,null,null,null,null,null,null,null,null,null,null,null,null,null,null,null,null,null,null,null,{"$f":"+U42","v":0},null,{"$f":"U$47+SUM(U$33:U$40)","v":0},null,0]
[8,{"$f":"LOOKUP(E12,Tracks!$A$3:$A$62,Tracks!$H$3:$H$62)","v":57},{"$f":"LOOKUP(E12,Tracks!$A$3:$A$62,Tracks!$I$3:$I$62)","v":310.10000000000002},5.4403508771929827,{"$f":"+Menu!I28","v":"Valencia"},{"$f":"LOOKUP(E12,Tracks!$A$3:$A$62,Tracks!$E$3:$E$62)","v":"Medium"},{"$f":"LOOKUP(E12,Tracks!$A$3:$A$62,Tracks!$F$3:$F$62)","v":"Medium"},{"$f":"LOOKUP(E12,Tracks!$A$3:$A$62,Tracks!$C$3:$C$62)","v":"Hard"},null,null,41,41,null,null,null,null,null,null,null,null,null,null,null,null,null,null,null,null,null,null,null,null,null,null,null,null,null,{"$f":"+W42","v":0},null,{"$f":"W$47+SUM(W$33:W$40)","v":0},null,0]
[9,{"$f":"LOOKUP(E13,Tracks!$A$3:$A$62,Tracks!$H$3:$H$62)","v":66},{"$f":"LOOKUP(E13,Tracks!$A$3:$A$62,Tracks!$I$3:$I$62)","v":309.7},4.6924242424242424,{"$f":"+Menu!I29","v":"Portimao"},{"$f":"LOOKUP(E13,Tracks!$A$3:$A$62,Tracks!$E$3:$E$62)","v":"Medium"},{"$f":"LOOKUP(E13,Tracks!$A$3:$A$62,Tracks!$F$3:$F$62)","v":"High"},{"$f":"LOOKUP(E13,Tracks!$A$3:$A$62,Tracks!$C$3:$C$62)","v":"Easy"},null,null,41,41,null,null,null,null,null,null,null,null,null,null,null,null,null,null,null,null,null,null,null,null,null,null,null,null,null,{"$f":"+Y42","v":0},null,{"$f":"Y$47+SUM(Y$33:Y$40)","v":0},null,0]
[10,{"$f":"LOOKUP(E14,Tracks!$A$3:$A$62,Tracks!$H$3:$H$62)","v":200},{"$f":"LOOKUP(E14,Tracks!$A$3:$A$62,Tracks!$I$3:$I$62)","v":804.40000000000009},4.0220000000000002,{"$f":"+Menu!I30","v":"Indianapolis Oval"},{"$f":"LOOKUP(E14,Tracks!$A$3:$A$62,Tracks!$E$3:$E$62)","v":"Very High"},{"$f":"LOOKUP(E14,Tracks!$A$3:$A$62,Tracks!$F$3:$F$62)","v":"Low"},{"$f":"LOOKUP(E14,Tracks!$A$3:$A$62,Tracks!$C$3:$C$62)","v":"Very Easy"},null,null,41,41,null,null,null,null,null,null,null,null,null,null,null,null,null,null,null,null,null,null,null,null,null,null,null,null,null,{"$f":"+AA42","v":0},null,{"$f":"AA$47+SUM(AA$33:AA$40)","v":0},null,0]
[11,{"$f":"LOOKUP(E15,Tracks!$A$3:$A$62,Tracks!$H$3:$H$62)","v":69},{"$f":"LOOKUP(E15,Tracks!$A$3:$A$62,Tracks!$I$3:$I$62)","v":305},4.4202898550724639,{"$f":"+Menu!I31","v":"Mexico City"},{"$f":"LOOKUP(E15,Tracks!$A$3:$A$62,Tracks!$E$3:$E$62)","v":"Low"},{"$f":"LOOKUP(E15,Tracks!$A$3:$A$62,Tracks!$F$3:$F$62)","v":"Medium"},{"$f":"LOOKUP(E15,Tracks!$A$3:$A$62,Tracks!$C$3:$C$62)","v":"Hard"},null,null,41,41,null,null,null,null,null,null,null,null,null,null,null,null,null,null,null,null,null,null,null,null,null,null,null,null,null,{"$f":"+AC42","v":0},null,{"$f":"AC$47+SUM(AC$33:AC$40)","v":0},null,0]
[12,{"$f":"LOOKUP(E16,Tracks!$A$3:$A$62,Tracks!$H$3:$H$62)","v":55},{"$f":"LOOKUP(E16,Tracks!$A$3:$A$62,Tracks!$I$3:$I$62)","v":301.10000000000002},5.4745454545454546,{"$f":"+Menu!I32","v":"Brasilia"},{"$f":"LOOKUP(E16,Tracks!$A$3:$A$62,Tracks!$E$3:$E$62)","v":"High"},{"$f":"LOOKUP(E16,Tracks!$A$3:$A$62,Tracks!$F$3:$F$62)","v":"Medium"},{"$f":"LOOKUP(E16,Tracks!$A$3:$A$62,Tracks!$C$3:$C$62)","v":"Hard"},null,null,41,41,null,null,null,null,null,null,null,null,null,null,null,null,null,null,null,null,null,null,null,null,null,null,null,null,null,{"$f":"+AE42","v":0},null,{"$f":"AE$47+SUM(AE$33:AE$40)","v":0},null,0]
[13,{"$f":"LOOKUP(E17,Tracks!$A$3:$A$62,Tracks!$H$3:$H$62)","v":57},{"$f":"LOOKUP(E17,Tracks!$A$3:$A$62,Tracks!$I$3:$I$62)","v":308.5},5.4122807017543861,{"$f":"+Menu!I33","v":"Sakhir"},{"$f":"LOOKUP(E17,Tracks!$A$3:$A$62,Tracks!$E$3:$E$62)","v":"Very High"},{"$f":"LOOKUP(E17,Tracks!$A$3:$A$62,Tracks!$F$3:$F$62)","v":"Medium"},{"$f":"LOOKUP(E17,Tracks!$A$3:$A$62,Tracks!$C$3:$C$62)","v":"Normal"},null,null,41,41,null,null,null,null,null,null,null,null,null,null,null,null,null,null,null,null,null,null,null,null,null,null,null,null,null,{"$f":"+AG42","v":0},null,{"$f":"AG$47+SUM(AG$33:AG$40)","v":0},null,0]
[14,{"$f":"LOOKUP(E18,Tracks!$A$3:$A$62,Tracks!$H$3:$H$62)","v":67},{"$f":"LOOKUP(E18,Tracks!$A$3:$A$62,Tracks!$I$3:$I$62)","v":305.39999999999998},4.55820895522388,{"$f":"+Menu!I34","v":"Fuji"},{"$f":"LOOKUP(E18,Tracks!$A$3:$A$62,Tracks!$E$3:$E$62)","v":"Medium"},{"$f":"LOOKUP(E18,Tracks!$A$3:$A$62,Tracks!$F$3:$F$62)","v":"Medium"},{"$f":"LOOKUP(E18,Tracks!$A$3:$A$62,Tracks!$C$3:$C$62)","v":"Easy"},null,null,41,41,null,null,null,null,null,null,null,null,null,null,null,null,null,null,null,null,null,null,null,null,null,null,null,null,null,{"$f":"+AI42","v":0},null,{"$f":"AI$47+SUM(AI$33:AI$40)","v":0},null,0]
[15,{"$f":"LOOKUP(E19,Tracks!$A$3:$A$62,Tracks!$H$3:$H$62)","v":55},{"$f":"LOOKUP(E19,Tracks!$A$3:$A$62,Tracks!$I$3:$I$62)","v":309.2},5.621818181818182,{"$f":"+Menu!I35","v":"Yeongam"},{"$f":"LOOKUP(E19,Tracks!$A$3:$A$62,Tracks!$E$3:$E$62)","v":"Medium"},{"$f":"LOOKUP(E19,Tracks!$A$3:$A$62,Tracks!$F$3:$F$62)","v":"High"},{"$f":"LOOKUP(E19,Tracks!$A$3:$A$62,Tracks!$C$3:$C$62)","v":"Normal"},null,null,41,41,null,null,null,null,null,null,null,null,null,null,null,null,null,null,null,null,null,null,null,null,null,null,null,null,null,{"$f":"+AK42","v":0},null,{"$f":"AK$47+SUM(AK$33:AK$40)","v":0},null,0]
[16,{"$f":"LOOKUP(E20,Tracks!$A$3:$A$62,Tracks!$H$3:$H$62)","v":79},{"$f":"LOOKUP(E20,Tracks!$A$3:$A$62,Tracks!$I$3:$I$62)","v":238.6},3.0202531645569621,{"$f":"+Menu!I36","v":"Fiorano"},{"$f":"LOOKUP(E20,Tracks!$A$3:$A$62,Tracks!$E$3:$E$62)","v":"Very High"},{"$f":"LOOKUP(E20,Tracks!$A$3:$A$62,Tracks!$F$3:$F$62)","v":"High"},{"$f":"LOOKUP(E20,Tracks!$A$3:$A$62,Tracks!$C$3:$C$62)","v":"Normal"},null,null,41,41,null,null,null,null,null,null,null,null,null,null,null,null,null,null,null,null,null,null,null,null,null,null,null,null,null,{"$f":"+AM42","v":0},null,{"$f":"AM$47+SUM(AM$33:AM$40)","v":0},null,0]
[17,{"$f":"LOOKUP(E21,Tracks!$A$3:$A$62,Tracks!$H$3:$H$62)","v":75},{"$f":"LOOKUP(E21,Tracks!$A$3:$A$62,Tracks!$I$3:$I$62)","v":315.5},4.206666666666667,{"$f":"+Menu!I37","v":"Brands Hatch"},{"$f":"LOOKUP(E21,Tracks!$A$3:$A$62,Tracks!$E$3:$E$62)","v":"Low"},{"$f":"LOOKUP(E21,Tracks!$A$3:$A$62,Tracks!$F$3:$F$62)","v":"Low"},{"$f":"LOOKUP(E21,Tracks!$A$3:$A$62,Tracks!$C$3:$C$62)","v":"Normal"},null,null,41,41,null,null,null,null,null,null,null,null,null,null,null,null,null,null,null,null,null,null,null,null,null,null,null,null,null,{"$f":"+AO42","v":0},null,{"$f":"AO$47+SUM(AO$33:AO$40)","v":0},null,0]
["Saison",null,null,null,null,null,null,null,{"$f":"AVERAGE(I5:I21)","v":{"$error":"#DIV/0!"}},null,{"$f":"AVERAGE(K5:K21)","v":41},{"$f":"AVERAGE(L5:L21)","v":41},null,{"$f":"AVERAGE(N5:N21)","v":{"$error":"#DIV/0!"}},{"$f":"AVERAGE(O5:O21)","v":{"$error":"#DIV/0!"}},{"$f":"AVERAGE(P5:P21)","v":{"$error":"#DIV/0!"}},{"$error":"#DIV/0!"},{"$error":"#DIV/0!"},{"$error":"#DIV/0!"},{"$error":"#DIV/0!"},{"$error":"#DIV/0!"},{"$error":"#DIV/0!"},{"$error":"#DIV/0!"},{"$error":"#DIV/0!"},{"$error":"#DIV/0!"},{"$error":"#DIV/0!"},null,{"$error":"#DIV/0!"},null,null,null,{"$f":"AVERAGE(AF5:AF21)","v":{"$error":"#DIV/0!"}},{"$error":"#DIV/0!"},{"$error":"#DIV/0!"},{"$f":"AVERAGE(AI5:AI21)","v":{"$error":"#DIV/0!"}},{"$f":"AVERAGE(AJ5:AJ21)","v":{"$error":"#DIV/0!"}},{"$error":"#DIV/0!"},{"$f":"SUM(AL5:AL21)","v":0},null,{"$f":"SUM(AN5:AN21)","v":0},null,{"$f":"SUM(AP5:AP21)","v":0}]
[]
[]
["Detail",null,null,null,null,null,null,"Montant ",{"$f":"E5","v":"Adelaide"},null,{"$f":"+E6","v":"Irungattukottai"},null,{"$f":"+E7","v":"Singapore"},null,{"$f":"+E8","v":"Grobnik"},null,{"$f":"+E9","v":"Bucharest Ring"},null,{"$f":"+E10","v":"Jyllands-Ringen"},null,{"$f":"+E11","v":"Zandvoort"},null,{"$f":"+E12","v":"Valencia"},null,{"$f":"+E13","v":"Portimao"},null,{"$f":"+E14","v":"Indianapolis Oval"},null,{"$f":"+E15","v":"Mexico City"},null,{"$f":"+E16","v":"Brasilia"},null,{"$f":"+E17","v":"Sakhir"},null,{"$f":"+E18","v":"Fuji"},null,{"$f":"+E19","v":"Yeongam"},null,{"$f":"+E20","v":"Fiorano"},null,{"$f":"E21","v":"Brands Hatch"}]
["Qualification  (Mettre non si l'on a raté la course)",null,null,null,null,null,null,null,"NON",null,"NON",null,"NON",null,"NON",null,"NON",null,"NON",null,"NON",null,"NON",null,"NON",null,"NON",null,"NON",null,"NON",null,"NON",null,"NON",null,"NON",null,"NON",null,"NON",null,"NON"]
["Practices  (Nbres de Tours)"]
["Qualification Coupe",null,null,null,null,null,null,null,null,null,"NON",null,null,null,null,null,"NON",null,null,null,null,null,"NON",null,null,null,null,null,"NON",null,null,null,null,null,"NON",null,null,null,null,null,"NON",null,"NON"]
[]
["Balance Financiere"]
["Categorie",null,null,null,null,null,"Amateur",null,{"$f":"+I25","v":"Adelaide"},null,{"$f":"+K25","v":"Irungattukottai"},null,{"$f":"+M25","v":"Singapore"},null,{"$f":"+O25","v":"Grobnik"},null,{"$f":"+Q25","v":"Bucharest Ring"},null,{"$f":"+S25","v":"Jyllands-Ringen"},null,{"$f":"+U25","v":"Zandvoort"},null,{"$f":"+W25","v":"Valencia"},null,{"$f":"+Y25","v":"Portimao"},null,{"$f":"+AA25","v":"Indianapolis Oval"},null,{"$f":"+AC25","v":"Mexico City"},null,{"$f":"+AE25","v":"Brasilia"},null,{"$f":"+AG25","v":"Sakhir"},null,{"$f":"+AI25","v":"Fuji"},null,{"$f":"+AK25","v":"Yeongam"},null,{"$f":"+AM25","v":"Fiorano"},null,{"$f":"+AO25","v":"Brands Hatch"}]
["Avant Race",null,null,null,null,null,null,null,61460114,null,{"$f":"+I55","v":61460114},null,{"$f":"+K55","v":61460114},null,{"$f":"+M55","v":61460114},null,{"$f":"+O55","v":61460114},null,{"$f":"+Q55","v":61460114},null,{"$f":"+S55","v":61460114},null,{"$f":"+U55","v":61460114},null,{"$f":"+W55","v":61460114},null,{"$f":"+Y55","v":61460114},null,{"$f":"+AA55","v":61460114},null,{"$f":"+AC55","v":61460114},null,{"$f":"+AE55","v":61460114},null,{"$f":"+AG55","v":61460114},null,{"$f":"+AI55","v":61460114},null,{"$f":"+AK55","v":61460114},null,{"$f":"+AM55","v":61460114}]
["Cout des entrainements  Pilote",null,null,null,null,null,null,null,{"$f":"IF(I27=\"\",0,+IMPORTS!$Q$24)","v":0},null,{"$f":"IF(K27=\"\",0,+IMPORTS!$Q$24)","v":0},null,{"$f":"IF(M27=\"\",0,+IMPORTS!$Q$24)","v":0},null,{"$f":"IF(O27=\"\",0,+IMPORTS!$Q$24)","v":0},null,{"$f":"IF(Q27=\"\",0,+IMPORTS!$Q$24)","v":0},null,{"$f":"IF(S27=\"\",0,+IMPORTS!$Q$24)","v":0},null,{"$f":"IF(U27=\"\",0,+IMPORTS!$Q$24)","v":0},null,{"$f":"IF(W27=\"\",0,+IMPORTS!$Q$24)","v":0},null,{"$f":"IF(Y27=\"\",0,+IMPORTS!$Q$24)","v":0},null,{"$f":"IF(AA27=\"\",0,+IMPORTS!$Q$24)","v":0},null,{"$f":"IF(AC27=\"\",0,+IMPORTS!$Q$24)","v":0},null,{"$f":"IF(AE27=\"\",0,+IMPORTS!$Q$24)","v":0},null,{"$f":"IF(AG27=\"\",0,+IMPORTS!$Q$24)","v":0},null,{"$f":"IF(AI27=\"\",0,+IMPORTS!$Q$24)","v":0},null,{"$f":"IF(AK27=\"\",0,+IMPORTS!$Q$24)","v":0},null,{"$f":"IF(AM27=\"\",0,+IMPORTS!$Q$24)","v":0},null,{"$f":"IF(AO27=\"\",0,+IMPORTS!$Q$24)","v":0},null,{"$f":"IF(AQ27=\"\",0,+IMPORTS!$Q$24)","v":0}]
["Cout des entrainements  Staff",null,null,null,null,null,null,null,{"$f":"IF(I27=\"\",0,+IMPORTS!$Q$25)","v":0},null,{"$f":"IF(K27=\"\",0,+IMPORTS!$Q$25)","v":0},null,{"$f":"IF(M27=\"\",0,+IMPORTS!$Q$25)","v":0},null,{"$f":"IF(O27=\"\",0,+IMPORTS!$Q$25)","v":0},null,{"$f":"IF(Q27=\"\",0,+IMPORTS!$Q$25)","v":0},null,{"$f":"IF(S27=\"\",0,+IMPORTS!$Q$25)","v":0},null,{"$f":"IF(U27=\"\",0,+IMPORTS!$Q$25)","v":0},null,{"$f":"IF(W27=\"\",0,+IMPORTS!$Q$25)","v":0},null,{"$f":"IF(Y27=\"\",0,+IMPORTS!$Q$25)","v":0},null,{"$f":"IF(AA27=\"\",0,+IMPORTS!$Q$25)","v":0},null,{"$f":"IF(AC27=\"\",0,+IMPORTS!$Q$25)","v":0},null,{"$f":"IF(AE27=\"\",0,+IMPORTS!$Q$25)","v":0},null,{"$f":"IF(AG27=\"\",0,+IMPORTS!$Q$25)","v":0},null,{"$f":"IF(AI27=\"\",0,+IMPORTS!$Q$25)","v":0},null,{"$f":"IF(AK27=\"\",0,+IMPORTS!$Q$25)","v":0},null,{"$f":"IF(AM27=\"\",0,+IMPORTS!$Q$25)","v":0},null,{"$f":"IF(AO27=\"\",0,+IMPORTS!$Q$25)","v":0},null,{"$f":"IF(AQ27=\"\",0,+IMPORTS!$Q$25)","v":0}]
["Cout des contrats pilote et Staff",null,null,null,null,null,null,null,{"$f":"IF(I27=\"\",0,+IMPORTS!$Q$26)","v":0},null,{"$f":"IF(K27=\"\",0,+IMPORTS!$Q$26)","v":0},null,{"$f":"IF(M27=\"\",0,+IMPORTS!$Q$26)","v":0},null,{"$f":"IF(O27=\"\",0,+IMPORTS!$Q$26)","v":0},null,{"$f":"IF(Q27=\"\",0,+IMPORTS!$Q$26)","v":0},null,{"$f":"IF(S27=\"\",0,+IMPORTS!$Q$26)","v":0},null,{"$f":"IF(U27=\"\",0,+IMPORTS!$Q$26)","v":0},null,{"$f":"IF(W27=\"\",0,+IMPORTS!$Q$26)","v":0},null,{"$f":"IF(Y27=\"\",0,+IMPORTS!$Q$26)","v":0},null,{"$f":"IF(AA27=\"\",0,+IMPORTS!$Q$26)","v":0},null,{"$f":"IF(AC27=\"\",0,+IMPORTS!$Q$26)","v":0},null,{"$f":"IF(AE27=\"\",0,+IMPORTS!$Q$26)","v":0},null,{"$f":"IF(AG27=\"\",0,+IMPORTS!$Q$26)","v":0},null,{"$f":"IF(AI27=\"\",0,+IMPORTS!$Q$26)","v":0},null,{"$f":"IF(AK27=\"\",0,+IMPORTS!$Q$26)","v":0},null,{"$f":"IF(AM27=\"\",0,+IMPORTS!$Q$26)","v":0},null,{"$f":"IF(AO27=\"\",0,+IMPORTS!$Q$26)","v":0},null,{"$f":"IF(AQ27=\"\",0,+IMPORTS!$Q$26)","v":0}]
["Cout des Testings",null,null,null,null,null,null,null,{"$f":"IF(I27=\"\",0,+IMPORTS!$Q$27)","v":0},null,{"$f":"IF(K27=\"\",0,+IMPORTS!$Q$27)","v":0},null,{"$f":"IF(M27=\"\",0,+IMPORTS!$Q$27)","v":0},null,{"$f":"IF(O27=\"\",0,+IMPORTS!$Q$27)","v":0},null,{"$f":"IF(Q27=\"\",0,+IMPORTS!$Q$27)","v":0},null,{"$f":"IF(S27=\"\",0,+IMPORTS!$Q$27)","v":0},null,{"$f":"IF(U27=\"\",0,+IMPORTS!$Q$27)","v":0},null,{"$f":"IF(W27=\"\",0,+IMPORTS!$Q$27)","v":0},null,{"$f":"IF(Y27=\"\",0,+IMPORTS!$Q$27)","v":0},null,{"$f":"IF(AA27=\"\",0,+IMPORTS!$Q$27)","v":0},null,{"$f":"IF(AC27=\"\",0,+IMPORTS!$Q$27)","v":0},null,{"$f":"IF(AE27=\"\",0,+IMPORTS!$Q$27)","v":0},null,{"$f":"IF(AG27=\"\",0,+IMPORTS!$Q$27)","v":0},null,{"$f":"IF(AI27=\"\",0,+IMPORTS!$Q$27)","v":0},null,{"$f":"IF(AK27=\"\",0,+IMPORTS!$Q$27)","v":0},null,{"$f":"IF(AM27=\"\",0,+IMPORTS!$Q$27)","v":0},null,{"$f":"IF(AO27=\"\",0,+IMPORTS!$Q$27)","v":0},null,{"$f":"IF(AQ27=\"\",0,+IMPORTS!$Q$27)","v":0}]
["Cout des Ameliorations Installations",null,null,null,null,null,null,null,{"$f":"IF(I27=\"\",0,+IMPORTS!$Q$28)","v":0},null,{"$f":"IF(K27=\"\",0,+IMPORTS!$Q$28)","v":0},null,{"$f":"IF(M27=\"\",0,+IMPORTS!$Q$28)","v":0},null,{"$f":"IF(O27=\"\",0,+IMPORTS!$Q$28)","v":0},null,{"$f":"IF(Q27=\"\",0,+IMPORTS!$Q$28)","v":0},null,{"$f":"IF(S27=\"\",0,+IMPORTS!$Q$28)","v":0},null,{"$f":"IF(U27=\"\",0,+IMPORTS!$Q$28)","v":0},null,{"$f":"IF(W27=\"\",0,+IMPORTS!$Q$28)","v":0},null,{"$f":"IF(Y27=\"\",0,+IMPORTS!$Q$28)","v":0},null,{"$f":"IF(AA27=\"\",0,+IMPORTS!$Q$28)","v":0},null,{"$f":"IF(AC27=\"\",0,+IMPORTS!$Q$28)","v":0},null,{"$f":"IF(AE27=\"\",0,+IMPORTS!$Q$28)","v":0},null,{"$f":"IF(AG27=\"\",0,+IMPORTS!$Q$28)","v":0},null,{"$f":"IF(AI27=\"\",0,+IMPORTS!$Q$28)","v":0},null,{"$f":"IF(AK27=\"\",0,+IMPORTS!$Q$28)","v":0},null,{"$f":"IF(AM27=\"\",0,+IMPORTS!$Q$28)","v":0},null,{"$f":"IF(AO27=\"\",0,+IMPORTS!$Q$28)","v":0},null,{"$f":"IF(AQ27=\"\",0,+IMPORTS!$Q$28)","v":0}]
["Couts des Réparations",null,null,null,null,null,null,null,{"$f":"IF(I27=\"\",0,+IMPORTS!$Q$29)","v":0},null,{"$f":"IF(K27=\"\",0,+IMPORTS!$Q$29)","v":0},null,{"$f":"IF(M27=\"\",0,+IMPORTS!$Q$29)","v":0},null,{"$f":"IF(O27=\"\",0,+IMPORTS!$Q$29)","v":0},null,{"$f":"IF(Q27=\"\",0,+IMPORTS!$Q$29)","v":0},null,{"$f":"IF(S27=\"\",0,+IMPORTS!$Q$29)","v":0},null,{"$f":"IF(U27=\"\",0,+IMPORTS!$Q$29)","v":0},null,{"$f":"IF(W27=\"\",0,+IMPORTS!$Q$29)","v":0},null,{"$f":"IF(Y27=\"\",0,+IMPORTS!$Q$29)","v":0},null,{"$f":"IF(AA27=\"\",0,+IMPORTS!$Q$29)","v":0},null,{"$f":"IF(AC27=\"\",0,+IMPORTS!$Q$29)","v":0},null,{"$f":"IF(AE27=\"\",0,+IMPORTS!$Q$29)","v":0},null,{"$f":"IF(AG27=\"\",0,+IMPORTS!$Q$29)","v":0},null,{"$f":"IF(AI27=\"\",0,+IMPORTS!$Q$29)","v":0},null,{"$f":"IF(AK27=\"\",0,+IMPORTS!$Q$29)","v":0},null,{"$f":"IF(AM27=\"\",0,+IMPORTS!$Q$29)","v":0},null,{"$f":"IF(AO27=\"\",0,+IMPORTS!$Q$29)","v":0},null,{"$f":"IF(AQ27=\"\",0,+IMPORTS!$Q$29)","v":0}]
["Couts des Qualifs  + Practices",null,null,null,null,null,null,null,{"$f":"IF(I27=\"\",0,(I27*-50000)-200000)","v":0},null,{"$f":"IF(K27=\"\",0,(K27*-50000)-200000)","v":0},null,{"$f":"IF(M27=\"\",0,(M27*-50000)-200000)","v":0},null,{"$f":"IF(O27=\"\",0,(O27*-50000)-200000)","v":0},null,{"$f":"IF(Q27=\"\",0,(Q27*-50000)-200000)","v":0},null,{"$f":"IF(S27=\"\",0,(S27*-50000)-200000)","v":0},null,{"$f":"IF(U27=\"\",0,(U27*-50000)-200000)","v":0},null,{"$f":"IF(W27=\"\",0,(W27*-50000)-200000)","v":0},null,{"$f":"IF(Y27=\"\",0,(Y27*-50000)-200000)","v":0},null,{"$f":"IF(AA27=\"\",0,(AA27*-50000)-200000)","v":0},null,{"$f":"IF(AC27=\"\",0,(AC27*-50000)-200000)","v":0},null,{"$f":"IF(AE27=\"\",0,(AE27*-50000)-200000)","v":0},null,{"$f":"IF(AG27=\"\",0,(AG27*-50000)-200000)","v":0},null,{"$f":"IF(AI27=\"\",0,(AI27*-50000)-200000)","v":0},null,{"$f":"IF(AK27=\"\",0,(AK27*-50000)-200000)","v":0},null,{"$f":"IF(AM27=\"\",0,(AM27*-50000)-200000)","v":0},null,{"$f":"IF(AO27=\"\",0,(AO27*-50000)-200000)","v":0}]
["Gains des Coupes",null,null,null,null,null,null,null,null,null,{"$f":"LOOKUP(K28,Tables!$X$60:$X$61,Tables!$AD$60:$AD$61)","v":0},null,null,null,null,null,{"$f":"LOOKUP(Q28,Tables!$X$60:$X$61,Tables!$AD$60:$AD$61)","v":0},null,null,null,null,null,{"$f":"LOOKUP(W28,Tables!$X$60:$X$61,Tables!$AD$60:$AD$61)","v":0},null,null,null,null,null,{"$f":"LOOKUP(AC28,Tables!$X$60:$X$61,Tables!$AD$60:$AD$61)","v":0},null,null,null,null,null,{"$f":"LOOKUP(AI28,Tables!$X$60:$X$61,Tables!$AD$60:$AD$61)","v":0},null,null,null,null,null,{"$f":"LOOKUP(AO28,Tables!$X$60:$X$61,Tables!$AD$60:$AD$61)","v":0}]
["Balance Avant Race",null,null,null,null,null,null,null,{"$f":"SUM(I33:J40)+I32","v":61460114},null,{"$f":"SUM(K33:L40)+K32","v":61460114},null,{"$f":"SUM(M33:N40)+M32","v":61460114},null,{"$f":"SUM(O33:P40)+O32","v":61460114},null,{"$f":"SUM(Q33:R40)+Q32","v":61460114},null,{"$f":"SUM(S33:T40)+S32","v":61460114},null,{"$f":"SUM(U33:V40)+U32","v":61460114},null,{"$f":"SUM(W33:X40)+W32","v":61460114},null,{"$f":"SUM(Y33:Z40)+Y32","v":61460114},null,{"$f":"SUM(AA33:AB40)+AA32","v":61460114},null,{"$f":"SUM(AC33:AD40)+AC32","v":61460114},null,{"$f":"SUM(AE33:AF40)+AE32","v":61460114},null,{"$f":"SUM(AG33:AH40)+AG32","v":61460114},null,{"$f":"SUM(AI33:AJ40)+AI32","v":61460114},null,{"$f":"SUM(AK33:AL40)+AK32","v":61460114},null,{"$f":"SUM(AM33:AN40)+AM32","v":61460114},null,{"$f":"SUM(AO33:AP40)+AO32","v":61460114}]
["Gains",null,null,null,null,null,null,null,{"$f":"+SUM(I43:J46)","v":0},null,{"$f":"+SUM(K43:L46)","v":0},null,{"$f":"+SUM(M43:N46)","v":0},null,{"$f":"+SUM(O43:P46)","v":0},null,{"$f":"+SUM(Q43:R46)","v":0},null,{"$f":"+SUM(S43:T46)","v":0},null,{"$f":"+SUM(U43:V46)","v":0},null,{"$f":"+SUM(W43:X46)","v":0},null,{"$f":"+SUM(Y43:Z46)","v":0},null,{"$f":"+SUM(AA43:AB46)","v":0},null,{"$f":"+SUM(AC43:AD46)","v":0},null,{"$f":"+SUM(AE43:AF46)","v":0},null,{"$f":"+SUM(AG43:AH46)","v":0},null,{"$f":"+SUM(AI43:AJ46)","v":0},null,{"$f":"+SUM(AK43:AL46)","v":0},null,{"$f":"+SUM(AM43:AN46)","v":0},null,{"$f":"+SUM(AO43:AP46)","v":0}]
["Position en Course",null,null,null,null,null,null,null,{"$f":"LOOKUP(K5,Tables!Q19:Q59,Tables!W19:W58)","v":0},null,{"$f":"LOOKUP(K6,Tables!Q19:Q59,Tables!W19:W58)","v":0},null,{"$f":"LOOKUP(K7,Tables!Q19:Q59,Tables!W19:W58)","v":0},null,{"$f":"LOOKUP(K8,Tables!Q19:Q59,Tables!W19:W58)","v":0},null,{"$f":"LOOKUP(K9,Tables!Q19:Q59,Tables!W19:W58)","v":0},null,{"$f":"LOOKUP(K10,Tables!Q19:Q59,Tables!W19:W58)","v":0},null,{"$f":"LOOKUP(K11,Tables!Q19:Q59,Tables!W19:W58)","v":0},null,{"$f":"LOOKUP(K12,Tables!Q19:Q59,Tables!W19:W58)","v":0},null,{"$f":"LOOKUP(K13,Tables!Q19:Q59,Tables!W19:W58)","v":0},null,{"$f":"LOOKUP(K14,Tables!Q19:Q59,Tables!W19:W58)","v":0},null,{"$f":"LOOKUP(K15,Tables!Q19:Q59,Tables!W19:W58)","v":0},null,{"$f":"LOOKUP(K16,Tables!Q19:Q59,Tables!W19:W58)","v":0},null,{"$f":"LOOKUP(K17,Tables!Q19:Q59,Tables!W19:W58)","v":0},null,{"$f":"LOOKUP(K18,Tables!Q19:Q59,Tables!W19:W58)","v":0},null,{"$f":"LOOKUP(K19,Tables!Q19:Q59,Tables!W19:W58)","v":0},null,{"$f":"LOOKUP(K20,Tables!Q19:Q59,Tables!W19:W58)","v":0},null,{"$f":"LOOKUP(K21,Tables!Q19:Q59,Tables!W19:W58)","v":0}]
["Position en Qualif",null,null,null,null,null,null,null,{"$f":"LOOKUP(L5,Tables!X19:X59,Tables!AD19:AD59)","v":0},null,{"$f":"LOOKUP(L6,Tables!X19:X59,Tables!AD19:AD59)","v":0},null,{"$f":"LOOKUP(L7,Tables!X19:X59,Tables!AD19:AD59)","v":0},null,{"$f":"LOOKUP(L8,Tables!X19:X59,Tables!AD19:AD59)","v":0},null,{"$f":"LOOKUP(L9,Tables!X19:X59,Tables!AD19:AD59)","v":0},null,{"$f":"LOOKUP(L10,Tables!X19:X59,Tables!AD19:AD59)","v":0},null,{"$f":"LOOKUP(L11,Tables!X19:X59,Tables!AD19:AD59)","v":0},null,{"$f":"LOOKUP(L12,Tables!X19:X59,Tables!AD19:AD59)","v":0},null,{"$f":"LOOKUP(L13,Tables!X19:X59,Tables!AD19:AD59)","v":0},null,{"$f":"LOOKUP(L14,Tables!X19:X59,Tables!AD19:AD59)","v":0},null,{"$f":"LOOKUP(L15,Tables!X19:X59,Tables!AD19:AD59)","v":0},null,{"$f":"LOOKUP(L16,Tables!X19:X59,Tables!AD19:AD59)","v":0},null,{"$f":"LOOKUP(L17,Tables!X19:X59,Tables!AD19:AD59)","v":0},null,{"$f":"LOOKUP(L18,Tables!X19:X59,Tables!AD19:AD59)","v":0},null,{"$f":"LOOKUP(L19,Tables!X19:X59,Tables!AD19:AD59)","v":0},null,{"$f":"LOOKUP(L20,Tables!X19:X59,Tables!AD19:AD59)","v":0},null,{"$f":"LOOKUP(L21,Tables!X19:X59,Tables!AD19:AD59)","v":0}]
["Tour du pilote le plus rapide:",null,null,null,null,null,null,null,{"$f":"IF(I$27=\"\",0,(VLOOKUP($A$45,'CR DE COURSE'!$O$21:$T$28,5)))","v":0},null,{"$f":"IF(K$27=\"\",0,(VLOOKUP($A$45,'CR DE COURSE'!$O$21:$T$28,5)))","v":0},null,{"$f":"IF(M$27=\"\",0,(VLOOKUP($A$45,'CR DE COURSE'!$O$21:$T$28,5)))","v":0},null,{"$f":"IF(O$27=\"\",0,(VLOOKUP($A$45,'CR DE COURSE'!$O$21:$T$28,5)))","v":0},null,{"$f":"IF(Q$27=\"\",0,(VLOOKUP($A$45,'CR DE COURSE'!$O$21:$T$28,5)))","v":0},null,{"$f":"IF(S$27=\"\",0,(VLOOKUP($A$45,'CR DE COURSE'!$O$21:$T$28,5)))","v":0},null,{"$f":"IF(U$27=\"\",0,(VLOOKUP($A$45,'CR DE COURSE'!$O$21:$T$28,5)))","v":0},null,{"$f":"IF(W$27=\"\",0,(VLOOKUP($A$45,'CR DE COURSE'!$O$21:$T$28,5)))","v":0},null,{"$f":"IF(Y$27=\"\",0,(VLOOKUP($A$45,'CR DE COURSE'!$O$21:$T$28,5)))","v":0},null,{"$f":"IF(AA$27=\"\",0,(VLOOKUP($A$45,'CR DE COURSE'!$O$21:$T$28,5)))","v":0},null,{"$f":"IF(AC$27=\"\",0,(VLOOKUP($A$45,'CR DE COURSE'!$O$21:$T$28,5)))","v":0},null,{"$f":"IF(AE$27=\"\",0,(VLOOKUP($A$45,'CR DE COURSE'!$O$21:$T$28,5)))","v":0},null,{"$f":"IF(AG$27=\"\",0,(VLOOKUP($A$45,'CR DE COURSE'!$O$21:$T$28,5)))","v":0},null,{"$f":"IF(AI$27=\"\",0,(VLOOKUP($A$45,'CR DE COURSE'!$O$21:$T$28,5)))","v":0},null,{"$f":"IF(AK$27=\"\",0,(VLOOKUP($A$45,'CR DE COURSE'!$O$21:$T$28,5)))","v":0},null,{"$f":"IF(AM$27=\"\",0,(VLOOKUP($A$45,'CR DE COURSE'!$O$21:$T$28,5)))","v":0},null,{"$f":"IF(AO$27=\"\",0,(VLOOKUP($A$45,'CR DE COURSE'!$O$21:$T$28,5)))","v":0},null,{"$f":"IF(AQ$27=\"\",0,(VLOOKUP($A$45,'CR DE COURSE'!$O$21:$T$28,5)))","v":0}]
["Gains par sponsor:",null,null,null,null,null,null,null,{"$f":"IF(I$27=\"\",0,(VLOOKUP($A46,'CR DE COURSE'!$O$21:$T$28,5)))","v":0},null,{"$f":"IF(K$27=\"\",0,(VLOOKUP($A46,'CR DE COURSE'!$O$21:$T$28,5)))","v":0},null,{"$f":"IF(M$27=\"\",0,(VLOOKUP($A46,'CR DE COURSE'!$O$21:$T$28,5)))","v":0},null,{"$f":"IF(O$27=\"\",0,(VLOOKUP($A46,'CR DE COURSE'!$O$21:$T$28,5)))","v":0},null,{"$f":"IF(Q$27=\"\",0,(VLOOKUP($A46,'CR DE COURSE'!$O$21:$T$28,5)))","v":0},null,{"$f":"IF(S$27=\"\",0,(VLOOKUP($A46,'CR DE COURSE'!$O$21:$T$28,5)))","v":0},null,{"$f":"IF(U$27=\"\",0,(VLOOKUP($A46,'CR DE COURSE'!$O$21:$T$28,5)))","v":0},null,{"$f":"IF(W$27=\"\",0,(VLOOKUP($A46,'CR DE COURSE'!$O$21:$T$28,5)))","v":0},null,{"$f":"IF(Y$27=\"\",0,(VLOOKUP($A46,'CR DE COURSE'!$O$21:$T$28,5)))","v":0},null,{"$f":"IF(AA$27=\"\",0,(VLOOKUP($A46,'CR DE COURSE'!$O$21:$T$28,5)))","v":0},null,{"$f":"IF(AC$27=\"\",0,(VLOOKUP($A46,'CR DE COURSE'!$O$21:$T$28,5)))","v":0},null,{"$f":"IF(AE$27=\"\",0,(VLOOKUP($A46,'CR DE COURSE'!$O$21:$T$28,5)))","v":0},null,{"$f":"IF(AG$27=\"\",0,(VLOOKUP($A46,'CR DE COURSE'!$O$21:$T$28,5)))","v":0},null,{"$f":"IF(AI$27=\"\",0,(VLOOKUP($A46,'CR DE COURSE'!$O$21:$T$28,5)))","v":0},null,{"$f":"IF(AK$27=\"\",0,(VLOOKUP($A46,'CR DE COURSE'!$O$21:$T$28,5)))","v":0},null,{"$f":"IF(AM$27=\"\",0,(VLOOKUP($A46,'CR DE COURSE'!$O$21:$T$28,5)))","v":0},null,{"$f":"IF(AO$27=\"\",0,(VLOOKUP($A46,'CR DE COURSE'!$O$21:$T$28,5)))","v":0},null,{"$f":"IF(AQ$27=\"\",0,(VLOOKUP($A46,'CR DE COURSE'!$O$21:$T$28,5)))","v":0}]
["Couts",null,null,null,null,null,null,null,{"$f":"SUM(I48:J54)","v":0},null,{"$f":"SUM(K48:L54)","v":0},null,{"$f":"SUM(M48:N54)","v":0},null,{"$f":"SUM(O48:P54)","v":0},null,{"$f":"SUM(Q48:R54)","v":0},null,{"$f":"SUM(S48:T54)","v":0},null,{"$f":"SUM(U48:V54)","v":0},null,{"$f":"SUM(W48:X54)","v":0},null,{"$f":"SUM(Y48:Z54)","v":0},null,{"$f":"SUM(AA48:AB54)","v":0},null,{"$f":"SUM(AC48:AD54)","v":0},null,{"$f":"SUM(AE48:AF54)","v":0},null,{"$f":"SUM(AG48:AH54)","v":0},null,{"$f":"SUM(AI48:AJ54)","v":0},null,{"$f":"SUM(AK48:AL54)","v":0},null,{"$f":"SUM(AM48:AN54)","v":0},null,{"$f":"SUM(AO48:AP54)","v":0},null,{"$f":"SUM(AQ48:AR54)","v":0}]
["Salaire du pilote:",null,null,null,null,null,null,null,{"$f":"IF(I$27=\"\",0,(VLOOKUP($A48,'CR DE COURSE'!$O$21:$T$28,5)))","v":0},null,{"$f":"IF(K$27=\"\",0,(VLOOKUP($A48,'CR DE COURSE'!$O$21:$T$28,5)))","v":0},null,{"$f":"IF(M$27=\"\",0,(VLOOKUP($A48,'CR DE COURSE'!$O$21:$T$28,5)))","v":0},null,{"$f":"IF(O$27=\"\",0,(VLOOKUP($A48,'CR DE COURSE'!$O$21:$T$28,5)))","v":0},null,{"$f":"IF(Q$27=\"\",0,(VLOOKUP($A48,'CR DE COURSE'!$O$21:$T$28,5)))","v":0},null,{"$f":"IF(S$27=\"\",0,(VLOOKUP($A48,'CR DE COURSE'!$O$21:$T$28,5)))","v":0},null,{"$f":"IF(U$27=\"\",0,(VLOOKUP($A48,'CR DE COURSE'!$O$21:$T$28,5)))","v":0},null,{"$f":"IF(W$27=\"\",0,(VLOOKUP($A48,'CR DE COURSE'!$O$21:$T$28,5)))","v":0},null,{"$f":"IF(Y$27=\"\",0,(VLOOKUP($A48,'CR DE COURSE'!$O$21:$T$28,5)))","v":0},null,{"$f":"IF(AA$27=\"\",0,(VLOOKUP($A48,'CR DE COURSE'!$O$21:$T$28,5)))","v":0},null,{"$f":"IF(AC$27=\"\",0,(VLOOKUP($A48,'CR DE COURSE'!$O$21:$T$28,5)))","v":0},null,{"$f":"IF(AE$27=\"\",0,(VLOOKUP($A48,'CR DE COURSE'!$O$21:$T$28,5)))","v":0},null,{"$f":"IF(AG$27=\"\",0,(VLOOKUP($A48,'CR DE COURSE'!$O$21:$T$28,5)))","v":0},null,{"$f":"IF(AI$27=\"\",0,(VLOOKUP($A48,'CR DE COURSE'!$O$21:$T$28,5)))","v":0},null,{"$f":"IF(AK$27=\"\",0,(VLOOKUP($A48,'CR DE COURSE'!$O$21:$T$28,5)))","v":0},null,{"$f":"IF(AM$27=\"\",0,(VLOOKUP($A48,'CR DE COURSE'!$O$21:$T$28,5)))","v":0},null,{"$f":"IF(AO$27=\"\",0,(VLOOKUP($A48,'CR DE COURSE'!$O$21:$T$28,5)))","v":0},null,{"$f":"IF(AQ$27=\"\",0,(VLOOKUP($A48,'CR DE COURSE'!$O$21:$T$28,5)))","v":0}]
["Salaire du DT :",null,null,null,null,null,null,null,{"$f":"IF(I$27=\"\",0,(VLOOKUP($A49,'CR DE COURSE'!$O$21:$T$28,5)))","v":0},null,{"$f":"IF(K$27=\"\",0,(VLOOKUP($A49,'CR DE COURSE'!$O$21:$T$28,5)))","v":0},null,{"$f":"IF(M$27=\"\",0,(VLOOKUP($A49,'CR DE COURSE'!$O$21:$T$28,5)))","v":0},null,{"$f":"IF(O$27=\"\",0,(VLOOKUP($A49,'CR DE COURSE'!$O$21:$T$28,5)))","v":0},null,{"$f":"IF(Q$27=\"\",0,(VLOOKUP($A49,'CR DE COURSE'!$O$21:$T$28,5)))","v":0},null,{"$f":"IF(S$27=\"\",0,(VLOOKUP($A49,'CR DE COURSE'!$O$21:$T$28,5)))","v":0},null,{"$f":"IF(U$27=\"\",0,(VLOOKUP($A49,'CR DE COURSE'!$O$21:$T$28,5)))","v":0},null,{"$f":"IF(W$27=\"\",0,(VLOOKUP($A49,'CR DE COURSE'!$O$21:$T$28,5)))","v":0},null,{"$f":"IF(Y$27=\"\",0,(VLOOKUP($A49,'CR DE COURSE'!$O$21:$T$28,5)))","v":0},null,{"$f":"IF(AA$27=\"\",0,(VLOOKUP($A49,'CR DE COURSE'!$O$21:$T$28,5)))","v":0},null,{"$f":"IF(AC$27=\"\",0,(VLOOKUP($A49,'CR DE COURSE'!$O$21:$T$28,5)))","v":0},null,{"$f":"IF(AE$27=\"\",0,(VLOOKUP($A49,'CR DE COURSE'!$O$21:$T$28,5)))","v":0},null,{"$f":"IF(AG$27=\"\",0,(VLOOKUP($A49,'CR DE COURSE'!$O$21:$T$28,5)))","v":0},null,{"$f":"IF(AI$27=\"\",0,(VLOOKUP($A49,'CR DE COURSE'!$O$21:$T$28,5)))","v":0},null,{"$f":"IF(AK$27=\"\",0,(VLOOKUP($A49,'CR DE COURSE'!$O$21:$T$28,5)))","v":0},null,{"$f":"IF(AM$27=\"\",0,(VLOOKUP($A49,'CR DE COURSE'!$O$21:$T$28,5)))","v":0},null,{"$f":"IF(AO$27=\"\",0,(VLOOKUP($A49,'CR DE COURSE'!$O$21:$T$28,5)))","v":0},null,{"$f":"IF(AQ$27=\"\",0,(VLOOKUP($A49,'CR DE COURSE'!$O$21:$T$28,5)))","v":0}]
["Bonus points (pilote):",null,null,null,null,null,null,null,{"$f":"IF(I$27=\"\",0,(VLOOKUP($A50,'CR DE COURSE'!$O$21:$T$28,5)))","v":0},null,{"$f":"IF(K$27=\"\",0,(VLOOKUP($A50,'CR DE COURSE'!$O$21:$T$28,5)))","v":0},null,{"$f":"IF(M$27=\"\",0,(VLOOKUP($A50,'CR DE COURSE'!$O$21:$T$28,5)))","v":0},null,{"$f":"IF(O$27=\"\",0,(VLOOKUP($A50,'CR DE COURSE'!$O$21:$T$28,5)))","v":0},null,{"$f":"IF(Q$27=\"\",0,(VLOOKUP($A50,'CR DE COURSE'!$O$21:$T$28,5)))","v":0},null,{"$f":"IF(S$27=\"\",0,(VLOOKUP($A50,'CR DE COURSE'!$O$21:$T$28,5)))","v":0},null,{"$f":"IF(U$27=\"\",0,(VLOOKUP($A50,'CR DE COURSE'!$O$21:$T$28,5)))","v":0},null,{"$f":"IF(W$27=\"\",0,(VLOOKUP($A50,'CR DE COURSE'!$O$21:$T$28,5)))","v":0},null,{"$f":"IF(Y$27=\"\",0,(VLOOKUP($A50,'CR DE COURSE'!$O$21:$T$28,5)))","v":0},null,{"$f":"IF(AA$27=\"\",0,(VLOOKUP($A50,'CR DE COURSE'!$O$21:$T$28,5)))","v":0},null,{"$f":"IF(AC$27=\"\",0,(VLOOKUP($A50,'CR DE COURSE'!$O$21:$T$28,5)))","v":0},null,{"$f":"IF(AE$27=\"\",0,(VLOOKUP($A50,'CR DE COURSE'!$O$21:$T$28,5)))","v":0},null,{"$f":"IF(AG$27=\"\",0,(VLOOKUP($A50,'CR DE COURSE'!$O$21:$T$28,5)))","v":0},null,{"$f":"IF(AI$27=\"\",0,(VLOOKUP($A50,'CR DE COURSE'!$O$21:$T$28,5)))","v":0},null,{"$f":"IF(AK$27=\"\",0,(VLOOKUP($A50,'CR DE COURSE'!$O$21:$T$28,5)))","v":0},null,{"$f":"IF(AM$27=\"\",0,(VLOOKUP($A50,'CR DE COURSE'!$O$21:$T$28,5)))","v":0},null,{"$f":"IF(AO$27=\"\",0,(VLOOKUP($A50,'CR DE COURSE'!$O$21:$T$28,5)))","v":0},null,{"$f":"IF(AQ$27=\"\",0,(VLOOKUP($A50,'CR DE COURSE'!$O$21:$T$28,5)))","v":0}]
["Bonus points pour le DT:",null,null,null,null,null,null,null,{"$f":"IF(I$27=\"\",0,(VLOOKUP($A51,'CR DE COURSE'!$O$21:$T$28,5)))","v":0},null,{"$f":"IF(K$27=\"\",0,(VLOOKUP($A51,'CR DE COURSE'!$O$21:$T$28,5)))","v":0},null,{"$f":"IF(M$27=\"\",0,(VLOOKUP($A51,'CR DE COURSE'!$O$21:$T$28,5)))","v":0},null,{"$f":"IF(O$27=\"\",0,(VLOOKUP($A51,'CR DE COURSE'!$O$21:$T$28,5)))","v":0},null,{"$f":"IF(Q$27=\"\",0,(VLOOKUP($A51,'CR DE COURSE'!$O$21:$T$28,5)))","v":0},null,{"$f":"IF(S$27=\"\",0,(VLOOKUP($A51,'CR DE COURSE'!$O$21:$T$28,5)))","v":0},null,{"$f":"IF(U$27=\"\",0,(VLOOKUP($A51,'CR DE COURSE'!$O$21:$T$28,5)))","v":0},null,{"$f":"IF(W$27=\"\",0,(VLOOKUP($A51,'CR DE COURSE'!$O$21:$T$28,5)))","v":0},null,{"$f":"IF(Y$27=\"\",0,(VLOOKUP($A51,'CR DE COURSE'!$O$21:$T$28,5)))","v":0},null,{"$f":"IF(AA$27=\"\",0,(VLOOKUP($A51,'CR DE COURSE'!$O$21:$T$28,5)))","v":0},null,{"$f":"IF(AC$27=\"\",0,(VLOOKUP($A51,'CR DE COURSE'!$O$21:$T$28,5)))","v":0},null,{"$f":"IF(AE$27=\"\",0,(VLOOKUP($A51,'CR DE COURSE'!$O$21:$T$28,5)))","v":0},null,{"$f":"IF(AG$27=\"\",0,(VLOOKUP($A51,'CR DE COURSE'!$O$21:$T$28,5)))","v":0},null,{"$f":"IF(AI$27=\"\",0,(VLOOKUP($A51,'CR DE COURSE'!$O$21:$T$28,5)))","v":0},null,{"$f":"IF(AK$27=\"\",0,(VLOOKUP($A51,'CR DE COURSE'!$O$21:$T$28,5)))","v":0},null,{"$f":"IF(AM$27=\"\",0,(VLOOKUP($A51,'CR DE COURSE'!$O$21:$T$28,5)))","v":0},null,{"$f":"IF(AO$27=\"\",0,(VLOOKUP($A51,'CR DE COURSE'!$O$21:$T$28,5)))","v":0},null,{"$f":"IF(AQ$27=\"\",0,(VLOOKUP($A51,'CR DE COURSE'!$O$21:$T$28,5)))","v":0}]
["Salaire du personnel:",null,null,null,null,null,null,null,{"$f":"IF(I$27=\"\",0,(VLOOKUP($A52,'CR DE COURSE'!$O$21:$T$28,5)))","v":0},null,{"$f":"IF(K$27=\"\",0,(VLOOKUP($A52,'CR DE COURSE'!$O$21:$T$28,5)))","v":0},null,{"$f":"IF(M$27=\"\",0,(VLOOKUP($A52,'CR DE COURSE'!$O$21:$T$28,5)))","v":0},null,{"$f":"IF(O$27=\"\",0,(VLOOKUP($A52,'CR DE COURSE'!$O$21:$T$28,5)))","v":0},null,{"$f":"IF(Q$27=\"\",0,(VLOOKUP($A52,'CR DE COURSE'!$O$21:$T$28,5)))","v":0},null,{"$f":"IF(S$27=\"\",0,(VLOOKUP($A52,'CR DE COURSE'!$O$21:$T$28,5)))","v":0},null,{"$f":"IF(U$27=\"\",0,(VLOOKUP($A52,'CR DE COURSE'!$O$21:$T$28,5)))","v":0},null,{"$f":"IF(W$27=\"\",0,(VLOOKUP($A52,'CR DE COURSE'!$O$21:$T$28,5)))","v":0},null,{"$f":"IF(Y$27=\"\",0,(VLOOKUP($A52,'CR DE COURSE'!$O$21:$T$28,5)))","v":0},null,{"$f":"IF(AA$27=\"\",0,(VLOOKUP($A52,'CR DE COURSE'!$O$21:$T$28,5)))","v":0},null,{"$f":"IF(AC$27=\"\",0,(VLOOKUP($A52,'CR DE COURSE'!$O$21:$T$28,5)))","v":0},null,{"$f":"IF(AE$27=\"\",0,(VLOOKUP($A52,'CR DE COURSE'!$O$21:$T$28,5)))","v":0},null,{"$f":"IF(AG$27=\"\",0,(VLOOKUP($A52,'CR DE COURSE'!$O$21:$T$28,5)))","v":0},null,{"$f":"IF(AI$27=\"\",0,(VLOOKUP($A52,'CR DE COURSE'!$O$21:$T$28,5)))","v":0},null,{"$f":"IF(AK$27=\"\",0,(VLOOKUP($A52,'CR DE COURSE'!$O$21:$T$28,5)))","v":0},null,{"$f":"IF(AM$27=\"\",0,(VLOOKUP($A52,'CR DE COURSE'!$O$21:$T$28,5)))","v":0},null,{"$f":"IF(AO$27=\"\",0,(VLOOKUP($A52,'CR DE COURSE'!$O$21:$T$28,5)))","v":0},null,{"$f":"IF(AQ$27=\"\",0,(VLOOKUP($A52,'CR DE COURSE'!$O$21:$T$28,5)))","v":0}]
["Coût des installations:",null,null,null,null,null,null,null,{"$f":"IF(I$27=\"\",0,(VLOOKUP($A53,'CR DE COURSE'!$O$21:$T$28,5)))","v":0},null,{"$f":"IF(K$27=\"\",0,(VLOOKUP($A53,'CR DE COURSE'!$O$21:$T$28,5)))","v":0},null,{"$f":"IF(M$27=\"\",0,(VLOOKUP($A53,'CR DE COURSE'!$O$21:$T$28,5)))","v":0},null,{"$f":"IF(O$27=\"\",0,(VLOOKUP($A53,'CR DE COURSE'!$O$21:$T$28,5)))","v":0},null,{"$f":"IF(Q$27=\"\",0,(VLOOKUP($A53,'CR DE COURSE'!$O$21:$T$28,5)))","v":0},null,{"$f":"IF(S$27=\"\",0,(VLOOKUP($A53,'CR DE COURSE'!$O$21:$T$28,5)))","v":0},null,{"$f":"IF(U$27=\"\",0,(VLOOKUP($A53,'CR DE COURSE'!$O$21:$T$28,5)))","v":0},null,{"$f":"IF(W$27=\"\",0,(VLOOKUP($A53,'CR DE COURSE'!$O$21:$T$28,5)))","v":0},null,{"$f":"IF(Y$27=\"\",0,(VLOOKUP($A53,'CR DE COURSE'!$O$21:$T$28,5)))","v":0},null,{"$f":"IF(AA$27=\"\",0,(VLOOKUP($A53,'CR DE COURSE'!$O$21:$T$28,5)))","v":0},null,{"$f":"IF(AC$27=\"\",0,(VLOOKUP($A53,'CR DE COURSE'!$O$21:$T$28,5)))","v":0},null,{"$f":"IF(AE$27=\"\",0,(VLOOKUP($A53,'CR DE COURSE'!$O$21:$T$28,5)))","v":0},null,{"$f":"IF(AG$27=\"\",0,(VLOOKUP($A53,'CR DE COURSE'!$O$21:$T$28,5)))","v":0},null,{"$f":"IF(AI$27=\"\",0,(VLOOKUP($A53,'CR DE COURSE'!$O$21:$T$28,5)))","v":0},null,{"$f":"IF(AK$27=\"\",0,(VLOOKUP($A53,'CR DE COURSE'!$O$21:$T$28,5)))","v":0},null,{"$f":"IF(AM$27=\"\",0,(VLOOKUP($A53,'CR DE COURSE'!$O$21:$T$28,5)))","v":0},null,{"$f":"IF(AO$27=\"\",0,(VLOOKUP($A53,'CR DE COURSE'!$O$21:$T$28,5)))","v":0},null,{"$f":"IF(AQ$27=\"\",0,(VLOOKUP($A53,'CR DE COURSE'!$O$21:$T$28,5)))","v":0}]
["Cout des Pneumatques",null,null,null,null,null,null,null,{"$f":"IF(I27>0,-LOOKUP('Tyre&Fuel'!$C$10,'Setup&WS'!$J$31:$J$39,'Setup&WS'!$M$31:$M$39),0)","v":0},null,{"$f":"IF(K27>0,-LOOKUP('Tyre&Fuel'!$C$10,'Setup&WS'!$J$31:$J$39,'Setup&WS'!$M$31:$M$39),0)","v":0},null,{"$f":"IF(M27>0,-LOOKUP('Tyre&Fuel'!$C$10,'Setup&WS'!$J$31:$J$39,'Setup&WS'!$M$31:$M$39),0)","v":0},null,{"$f":"IF(O27>0,-LOOKUP('Tyre&Fuel'!$C$10,'Setup&WS'!$J$31:$J$39,'Setup&WS'!$M$31:$M$39),0)","v":0},null,{"$f":"IF(Q27>0,-LOOKUP('Tyre&Fuel'!$C$10,'Setup&WS'!$J$31:$J$39,'Setup&WS'!$M$31:$M$39),0)","v":0},null,{"$f":"IF(S27>0,-LOOKUP('Tyre&Fuel'!$C$10,'Setup&WS'!$J$31:$J$39,'Setup&WS'!$M$31:$M$39),0)","v":0},null,{"$f":"IF(U27>0,-LOOKUP('Tyre&Fuel'!$C$10,'Setup&WS'!$J$31:$J$39,'Setup&WS'!$M$31:$M$39),0)","v":0},null,{"$f":"IF(W27>0,-LOOKUP('Tyre&Fuel'!$C$10,'Setup&WS'!$J$31:$J$39,'Setup&WS'!$M$31:$M$39),0)","v":0},null,{"$f":"IF(Y27>0,-LOOKUP('Tyre&Fuel'!$C$10,'Setup&WS'!$J$31:$J$39,'Setup&WS'!$M$31:$M$39),0)","v":0},null,{"$f":"IF(AA27>0,-LOOKUP('Tyre&Fuel'!$C$10,'Setup&WS'!$J$31:$J$39,'Setup&WS'!$M$31:$M$39),0)","v":0},null,{"$f":"IF(AC27>0,-LOOKUP('Tyre&Fuel'!$C$10,'Setup&WS'!$J$31:$J$39,'Setup&WS'!$M$31:$M$39),0)","v":0},null,{"$f":"IF(AE27>0,-LOOKUP('Tyre&Fuel'!$C$10,'Setup&WS'!$J$31:$J$39,'Setup&WS'!$M$31:$M$39),0)","v":0},null,{"$f":"IF(AG27>0,-LOOKUP('Tyre&Fuel'!$C$10,'Setup&WS'!$J$31:$J$39,'Setup&WS'!$M$31:$M$39),0)","v":0},null,{"$f":"IF(AI27>0,-LOOKUP('Tyre&Fuel'!$C$10,'Setup&WS'!$J$31:$J$39,'Setup&WS'!$M$31:$M$39),0)","v":0},null,{"$f":"IF(AK27>0,-LOOKUP('Tyre&Fuel'!$C$10,'Setup&WS'!$J$31:$J$39,'Setup&WS'!$M$31:$M$39),0)","v":0},null,{"$f":"IF(AM27>0,-LOOKUP('Tyre&Fuel'!$C$10,'Setup&WS'!$J$31:$J$39,'Setup&WS'!$M$31:$M$39),0)","v":0},null,{"$f":"IF(AO27>0,-LOOKUP('Tyre&Fuel'!$C$10,'Setup&WS'!$J$31:$J$39,'Setup&WS'!$M$31:$M$39),0)","v":0},null,{"$f":"IF(AQ27>0,-LOOKUP('Tyre&Fuel'!$C$10,'Setup&WS'!$J$31:$J$39,'Setup&WS'!$M$31:$M$39),0)","v":0}]
["Balance  Définitive",null,null,null,null,null,null,null,{"$f":"+I41+I42+I47","v":61460114},null,{"$f":"+K41+K42+K47","v":61460114},null,{"$f":"+M41+M42+M47","v":61460114},null,{"$f":"+O41+O42+O47","v":61460114},null,{"$f":"+Q41+Q42+Q47","v":61460114},null,{"$f":"+S41+S42+S47","v":61460114},null,{"$f":"+U41+U42+U47","v":61460114},null,{"$f":"+W41+W42+W47","v":61460114},null,{"$f":"+Y41+Y42+Y47","v":61460114},null,{"$f":"+AA41+AA42+AA47","v":61460114},null,{"$f":"+AC41+AC42+AC47","v":61460114},null,{"$f":"+AE41+AE42+AE47","v":61460114},null,{"$f":"+AG41+AG42+AG47","v":61460114},null,{"$f":"+AI41+AI42+AI47","v":61460114},null,{"$f":"+AK41+AK42+AK47","v":61460114},null,{"$f":"+AM41+AM42+AM47","v":61460114},null,{"$f":"+AO41+AO42+AO47","v":61460114}]
[]
[]
["Caisse",null,null,null,null,null,null,null,"RISK","Chassis","Engine","Front wing","Rear wing","Underbody","Sidepods","Cooling","Gearbox","Brakes","Suspension","Electronics",null,"Chassis","Engine","Front wing","Rear wing","Underbody","Sidepods","Cooling","Gearbox","Brakes","Suspension","Electronics"]
[null,null,null,null,null,null,"Level",null,null,6,6,6,6,6,6,6,6,6,6,6]
["A1-Ring",null,null,null,null,null,"Usure ",null,{"$f":"+I5","v":0},{"$f":"VLOOKUP(A60,Tracks!$A$3:$AP$889,32,0)*VLOOKUP($J$59,Tables!$B$94:$C$102,2,0)^I60*Tables!$B$91","v":14.368844621047279},{"$f":"VLOOKUP(A60,Tracks!$A$3:$AP$889,33,0)*VLOOKUP($K$59,Tables!$B$94:$C$102,2,0)^I60*Tables!$B$91","v":26.873954248411263},{"$f":"VLOOKUP(A60,Tracks!$A$3:$AP$889,34,0)*VLOOKUP($L$59,Tables!$B$94:$C$102,2,0)^I60*Tables!$B$91","v":10.214321467147661},{"$f":"VLOOKUP(A60,Tracks!$A$3:$AP$889,35,0)*VLOOKUP($M$59,Tables!$B$94:$C$102,2,0)^I60*Tables!$B$91","v":10.737626237051126},{"$f":"VLOOKUP(A60,Tracks!$A$3:$AP$889,36,0)*VLOOKUP($N$59,Tables!$B$94:$C$102,2,0)^I60*Tables!$B$91","v":10.611485977897241},{"$f":"VLOOKUP(A60,Tracks!$A$3:$AP$889,37,0)*VLOOKUP($O$59,Tables!$B$94:$C$102,2,0)^I60*Tables!$B$91","v":12.211288943391082},{"$f":"VLOOKUP(A60,Tracks!$A$3:$AP$889,38,0)*VLOOKUP($P$59,Tables!$B$94:$C$102,2,0)^I60*Tables!$B$91","v":9.2594042442357267},{"$f":"VLOOKUP(A60,Tracks!$A$3:$AP$889,39,0)*VLOOKUP($Q$59,Tables!$B$94:$C$102,2,0)^I60*Tables!$B$91","v":18.000569592429592},{"$f":"VLOOKUP(A60,Tracks!$A$3:$AP$889,40,0)*VLOOKUP($R$59,Tables!$B$94:$C$102,2,0)^I60*Tables!$B$91","v":20.983862709526875},{"$f":"VLOOKUP(A60,Tracks!$A$3:$AP$889,41,0)*VLOOKUP($S$59,Tables!$B$94:$C$102,2,0)^I60*Tables!$B$91","v":13.606430604876211},{"$f":"VLOOKUP(A60,Tracks!$A$3:$AP$889,42,0)*VLOOKUP($T$59,Tables!$B$94:$C$102,2,0)^I60*Tables!$B$91","v":10.756876557725212},null,{"$f":"+J60","v":14.368844621047279},{"$f":"+K60","v":26.873954248411263},10.214321467147661,10.737626237051126,10.611485977897241,12.211288943391082,9.2594042442357267,18.000569592429592,20.983862709526875,13.606430604876211,10.756876557725212]
["Magny Cours",null,null,null,null,null,"Usure ",null,{"$f":"+I6","v":0},{"$f":"VLOOKUP(A61,Tracks!$A$3:$AP$889,32,0)*VLOOKUP($J$59,Tables!$B$94:$C$102,2,0)^I61*Tables!$B$91","v":11.885553254090087},{"$f":"VLOOKUP(A61,Tracks!$A$3:$AP$889,33,0)*VLOOKUP($K$59,Tables!$B$94:$C$102,2,0)^I61*Tables!$B$91","v":25.736158979095503},{"$f":"VLOOKUP(A61,Tracks!$A$3:$AP$889,34,0)*VLOOKUP($L$59,Tables!$B$94:$C$102,2,0)^I61*Tables!$B$91","v":14.752837859756692},{"$f":"VLOOKUP(A61,Tracks!$A$3:$AP$889,35,0)*VLOOKUP($M$59,Tables!$B$94:$C$102,2,0)^I61*Tables!$B$91","v":13.041585669307613},{"$f":"VLOOKUP(A61,Tracks!$A$3:$AP$889,36,0)*VLOOKUP($N$59,Tables!$B$94:$C$102,2,0)^I61*Tables!$B$91","v":13.894678827601352},{"$f":"VLOOKUP(A61,Tracks!$A$3:$AP$889,37,0)*VLOOKUP($O$59,Tables!$B$94:$C$102,2,0)^I61*Tables!$B$91","v":10.518780486229927},{"$f":"VLOOKUP(A61,Tracks!$A$3:$AP$889,38,0)*VLOOKUP($P$59,Tables!$B$94:$C$102,2,0)^I61*Tables!$B$91","v":10.763968781131455},{"$f":"VLOOKUP(A61,Tracks!$A$3:$AP$889,39,0)*VLOOKUP($Q$59,Tables!$B$94:$C$102,2,0)^I61*Tables!$B$91","v":17.648491359048268},{"$f":"VLOOKUP(A61,Tracks!$A$3:$AP$889,40,0)*VLOOKUP($R$59,Tables!$B$94:$C$102,2,0)^I61*Tables!$B$91","v":26.52643530150538},{"$f":"VLOOKUP(A61,Tracks!$A$3:$AP$889,41,0)*VLOOKUP($S$59,Tables!$B$94:$C$102,2,0)^I61*Tables!$B$91","v":20.1961193240478},{"$f":"VLOOKUP(A61,Tracks!$A$3:$AP$889,42,0)*VLOOKUP($T$59,Tables!$B$94:$C$102,2,0)^I61*Tables!$B$91","v":6.8348770140731165},null,{"$f":"+J61+V60","v":26.254397875137364},{"$f":"+K61+W60","v":52.610113227506766},24.967159326904351,23.779211906358739,24.506164805498592,22.730069429621011,20.023373025367182,35.649060951477864,47.510298011032255,33.802549928924009,17.591753571798328]
["Anderstorp",null,null,null,null,null,"Usure ",null,0,{"$f":"VLOOKUP(A62,Tracks!$A$3:$AP$889,32,0)*VLOOKUP($J$59,Tables!$B$94:$C$102,2,0)^I62*Tables!$B$91","v":12.186972748855393},{"$f":"VLOOKUP(A62,Tracks!$A$3:$AP$889,33,0)*VLOOKUP($K$59,Tables!$B$94:$C$102,2,0)^I62*Tables!$B$91","v":26.605969521132529},{"$f":"VLOOKUP(A62,Tracks!$A$3:$AP$889,34,0)*VLOOKUP($L$59,Tables!$B$94:$C$102,2,0)^I62*Tables!$B$91","v":9.6297196235188167},{"$f":"VLOOKUP(A62,Tracks!$A$3:$AP$889,35,0)*VLOOKUP($M$59,Tables!$B$94:$C$102,2,0)^I62*Tables!$B$91","v":8.9574781620842607},{"$f":"VLOOKUP(A62,Tracks!$A$3:$AP$889,36,0)*VLOOKUP($N$59,Tables!$B$94:$C$102,2,0)^I62*Tables!$B$91","v":21.116082017314685},{"$f":"VLOOKUP(A62,Tracks!$A$3:$AP$889,37,0)*VLOOKUP($O$59,Tables!$B$94:$C$102,2,0)^I62*Tables!$B$91","v":13.444829228691114},{"$f":"VLOOKUP(A62,Tracks!$A$3:$AP$889,38,0)*VLOOKUP($P$59,Tables!$B$94:$C$102,2,0)^I62*Tables!$B$91","v":7.3439973371640948},{"$f":"VLOOKUP(A62,Tracks!$A$3:$AP$889,39,0)*VLOOKUP($Q$59,Tables!$B$94:$C$102,2,0)^I62*Tables!$B$91","v":20.428642934295322},{"$f":"VLOOKUP(A62,Tracks!$A$3:$AP$889,40,0)*VLOOKUP($R$59,Tables!$B$94:$C$102,2,0)^I62*Tables!$B$91","v":26.260983511157448},{"$f":"VLOOKUP(A62,Tracks!$A$3:$AP$889,41,0)*VLOOKUP($S$59,Tables!$B$94:$C$102,2,0)^I62*Tables!$B$91","v":10.512701437596006},{"$f":"VLOOKUP(A62,Tracks!$A$3:$AP$889,42,0)*VLOOKUP($T$59,Tables!$B$94:$C$102,2,0)^I62*Tables!$B$91","v":6.1104570518640617},null,{"$f":"+J62+V61","v":38.441370623992754},{"$f":"+K62+W61","v":79.216082748639295},{"$f":"+L62+X61","v":34.596878950423168},{"$f":"+M62+Y61","v":32.736690068442996},{"$f":"+N62+Z61","v":45.622246822813281},{"$f":"+O62+AA61","v":36.174898658312124},{"$f":"+P62+AB61","v":27.367370362531275},{"$f":"+Q62+AC61","v":56.07770388577319},{"$f":"+R62+AD61","v":73.771281522189696},{"$f":"+S62+AE61","v":44.315251366520016},{"$f":"+T62+AF61","v":23.702210623662388}]
["Portimao",null,null,null,null,null,"Usure ",null,0,{"$f":"VLOOKUP(A63,Tracks!$A$3:$AP$889,32,0)*VLOOKUP($J$59,Tables!$B$94:$C$102,2,0)^I63*Tables!$B$91","v":12.261947682007099},{"$f":"VLOOKUP(A63,Tracks!$A$3:$AP$889,33,0)*VLOOKUP($K$59,Tables!$B$94:$C$102,2,0)^I63*Tables!$B$91","v":12.661645129687479},{"$f":"VLOOKUP(A63,Tracks!$A$3:$AP$889,34,0)*VLOOKUP($L$59,Tables!$B$94:$C$102,2,0)^I63*Tables!$B$91","v":12.246243473036133},{"$f":"VLOOKUP(A63,Tracks!$A$3:$AP$889,35,0)*VLOOKUP($M$59,Tables!$B$94:$C$102,2,0)^I63*Tables!$B$91","v":13.289306901139939},{"$f":"VLOOKUP(A63,Tracks!$A$3:$AP$889,36,0)*VLOOKUP($N$59,Tables!$B$94:$C$102,2,0)^I63*Tables!$B$91","v":22.949928355214524},{"$f":"VLOOKUP(A63,Tracks!$A$3:$AP$889,37,0)*VLOOKUP($O$59,Tables!$B$94:$C$102,2,0)^I63*Tables!$B$91","v":11.151001544157831},{"$f":"VLOOKUP(A63,Tracks!$A$3:$AP$889,38,0)*VLOOKUP($P$59,Tables!$B$94:$C$102,2,0)^I63*Tables!$B$91","v":10.854647923254126},{"$f":"VLOOKUP(A63,Tracks!$A$3:$AP$889,39,0)*VLOOKUP($Q$59,Tables!$B$94:$C$102,2,0)^I63*Tables!$B$91","v":11.653029643842565},{"$f":"VLOOKUP(A63,Tracks!$A$3:$AP$889,40,0)*VLOOKUP($R$59,Tables!$B$94:$C$102,2,0)^I63*Tables!$B$91","v":16.76804248190188},{"$f":"VLOOKUP(A63,Tracks!$A$3:$AP$889,41,0)*VLOOKUP($S$59,Tables!$B$94:$C$102,2,0)^I63*Tables!$B$91","v":24.688029677130096},{"$f":"VLOOKUP(A63,Tracks!$A$3:$AP$889,42,0)*VLOOKUP($T$59,Tables!$B$94:$C$102,2,0)^I63*Tables!$B$91","v":9.3298198909119918},null,50.703318305999851,91.877727878326766,46.843122423459299,46.025996969582934,68.572175178027805,47.325900202469953,38.222018285785403,67.730733529615748,90.539324004091583,69.003281043650105,33.03203051457438]
["Silverstone",null,null,null,null,null,"Usure ",null,0,{"$f":"VLOOKUP(A64,Tracks!$A$3:$AP$889,32,0)*VLOOKUP($J$59,Tables!$B$94:$C$102,2,0)^I64*Tables!$B$91","v":12.672790052183002},{"$f":"VLOOKUP(A64,Tracks!$A$3:$AP$889,33,0)*VLOOKUP($K$59,Tables!$B$94:$C$102,2,0)^I64*Tables!$B$91","v":28.489968010262228},{"$f":"VLOOKUP(A64,Tracks!$A$3:$AP$889,34,0)*VLOOKUP($L$59,Tables!$B$94:$C$102,2,0)^I64*Tables!$B$91","v":11.336412527492454},{"$f":"VLOOKUP(A64,Tracks!$A$3:$AP$889,35,0)*VLOOKUP($M$59,Tables!$B$94:$C$102,2,0)^I64*Tables!$B$91","v":13.616055765213254},{"$f":"VLOOKUP(A64,Tracks!$A$3:$AP$889,36,0)*VLOOKUP($N$59,Tables!$B$94:$C$102,2,0)^I64*Tables!$B$91","v":14.329330804926785},{"$f":"VLOOKUP(A64,Tracks!$A$3:$AP$889,37,0)*VLOOKUP($O$59,Tables!$B$94:$C$102,2,0)^I64*Tables!$B$91","v":8.6748024006068807},{"$f":"VLOOKUP(A64,Tracks!$A$3:$AP$889,38,0)*VLOOKUP($P$59,Tables!$B$94:$C$102,2,0)^I64*Tables!$B$91","v":8.310566069957714},{"$f":"VLOOKUP(A64,Tracks!$A$3:$AP$889,39,0)*VLOOKUP($Q$59,Tables!$B$94:$C$102,2,0)^I64*Tables!$B$91","v":19.039073734057954},{"$f":"VLOOKUP(A64,Tracks!$A$3:$AP$889,40,0)*VLOOKUP($R$59,Tables!$B$94:$C$102,2,0)^I64*Tables!$B$91","v":13.936725580652647},{"$f":"VLOOKUP(A64,Tracks!$A$3:$AP$889,41,0)*VLOOKUP($S$59,Tables!$B$94:$C$102,2,0)^I64*Tables!$B$91","v":11.277141803311714},{"$f":"VLOOKUP(A64,Tracks!$A$3:$AP$889,42,0)*VLOOKUP($T$59,Tables!$B$94:$C$102,2,0)^I64*Tables!$B$91","v":6.239130247948748},null,63.376108358182854,120.367695888589,58.179534950951755,59.642052734796188,82.901505982954589,56.000702603076832,46.532584355743118,86.769807263673698,104.47604958474423,80.280422846961812,39.271160762523131]
["Slovakiaring",null,null,null,null,null,"Usure ",null,0,{"$f":"VLOOKUP(A65,Tracks!$A$3:$AP$889,32,0)*VLOOKUP($J$59,Tables!$B$94:$C$102,2,0)^I65*Tables!$B$91","v":10.86629943313581},{"$f":"VLOOKUP(A65,Tracks!$A$3:$AP$889,33,0)*VLOOKUP($K$59,Tables!$B$94:$C$102,2,0)^I65*Tables!$B$91","v":25.142945149901934},{"$f":"VLOOKUP(A65,Tracks!$A$3:$AP$889,34,0)*VLOOKUP($L$59,Tables!$B$94:$C$102,2,0)^I65*Tables!$B$91","v":12.858201035517629},{"$f":"VLOOKUP(A65,Tracks!$A$3:$AP$889,35,0)*VLOOKUP($M$59,Tables!$B$94:$C$102,2,0)^I65*Tables!$B$91","v":14.600861643908638},{"$f":"VLOOKUP(A65,Tracks!$A$3:$AP$889,36,0)*VLOOKUP($N$59,Tables!$B$94:$C$102,2,0)^I65*Tables!$B$91","v":19.193076299450649},{"$f":"VLOOKUP(A65,Tracks!$A$3:$AP$889,37,0)*VLOOKUP($O$59,Tables!$B$94:$C$102,2,0)^I65*Tables!$B$91","v":9.471157771650681},{"$f":"VLOOKUP(A65,Tracks!$A$3:$AP$889,38,0)*VLOOKUP($P$59,Tables!$B$94:$C$102,2,0)^I65*Tables!$B$91","v":8.2097551801118378},{"$f":"VLOOKUP(A65,Tracks!$A$3:$AP$889,39,0)*VLOOKUP($Q$59,Tables!$B$94:$C$102,2,0)^I65*Tables!$B$91","v":23.083160837774656},{"$f":"VLOOKUP(A65,Tracks!$A$3:$AP$889,40,0)*VLOOKUP($R$59,Tables!$B$94:$C$102,2,0)^I65*Tables!$B$91","v":15.944837979391592},{"$f":"VLOOKUP(A65,Tracks!$A$3:$AP$889,41,0)*VLOOKUP($S$59,Tables!$B$94:$C$102,2,0)^I65*Tables!$B$91","v":19.960049602097161},{"$f":"VLOOKUP(A65,Tracks!$A$3:$AP$889,42,0)*VLOOKUP($T$59,Tables!$B$94:$C$102,2,0)^I65*Tables!$B$91","v":7.692529458842297},null,74.242407791318669,145.51064103849092,71.037735986469386,74.242914378704825,102.09458228240524,65.471860374727513,54.742339535854953,109.85296810144835,120.42088756413582,100.24047244905897,46.963690221365425]
["Istanbul",null,null,null,null,null,"Usure ",null,0,{"$f":"VLOOKUP(A66,Tracks!$A$3:$AP$889,32,0)*VLOOKUP($J$59,Tables!$B$94:$C$102,2,0)^I66*Tables!$B$91","v":13.828822467400528},{"$f":"VLOOKUP(A66,Tracks!$A$3:$AP$889,33,0)*VLOOKUP($K$59,Tables!$B$94:$C$102,2,0)^I66*Tables!$B$91","v":16.587190785042694},{"$f":"VLOOKUP(A66,Tracks!$A$3:$AP$889,34,0)*VLOOKUP($L$59,Tables!$B$94:$C$102,2,0)^I66*Tables!$B$91","v":8.760922256254112},{"$f":"VLOOKUP(A66,Tracks!$A$3:$AP$889,35,0)*VLOOKUP($M$59,Tables!$B$94:$C$102,2,0)^I66*Tables!$B$91","v":9.8288084662797672},{"$f":"VLOOKUP(A66,Tracks!$A$3:$AP$889,36,0)*VLOOKUP($N$59,Tables!$B$94:$C$102,2,0)^I66*Tables!$B$91","v":10.168728602393246},{"$f":"VLOOKUP(A66,Tracks!$A$3:$AP$889,37,0)*VLOOKUP($O$59,Tables!$B$94:$C$102,2,0)^I66*Tables!$B$91","v":10.559307477122744},{"$f":"VLOOKUP(A66,Tracks!$A$3:$AP$889,38,0)*VLOOKUP($P$59,Tables!$B$94:$C$102,2,0)^I66*Tables!$B$91","v":13.586167109429804},{"$f":"VLOOKUP(A66,Tracks!$A$3:$AP$889,39,0)*VLOOKUP($Q$59,Tables!$B$94:$C$102,2,0)^I66*Tables!$B$91","v":10.789804737825623},{"$f":"VLOOKUP(A66,Tracks!$A$3:$AP$889,40,0)*VLOOKUP($R$59,Tables!$B$94:$C$102,2,0)^I66*Tables!$B$91","v":22.672825054984909},{"$f":"VLOOKUP(A66,Tracks!$A$3:$AP$889,41,0)*VLOOKUP($S$59,Tables!$B$94:$C$102,2,0)^I66*Tables!$B$91","v":10.01219310006975},{"$f":"VLOOKUP(A66,Tracks!$A$3:$AP$889,42,0)*VLOOKUP($T$59,Tables!$B$94:$C$102,2,0)^I66*Tables!$B$91","v":8.6514993808435126},null,88.071230258719197,162.09783182353362,79.798658242723491,84.071722844984592,112.26331088479849,76.031167851850256,68.328506645284762,120.64277283927397,143.09371261912074,110.25266554912872,55.615189602208936]
["Grobnik",null,null,null,null,null,"Usure ",null,0,{"$f":"VLOOKUP(A67,Tracks!$A$3:$AP$889,32,0)*VLOOKUP($J$59,Tables!$B$94:$C$102,2,0)^I67*Tables!$B$91","v":15.513072511013684},{"$f":"VLOOKUP(A67,Tracks!$A$3:$AP$889,33,0)*VLOOKUP($K$59,Tables!$B$94:$C$102,2,0)^I67*Tables!$B$91","v":17.97881413218391},{"$f":"VLOOKUP(A67,Tracks!$A$3:$AP$889,34,0)*VLOOKUP($L$59,Tables!$B$94:$C$102,2,0)^I67*Tables!$B$91","v":11.099670862837248},{"$f":"VLOOKUP(A67,Tracks!$A$3:$AP$889,35,0)*VLOOKUP($M$59,Tables!$B$94:$C$102,2,0)^I67*Tables!$B$91","v":10.404970953737903},{"$f":"VLOOKUP(A67,Tracks!$A$3:$AP$889,36,0)*VLOOKUP($N$59,Tables!$B$94:$C$102,2,0)^I67*Tables!$B$91","v":11.642315190731207},{"$f":"VLOOKUP(A67,Tracks!$A$3:$AP$889,37,0)*VLOOKUP($O$59,Tables!$B$94:$C$102,2,0)^I67*Tables!$B$91","v":14.697474612947699},{"$f":"VLOOKUP(A67,Tracks!$A$3:$AP$889,38,0)*VLOOKUP($P$59,Tables!$B$94:$C$102,2,0)^I67*Tables!$B$91","v":13.255237080901637},{"$f":"VLOOKUP(A67,Tracks!$A$3:$AP$889,39,0)*VLOOKUP($Q$59,Tables!$B$94:$C$102,2,0)^I67*Tables!$B$91","v":18.241945492514578},{"$f":"VLOOKUP(A67,Tracks!$A$3:$AP$889,40,0)*VLOOKUP($R$59,Tables!$B$94:$C$102,2,0)^I67*Tables!$B$91","v":10.562951529053686},{"$f":"VLOOKUP(A67,Tracks!$A$3:$AP$889,41,0)*VLOOKUP($S$59,Tables!$B$94:$C$102,2,0)^I67*Tables!$B$91","v":21.00195814085459},{"$f":"VLOOKUP(A67,Tracks!$A$3:$AP$889,42,0)*VLOOKUP($T$59,Tables!$B$94:$C$102,2,0)^I67*Tables!$B$91","v":9.1068501290847301},null,103.58430276973289,180.07664595571754,90.898329105560734,94.476693798722494,123.9056260755297,90.728642464797957,81.583743726186398,138.88471833178855,153.65666414817443,131.2546236899833,64.722039731293663]
["Hockenheim",null,null,null,null,null,"Usure ",null,0,{"$f":"VLOOKUP(A68,Tracks!$A$3:$AP$889,32,0)*VLOOKUP($J$59,Tables!$B$94:$C$102,2,0)^I68*Tables!$B$91","v":14.974216547508691},{"$f":"VLOOKUP(A68,Tracks!$A$3:$AP$889,33,0)*VLOOKUP($K$59,Tables!$B$94:$C$102,2,0)^I68*Tables!$B$91","v":32.647530688478803},{"$f":"VLOOKUP(A68,Tracks!$A$3:$AP$889,34,0)*VLOOKUP($L$59,Tables!$B$94:$C$102,2,0)^I68*Tables!$B$91","v":10.679368687642704},{"$f":"VLOOKUP(A68,Tracks!$A$3:$AP$889,35,0)*VLOOKUP($M$59,Tables!$B$94:$C$102,2,0)^I68*Tables!$B$91","v":11.653536231228726},{"$f":"VLOOKUP(A68,Tracks!$A$3:$AP$889,36,0)*VLOOKUP($N$59,Tables!$B$94:$C$102,2,0)^I68*Tables!$B$91","v":12.110478053545206},{"$f":"VLOOKUP(A68,Tracks!$A$3:$AP$889,37,0)*VLOOKUP($O$59,Tables!$B$94:$C$102,2,0)^I68*Tables!$B$91","v":10.121109388094188},{"$f":"VLOOKUP(A68,Tracks!$A$3:$AP$889,38,0)*VLOOKUP($P$59,Tables!$B$94:$C$102,2,0)^I68*Tables!$B$91","v":10.433673805355019},{"$f":"VLOOKUP(A68,Tracks!$A$3:$AP$889,39,0)*VLOOKUP($Q$59,Tables!$B$94:$C$102,2,0)^I68*Tables!$B$91","v":18.604928344118683},{"$f":"VLOOKUP(A68,Tracks!$A$3:$AP$889,40,0)*VLOOKUP($R$59,Tables!$B$94:$C$102,2,0)^I68*Tables!$B$91","v":25.420048450131553},{"$f":"VLOOKUP(A68,Tracks!$A$3:$AP$889,41,0)*VLOOKUP($S$59,Tables!$B$94:$C$102,2,0)^I68*Tables!$B$91","v":13.245740385930164},{"$f":"VLOOKUP(A68,Tracks!$A$3:$AP$889,42,0)*VLOOKUP($T$59,Tables!$B$94:$C$102,2,0)^I68*Tables!$B$91","v":8.8916218018834368},null,118.55851931724158,212.72417664419635,101.57769779320344,106.13023002995122,136.0161041290749,100.84975185289214,92.017417531541412,157.48964667590724,179.07671259830599,144.50036407591347,73.613661533177094]
["Zolder",null,null,null,null,null,"Usure ",null,0,{"$f":"VLOOKUP(A69,Tracks!$A$3:$AP$889,32,0)*VLOOKUP($J$59,Tables!$B$94:$C$102,2,0)^I69*Tables!$B$91","v":8.8358971894058183},{"$f":"VLOOKUP(A69,Tracks!$A$3:$AP$889,33,0)*VLOOKUP($K$59,Tables!$B$94:$C$102,2,0)^I69*Tables!$B$91","v":11.578054710690859},{"$f":"VLOOKUP(A69,Tracks!$A$3:$AP$889,34,0)*VLOOKUP($L$59,Tables!$B$94:$C$102,2,0)^I69*Tables!$B$91","v":12.786772214069043},{"$f":"VLOOKUP(A69,Tracks!$A$3:$AP$889,35,0)*VLOOKUP($M$59,Tables!$B$94:$C$102,2,0)^I69*Tables!$B$91","v":11.540060656728846},{"$f":"VLOOKUP(A69,Tracks!$A$3:$AP$889,36,0)*VLOOKUP($N$59,Tables!$B$94:$C$102,2,0)^I69*Tables!$B$91","v":10.387574353214442},{"$f":"VLOOKUP(A69,Tracks!$A$3:$AP$889,37,0)*VLOOKUP($O$59,Tables!$B$94:$C$102,2,0)^I69*Tables!$B$91","v":11.554751690927493},{"$f":"VLOOKUP(A69,Tracks!$A$3:$AP$889,38,0)*VLOOKUP($P$59,Tables!$B$94:$C$102,2,0)^I69*Tables!$B$91","v":10.86528625836349},{"$f":"VLOOKUP(A69,Tracks!$A$3:$AP$889,39,0)*VLOOKUP($Q$59,Tables!$B$94:$C$102,2,0)^I69*Tables!$B$91","v":20.754378623596317},{"$f":"VLOOKUP(A69,Tracks!$A$3:$AP$889,40,0)*VLOOKUP($R$59,Tables!$B$94:$C$102,2,0)^I69*Tables!$B$91","v":14.701672533754515},{"$f":"VLOOKUP(A69,Tracks!$A$3:$AP$889,41,0)*VLOOKUP($S$59,Tables!$B$94:$C$102,2,0)^I69*Tables!$B$91","v":16.186986749976157},{"$f":"VLOOKUP(A69,Tracks!$A$3:$AP$889,42,0)*VLOOKUP($T$59,Tables!$B$94:$C$102,2,0)^I69*Tables!$B$91","v":9.3500833863583992},null,127.39441650664739,224.3022313548872,114.36447000727249,117.67029068668006,146.40367848228934,112.40450354381963,102.88270378990489,178.24402529950356,193.77838513206049,160.68735082588961,82.963744919535486]
["Hungaroring",null,null,null,null,null,"Usure ",null,0,{"$f":"VLOOKUP(A70,Tracks!$A$3:$AP$889,32,0)*VLOOKUP($J$59,Tables!$B$94:$C$102,2,0)^I70*Tables!$B$91","v":12.849082462566745},{"$f":"VLOOKUP(A70,Tracks!$A$3:$AP$889,33,0)*VLOOKUP($K$59,Tables!$B$94:$C$102,2,0)^I70*Tables!$B$91","v":19.587201285883268},{"$f":"VLOOKUP(A70,Tracks!$A$3:$AP$889,34,0)*VLOOKUP($L$59,Tables!$B$94:$C$102,2,0)^I70*Tables!$B$91","v":38.521918018392228},{"$f":"VLOOKUP(A70,Tracks!$A$3:$AP$889,35,0)*VLOOKUP($M$59,Tables!$B$94:$C$102,2,0)^I70*Tables!$B$91","v":35.091308239315502},{"$f":"VLOOKUP(A70,Tracks!$A$3:$AP$889,36,0)*VLOOKUP($N$59,Tables!$B$94:$C$102,2,0)^I70*Tables!$B$91","v":17.971694111418461},{"$f":"VLOOKUP(A70,Tracks!$A$3:$AP$889,37,0)*VLOOKUP($O$59,Tables!$B$94:$C$102,2,0)^I70*Tables!$B$91","v":9.4605194365413183},{"$f":"VLOOKUP(A70,Tracks!$A$3:$AP$889,38,0)*VLOOKUP($P$59,Tables!$B$94:$C$102,2,0)^I70*Tables!$B$91","v":7.7031677939516605},{"$f":"VLOOKUP(A70,Tracks!$A$3:$AP$889,39,0)*VLOOKUP($Q$59,Tables!$B$94:$C$102,2,0)^I70*Tables!$B$91","v":24.515789965835634},{"$f":"VLOOKUP(A70,Tracks!$A$3:$AP$889,40,0)*VLOOKUP($R$59,Tables!$B$94:$C$102,2,0)^I70*Tables!$B$91","v":15.946357741550072},{"$f":"VLOOKUP(A70,Tracks!$A$3:$AP$889,41,0)*VLOOKUP($S$59,Tables!$B$94:$C$102,2,0)^I70*Tables!$B$91","v":26.509211330375933},{"$f":"VLOOKUP(A70,Tracks!$A$3:$AP$889,42,0)*VLOOKUP($T$59,Tables!$B$94:$C$102,2,0)^I70*Tables!$B$91","v":6.4250478186695323},null,140.24349896921413,243.88943264077045,152.8863880256647,152.76159892599557,164.37537259370779,121.86502298036095,110.58587158385656,202.7598152653392,209.72474287361055,187.19656215626554,89.388792738205012]
["Laguna Seca",null,null,null,null,null,"Usure ",null,0,{"$f":"VLOOKUP(A71,Tracks!$A$3:$AP$889,32,0)*VLOOKUP($J$59,Tables!$B$94:$C$102,2,0)^I71*Tables!$B$91","v":15.273103105343196},{"$f":"VLOOKUP(A71,Tracks!$A$3:$AP$889,33,0)*VLOOKUP($K$59,Tables!$B$94:$C$102,2,0)^I71*Tables!$B$91","v":20.550730494359925},{"$f":"VLOOKUP(A71,Tracks!$A$3:$AP$889,34,0)*VLOOKUP($L$59,Tables!$B$94:$C$102,2,0)^I71*Tables!$B$91","v":13.353643499182281},{"$f":"VLOOKUP(A71,Tracks!$A$3:$AP$889,35,0)*VLOOKUP($M$59,Tables!$B$94:$C$102,2,0)^I71*Tables!$B$91","v":8.8916218018834368},{"$f":"VLOOKUP(A71,Tracks!$A$3:$AP$889,36,0)*VLOOKUP($N$59,Tables!$B$94:$C$102,2,0)^I71*Tables!$B$91","v":8.7072239933211328},{"$f":"VLOOKUP(A71,Tracks!$A$3:$AP$889,37,0)*VLOOKUP($O$59,Tables!$B$94:$C$102,2,0)^I71*Tables!$B$91","v":8.0061070508754479},{"$f":"VLOOKUP(A71,Tracks!$A$3:$AP$889,38,0)*VLOOKUP($P$59,Tables!$B$94:$C$102,2,0)^I71*Tables!$B$91","v":12.375423256506979},{"$f":"VLOOKUP(A71,Tracks!$A$3:$AP$889,39,0)*VLOOKUP($Q$59,Tables!$B$94:$C$102,2,0)^I71*Tables!$B$91","v":19.990444845266769},{"$f":"VLOOKUP(A71,Tracks!$A$3:$AP$889,40,0)*VLOOKUP($R$59,Tables!$B$94:$C$102,2,0)^I71*Tables!$B$91","v":21.814666022829567},{"$f":"VLOOKUP(A71,Tracks!$A$3:$AP$889,41,0)*VLOOKUP($S$59,Tables!$B$94:$C$102,2,0)^I71*Tables!$B$91","v":17.690031524713405},{"$f":"VLOOKUP(A71,Tracks!$A$3:$AP$889,42,0)*VLOOKUP($T$59,Tables!$B$94:$C$102,2,0)^I71*Tables!$B$91","v":4.7264603128744573},null,155.51660207455734,264.44016313513038,166.24003152484698,161.65322072787902,173.08259658702892,129.87113003123639,122.96129484036354,222.75026011060598,231.53940889644011,204.88659368097893,94.115253051079463]
["Brasilia",null,null,null,null,null,"Usure ",null,0,{"$f":"VLOOKUP(A72,Tracks!$A$3:$AP$889,32,0)*VLOOKUP($J$59,Tables!$B$94:$C$102,2,0)^I72*Tables!$B$91","v":9.8961845886390698},{"$f":"VLOOKUP(A72,Tracks!$A$3:$AP$889,33,0)*VLOOKUP($K$59,Tables!$B$94:$C$102,2,0)^I72*Tables!$B$91","v":21.204734809892713},{"$f":"VLOOKUP(A72,Tracks!$A$3:$AP$889,34,0)*VLOOKUP($L$59,Tables!$B$94:$C$102,2,0)^I72*Tables!$B$91","v":12.781199752821282},{"$f":"VLOOKUP(A72,Tracks!$A$3:$AP$889,35,0)*VLOOKUP($M$59,Tables!$B$94:$C$102,2,0)^I72*Tables!$B$91","v":15.642405309853965},{"$f":"VLOOKUP(A72,Tracks!$A$3:$AP$889,36,0)*VLOOKUP($N$59,Tables!$B$94:$C$102,2,0)^I72*Tables!$B$91","v":10.411890547750131},{"$f":"VLOOKUP(A72,Tracks!$A$3:$AP$889,37,0)*VLOOKUP($O$59,Tables!$B$94:$C$102,2,0)^I72*Tables!$B$91","v":9.6150285893201719},{"$f":"VLOOKUP(A72,Tracks!$A$3:$AP$889,38,0)*VLOOKUP($P$59,Tables!$B$94:$C$102,2,0)^I72*Tables!$B$91","v":11.122632650532859},{"$f":"VLOOKUP(A72,Tracks!$A$3:$AP$889,39,0)*VLOOKUP($Q$59,Tables!$B$94:$C$102,2,0)^I72*Tables!$B$91","v":16.407858850341995},{"$f":"VLOOKUP(A72,Tracks!$A$3:$AP$889,40,0)*VLOOKUP($R$59,Tables!$B$94:$C$102,2,0)^I72*Tables!$B$91","v":22.473229624837799},{"$f":"VLOOKUP(A72,Tracks!$A$3:$AP$889,41,0)*VLOOKUP($S$59,Tables!$B$94:$C$102,2,0)^I72*Tables!$B$91","v":10.466095398069269},{"$f":"VLOOKUP(A72,Tracks!$A$3:$AP$889,42,0)*VLOOKUP($T$59,Tables!$B$94:$C$102,2,0)^I72*Tables!$B$91","v":8.7852384507897998},null,165.41278666319641,285.6448979450231,179.02123127766828,177.29562603773297,183.49448713477904,139.48615862055655,134.0839274908964,239.15811896094797,254.01263852127789,215.35268907904819,102.90049150186927]
["New Delhi",null,null,null,null,null,"Usure ",null,{"$f":"+I18","v":0},{"$f":"VLOOKUP(A73,Tracks!$A$3:$AP$889,32,0)*VLOOKUP($J$59,Tables!$B$94:$C$102,2,0)^I73*Tables!$B$91","v":13.648983945313667},{"$f":"VLOOKUP(A73,Tracks!$A$3:$AP$889,33,0)*VLOOKUP($K$59,Tables!$B$94:$C$102,2,0)^I73*Tables!$B$91","v":24.63990387544488},{"$f":"VLOOKUP(A73,Tracks!$A$3:$AP$889,34,0)*VLOOKUP($L$59,Tables!$B$94:$C$102,2,0)^I73*Tables!$B$91","v":19.165720580597998},{"$f":"VLOOKUP(A73,Tracks!$A$3:$AP$889,35,0)*VLOOKUP($M$59,Tables!$B$94:$C$102,2,0)^I73*Tables!$B$91","v":16.556795541873086},{"$f":"VLOOKUP(A73,Tracks!$A$3:$AP$889,36,0)*VLOOKUP($N$59,Tables!$B$94:$C$102,2,0)^I73*Tables!$B$91","v":12.335909440386486},{"$f":"VLOOKUP(A73,Tracks!$A$3:$AP$889,37,0)*VLOOKUP($O$59,Tables!$B$94:$C$102,2,0)^I73*Tables!$B$91","v":8.2097551801118378},{"$f":"VLOOKUP(A73,Tracks!$A$3:$AP$889,38,0)*VLOOKUP($P$59,Tables!$B$94:$C$102,2,0)^I73*Tables!$B$91","v":10.515740961912966},{"$f":"VLOOKUP(A73,Tracks!$A$3:$AP$889,39,0)*VLOOKUP($Q$59,Tables!$B$94:$C$102,2,0)^I73*Tables!$B$91","v":17.068448801894863},{"$f":"VLOOKUP(A73,Tracks!$A$3:$AP$889,40,0)*VLOOKUP($R$59,Tables!$B$94:$C$102,2,0)^I73*Tables!$B$91","v":23.098358459359456},{"$f":"VLOOKUP(A73,Tracks!$A$3:$AP$889,41,0)*VLOOKUP($S$59,Tables!$B$94:$C$102,2,0)^I73*Tables!$B$91","v":21.063903516540183},{"$f":"VLOOKUP(A73,Tracks!$A$3:$AP$889,42,0)*VLOOKUP($T$59,Tables!$B$94:$C$102,2,0)^I73*Tables!$B$91","v":6.6089390398456773},null,179.06177060851007,310.28480182046798,198.18695185826627,193.85242157960607,195.83039657516551,147.69591380066839,144.59966845280937,256.22656776284282,277.11099698063737,236.41659259558838,109.50943054171495]
["Fuji",null,null,null,null,null,"Usure ",null,0,{"$f":"VLOOKUP(A74,Tracks!$A$3:$AP$889,32,0)*VLOOKUP($J$59,Tables!$B$94:$C$102,2,0)^I74*Tables!$B$91","v":16.015760213454016},{"$f":"VLOOKUP(A74,Tracks!$A$3:$AP$889,33,0)*VLOOKUP($K$59,Tables!$B$94:$C$102,2,0)^I74*Tables!$B$91","v":20.098347958518886},{"$f":"VLOOKUP(A74,Tracks!$A$3:$AP$889,34,0)*VLOOKUP($L$59,Tables!$B$94:$C$102,2,0)^I74*Tables!$B$91","v":10.23965083645567},{"$f":"VLOOKUP(A74,Tracks!$A$3:$AP$889,35,0)*VLOOKUP($M$59,Tables!$B$94:$C$102,2,0)^I74*Tables!$B$91","v":11.960528187241794},{"$f":"VLOOKUP(A74,Tracks!$A$3:$AP$889,36,0)*VLOOKUP($N$59,Tables!$B$94:$C$102,2,0)^I74*Tables!$B$91","v":12.021825260967177},{"$f":"VLOOKUP(A74,Tracks!$A$3:$AP$889,37,0)*VLOOKUP($O$59,Tables!$B$94:$C$102,2,0)^I74*Tables!$B$91","v":11.588693045800223},{"$f":"VLOOKUP(A74,Tracks!$A$3:$AP$889,38,0)*VLOOKUP($P$59,Tables!$B$94:$C$102,2,0)^I74*Tables!$B$91","v":15.804513273425222},{"$f":"VLOOKUP(A74,Tracks!$A$3:$AP$889,39,0)*VLOOKUP($Q$59,Tables!$B$94:$C$102,2,0)^I74*Tables!$B$91","v":14.041082582201643},{"$f":"VLOOKUP(A74,Tracks!$A$3:$AP$889,40,0)*VLOOKUP($R$59,Tables!$B$94:$C$102,2,0)^I74*Tables!$B$91","v":26.385097420766694},{"$f":"VLOOKUP(A74,Tracks!$A$3:$AP$889,41,0)*VLOOKUP($S$59,Tables!$B$94:$C$102,2,0)^I74*Tables!$B$91","v":11.121619475760539},{"$f":"VLOOKUP(A74,Tracks!$A$3:$AP$889,42,0)*VLOOKUP($T$59,Tables!$B$94:$C$102,2,0)^I74*Tables!$B$91","v":10.233571787821749},null,195.0775308219641,330.38314977898688,208.42660269472194,205.81294976684788,207.85222183613268,159.28460684646862,160.40418172623458,270.26765034504444,303.49609440140404,247.53821207134894,119.74300232953669]
["Sepang",null,null,null,null,null,"Usure ",null,0,{"$f":"VLOOKUP(A75,Tracks!$A$3:$AP$889,32,0)*VLOOKUP($J$59,Tables!$B$94:$C$102,2,0)^I75*Tables!$B$91","v":12.803996185198489},{"$f":"VLOOKUP(A75,Tracks!$A$3:$AP$889,33,0)*VLOOKUP($K$59,Tables!$B$94:$C$102,2,0)^I75*Tables!$B$91","v":24.308595724896122},{"$f":"VLOOKUP(A75,Tracks!$A$3:$AP$889,34,0)*VLOOKUP($L$59,Tables!$B$94:$C$102,2,0)^I75*Tables!$B$91","v":16.621638727301587},{"$f":"VLOOKUP(A75,Tracks!$A$3:$AP$889,35,0)*VLOOKUP($M$59,Tables!$B$94:$C$102,2,0)^I75*Tables!$B$91","v":13.324261430784992},{"$f":"VLOOKUP(A75,Tracks!$A$3:$AP$889,36,0)*VLOOKUP($N$59,Tables!$B$94:$C$102,2,0)^I75*Tables!$B$91","v":16.686481912730091},{"$f":"VLOOKUP(A75,Tracks!$A$3:$AP$889,37,0)*VLOOKUP($O$59,Tables!$B$94:$C$102,2,0)^I75*Tables!$B$91","v":9.2619371811665285},{"$f":"VLOOKUP(A75,Tracks!$A$3:$AP$889,38,0)*VLOOKUP($P$59,Tables!$B$94:$C$102,2,0)^I75*Tables!$B$91","v":16.124169914092295},{"$f":"VLOOKUP(A75,Tracks!$A$3:$AP$889,39,0)*VLOOKUP($Q$59,Tables!$B$94:$C$102,2,0)^I75*Tables!$B$91","v":18.542111508234818},{"$f":"VLOOKUP(A75,Tracks!$A$3:$AP$889,40,0)*VLOOKUP($R$59,Tables!$B$94:$C$102,2,0)^I75*Tables!$B$91","v":21.869377460534867},{"$f":"VLOOKUP(A75,Tracks!$A$3:$AP$889,41,0)*VLOOKUP($S$59,Tables!$B$94:$C$102,2,0)^I75*Tables!$B$91","v":13.174311564481579},{"$f":"VLOOKUP(A75,Tracks!$A$3:$AP$889,42,0)*VLOOKUP($T$59,Tables!$B$94:$C$102,2,0)^I75*Tables!$B$91","v":9.5192835733358976},null,207.88152700716259,354.691745503883,225.04824142202352,219.13721119763287,224.53870374886279,168.54654402763515,176.52835164032689,288.80976185327927,325.36547186193889,260.71252363583051,129.26228590287258]
["Yas Marina",null,null,null,null,null,"Usure ",null,0,{"$f":"VLOOKUP(A76,Tracks!$A$3:$AP$889,32,0)*VLOOKUP($J$59,Tables!$B$94:$C$102,2,0)^I76*Tables!$B$91","v":11.474710883914183},{"$f":"VLOOKUP(A76,Tracks!$A$3:$AP$889,33,0)*VLOOKUP($K$59,Tables!$B$94:$C$102,2,0)^I76*Tables!$B$91","v":9.1251585869032787},{"$f":"VLOOKUP(A76,Tracks!$A$3:$AP$889,34,0)*VLOOKUP($L$59,Tables!$B$94:$C$102,2,0)^I76*Tables!$B$91","v":17.610497305086255},{"$f":"VLOOKUP(A76,Tracks!$A$3:$AP$889,35,0)*VLOOKUP($M$59,Tables!$B$94:$C$102,2,0)^I76*Tables!$B$91","v":20.004629292079251},{"$f":"VLOOKUP(A76,Tracks!$A$3:$AP$889,36,0)*VLOOKUP($N$59,Tables!$B$94:$C$102,2,0)^I76*Tables!$B$91","v":14.361245810254875},{"$f":"VLOOKUP(A76,Tracks!$A$3:$AP$889,37,0)*VLOOKUP($O$59,Tables!$B$94:$C$102,2,0)^I76*Tables!$B$91","v":10.699632183089111},{"$f":"VLOOKUP(A76,Tracks!$A$3:$AP$889,38,0)*VLOOKUP($P$59,Tables!$B$94:$C$102,2,0)^I76*Tables!$B$91","v":14.643921571732255},{"$f":"VLOOKUP(A76,Tracks!$A$3:$AP$889,39,0)*VLOOKUP($Q$59,Tables!$B$94:$C$102,2,0)^I76*Tables!$B$91","v":17.874429333275707},{"$f":"VLOOKUP(A76,Tracks!$A$3:$AP$889,40,0)*VLOOKUP($R$59,Tables!$B$94:$C$102,2,0)^I76*Tables!$B$91","v":20.783254104607447},{"$f":"VLOOKUP(A76,Tracks!$A$3:$AP$889,41,0)*VLOOKUP($S$59,Tables!$B$94:$C$102,2,0)^I76*Tables!$B$91","v":15.210792856845494},{"$f":"VLOOKUP(A76,Tracks!$A$3:$AP$889,42,0)*VLOOKUP($T$59,Tables!$B$94:$C$102,2,0)^I76*Tables!$B$91","v":10.530431996111611},null,219.35623789107677,363.8169040907863,242.65873872710978,239.14184048971211,238.89994955911766,179.24617621072426,191.17227321205914,306.68419118655498,346.14872596654635,275.92331649267601,139.79271789898419]
["Austin",null,null,null,null,null,"Usure ",null,null,{"$f":"VLOOKUP(A77,Tracks!$A$3:$AP$889,32,0)*VLOOKUP($J$59,Tables!$B$94:$C$102,2,0)^I77*Tables!$B$91","v":8.8333642524750182},{"$f":"VLOOKUP(A77,Tracks!$A$3:$AP$889,33,0)*VLOOKUP($K$59,Tables!$B$94:$C$102,2,0)^I77*Tables!$B$91","v":20.067446127963116},{"$f":"VLOOKUP(A77,Tracks!$A$3:$AP$889,34,0)*VLOOKUP($L$59,Tables!$B$94:$C$102,2,0)^I77*Tables!$B$91","v":14.339462552649989},{"$f":"VLOOKUP(A77,Tracks!$A$3:$AP$889,35,0)*VLOOKUP($M$59,Tables!$B$94:$C$102,2,0)^I77*Tables!$B$91","v":14.369351208433438},{"$f":"VLOOKUP(A77,Tracks!$A$3:$AP$889,36,0)*VLOOKUP($N$59,Tables!$B$94:$C$102,2,0)^I77*Tables!$B$91","v":9.9853439686032601},{"$f":"VLOOKUP(A77,Tracks!$A$3:$AP$889,37,0)*VLOOKUP($O$59,Tables!$B$94:$C$102,2,0)^I77*Tables!$B$91","v":9.4321505429163466},{"$f":"VLOOKUP(A77,Tracks!$A$3:$AP$889,38,0)*VLOOKUP($P$59,Tables!$B$94:$C$102,2,0)^I77*Tables!$B$91","v":9.7143197170075659},{"$f":"VLOOKUP(A77,Tracks!$A$3:$AP$889,39,0)*VLOOKUP($Q$59,Tables!$B$94:$C$102,2,0)^I77*Tables!$B$91","v":15.131765224604505},{"$f":"VLOOKUP(A77,Tracks!$A$3:$AP$889,40,0)*VLOOKUP($R$59,Tables!$B$94:$C$102,2,0)^I77*Tables!$B$91","v":18.078584049898257},{"$f":"VLOOKUP(A77,Tracks!$A$3:$AP$889,41,0)*VLOOKUP($S$59,Tables!$B$94:$C$102,2,0)^I77*Tables!$B$91","v":7.7330564497351117},{"$f":"VLOOKUP(A77,Tracks!$A$3:$AP$889,42,0)*VLOOKUP($T$59,Tables!$B$94:$C$102,2,0)^I77*Tables!$B$91","v":7.682904298505254},4,{"$f":"+(J77*$U$77)+V76","v":254.68969490097686},{"$f":"+(K77*$U$77)+W76","v":444.08668860263879},300.01658893770974,296.61924532344585,278.8413254335307,216.97477838238964,230.02955208008939,367.21125208497301,418.46306216613937,306.85554229161647,170.52433509300522]
["Total Saison",null,null,null,null,null,"Usure ",null,null,{"$f":"SUM(J60:J76)","v":219.35623789107677},{"$f":"SUM(K60:K76)","v":363.8169040907863},242.65873872710978,239.14184048971211,238.89994955911766,179.24617621072426,191.17227321205914,306.68419118655498,346.14872596654635,275.92331649267601,139.79271789898419]
["Cout Saison",null,null,null,null,null,"NOMBRES DE PIECES SAISON",null,null,{"$f":"+J78/100","v":2.1935623789107677},{"$f":"+K78/100","v":3.6381690409078629},2.4265873872710979,2.391418404897121,2.3889994955911766,1.7924617621072425,1.9117227321205914,3.0668419118655499,3.4614872596654633,2.7592331649267603,1.397927178989842]
[null,null,null,null,null,null,{"$f":"-SUM(J80:T80)","v":-121352872.7904713},null,null,{"$f":"LOOKUP(J59,Tables!$R$3:$Z$4,Tables!$R$4:$Z$4)*J79","v":8261780.6984324213},{"$f":"LOOKUP(K59,Tables!$R$3:$Z$4,Tables!$R$5:$Z$5)*K79","v":35109026.135047689},{"$f":"LOOKUP(L59,Tables!$R$3:$Z$4,Tables!$R$6:$Z$6)*L79","v":10969502.3337662},{"$f":"LOOKUP(M59,Tables!$R$3:$Z$4,Tables!$R$7:$Z$7)*M79","v":10481412.295120524},{"$f":"LOOKUP(N59,Tables!$R$3:$Z$4,Tables!$R$8:$Z$8)*N79","v":3551202.3592058676},{"$f":"LOOKUP(O59,Tables!$R$3:$Z$4,Tables!$R$9:$Z$9)*O79","v":2401751.7793592121},{"$f":"LOOKUP(P59,Tables!$R$3:$Z$4,Tables!$R$10:$Z$10)*P79","v":2532105.4345347052},{"$f":"LOOKUP(Q59,Tables!$R$3:$Z$4,Tables!$R$11:$Z$11)*Q79","v":27686461.257226564},{"$f":"LOOKUP(R59,Tables!$R$3:$Z$4,Tables!$R$12:$Z$12)*R79","v":7037127.4461801741},{"$f":"LOOKUP(S59,Tables!$R$3:$Z$4,Tables!$R$13:$Z$13)*S79","v":9499893.5474850945},{"$f":"LOOKUP(T59,Tables!$R$3:$Z$4,Tables!$R$14:$Z$14)*T79","v":3822609.5041128593}]
["GAINS SAISON",null,null,null,null,5,{"$f":"LOOKUP(F81,Tables!X19:X43,Tables!AE19:AE43)*17","v":197496410.25641027}]
["Tresorerie debut",null,null,null,null,null,{"$f":"I32","v":61460114}]
["Divers Cout ",null,null,null,null,null,{"$f":"-(2500000)*17","v":-42500000}]
["FIN DE SAISON Sans Bonus",null,null,null,null,null,{"$f":"SUM(G80:I83)","v":95103651.465938985}]

{"sheet":"Testing","index":4,"n_rows":65,"n_cols":43,"rows_kept":65,"cut":false,"hidden":true,"merged":[[45,0,46,6],[45,8,46,14],[6,0,6,2],[6,6,6,9],[6,11,6,15],[6,18,6,29],[7,0,7,1],[7,6,7,8],[8,26,9,26],[8,27,8,29],[9,0,9,1],[9,6,9,8],[10,0,10,1],[10,6,10,8],[7,15,13,15],[8,0,8,1],[8,6,8,8],[8,19,9,19],[8,20,8,22],[8,23,8,25],[11,0,11,1],[11,6,11,8],[12,0,12,1],[12,6,12,9],[23,0,23,1],[13,0,13,1],[13,6,13,8],[14,0,14,1],[14,6,14,8],[15,0,15,1],[16,0,16,1],[22,6,22,9],[17,0,17,1],[15,6,15,8],[16,6,16,8],[17,6,17,8],[18,6,18,8],[23,7,23,9],[19,6,19,8],[17,22,17,24],[18,0,18,1],[20,0,20,2],[21,0,21,1],[22,0,22,1],[18,11,18,12],[19,11,19,12],[20,11,20,12],[21,11,21,12],[31,6,31,7],[32,6,32,7],[33,6,33,7],[27,6,27,9],[29,6,29,7],[30,6,30,7],[2,6,3,7],[2,8,3,12],[16,11,16,12],[17,11,17,12],[15,11,15,12],[6,31,6,42],[7,31,7,32],[7,33,7,39],[8,31,8,32],[8,33,8,39],[8,41,11,41],[9,31,9,32],[9,33,9,39],[10,31,10,32],[10,33,10,39],[11,31,11,32],[11,33,11,39],[12,31,12,32],[12,33,12,39],[12,41,15,41],[13,31,13,32],[13,33,13,39],[14,31,14,32],[14,33,14,39],[15,31,15,32],[15,33,15,39],[16,31,16,32],[16,33,16,39],[16,41,19,41],[17,31,17,32],[17,33,17,39],[18,31,18,32],[18,33,18,39],[19,31,19,32],[19,33,19,39],[20,31,20,32],[20,33,20,39],[20,41,23,41],[21,31,21,32],[21,33,21,39],[22,31,22,32],[22,33,22,39],[23,31,23,32],[23,33,23,39],[24,31,24,32],[24,33,24,39],[24,41,27,41],[25,31,25,32],[25,33,25,39],[26,31,26,32],[26,33,26,39],[27,31,27,32],[27,33,27,39]]}
[]
[]
[null,null,null,null,null,null,"AVANT RACE",null,"Jerez"]
[]
[]
[]
["Driver",null,null,null,null,null,"Tech director",null,null,null,null,"Perfect Setups",null,null,null,null,null,null,"Setup Factor Calculations",null,null,null,null,null,null,null,null,null,null,null,null,"Commentaires   du   Pilote"]
["OA",null,{"$f":"Tables!D43","v":147.12319999999997},null,null,null,"R&D mechanics",null,null,{"$f":"IMPORTS!$I$8","v":0},null,"Rain","Low","Setup","High","Q1",null,null,null,null,null,null,null,null,null,null,null,null,null,null,null,"Pieces",null,"Divers Reglages - Info Pilotes",null,null,null,null,null,null,"+ / -","HR","AJUST"]
["Concentration",null,{"$f":"IMPORTS!$B$7","v":205},null,null,null,"R&D electronics",null,null,{"$f":"IMPORTS!$I$10","v":0},null,"Front Wings",{"$f":"ROUND($AB$11,0)-IF($J$11=0,$T19/2,$U19/2)","v":443},{"$f":"ROUND(AB11+W20,0)","v":586},{"$f":"ROUND($AB$11,0)+IF($J$11=0,$T19/2,$U19/2)","v":531},null,null,null,null,"Track Base","Weather",null,null,"Driver",null,null,"Car","Setups",null,null,null,"Ailerons",null,"Je manque un peu d'adhérence dans les courbes",null,null,null,null,null,null,0.5,{"$f":"IMPORTS!F38","v":86.200000000000017},{"$f":"+AO9*$AP$9","v":43.100000000000009}]
["Talent",null,{"$f":"IMPORTS!$B$9","v":210},null,null,null,"R&D aerodynamics",null,null,{"$f":"IMPORTS!$I$12","v":0},null,"Rear Wings",{"$f":"ROUND($AB$11,0)-IF($J$11=0,$T19/2,$U19/2)","v":443},{"$f":"ROUND(AB11-W20,0)","v":387},{"$f":"ROUND($AB$11,0)+IF($J$11=0,$T19/2,$U19/2)","v":531},null,null,null,null,null,"Q1","Q2","Race","Q1","Q2","Race",null,"Q1","Q2","Race",null,"Ailerons",null,"La voiture est très instable dans de nombreux virages",null,null,null,null,null,null,1,null,{"$f":"+AO10*$AP$9","v":86.200000000000017}]
["Aggressiveness",null,{"$f":"IMPORTS!$B$11","v":0},null,null,null,"Experience",null,null,{"$f":"IMPORTS!$I$14","v":0},null,"Engine",{"$f":"N11-IF($J$11=0,$T20/2,$U20/2)","v":810},{"$f":"ROUND(AB12,0)","v":853},{"$f":"N11+IF($J$11=0,$T20/2,$U20/2)","v":896},null,null,null,"Wings",{"$f":"VLOOKUP($H$24,Tracks!$A$3:$W$889,19,0)*2","v":498.44},{"$f":"IF($J$26=\"Dry\",Tables!D4*$H$26,Tables!B4*$H$26+Tables!C4)*2","v":620},{"$f":"IF($J$21=\"Dry\",Tables!D4*$H$21,Tables!B4*$H$21+Tables!C4)*2","v":526},{"$f":"IF(#REF!=\"Dry\",Tables!D4*#REF!,Tables!B4*#REF!+Tables!C4)*2","v":{"$error":"#REF!"}},{"$f":"($C$10*FLOOR(($T$11+U11),1)*(-0.001349079032746))*IF($H$24<>\"Indianapolis Oval\",1,0.39)","v":-316.73677530810585},{"$f":"($C$10*FLOOR(($T$11+V11),1)*(-0.001349079032746))*IF($H$24<>\"Indianapolis Oval\",1,0.39)","v":-290.10595520169983},{"$f":"($C$10*FLOOR(($T$11+W11),1)*(-0.001349079032746))*IF($H$24<>\"Indianapolis Oval\",1,0.39)","v":{"$error":"#REF!"}},{"$f":"Tables!M13+Tables!M19","v":171.77},{"$f":"(T11+U11+X11+AA11)/2","v":486.73661234594709},{"$f":"(T11+V11+Y11+AA11)/2","v":453.05202239915013},{"$f":"(T11+W11+Z11+AA11)/2","v":{"$error":"#REF!"}},null,"Ailerons",null,"La voiture manque un peu de vitesse dans les lignes droites",null,null,null,null,null,null,-2,null,{"$f":"+AO11*$AP$9","v":-172.40000000000003}]
["Experience",null,{"$f":"IMPORTS!$B$13","v":131},null,null,null,"Pit coordination",null,null,{"$f":"IMPORTS!$I$16","v":0},null,"Brake",{"$f":"N12-IF($J$11=0,$T21/2,$U21/2)","v":693},{"$f":"ROUND(AB13,0)","v":736},{"$f":"N12+IF($J$11=0,$T21/2,$U21/2)","v":779},null,null,null,"Engine",{"$f":"VLOOKUP($H$24,Tracks!$A$3:$W$889,20,0)","v":714.42},{"$f":"IF($J$26=\"Dry\",Tables!D5*$H$26,Tables!B5*$H$26+Tables!C5)","v":-157.1},{"$f":"IF($J$21=\"Dry\",Tables!D5*$H$21,Tables!B5*$H$21+Tables!C5)","v":-190},{"$f":"IF(#REF!=\"Dry\",Tables!D5*#REF!,Tables!B5*#REF!+Tables!C5)","v":{"$error":"#REF!"}},{"$f":"Tables!$G$28+($C$12*(($T$12+U12)*0.001655723+0.0469416263186552))*IF($H$24<>\"Indianapolis Oval\",1,0.39)","v":127.03190109690382},{"$f":"(Tables!$G$28+$C$12*(($T$12+V12)*0.001655723+0.0469416263186552))*IF($H$24<>\"Indianapolis Oval\",1,0.39)","v":119.89590053920382},{"$f":"(Tables!$G$28+$C$12*(($T$12+W12)*0.001655723+0.0469416263186552))*IF($H$24<>\"Indianapolis Oval\",1,0.39)","v":{"$error":"#REF!"}},{"$f":"Tables!M14+Tables!M20","v":168.16},{"$f":"T12+U12+X12+AA12","v":852.51190109690367},{"$f":"T12+V12+Y12+AA12","v":812.47590053920374},{"$f":"T12+W12+Z12+AA12","v":{"$error":"#REF!"}},null,"Ailerons",null,"La voiture pourrait avoir un peu plus de vitesse dans les lignes droites",null,null,null,null,null,null,-0.5,null,{"$f":"+AO12*$AP$9","v":-43.100000000000009}]
["Technical insight",null,{"$f":"IMPORTS!$B$15","v":119},null,null,null,"Staff",null,null,null,null,"Gears",{"$f":"N13-IF($J$11=0,$T22/2,$U22/2)","v":320},{"$f":"ROUND(AB14,0)","v":363},{"$f":"N13+IF($J$11=0,$T22/2,$U22/2)","v":406},null,null,null,"Brake",{"$f":"VLOOKUP($H$24,Tracks!$A$3:$W$889,21,0)","v":676.29},{"$f":"IF($J$26=\"Dry\",Tables!D6*$H$26,Tables!B6*$H$26+Tables!C6)","v":292.98623817827388},{"$f":"IF($J$21=\"Dry\",Tables!D6*$H$21,Tables!B6*$H$21+Tables!C6)","v":105.532592432347},{"$f":"IF(#REF!=\"Dry\",Tables!D6*#REF!,Tables!B6*#REF!+Tables!C6)","v":{"$error":"#REF!"}},{"$f":"Tables!G29","v":-104.58},{"$f":"Tables!G29","v":-104.58},{"$f":"Tables!G29","v":-104.58},{"$f":"Tables!M15+Tables!M21","v":-128.87},{"$f":"T13+U13+X13+AA13","v":735.8262381782738},{"$f":"T13+V13+Y13+AA13","v":548.37259243234689},{"$f":"T13+W13+Z13+AA13","v":{"$error":"#REF!"}},null,"Moteur",null,"Essayez de favoriser un peu plus les bas régimes",null,null,null,null,null,null,-0.5,{"$f":"IMPORTS!F39","v":86.200000000000017},{"$f":"AO13*$AP$13","v":-43.100000000000009}]
["Stamina",null,{"$f":"IMPORTS!$B$17","v":96},null,null,null,"Soufflerie: ",null,null,{"$f":"IMPORTS!F20","v":20},null,"Suspension",{"$f":"N14-IF($J$11=0,$T23/2,$U23/2)","v":445},{"$f":"ROUND(AB15,0)","v":488},{"$f":"N14+IF($J$11=0,$T23/2,$U23/2)","v":531},null,null,null,"Gears",{"$f":"VLOOKUP($H$24,Tracks!$A$3:$W$889,22,0)","v":789.1},{"$f":"IF($J$26=\"Dry\",Tables!D7*$H$26,Tables!B7*$H$26+Tables!C7)","v":-381.68102823482184},{"$f":"IF($J$21=\"Dry\",Tables!D7*$H$21,Tables!B7*$H$21+Tables!C7)","v":-4.7427117035430202},{"$f":"IF(#REF!=\"Dry\",Tables!D7*#REF!,Tables!B7*#REF!+Tables!C7)","v":{"$error":"#REF!"}},{"$f":"Tables!G30","v":102.5},{"$f":"Tables!G30","v":102.5},{"$f":"Tables!G30","v":102.5},{"$f":"Tables!M16+Tables!M22","v":-147.03},{"$f":"T14+U14+X14+AA14","v":362.88897176517821},{"$f":"T14+V14+Y14+AA14","v":739.82728829645703},{"$f":"T14+W14+Z14+AA14","v":{"$error":"#REF!"}},null,"Moteur",null,"Les tours du moteur sont trop élevés",null,null,null,null,null,null,-1,null,{"$f":"AO14*$AP$13","v":-86.200000000000017}]
["Charisma",null,{"$f":"IMPORTS!$B$19","v":63},null,null,null,"Centre d'entraînement aux stands: ",null,null,{"$f":"IMPORTS!F22","v":29},null,null,null,null,null,null,null,null,"Suspension",{"$f":"VLOOKUP($H$24,Tracks!$A$3:$W$889,23,0)","v":511.89},{"$f":"IF($J$26=\"Dry\",Tables!D8*$H$26,Tables!B8*$H$26+Tables!C8)","v":-304},{"$f":"IF($J$21=\"Dry\",Tables!D8*$H$21,Tables!B8*$H$21+Tables!C8)","v":-257},{"$f":"IF(#REF!=\"Dry\",Tables!D8*#REF!,Tables!B8*#REF!+Tables!C8)","v":{"$error":"#REF!"}},{"$f":"Tables!G31","v":210.25},{"$f":"Tables!G31","v":210.25},{"$f":"Tables!G31","v":210.25},{"$f":"Tables!M17+Tables!M23","v":70.06},{"$f":"T15+U15+X15+AA15","v":488.2},{"$f":"T15+V15+Y15+AA15","v":535.20000000000005},{"$f":"T15+W15+Z15+AA15","v":{"$error":"#REF!"}},null,"Moteur",null,"La puissance du moteur dans les lignes droites n'est pas suffisante",null,null,null,null,null,null,2,null,{"$f":"AO15*$AP$13","v":172.40000000000003}]
["Motivation",null,{"$f":"IMPORTS!$B$21","v":244},null,null,null,"Atelier de R&D: ",null,null,{"$f":"IMPORTS!F24","v":19},null,"Recherche",null,"Pneus","Fuel Reel","Tours",null,null,null,null,null,null,null,null,null,null,null,null,null,null,null,"Moteur",null,"Je pense que je n'ai pas assez de puissance du moteur dans les lignes droites",null,null,null,null,null,null,1,null,{"$f":"AO16*$AP$13","v":86.200000000000017}]
["Reputation",null,{"$f":"IMPORTS!$B$23","v":0},null,null,null,"Centre de design R&D: ",null,null,{"$f":"IMPORTS!F26","v":19},null,"Reglages",null,0.13,14,5,null,null,null,null,null,null,null,null,null,null,null,null,null,null,null,"Freins",null,"Mettez l'équilibre un peu plus à l'arrière",null,null,null,null,null,null,-0.5,{"$f":"IMPORTS!F40","v":86.200000000000017},{"$f":"AO17*$AP$17","v":-43.100000000000009}]
["Weight(kg)",null,{"$f":"IMPORTS!$B$25","v":56},null,null,null,"Atelier d'ingénierie: ",null,null,{"$f":"IMPORTS!F28","v":19},null,"Epingle a cheveux",null,{"$f":"($N$17/$P$17)*P18","v":0.83200000000000007},{"$f":"($O$17/$P$17)*P18","v":89.6},32,null,null,"Happy Range","Generic","TD",null,"Wing Split",null,null,null,null,null,null,null,null,"Freins",null,"Je pense que l'efficacité des freins pourrait être plus élevé si l'on déplace l'équilibre à l'arrière",null,null,null,null,null,null,-1.5,null,{"$f":"AO18*$AP$17","v":-129.30000000000001}]
["Age",null,{"$f":"IMPORTS!$B$27","v":25},null,null,null,"Laboratoire de chimie et alliages: ",null,null,{"$f":"IMPORTS!F30","v":19},null,"Virage",null,{"$f":"($N$17/$P$17)*P19","v":0.83200000000000007},{"$f":"($O$17/$P$17)*P19","v":89.6},32,null,null,"Wings",{"$f":"ROUND($C$12*-0.051+$C$13*-0.153+67.594,0)*2+2","v":88},{"$f":"MAX(2,ROUND($C$12*-0.051+$C$13*-0.153+69.592+$J$11*-0.031+$J$10*-0.203,0)*2)","v":90},null,"Q1","Q2","Race",null,null,null,null,null,null,"Freins",null,"Je voudrais avoir l'équilibre un peu plus à l'avant ",null,null,null,null,null,null,0.5,null,{"$f":"AO19*$AP$17","v":43.100000000000009}]
[null,null,null,null,null,null,"Commerce: ",null,null,{"$f":"IMPORTS!F32","v":29},null,"Vitesse de pointe",null,{"$f":"($N$17/$P$17)*P20","v":0.80600000000000005},{"$f":"($O$17/$P$17)*P20","v":86.8},31,null,null,"Engine",{"$f":"ROUND($C$12*-0.051+$C$13*-0.153+67.594,0)*2","v":86},{"$f":"MAX(2,ROUND($C$12*-0.051+$C$13*-0.153+69.592+$J$11*-0.031+$J$8*-0.076+$J$9*-0.123,0)*2)","v":90},null,{"$f":"VLOOKUP($H$24,Tracks!$A$3:$Y$889,25,0)+$C$10*-0.246534498671854+3.69107049712848*($B$28+$B$29)/2+$AB$11*-0.189968386659174+$H$26*0.376337780506523+IF($J$26=\"Wet\",58.8818967363256,0)","v":99.630452203630838},{"$f":"VLOOKUP($H$24,Tracks!$A$3:$Y$889,25,0)+$C$10*-0.246534498671854+3.69107049712848*($B$28+$B$29)/2+$AC$11*-0.189968386659174+$H$21*0.376337780506523+IF($J$21=\"Wet\",58.8818967363256,0)","v":29.459686990967512},{"$f":"VLOOKUP($H$24,Tracks!$A$3:$Y$889,25,0)+$C$10*-0.246534498671854+3.69107049712848*($B$28+$B$29)/2+$AD$11*-0.189968386659174+#REF!*0.376337780506523+IF(#REF!=\"Wet\",58.8818967363256,0)","v":{"$error":"#REF!"}},null,null,null,null,null,null,"Freins",null,"Je pense que l'efficacité des freins pourrait être plus élevé si l'on déplace l'équilibre à l'avant",null,null,null,null,null,null,1.5,null,{"$f":"AO20*$AP$17","v":129.30000000000001}]
["Car",null,null,null,null,null,null,null,null,null,null,null,null,{"$f":"($N$17/$P$17)*P21","v":0},{"$f":"($O$17/$P$17)*P21","v":0},null,null,null,"Brake",{"$f":"ROUND($C$12*-0.051+$C$13*-0.153+67.594,0)*2","v":86},{"$f":"MAX(2,ROUND($C$12*-0.051+$C$13*-0.153+69.592+$J$11*-0.031+$J$8*-0.12+$J$9*-0.075,0)*2)","v":90},null,null,null,null,null,null,null,null,null,null,"Boite de vitesse",null,"Je suis très souvent dans le rouge. Mettez le rapport de boite un peu plus élevé",null,null,null,null,null,null,0.5,{"$f":"IMPORTS!F41","v":86.200000000000017},{"$f":"AO21*$AP$21","v":43.100000000000009}]
["Power",null,{"$f":"A51","v":90},{"$f":"I51","v":90},{"$f":"D226","v":0},null,null,null,null,null,null,null,null,{"$f":"($N$17/$P$17)*P22","v":0},{"$f":"($O$17/$P$17)*P22","v":0},null,null,null,"Gears",{"$f":"ROUND($C$12*-0.051+$C$13*-0.153+67.594,0)*2","v":86},{"$f":"MAX(2,ROUND($C$12*-0.051+$C$13*-0.153+69.594+$J$11*-0.031+$J$8*-0.0418+$J$9*-0.157,0)*2)","v":90},null,null,null,null,null,null,null,null,null,null,"Boite de vitesse",null,"Le rapport de boite est trop élevé",null,null,null,null,null,null,-1,null,{"$f":"AO22*$AP$21","v":-86.200000000000017}]
["Handling",null,{"$f":"B51","v":95},{"$f":"J51","v":95},{"$f":"D227","v":0},null,"Stint Details",null,null,null,null,null,null,null,null,null,null,null,"Suspension",{"$f":"ROUND($C$12*-0.051+$C$13*-0.153+67.594,0)*2","v":86},{"$f":"MAX(2,ROUND($C$12*-0.051+$C$13*-0.153+69.594+$J$11*-0.031+$J$8*-0.134+$J$10*-0.061,0)*2)","v":90},null,null,null,null,null,null,null,null,null,null,"Boite de vitesse",null,"Je ne peux pas profiter de la puissance du moteur. Raccourcissez les rapports de boite ",null,null,null,null,null,null,-0.5,null,{"$f":"AO23*$AP$21","v":-43.100000000000009}]
["Acceleration",null,{"$f":"C51","v":92},{"$f":"K51","v":92},{"$f":"D228","v":0},null,"Track","A1-Ring",null,null,null,"Type de Point","P","M","A",null,null,null,null,null,null,null,null,null,null,null,null,null,null,null,null,"Boite de vitesse",null,"On dirait que le moteur va exploser. Mettez un espace beaucoup plus élevé entre les vitesses",null,null,null,null,null,null,1.5,null,{"$f":"AO24*$AP$21","v":129.30000000000001}]
[null,"Level","Avant","Apres","Usure",null,null,"Temp","Hum","Weather",null,"Point de Test",25,25.6,25.6,".",null,null,null,null,null,null,null,null,null,null,null,null,null,null,null,"Suspension",null,"Je pense qu'avec une suspension un peu plus rigide, je serai plus rapide ",null,null,null,null,null,null,1,{"$f":"IMPORTS!F42","v":86.200000000000017},{"$f":"AO25*$AP$25","v":86.200000000000017}]
["Chassis",{"$f":"B55","v":7},{"$f":"D55","v":0.38},{"$f":"L55","v":0.48},{"$f":"D26-C26","v":9.9999999999999978E-2},null,"Q1",47,99,"Wet",null,"Point R&D",0,0,0,null,null,null,null,null,null,null,null,null,null,null,null,null,null,null,null,"Suspension",null,"La voiture est trop rigide. Baissez un peu la rigidité",null,null,null,null,null,null,-0.5,null,{"$f":"AO26*$AP$25","v":-43.100000000000009}]
["Engine",{"$f":"B56","v":6},{"$f":"D56","v":0.44},{"$f":"L56","v":0.6},{"$f":"D27-C27","v":0.15999999999999998},null,null,null,null,null,null,"Point Inge,",0,0,0,null,null,null,null,null,null,null,null,null,null,null,null,null,null,null,null,"Suspension",null,"La rigidité de suspension est trop élevé",null,null,null,null,null,null,-1,null,{"$f":"AO27*$AP$25","v":-86.200000000000017}]
["Front wing",7,0,7.0000000000000007E-2,7.0000000000000007E-2,null,"Determine track Base Values",null,null,null,null,"Pts Car. Caisse",5,5,5,null,null,null,null,null,null,null,null,null,null,null,null,null,null,null,null,"Suspension",null,"La rigidité de suspension est trop faible",null,null,null,null,null,null,1.5,null,{"$f":"AO28*$AP$25","v":129.30000000000001}]
["Rear wing",7,0,0.08,0.08,null,"Balance",{"$f":"W20","v":99.630452203630838},"Q1 Setup","Track Base"]
["Underbody",7,0.57999999999999996,0.65,7.0000000000000062E-2,null,"(FW+RW)/2",null,{"$f":"AVERAGE(N9:N10)","v":486.5},{"$f":"((2*I30-AA11-U11*(1-IF($H$24<>\"Indianapolis Oval\",1,0.39)*C10*0.001349079032746))/(1-IF($H$24<>\"Indianapolis Oval\",1,0.39)*C10*0.001349079032746))/2","v":248.97682084713674}]
["Sidepods",7,0,0.1,0.1,null,"Engine",null,941,{"$f":"(I31-U12-AA12-IF($H$24<>\"Indianapolis Oval\",1,0.39)*C11*0.29521804804429-IF($H$24<>\"Indianapolis Oval\",1,0.39)*C12*U12*0.001655723-IF($H$24<>\"Indianapolis Oval\",1,0.39)*C12*0.0469416263186552)/(1+IF($H$24<>\"Indianapolis Oval\",1,0.39)*C12*0.001655723)","v":787.13601591962572}]
["Cooling",7,0,7.0000000000000007E-2,7.0000000000000007E-2,null,"Brake",null,{"$f":"+N12","v":736},{"$f":"I32-U13-X13-AA13","v":676.46376182172617}]
["Gearbox",6,0,0.13,0.13,null,"Gears",null,{"$f":"+N13","v":363},{"$f":"I33-U14-X14-AA14","v":789.21102823482181}]
["Brakes",6,0.52,0.66,0.14000000000000001,null,"Suspension",null,755,{"$f":"I34-U15-X15-AA15","v":778.69}]
["Suspension",7,0,0.1,0.1]
["Electronics",7,0.68,0.76,7.999999999999996E-2]
[]
[]
[]
[]
[]
[]
[]
[]
[]
["AVANT",null,null,null,null,null,null,null,"APRES"]
[]
[]
["Caractéristiques actuelles de la voiture",null,null,null,null,null,null,null,"Caractéristiques actuelles de la voiture"]
["Puissance","Maniabilité","Accélération",null,null,null,null,null,"Puissance","Maniabilité","Accélération"]
[90,95,92,null,null,null,null,null,90,95,92]
["Historique des caractéristiques de la voiture",null,null,null,null,null,null,null,"Historique des caractéristiques de la voiture"]
[]
["Pièces","Niveau","Action","Usure"," ","Nouveau niveau","Nouvelle usure",null,"Pièces","Niveau","Action","Usure"," ","Nouveau niveau","Nouvelle usure"]
["Châssis:",7,null,0.38,null,7,0.38,null,"Châssis:",7,null,0.48,null,7,0.48]
["Moteur:",6,null,0.44,null,6,0.44,null,"Moteur:",6,null,0.6,null,6,0.6]
["Aileron avant:",7,null,0,null,7,0,null,"Aileron avant:",7,null,7.0000000000000007E-2,null,7,7.0000000000000007E-2]
["Aileron arrière:",7,null,0,null,7,0,null,"Aileron arrière:",7,null,0.08,null,7,0.08]
["Fond plat:",7,null,0.57999999999999996,null,7,0.57999999999999996,null,"Fond plat:",7,null,0.65,null,7,0.65]
["Pontons latéraux:",7,null,0,null,7,0,null,"Pontons latéraux:",7,null,0.1,null,7,0.1]
["Refroidissement:",7,null,0,null,7,0,null,"Refroidissement:",7,null,7.0000000000000007E-2,null,7,7.0000000000000007E-2]
["Boîte de vitesse:",6,null,0,null,6,0,null,"Boîte de vitesse:",6,null,0.13,null,6,0.13]
["Freins:",6,null,0.52,null,6,0.52,null,"Freins:",6,null,0.66,null,6,0.66]
["Suspension:",7,null,0,null,7,0,null,"Suspension:",7,null,0.1,null,7,0.1]
["Électronique:",7,null,0.68,null,7,0.68,null,"Électronique:",7,null,0.76,null,7,0.76]

{"sheet":"Tables","index":5,"n_rows":125,"n_cols":33,"rows_kept":125,"cut":false,"hidden":true,"merged":[[81,19,82,19],[81,18,82,18],[0,0,0,12],[1,1,1,2],[1,3,2,3],[9,0,9,12],[11,1,11,11],[17,1,17,11],[24,0,24,12],[32,0,32,12],[44,0,44,12],[52,0,52,12],[70,3,70,6],[71,3,71,4],[71,5,71,6],[76,1,76,4],[83,0,83,12],[85,0,86,0],[88,0,88,12],[93,0,101,0],[103,0,103,12],[105,7,105,8],[110,0,110,1],[112,0,112,1],[114,0,114,12],[106,0,106,1],[106,7,106,8],[107,0,107,1],[108,0,108,1],[109,0,109,1],[0,16,0,25],[0,26,0,27],[0,31,0,32],[1,17,1,25],[4,31,4,32],[64,16,64,28],[23,31,23,32],[6,26,6,27],[10,31,10,32],[16,16,16,21],[16,23,16,28],[16,31,16,32]]}
["Setup Calculation - Weather Influence Table",null,null,null,null,null,null,null,null,null,null,null,null,null,null,null,"Voiture",null,null,null,null,null,null,null,null,null,"Entrainement Staff",null,null,null,null,"Essais"]
[null,"Wet",null,"Dry",null,null,null,null,null,null,null,null,null,null,null,null,null,"Coût",null,null,null,null,null,null,null,null,"Non",0,null,null,null,"Oui",1000000]
[null,"Temp","Offset",null,null,null,null,null,null,null,null,null,null,null,null,null,"Pièce",1,2,3,4,5,6,7,8,9,"Gestion du Stress",1500000,null,null,null,"Non",0]
["Wings",1,263,6,null,null,null,null,null,null,null,null,null,null,null,null,"Chassis",1292539,1600810,1982603,2455453,3041079,3766376,4664657,5777180,7155035,"Concentration",1000000]
["Engine",0.7,-190,-3,null,null,null,null,null,null,null,null,null,null,null,null,"Moteur",3311737,4101586,5079815,6291350,7791837,9650191,11951761,14802255,18332594,"Efficacité",1250000,null,null,null,"Offre Pilote"]
["Brakes",3.9883754414027002,105.532592432347,6,null,null,null,null,null,null,null,null,null,null,null,null,"A.Avant",1551354,1921352,2379594,2947128,3650018,4520547,5598697,6933985,8587742,null,null,null,null,null,"Non",0]
["Gear",-8.0199641815165705,-4.7427117035430202,-4,null,null,null,null,null,null,null,null,null,null,null,null,"A.Arrière",1504126,1862860,2307152,2857408,3538900,4382927,5428256,6722895,8326305,"Entrainement Pilote",null,null,null,null,"Publique",500000]
["Suspsensions",-1,-257,-6,null,null,null,null,null,null,null,null,null,null,null,null,"Fond Plat",510128,631794,782476,969097,1200226,1486481,1841006,2280088,2823887,"Non",0,null,null,null,"Semi-privée",1000000]
[null,null,null,null,null,null,null,null,null,null,null,null,null,null,null,null,"Pontons ",459831,569501,705327,873547,1081888,1339918,1659489,2055276,2545460,"Fitness",700000,null,null,null,"privée",1500000]
["Setup Calculation – Car Influence Table",null,null,null,null,null,null,null,null,null,null,null,null,null,null,null,"Refroidissement",454545,562954,697219,863505,1069451,1324515,1640412,2031650,2516199,"Yoga",700000]
[null,"Cha","Eng","F Wing","R Wing","Und","Side","Cool","Gear","Brake","Susp","Elec",null,null,null,null,"Boite de vitesse",3098104,3837002,4752127,5885509,7289203,9027678,11180779,13847395,17149998,"Relations Publiques",500000,null,null,null,"Offre TD"]
[null,"Level",null,null,null,null,null,null,null,null,null,null,null,null,null,null,"Freins",697674,864069,1070150,1325380,1641484,2032978,2517843,3118348,3862074,"Technique",600000,null,null,null,"Non",0]
["Wings",-19.739999999999998,null,30.03,30.03,-15.07,null,null,null,null,null,null,{"$f":"'Setup&WS'!$B$26*B13+'Setup&WS'!$B$27*C13+'Setup&WS'!$B$28*D13+'Setup&WS'!$B$29*E13+'Setup&WS'!$B$30*F13+'Setup&WS'!$B$31*G13+'Setup&WS'!$B$32*H13+'Setup&WS'!$B$33*I13+'Setup&WS'!$B$34*J13+'Setup&WS'!$B$35*K13+'Setup&WS'!$B$36*L13","v":176.75},null,null,null,"Suspensions",1181545,1463343,1812351,2244597,2779933,3442947,4264090,5281072,6540612,"Psychologie du Sport",400000,null,null,null,"Publique",500000]
["Engine",null,16.04,null,null,null,null,4.9000000000000004,null,null,null,3.34,{"$f":"'Setup&WS'!$B$26*B14+'Setup&WS'!$B$27*C14+'Setup&WS'!$B$28*D14+'Setup&WS'!$B$29*E14+'Setup&WS'!$B$30*F14+'Setup&WS'!$B$31*G14+'Setup&WS'!$B$32*H14+'Setup&WS'!$B$33*I14+'Setup&WS'!$B$34*J14+'Setup&WS'!$B$35*K14+'Setup&WS'!$B$36*L14","v":169.96},null,null,null,"Electronique",938416,1162228,1439420,1782721,2207900,2734484,3386659,4194377,5194736,"Ninja",550000,null,null,null,"Semi-privée",1000000]
["Brakes",6.04,null,null,null,null,null,null,null,-29.14,null,6.11,{"$f":"'Setup&WS'!$B$26*B15+'Setup&WS'!$B$27*C15+'Setup&WS'!$B$28*D15+'Setup&WS'!$B$29*E15+'Setup&WS'!$B$30*F15+'Setup&WS'!$B$31*G15+'Setup&WS'!$B$32*H15+'Setup&WS'!$B$33*I15+'Setup&WS'!$B$34*J15+'Setup&WS'!$B$35*K15+'Setup&WS'!$B$36*L15","v":-118.93},null,null,null,"Total",{"$f":"SUM(R4:R14)","v":14999999},18577499,23008234,28495695,35291919,43709042,54133649,67044521,83034642,"Spa resort",500000,null,null,null,"privée",1500000]
["Gearbox",null,null,null,null,null,null,null,-41,null,null,9,{"$f":"'Setup&WS'!$B$26*B16+'Setup&WS'!$B$27*C16+'Setup&WS'!$B$28*D16+'Setup&WS'!$B$29*E16+'Setup&WS'!$B$30*F16+'Setup&WS'!$B$31*G16+'Setup&WS'!$B$32*H16+'Setup&WS'!$B$33*I16+'Setup&WS'!$B$34*J16+'Setup&WS'!$B$35*K16+'Setup&WS'!$B$36*L16","v":-183}]
["Suspension",-15.27,null,null,null,-10.72,6.03,null,null,null,31,null,{"$f":"'Setup&WS'!$B$26*B17+'Setup&WS'!$B$27*C17+'Setup&WS'!$B$28*D17+'Setup&WS'!$B$29*E17+'Setup&WS'!$B$30*F17+'Setup&WS'!$B$31*G17+'Setup&WS'!$B$32*H17+'Setup&WS'!$B$33*I17+'Setup&WS'!$B$34*J17+'Setup&WS'!$B$35*K17+'Setup&WS'!$B$36*L17","v":77.28},null,null,null,"Revenus de Qualification",null,null,null,null,null,"Gpr","Revenus de Course",null,null,null,null,null,"Gpr",null,"Revenus Cup"]
[null,"Wear",null,null,null,null,null,null,null,null,null,null,null,null,null,null,"Position","Amateur","Elite","Master","Pro","Rookie",{"$f":"'Recap Saison'!G31","v":"Amateur"},"Position","Amateur","Elite","Master","Pro","Rookie",{"$f":"W18","v":"Amateur"},5,"Rookie",600000]
["Wings",0.47,null,-0.59,-0.59,0.32,null,null,null,null,null,null,{"$f":"'Setup&WS'!$C$26*B19+'Setup&WS'!$C$27*C19+'Setup&WS'!$C$28*D19+'Setup&WS'!$C$29*E19+'Setup&WS'!$C$30*F19+'Setup&WS'!$C$31*G19+'Setup&WS'!$C$32*H19+'Setup&WS'!$C$33*I19+'Setup&WS'!$C$34*J19+'Setup&WS'!$C$35*K19+'Setup&WS'!$C$36*L19","v":-4.9800000000000004},null,null,null,1,1000000,2500000,2000000,1500000,500000,{"$f":"LOOKUP($W$18,GROUPE,R19:V19)","v":1000000},1,12000000,22000000,18000000,15000000,8000000,{"$f":"LOOKUP($AD$18,$Y$18:$AC$18,Y19:AC19)","v":12000000},10,"Amateur",700000]
["Engine",null,-0.51,null,null,null,null,-0.09,null,null,null,-0.04,{"$f":"'Setup&WS'!$C$26*B20+'Setup&WS'!$C$27*C20+'Setup&WS'!$C$28*D20+'Setup&WS'!$C$29*E20+'Setup&WS'!$C$30*F20+'Setup&WS'!$C$31*G20+'Setup&WS'!$C$32*H20+'Setup&WS'!$C$33*I20+'Setup&WS'!$C$34*J20+'Setup&WS'!$C$35*K20+'Setup&WS'!$C$36*L20","v":-1.7999999999999998},null,null,null,2,900000,2250000,1800000,1350000,450000,900000,2,11748717.948717948,21620512.82051282,17671794.871794872,14710256.41025641,7800000,{"$f":"LOOKUP($AD$18,$Y$18:$AC$18,Y20:AC20)","v":11748717.948717948},15,"Pro",800000]
["Brakes",-0.14000000000000001,null,null,null,null,null,null,null,0.71,null,-0.09,{"$f":"'Setup&WS'!$C$26*B21+'Setup&WS'!$C$27*C21+'Setup&WS'!$C$28*D21+'Setup&WS'!$C$29*E21+'Setup&WS'!$C$30*F21+'Setup&WS'!$C$31*G21+'Setup&WS'!$C$32*H21+'Setup&WS'!$C$33*I21+'Setup&WS'!$C$34*J21+'Setup&WS'!$C$35*K21+'Setup&WS'!$C$36*L21","v":-9.9400000000000013},null,null,null,3,800000,2000000,1600000,1200000,400000,800000,3,11597435.897435896,21341025.64102564,17443589.743589744,14520512.82051282,7700000,11597435.897435896,20,"Master",900000]
["Gearbox",null,null,null,null,null,null,null,1.0900000000000001,null,null,-0.14000000000000001,{"$f":"'Setup&WS'!$C$26*B22+'Setup&WS'!$C$27*C22+'Setup&WS'!$C$28*D22+'Setup&WS'!$C$29*E22+'Setup&WS'!$C$30*F22+'Setup&WS'!$C$31*G22+'Setup&WS'!$C$32*H22+'Setup&WS'!$C$33*I22+'Setup&WS'!$C$34*J22+'Setup&WS'!$C$35*K22+'Setup&WS'!$C$36*L22","v":35.970000000000006},null,null,null,4,740000,1850000,1480000,1110000,370000,740000,4,11446153.846153846,21061538.461538464,17215384.615384616,14330769.230769232,7600000,11446153.846153846,25,"Elite",1000000]
["Suspension",0.34,null,null,null,0.23,-0.12,null,null,null,-0.7,null,{"$f":"'Setup&WS'!$C$26*B23+'Setup&WS'!$C$27*C23+'Setup&WS'!$C$28*D23+'Setup&WS'!$C$29*E23+'Setup&WS'!$C$30*F23+'Setup&WS'!$C$31*G23+'Setup&WS'!$C$32*H23+'Setup&WS'!$C$33*I23+'Setup&WS'!$C$34*J23+'Setup&WS'!$C$35*K23+'Setup&WS'!$C$36*L23","v":-7.2199999999999989},null,null,null,5,720000,1800000,1440000,1080000,360000,720000,5,11294871.794871796,20782051.28205128,16987179.487179488,14141025.64102564,7500000,11294871.794871796,{"$f":"AVERAGE(AD19:AD23)","v":11617435.897435898}]
[null,null,null,null,null,null,null,null,null,null,null,null,null,null,null,null,6,700000,1750000,1400000,1050000,350000,700000,6,11143589.743589744,20502564.102564104,16758974.35897436,13951282.051282052,7400000,11143589.743589744,null,"RISK"]
["Setup Calculation – Driver Influence Table",null,null,null,null,null,null,null,null,null,null,null,null,null,null,null,7,680000,1700000,1360000,1020000,340000,680000,7,10992307.692307692,20223076.923076924,16530769.230769232,13761538.461538462,7300000,10992307.692307692,null,0,0]
[null,"Conc","Tal","Aggr","Exp","Weight",null,null,null,null,null,null,null,null,null,null,8,660000,1650000,1320000,990000,330000,660000,8,10841025.64102564,19943589.743589744,16302564.102564104,13571794.871794872,7200000,10841025.64102564,null,5,1]
["Wings",null,null,null,null,null,null,null,null,null,null,null,null,null,null,null,9,640000,1600000,1280000,960000,320000,640000,9,10689743.58974359,19664102.564102564,16074358.974358976,13382051.282051282,7100000,10689743.58974359,null,10,2]
["Engine",null,null,0.29521804804429003,null,null,{"$f":"'Setup&WS'!C11*D28*IF('Setup&WS'!F18<>\"Indianapolis Oval\",1,0.39)","v":0},null,null,null,null,null,null,null,null,null,10,620000,1550000,1240000,930000,310000,620000,10,10538461.538461538,19384615.384615384,15846153.846153848,13192307.692307692,7000000,10538461.538461538,{"$f":"AVERAGE(AD24:AD28)","v":10841025.64102564},15,3]
["Brakes",null,-0.498,null,null,null,{"$f":"'Setup&WS'!C10*C29*IF('Setup&WS'!F18<>\"Indianapolis Oval\",1,0.39)","v":-104.58},null,null,null,null,null,null,null,null,null,11,600000,1500000,1200000,900000,300000,600000,11,10387179.487179488,19105128.205128208,15617948.717948718,13002564.102564104,6900000,10387179.487179488,null,20,4]
["Gearbox",0.5,null,null,null,null,{"$f":"'Setup&WS'!C9*B30*IF('Setup&WS'!F18<>\"Indianapolis Oval\",1,0.39)","v":102.5},null,null,null,null,null,null,null,null,null,12,580000,1450000,1160000,870000,290000,580000,12,10235897.435897436,18825641.025641024,15389743.58974359,12812820.512820512,6800000,10235897.435897436,null,25,5]
["Suspension",null,null,null,0.75,2,{"$f":"'Setup&WS'!C12*E31*IF('Setup&WS'!F18<>\"Indianapolis Oval\",1,0.39)+'Setup&WS'!C18*F31+IF('Setup&WS'!H20<>\"Dry\",'Setup&WS'!C13*0.11,0)","v":210.25},null,null,null,null,null,null,null,null,null,13,560000,1400000,1120000,840000,280000,560000,13,10084615.384615384,18546153.846153848,15161538.461538462,12623076.923076924,6700000,10084615.384615384,null,30,6]
[null,null,null,null,null,null,null,null,null,null,null,null,null,null,null,null,14,540000,1350000,1080000,810000,270000,540000,14,9933333.333333334,18266666.666666668,14933333.333333334,12433333.333333334,6600000,9933333.333333334,null,35,7]
["Driver Overall Calculation",null,null,null,null,null,null,null,null,null,null,null,null,null,null,null,15,520000,1300000,1040000,780000,260000,520000,15,9782051.282051282,17987179.487179488,14705128.205128204,12243589.743589744,6500000,9782051.282051282,{"$f":"AVERAGE(AD29:AD33)","v":10084615.384615384},40,8]
[null,"Factor","F*Att",null,null,null,null,null,null,null,null,null,null,null,null,null,16,500000,1250000,1000000,750000,250000,500000,16,9630769.2307692319,17707692.307692308,14476923.076923076,12053846.153846154,6400000,9630769.2307692319,null,45,9]
["Concentration",0.16650000000000001,{"$f":"B35*'Setup&WS'!C9","v":34.1325},null,null,null,0.16700000000000001,null,null,null,null,null,null,null,null,null,17,480000,1200000,960000,720000,240000,480000,17,9479487.17948718,17428205.128205128,14248717.948717948,11864102.564102564,6300000,9479487.17948718,null,50,10]
["Talent",0.249,{"$f":"B36*'Setup&WS'!C10","v":52.29},null,null,null,0.249,null,null,null,null,null,null,null,null,null,18,460000,1150000,920000,690000,230000,460000,18,9328205.128205128,17148717.948717948,14020512.82051282,11674358.974358974,6200000,9328205.128205128,null,55,11]
["Agressiveness",0.14549999999999999,{"$f":"B37*'Setup&WS'!C11","v":0},null,null,null,0.14499999999999999,null,null,null,null,null,null,null,null,null,19,440000,1100000,880000,660000,220000,440000,19,9176923.0769230761,16869230.769230768,13792307.692307692,11484615.384615384,6100000,9176923.0769230761,null,60,12]
["Experience",8.4699999999999998E-2,{"$f":"B38*'Setup&WS'!C12","v":11.095699999999999},null,null,null,8.6999999999999994E-2,null,null,null,null,null,null,null,null,null,20,420000,1050000,840000,630000,210000,420000,20,9025641.025641026,16589743.58974359,13564102.564102564,11294871.794871796,6000000,9025641.025641026,{"$f":"AVERAGE(AD34:AD38)","v":9328205.128205128},65,13]
["Technical insight",0.1245,{"$f":"B39*'Setup&WS'!C13","v":14.8155},null,null,null,0.125,null,null,null,null,null,null,null,null,null,21,400000,1000000,800000,600000,200000,400000,21,8874358.974358974,16310256.41025641,13335897.435897436,11105128.205128204,5900000,8874358.974358974,null,70,14]
["Stamina",0.14399999999999999,{"$f":"B40*'Setup&WS'!C14","v":13.823999999999998},null,null,null,0.14499999999999999,null,null,null,null,null,null,null,null,null,22,380000,950000,760000,570000,190000,380000,22,8723076.9230769239,16030769.230769232,13107692.307692308,10915384.615384616,5800000,8723076.9230769239,null,75,15]
["Charisma",8.2900000000000001E-2,{"$f":"B41*'Setup&WS'!C15","v":5.2226999999999997},null,null,null,8.2900000000000001E-2,null,null,null,null,null,null,null,null,null,23,360000,900000,720000,540000,180000,360000,23,8571794.871794872,15751282.051282052,12879487.17948718,10725641.025641026,5700000,8571794.871794872,null,80,16]
["Motivation",8.3500000000000005E-2,{"$f":"B42*'Setup&WS'!C16","v":20.374000000000002},"OA",null,null,8.4000000000000005E-2,null,null,null,null,null,null,null,null,null,24,340000,850000,680000,510000,170000,340000,24,8420512.82051282,15471794.871794872,12651282.051282052,10535897.435897436,5600000,8420512.82051282,null,85,17]
["Weight",-8.2699999999999996E-2,{"$f":"B43*'Setup&WS'!C18","v":-4.6311999999999998},{"$f":"SUM(C35:C43)","v":147.12319999999997},null,null,-8.2699999999999996E-2,null,null,null,null,null,null,null,null,null,25,320000,800000,640000,480000,160000,320000,25,8269230.769230769,15192307.692307692,12423076.923076924,10346153.846153846,5500000,8269230.769230769,{"$f":"AVERAGE(AD39:AD43)","v":8571794.8717948701},90,18]
[null,null,null,null,null,null,null,null,null,null,null,null,null,null,null,null,26,300000,750000,600000,450000,150000,300000,26,8117948.717948718,14912820.512820512,12194871.794871796,10156410.256410256,5400000,8117948.717948718,null,95,19]
["Fuel Calculation – Using method 2",null,null,null,null,null,null,null,null,null,null,null,null,null,null,null,27,280000,700000,560000,420000,140000,280000,27,7966666.666666667,14633333.333333334,11966666.666666668,9966666.6666666679,5300000,7966666.666666667,null,100,20]
[null,"Conc","Agg","Exp","TI","Eng lvl","Elec lvl",null,null,null,null,null,null,null,null,null,28,260000,650000,520000,390000,130000,260000,28,7815384.615384616,14353846.153846154,11738461.538461538,9776923.0769230761,5200000,7815384.615384616]
["Factors",-1.01165457155397E-4,7.0608061378709094E-5,-8.6645502152733194E-5,-1.6391545280336901E-4,-1.26912680856842E-2,-8.3557977071091003E-3,{"$f":"B47*'Setup&WS'!C9+C47*'Setup&WS'!C11+D47*'Setup&WS'!C12+E47*'Setup&WS'!C13+F47*'Setup&WS'!B27+G47*'Setup&WS'!B36","v":-0.19892487893201843},null,null,null,null,null,null,null,null,29,240000,600000,480000,360000,120000,240000,29,7664102.564102564,14074358.974358974,11510256.41025641,9587179.4871794879,5100000,7664102.564102564,null,"Vide"]
[null,null,null,null,null,null,null,null,null,null,null,null,null,null,null,null,30,220000,550000,440000,330000,110000,220000,30,7512820.512820513,13794871.794871796,11282051.282051282,9397435.897435898,5000000,7512820.512820513,null,"Chicanes"]
[null,"Nbre","Total","Coef","Conso","Tour","CR","Impacte",null,null,null,null,null,null,null,null,31,200000,500000,400000,300000,100000,200000,31,7361538.461538462,13515384.615384616,11053846.153846154,9207692.307692308,4900000,7361538.461538462,null,"Depassement"]
["Boost",{"$f":"3*'Tyre&Fuel'!H29","v":9},{"$f":"'Tyre&Fuel'!D22","v":79},{"$f":"B50/C50","v":0.11392405063291139},{"$f":"VLOOKUP('Setup&WS'!F18,Tracks!$A$3:$AA$889,9,0)*'Tyre&Fuel'!C15","v":181.56824515089929},{"$f":"E50/C50","v":2.2983322170999911},{"$f":"+B50*3/100","v":0.27},{"$f":"ROUNDUP(F50*B50*D50*(1+G50),0.1)","v":3},null,null,null,null,null,null,null,null,32,180000,450000,360000,270000,90000,180000,32,7210256.41025641,13235897.435897436,10825641.025641026,9017948.717948718,4800000,7210256.41025641,null,"Epingle a cheveux"]
[null,null,null,null,null,null,null,null,null,null,null,null,null,null,null,null,33,160000,400000,320000,240000,80000,160000,33,7058974.358974359,12956410.256410256,10597435.897435898,8828205.128205128,4700000,7058974.358974359,null,"freinage"]
[null,null,null,null,null,null,null,null,null,null,null,null,null,null,null,null,34,140000,350000,280000,210000,70000,140000,34,6907692.307692308,12676923.076923076,10369230.76923077,8638461.538461538,4600000,6907692.307692308,null,"Reglages"]
["Tyre Wear Calculation",null,null,null,null,null,null,null,null,null,null,null,null,null,null,null,35,120000,300000,240000,180000,60000,120000,35,6756410.256410256,12397435.897435898,10141025.64102564,8448717.948717948,4500000,6756410.256410256,null,"Tester les Limites"]
[null,"Type","Factor",null,null,"max km",null,null,null,null,null,null,null,null,null,null,36,100000,250000,200000,150000,50000,100000,36,6605128.205128205,12117948.717948718,9912820.5128205121,8258974.358974359,4400000,6605128.205128205,null,"Virage"]
["Extra Soft",0,0.998163750229071,null,{"$f":"$B$82*$C$82*$D$82*$F$82*$G$82*$H$82*$I$82*($E$81^B55)*(C55^$J$80)","v":0.59802826846392576},{"$f":"E55*$B$77*VLOOKUP('Setup&WS'!$F$18,Tracks!$A$3:$AD$889,30,0)","v":78.607076759031884},{"$f":"+E55*$B$77/#REF!","v":{"$error":"#REF!"}},null,{"$f":"E55*B77*G55","v":{"$error":"#REF!"}},null,null,null,null,null,null,null,37,80000,200000,160000,120000,40000,80000,37,6453846.153846154,11838461.538461538,9684615.384615384,8069230.769230769,4300000,6453846.153846154,null,"Vitesse de pointe"]
["Hard",3,0.99586252604811198,null,{"$f":"$B$82*$C$82*$D$82*$F$82*$G$82*$H$82*$I$82*($E$81^B56)*(C56^$J$80)","v":1.3891523659867426},{"$f":"E56*$B$77*VLOOKUP('Setup&WS'!$F$18,Tracks!$A$3:$AD$889,30,0)","v":182.59539292948591},{"$f":"+E56*$B$77/#REF!","v":{"$error":"#REF!"}},null,null,null,null,null,null,null,null,null,38,60000,150000,120000,90000,30000,60000,38,6302564.102564103,11558974.35897436,9456410.256410256,7879487.17948718,4200000,6302564.102564103]
["Medium",2,0.99638034655434904,null,{"$f":"$B$82*$C$82*$D$82*$F$82*$G$82*$H$82*$I$82*($E$81^B57)*(C57^$J$80)","v":1.0410925181065804},{"$f":"E57*$B$77*VLOOKUP('Setup&WS'!$F$18,Tracks!$A$3:$AD$889,30,0)","v":136.8451021458601},{"$f":"+E57*$B$77/#REF!","v":{"$error":"#REF!"}},null,null,null,null,null,null,null,null,null,39,40000,100000,80000,60000,20000,40000,39,6151282.051282051,11279487.17948718,9228205.128205128,7689743.58974359,4100000,6151282.051282051,null,"OUI"]
["Rain",3.05,0.99608785438452296,null,{"$f":"$B$82*$C$82*$D$82*$F$82*$G$82*$H$82*$I$82*($E$81^B58)*(C58^$J$80)","v":1.4200354405038871},{"$f":"E58*$B$77*VLOOKUP('Setup&WS'!$F$18,Tracks!$A$3:$AD$889,30,0)*1.25","v":233.31847497558581},{"$f":"+E58*$B$77/#REF!","v":{"$error":"#REF!"}},null,null,null,null,null,null,null,null,null,40,20000,50000,40000,30000,10000,20000,40,6000000,11000000,9000000,7500000,4000000,6000000,null,"NON"]
["Soft",1,0.99706484481765401,null,{"$f":"$B$82*$C$82*$D$82*$F$82*$G$82*$H$82*$I$82*($E$81^B59)*(C59^$J$80)","v":0.78415775293135626},{"$f":"E59*$B$77*VLOOKUP('Setup&WS'!$F$18,Tracks!$A$3:$AD$889,30,0)","v":103.07263373049621},{"$f":"+E59*$B$77/#REF!","v":{"$error":"#REF!"}},null,null,null,null,null,null,null,null,null,41,0,0,0,0,0,0,41,0,0,0,0,0,0]
[null,null,null,null,null,null,null,null,null,null,null,null,null,null,null,null,null,null,null,null,null,null,null,"NON",null,null,null,null,null,{"$f":"LOOKUP($AD$18,$Y$18:$AC$18,Y60:AC60)","v":0}]
["Avonn",{"$f":"'Setup&WS'!$L31","v":8},null,null,null,null,null,null,null,null,null,null,null,null,null,null,null,null,null,null,null,null,null,"OUI",700000,1000000,900000,800000,600000,{"$f":"LOOKUP($AD$18,$Y$18:$AC$18,Y61:AC61)","v":700000}]
["Badyear",{"$f":"'Setup&WS'!$L32","v":7}]
["Bridgerock",{"$f":"'Setup&WS'!$L33","v":7},null,null,null,null,"Coef",{"$f":"VLOOKUP('Setup&WS'!$F$18,Tracks!$A$3:$AD$889,30,0)","v":1.0128473948226895},{"$f":"+H63+(1-#REF!)","v":{"$error":"#REF!"}}]
["Contimental",{"$f":"'Setup&WS'!$L34","v":8},null,null,null,null,null,{"$f":"E59*B77","v":101.76521582359429}]
["Dunnolop",{"$f":"'Setup&WS'!$L35","v":4},null,null,null,null,null,{"$f":"H63*H64","v":103.07263373049621},null,null,null,null,null,null,null,null,"Energy Calculation "]
["Hancock",{"$f":"'Setup&WS'!$L36","v":1}]
["Michelini",{"$f":"'Setup&WS'!$L37","v":5},null,null,null,null,null,null,null,null,null,null,null,null,null,null,null,"Base","Coef","Resultat","cr","Coef"]
["Pipirelli",{"$f":"'Setup&WS'!$L38","v":1},null,null,null,null,null,null,null,null,null,null,null,null,null,null,"Con.",{"$f":"+'Setup&WS'!C9","v":205},-5.9897272803935658E-4,{"$f":"1+(R68*S68)","v":0.87721059075193186},0,2.2000000000000002]
["Yokomama",{"$f":"'Setup&WS'!$L39","v":3},null,null,null,null,null,null,null,null,null,null,null,null,null,null,"Poids",{"$f":"+'Setup&WS'!C18","v":56},1.1458837538843296E-3,{"$f":"1-(R69*S69)","v":0.9358305097824775},0.1,2]
[null,null,null,null,null,null,null,null,null,null,null,null,null,null,null,null,"Tal.",{"$f":"+'Setup&WS'!C10","v":210},-1.1975501410170018E-3,{"$f":"1+(R70*S70)","v":0.7485144703864296},0.2,1.8]
["Very high",4,null,"Selected Track",null,null,null,null,null,null,null,null,null,null,null,null,"Agr.",{"$f":"+'Setup&WS'!C11","v":0},-1.9234472247041531E-4,{"$f":"1-(R71*S71)","v":1},0.3,1.6]
["High",3,null,"Track Wear",null,{"$f":"VLOOKUP('Setup&WS'!F18,Tracks!A3:F889,6,0)","v":"Medium"},null,null,null,null,null,null,null,null,null,null,"Exp.",{"$f":"+'Setup&WS'!C12","v":131},-1.7096601950894093E-3,{"$f":"1-(R72*S72)","v":1.2239654855567126},0.4,1.4]
["Medium",2,null,null,null,null,null,null,null,null,null,null,null,null,null,null,"AGE",{"$f":"+'Setup&WS'!C19","v":25},3.0310361807312338E-3,1.0757759045182809,0.5,1.2]
["Low",1,null,null,null,null,null,null,null,null,null,null,null,null,null,null,"End.",{"$f":"+'Setup&WS'!C14","v":96},-1.3732478717659994E-3,{"$f":"1-(R74*S74)","v":1.1318317956895361},0.6,1]
["Very low",0,null,null,null,null,null,null,null,null,null,null,null,null,null,null,"Mot.",{"$f":"+'Setup&WS'!C16","v":244},-8.3630482331032574E-5,0.97959416231122809,0.7,0.8]
[null,null,null,null,null,null,null,null,null,null,null,null,null,null,null,null,"Boost",{"$f":"+'Tyre&Fuel'!H29","v":3},{"$f":"+'Tyre&Fuel'!D22","v":79},{"$f":"1+(R76/S76)","v":1.0379746835443038},0.8,0.6]
["Base Wear",129.77645817206201,null,null,null,null,null,null,null,null,null,null,null,null,null,null,"TEMP",null,6.309584662743375E-3,1,0.9,0.4]
[null,null,null,null,null,null,null,null,null,null,null,null,null,null,null,null,"Coef",{"$f":"'Setup&WS'!F18","v":"Adelaide"},{"$f":"LOOKUP(R78,Tracks!A3:A62,Tracks!AR3:AR62)","v":2.8984848185734826},{"$f":"+S78","v":2.8984848185734826},1,0.2]
[null,"Trk Wear","AvgT","T Fourn","T Type","Susp","Agg","Exp","Weig","CT"]
["Values",{"$f":"VLOOKUP(F72,A71:B75,2,0)","v":2},{"$f":"'Setup&WS'!F22","v":32.333333333333336},{"$f":"VLOOKUP('Tyre&Fuel'!C10,A61:B69,2,0)","v":1},{"$f":"VLOOKUP('Tyre&Fuel'!C11,A55:C59,2,0)","v":3},{"$f":"'Setup&WS'!B35","v":7},{"$f":"'Setup&WS'!C11","v":0},{"$f":"'Setup&WS'!C12","v":131},{"$f":"'Setup&WS'!C18","v":56},{"$f":"'Tyre&Fuel'!J22","v":30},null,null,null,null,null,null,null,null,"Coef",{"$f":"T68^T69^T70^T71^T72^T73^T74^T75^T76^T77^T78","v":0.66827014293616449}]
["Factors",0.89641617623862402,0.98846362200000004,1.0488763560000001,1.355293715,1.0093392940000001,0.999670155,1.0002293600000001,0.99985832900000005,{"$f":"VLOOKUP('Tyre&Fuel'!C11,A55:C59,3,0)","v":0.99586252604811198},null,null,null,null,null,null,null,null,"cr",{"$f":"IF('Setup&WS'!H22=\"Wet\",(100-'Tyre&Fuel'!J23)/100,(100-'Tyre&Fuel'!J22)/100)","v":0.7}]
["Factors^Val",{"$f":"B81^B80","v":0.80356196102227584},0.68716706408663941,1.0488763560000001,2.4894320299554207,1.0672355072800872,1,1.0304985505870821,0.99209725416305017,0.8830427108373774,{"$f":"PRODUCT(B82:J82)","v":1.3891523659867429},null,null,null,null,null,null,null,"Energy",{"$f":"(T80^T81)*LOOKUP(T81,U68:U78,V68:V78)*IF('Setup&WS'!H22=\"Wet\",0.75,1)","v":0.60333209345717531}]
[]
["Race Pit Stop Calculation"]
[]
["Lap Calcs",{"$f":"ROUNDDOWN(VLOOKUP('Setup&WS'!F18,Tracks!$A$3:$H$889,8,0)/('Tyre&Fuel'!$H$22+1),0)","v":39},{"$f":"IF('Tyre&Fuel'!$H$22>=1,ROUNDDOWN(VLOOKUP('Setup&WS'!F18,Tracks!$A$3:$H$889,8,0)/('Tyre&Fuel'!$H$22+1),0),\"-\")","v":39},{"$f":"IF('Tyre&Fuel'!$H$22>=2,ROUNDDOWN(VLOOKUP('Setup&WS'!F18,Tracks!$A$3:$H$889,8,0)/('Tyre&Fuel'!$H$22+1),0),\"-\")","v":"-"},{"$f":"IF('Tyre&Fuel'!$H$22>=3,ROUNDDOWN(VLOOKUP('Setup&WS'!F18,Tracks!$A$3:$H$889,8,0)/('Tyre&Fuel'!$H$22+1),0),\"-\")","v":"-"},{"$f":"IF('Tyre&Fuel'!$H$22>=4,ROUNDDOWN(VLOOKUP('Setup&WS'!F18,Tracks!$A$3:$H$889,8,0)/('Tyre&Fuel'!$H$22+1),0),\"-\")","v":"-"}]
[null,{"$f":"IF(VLOOKUP('Setup&WS'!F18,Tracks!$A$3:$H$889,8,0)-SUM($B$86:$F$86)>0,1,0)","v":1},{"$f":"IF(VLOOKUP('Setup&WS'!F18,Tracks!$A$3:$H$889,8,0)-SUM($B$86:$F$86)>1,1,0)","v":0},{"$f":"IF(VLOOKUP('Setup&WS'!F18,Tracks!$A$3:$H$889,8,0)-SUM($B$86:$F$86)>2,1,0)","v":0},{"$f":"IF(VLOOKUP('Setup&WS'!F18,Tracks!$A$3:$H$889,8,0)-SUM($B$86:$F$86)>3,1,0)","v":0},{"$f":"IF(VLOOKUP('Setup&WS'!F18,Tracks!$A$3:$H$889,8,0)-SUM($B$86:$F$86)>4,1,0)","v":0}]
[]
["Parts Wear Calculation"]
[]
["Common Factor",{"$f":"(0.998789138^'Setup&WS'!C9)*(0.998751839^'Setup&WS'!C10)*(0.998707677^'Setup&WS'!C12)*(1.0009^'Setup&WS'!C11)","v":0.50658738616017762}]
[]
[null,"Lvl","Factor"]
["CT Risk Factors / Lvl",1,1.0193267935988299]
[null,2,1.00995581572653]
[null,3,1.0073261618496101]
[null,4,1.0053141448054901]
[null,5,1.0043268635857201]
[null,6,1.0036669136885199]
[null,7,1.00430482472465]
[null,8,1.0096900118273699]
[null,9,1.0051519553917501]
[]
["Pit Stop Estimated Refuel Time"]
[]
[null,null,"TD","No TD",null,null,null,"Using TD?"]
["Fuel Tanked",null,3.1470799100151797E-2,3.5999999999999997E-2,null,{"$f":"IF($H$107=\"Yes\",C107,D107)","v":3.5999999999999997E-2},null,{"$f":"IF(SUM('Setup&WS'!H8:H12)>0,\"Yes\",\"No\")","v":"No"}]
["Staff Concentration",null,-9.4545618459636896E-2,-0.08,null,{"$f":"IF($H$107=\"Yes\",C108,D108)","v":-0.08}]
["Staff Stress Handling",null,-3.5538342026769199E-2,-0.184,null,{"$f":"IF($H$107=\"Yes\",C109,D109)","v":-0.184}]
["TD Experience",null,-9.4469512881002592E-3,0,null,{"$f":"IF($H$107=\"Yes\",C110,D110)","v":0}]
["TD Pit Coordination",null,-2.5000000000000001E-2,0,null,{"$f":"IF($H$107=\"Yes\",C111,D111)","v":0}]
[]
["Base Pitstop",null,26.26,null,24.26]
[]
["Tyre Compound Difference"]
[]
["Pipirelli",0]
["Avonn",2.1000000000000001E-2]
["Yokomama",0.05]
["Dunnolop",7.0000000000000007E-2]
["Contimental",2.8000000000000001E-2]
["Badyear",0.09]
["Bridgerock",0.04]
["Hancock",0.1]
["Michelini",0.11]

{"sheet":"CR DE COURSE","index":6,"n_rows":57,"n_cols":30,"rows_kept":57,"cut":false,"hidden":true,"merged":[[49,20,52,21],[38,29,38,30],[56,14,60,24],[46,14,48,15],[46,16,48,16],[46,17,48,17],[46,18,48,18],[50,16,52,16],[50,17,52,17],[50,18,52,18],[50,14,52,15],[51,22,52,22],[51,23,52,23],[51,24,52,24],[49,22,50,22],[49,23,50,23],[47,11,47,12],[48,11,48,12],[36,27,36,28],[37,27,37,28],[33,27,33,28],[34,27,34,28],[35,27,35,28],[46,28,46,29],[48,28,48,29],[40,24,42,24],[43,24,45,24],[41,18,42,19],[47,24,48,24],[32,29,33,30],[34,29,34,30],[35,29,35,30],[0,0,0,11],[44,14,45,15],[43,14,43,15],[40,14,40,15],[45,28,45,29],[32,17,32,19],[32,27,32,28],[36,29,36,30],[37,29,37,30],[44,16,45,17],[43,18,43,19],[44,18,45,19],[37,25,37,26],[41,14,42,15],[40,16,40,17],[41,16,42,17],[46,20,48,21],[34,25,34,26],[35,25,35,26],[32,25,32,26],[33,25,33,26],[36,25,36,26],[53,14,55,24],[38,25,38,27],[40,29,40,30],[42,29,42,30],[40,18,40,19],[40,20,42,21],[40,22,42,23],[46,19,48,19],[50,19,52,19],[43,20,45,21],[43,22,45,23],[46,22,46,24],[47,22,48,22],[47,23,48,23],[49,24,50,24],[43,16,43,17]]}
["COPIER COLLER DE CR DE COURSE"]
["Temps au tour",null,null,null,null,null,null,null,null,null,null,null,null," "]
["Qualification 1","Qualification 2",null,null,null,null,null,null,null,null,null,null,null,"Analyse financière de la course précédente"]
["1:25.334s (#2)","1:27.341s (#3)",null,null,null,null,null,null,null,null,null,null,null,"Gains"]
[null,null,null,null,null,null,null,null,null,null,null,null,null,"Position en course (3):","$11.597.436"]
["Réglages utilisés",null,null,null,null,null,null,null,null,null,null,null,null,"Position en qualifs (2):","$900.000"]
["Session","A.Av.","A.Ar.","Mot.","Fre.","B.V.","Susp.","Pneus",null,null,null,null,null,"Gains par sponsor:","$596.052"]
["Q1",677,691,810,556,564,543,"Tendres",null,null,null,null,null,"Coûts"]
["Q2",666,677,821,538,576,561,"Tendres",null,null,null,null,null,"Bonus de podium:","$-1.000"]
["Course",669,681,818,543,573,556,"Tendres",null,null,null,null,null,"Salaire du pilote:","$-1.454.522"]
[null,null,null,null,null,null,null,null,null,null,null,null,null,"Salaire du personnel:","$-665.000"]
["Risques utilisés",null,null,null,null,null,null,null,null,null,null,null,null,"Coût des installations:","$-775.000"]
["Risque en Q1",null,"Risque en Q2",null,null,null,null,null,null,null,null,null,null,"Contrat pneus (Pipirelli):","$-250.000"]
["Pousser la voiture à la limite","Pousser la voiture à la limite",null,null,null,null,null,null,null,null,null,null,null," "]
["Risques au départ",null,null,null,null,null,null,null,null,null,null,null,null,"Total:","$9.947.966"]
["Forcer son chemin vers l'avant",null,null,null,null,null,null,null,null,null,null,null,null," "]
["Dépassement","Défense","Sec et dégagé","Mouillé","Disfonctionnement",null,null,null,null,null,null,null,null,"Balance actuelle:","$35.906.206"]
[30,60,30,0,0]
[]
["Caractéristiques pilote"]
["Pilotes","NG","Con.","Tal.","Agr.","Exp.","Tech.","End.","Cha.","Mot.","Rép.","Poids",null,null,"Bonus de podium:",null,null,null,{"$f":"RIGHT(T21,6)","v":"-1.000"},{"$f":"IFERROR(VLOOKUP(O21,$N$6:$O$15,2,0),0)","v":"$-1.000"}]
["Elio Gabbiani",146,205,210,0,130,117,90,62,244,0,57,null,null,"Bonus points pour le DT:",null,null,null,{"$f":"RIGHT(T22,7)*-1000","v":0},0]
["(+1)",0,0,0,"(+1)","(+2)","(+4)","(+1)","(+6)",0,0,null,null,null,"Coût des installations:",null,null,null,{"$f":"RIGHT(T23,7)*-1000","v":-775000},"$-775.000"]
[null,null,null,null,null,null,null,null,null,null,null,null,null,null,"Gains par sponsor:",null,null,null,{"$f":"RIGHT(T24,7)*1000","v":596052},"$596.052"]
["Energie du pilote",null,null,null,null,null,null,null,null,null,null,null,null,null,"Salaire du DT :",null,null,null,{"$f":"RIGHT(T25,7)*-1000","v":0},0]
["Q1",null,null,null,null,null,null,null,null,null,null,null,null,null,"Salaire du personnel:",null,null,null,-665000,"$-665.000"]
[0.8,"    ",0.75,null,null,null,null,null,null,null,null,null,null,null,"Salaire du pilote:",null,null,null,-1454522,"$-1.454.522"]
["Q2",null,null,null,null,null,null,null,null,null,null,null,null,null,"Tour du pilote le plus rapide:",null,null,null,1000000,0]
[0.75,"    ",0.71]
["Course "]
[0.88,"    ",0.26]
[]
["Positions",null,null,null,null,null,null,null,null,null,null,null,null,null,null,"Hum",null,{"$f":"'Tyre&Fuel'!C11","v":"Hard"},null,null,null,null,null,null,null,"Relais 1",null,109.654,null,"Race"]
["Départ","Arrivée",null,null,null,null,null,null,null,null,null,null,null,null,null,9.7100000000000009,null,null,null,null,null,null,null,null,null,"Relais 2",null,111.02500000000001]
[2,3,null,null,null,null,null,null,null,null,null,null,null,null,"Trk Wear","AvgT","T Fourn","T Type","Susp","Agg","Exp","Weig","CT",null,null,"Relais 3",null,114.389,null,"Km"]
["Caractéristiques générales de la voiture",null,null,null,null,null,null,null,null,null,null,null,null,"Values",{"$f":"Tables!B80","v":2},11.2,{"$f":"Tables!D80","v":1},{"$f":"Tables!E80","v":3},{"$f":"Tables!F80","v":7},{"$f":"Tables!G80","v":0},{"$f":"Tables!H80","v":131},{"$f":"Tables!I80","v":56},{"$f":"Tables!J80","v":30},null,null,"Relais 4",null,119.565,null,{"$f":"VLOOKUP('Setup&WS'!$F$18,Tracks!A3:AD889,8,0)","v":79}]
["Puissance","Maniabilité","Accélération",null,null,null,null,null,null,null,null,null,null,"Factors",0.89641617623862402,0.98846362200000004,1.0488763560000001,1.355293715,1.0093392940000001,0.999670155,1.0002293600000001,0.99985832900000005,{"$f":"Tables!J81","v":0.99586252604811198},null,null,"Relais 5",null,null,null,"Laps"]
[90,95,92,null,null,null,null,null,null,null,null,null,null,"Factors^Val",{"$f":"O37^O36","v":0.80356196102227584},{"$f":"P37^P36","v":0.87813186513680397},1.0488763560000001,2.4894320299554207,1.0672355072800872,1,1.0304985505870821,0.99209725416305017,0.8830427108373774,{"$f":"PRODUCT(O38:W38)","v":1.7751999795341478},null,"Moyenne",null,{"$f":"AVERAGE(AB33:AC37)","v":113.65825},null,{"$f":"VLOOKUP('Setup&WS'!$F$18,Tracks!A3:AD889,9,0)","v":298.60000000000002}]
[null,null,null,null,null,null,null,null,null,null,null,null,null,null,null,null,null,null,null,null,null,null,null,null,null,"Nbre Pit",null,null,{"$f":"COUNT(AB33:AC37)-1","v":3}]
["Niveau des pièces de la voiture"]
["Cha.","Mot.","A.Av.","A.Ar.","F.P.","P.L.","Refr.","B.V.","Fre.","Susp.","Elec.",null,null,null,"Fuel",null,"Race",null,"Delta",null,"Piece Caisse",null,"Depart",null,{"$f":"A35","v":2},null,null,null,null,{"$f":"+(AD38/AD36)*1.5","v":5.669620253164557}]
[7,6,7,7,7,7,7,6,6,7,7,null,null,null,{"$f":"+'Tyre&Fuel'!M27","v":186},null,217.4,null,{"$f":"IF((O42/AD36)*1.6>ABS(O42-Q42),\"OK\",O42-Q42)","v":-31.400000000000006}]
["Usure des pièces de la voiture (au départ)",null,null,null,null,null,null,null,null,null,null,null,null,null,null,null,null,null,null,null,null,null,null,null,null,null,null,null,null,{"$f":"+O45-Q45","v":119.68068799418297}]
[0.48,0.6,7.0000000000000007E-2,0.08,0.65,0.1,7.0000000000000007E-2,0.13,0.66,0.1,0.76,null,null,null,"Pneus",null,"Race",null,"delta",null,{"$f":"M50","v":false},null,"Arrivée",null,{"$f":"B35","v":3}]
["Usure des pièces de la voiture (à l'arrivée)",null,null,null,null,null,null,null,null,null,null,null,null,null,{"$f":"X38*VLOOKUP('Setup&WS'!$F$18,Tracks!A3:AD889,30,0)*Tables!B77*IF('Tyre&Fuel'!C7=\"Wet\",1.25,1)","v":233.33893799418297},null,{"$f":"+AB38","v":113.65825},null,{"$f":"IF((AD38/AD36)*1.5>ABS(O45-Q45),\"OK\",O45-Q45)","v":119.68068799418297}]
[0.71,1,0.31,0.34,0.86,0.28000000000000003,0.2,0.33,0.97,0.4,0.9]
[null,null,null,null,null,null,null,null,null,null,null,null,null,null,"Boost",null,{"$f":"Qualif!F34","v":1},{"$f":"Qualif!H34","v":35},{"$f":"Qualif!J34","v":55},"DM","forcer vers l'avant",null,"Risk"]
[{"$f":"+A46-A44","v":0.22999999999999998},{"$f":"+B46-B44","v":0.4},0.24,0.26,0.20999999999999996,0.18000000000000002,0.13,0.2,0.30999999999999994,0.30000000000000004,0.14000000000000001,"Usure",null,null,null,null,null,null,null,null,null,null,{"$f":"A18","v":30},{"$f":"B18","v":60},{"$f":"C18","v":30}]
[{"$f":"'Tyre&Fuel'!S25/100","v":0.21725696766591404},{"$f":"'Tyre&Fuel'!$S$26/100","v":0.12792465518727955},{"$f":"'Tyre&Fuel'!$S$27/100","v":0.22976187787612157},{"$f":"'Tyre&Fuel'!$S$28/100","v":0.27050368210937831},{"$f":"'Tyre&Fuel'!$S$29/100","v":0.24524606853733244},{"$f":"'Tyre&Fuel'!$S$30/100","v":0.14807081467801017},{"$f":"'Tyre&Fuel'!$S$31/100","v":0.17285589247252747},{"$f":"'Tyre&Fuel'!$S$32/100","v":0.16446986028886623},{"$f":"'Tyre&Fuel'!$S$33/100","v":0.13648216286569345},{"$f":"'Tyre&Fuel'!$S$34/100","v":8.6036087298801009E-2},{"$f":"'Tyre&Fuel'!$S$35/100","v":0.12363149476948941},"Est"]
[{"$f":"+A48-A49","v":1.2743032334085941E-2},{"$f":"+B48-B49","v":0.27207534481272044},1.0238122123878424E-2,-1.0503682109378298E-2,-3.5246068537332476E-2,3.192918532198985E-2,-4.2855892472527468E-2,3.5530139711133779E-2,0.17351783713430649,0.21396391270119902,1.6368505230510602E-2,{"$f":"AVERAGE(A50:K50)","v":6.1614585113689668E-2},{"$f":"IF(L50<0.02,\"OK\",FALSE)","v":false},null,null,null,null,null,null,null,"Energy",null,"Q1","Q2","Race"]
[null,null,null,null,null,null,null,null,null,null,null,null,null,null,"PMA",null,{"$f":"A38","v":90},{"$f":"B38","v":95},{"$f":"C38","v":92},1]
[null,null,null,null,null,null,null,null,null,null,null,null,null,null,null,null,null,null,null,null,null,null,{"$f":"A27-C27","v":5.0000000000000044E-2},{"$f":"A29-C29","v":4.0000000000000036E-2},{"$f":"A31-C31","v":0.62}]
[]
[]
[]
[]
[null,null,null,null,null,null,null,null,null,null,null,null,null,null,{"$f":"'Setup&WS'!F18","v":"Adelaide"}]

{"sheet":"Tracks","index":7,"n_rows":66,"n_cols":51,"rows_kept":66,"cut":false,"hidden":true,"merged":[[0,1,0,16],[0,18,0,22],[0,26,0,27],[0,31,0,41],[0,46,0,47]]}
["Track List","Track Details Table",null,null,null,null,null,null,null,null,null,null,null,null,null,null,null,null,"Track Base Setup",null,null,null,null,null,"WS Base",null,"Fuel 2 Base",null,null,"Tyre Base",null,"Parts Wear Base",null,null,null,null,null,null,null,null,null,null,null,"Coef ",null,null,"Fuel 2 Base",null,"Tyre Base",null,"WS Base"]
["Name","Downforce","Overtaking","Suspension","Fuel (5)","Tyre Wear","Lap Length","Laps","Distance","P (10)","H","A","Avg. Speed","Note","Corners (15)","Pit I/O","Grip",null,"Wings (19)","Engine","Brakes","Gear","Suspension",null,"WS (25)",null,"L/km (27)","L/km (wet)",null,"Wear (30)",null,"Cha (32)","Eng","FW","RW","UndB","SidP","Coo","GeaB","Bra","Sus","Ele",null,"Energy",null,null,"L/km (27)","L/km (wet)","Wear (30)",null,"WS (25)"]
["A1-Ring","Low","Easy","Medium","High","Medium",4.3250000000000002,71,307.10000000000002,13,8,9,226.29,null,9,21,"Low",null,249.22,714.42,676.29,789.1,511.89,null,141.46,null,0.875,0.78290000000000004,null,0.96199999999999997,null,28.364000000000001,53.048999999999999,20.163,21.196000000000002,20.946999999999999,24.105,18.277999999999999,35.533000000000001,41.421999999999997,26.859000000000002,21.234000000000002,null,3.117434457869626,null,null,0.875,0.91437499999999994,0.89210999999999996,null,141.46]
["Adelaide","Medium","Hard","Medium","Low","Medium",3.78,79,298.60000000000002,8,9,10,190.87,null,12,19.5,"Low",null,631.9,496.9,358.33,549.99,652.04999999999995,null,79.459999999999994,null,0.80698999999999999,0.69998000000000005,null,1.0128473948226895,null,37.701000000000001,22.199000000000002,39.871000000000002,46.941000000000003,42.558,25.695,29.995999999999999,29.09,23.684000000000001,14.93,21.454000000000001,null,2.8984848185734826,null,null,0.80698999999999999,0.84330454999999993,0.94557000000000002,null,79.459999999999994]
["Ahvenisto","High","Normal","Soft","Medium","High",3.04,80,243.2,5,10,7,148.41999999999999,null,10,11.5,"Normal",null,993.04,466.54,699.74,766.1,252.44,null,228.29049000000001,null,0.84548000000000001,0.79600000000000004,null,1.0345,null,19.004999999999999,27.242000000000001,26.228000000000002,25.398,21.434000000000001,19.065999999999999,15.144,23.54,30.803999999999998,21.994,11.295,null,3.7629173868185526,null,null,0.84548000000000001,0.88352659999999994,0.93359999999999999,null,228.29049000000001]
["Anderstorp","Low","Very Hard","Soft","High","Medium",4.0259999999999998,70,281.8,9,11,9,203.49,null,10,13.5,"Low",null,250.72,699.88,769.29,611.17999999999995,107.05,null,75.319699999999997,null,0.90417999999999998,0.78500000000000003,null,0.99665375810405799,null,24.056999999999999,52.52,19.009,17.681999999999999,41.683,26.54,14.497,40.326000000000001,51.838999999999999,20.751999999999999,12.061999999999999,null,3.0512657387649993,null,null,0.90417999999999998,0.94486809999999988,0.97099999999999997,null,75.319699999999997]
["Austin","Medium","Easy","Hard","Medium","Medium",5.516,56,308.89999999999998,11,18,10,190.53,null,20,17.5,"High",null,521.55999999999995,605.59,608.9,640.62,786.9,null,173.6,null,0.86168999999999996,0.752,null,1.0502,null,17.437000000000001,39.613,28.306000000000001,28.364999999999998,19.710999999999999,18.619,19.175999999999998,29.87,35.686999999999998,15.265000000000001,15.166,null,3.0977106554992306,null,null,0.86168999999999996,0.90046604999999991,1.0037400000000001,null,173.6]
["Avus","Low","Easy","Hard","Very High","Low",4.88,64,312.3,22,3,9,285.89,null,4,13,"Normal",null,302.56478499999997,636.26228030000004,412.39800000000002,387.41,821.34,null,103.24509999999999,null,0.90563000000000005,{"$f":"+AA8/1.283","v":0.70586905689789559},null,1.18641,null,29.640999999999998,85.947999999999993,16.89,18.291,35.856999999999999,17.695,19.192,26.277000000000001,23.155000000000001,58.773000000000003,21.23,null,1.9252667610143313,null,null,0.90563000000000005,0.94638334999999996,1.18641,null,103.24509999999999]
["Baku City","Medium","Easy","Hard","High","Very High",6.0060000000000002,51,306.3,18,8,16,211.45,null,20,17,"High",null,362.08140209999999,615.56397440000001,611.02,706,791.79,null,96.709900000000005,null,0.89344999999999997,{"$f":"+AA9/1.283","v":0.69637568199532351},null,1.1559600000000001,null,20.6,60.51,19.98,21.81,18.45,23.86,17.28,26.63,46.2,18.920000000000002,14.28,null,3.591263665074655,null,null,0.89344999999999997,0.93365524999999994,1.0005500000000001,null,96.709900000000005]
["Barcelona","Medium","Hard","Soft","High","Medium",4.7279999999999998,65,307.3,11,13,8,217.02,null,16,21,"Low",null,457.87,673.95,503.46,676.11,315.93,null,140.56392,null,0.874,0,null,1.1174999999999999,null,26.337,59.326000000000001,42.814999999999998,50.241999999999997,32.36,23.23,22.654,34.648000000000003,51.347000000000001,40.249000000000002,19.984000000000002,null,2.9314012721640039,null,null,0.874,0.91332999999999998,1.0932999999999999,null,140.56392]
["Brands Hatch","Medium","Normal","Medium","Low","Low",4.2069999999999999,75,315.5,10,12,8,211.02,null,12,25.5,"Normal",null,475.32,647.54494999999997,386.69197000000003,709.39820999999995,641.46833000000004,null,121.09563,null,0.83052000000000004,0.63566,null,1.0394716231273702,null,11.226000000000001,34.311999999999998,19.867000000000001,24.585999999999999,27.84,15.257999999999999,12.634,21.206,38.031999999999996,38.167000000000002,19.266999999999999,null,3.1701613758081844,null,null,0.83052000000000004,0.86789339999999993,1.04047,null,121.09563]
["Brasilia","Medium","Hard","Hard","High","Medium",5.4749999999999996,55,301.10000000000002,16,15,7,206.08,null,12,13.5,"Normal",null,577.88028999999995,409.23081000000002,697.755,849.60500000000002,784.06,null,46.68976,null,0.89107999999999998,0.62207000000000001,null,1.0511242376602301,null,19.535,41.857999999999997,25.23,30.878,20.553000000000001,18.98,21.956,32.389000000000003,44.362000000000002,20.66,17.341999999999999,null,3.7543195576536985,null,null,0.89107999999999998,0.93117859999999997,1.0403500000000001,null,46.68976]
["Bremgarten","Medium","Normal","Medium","Medium","Medium",7.2809999999999997,42,305.8,8,26,17,257.04000000000002,null,16,17,"Low",null,713.7,594.03,589.41,697.91,539.29,null,138.55358000000001,null,0.85499999999999998,{"$f":"+AA13/1.283","v":0.666406858924396},null,1.2266944309523813,null,38.557000000000002,24.318999999999999,19.579000000000001,18.667000000000002,43.387999999999998,31.768999999999998,13.817,35.362000000000002,30.61,42.353000000000002,11.939,null,3.171001161198753,null,null,0.85799999999999998,0.89660999999999991,1.0812999999999999,null,138.55358000000001]
["Brno","Medium","Easy","Medium","Medium","High",5.4039999999999999,57,308,12,12,14,207.14,null,15,14,"Normal",null,489.73,515.49,378.53,555.53,490.25,null,73.583219999999997,null,0.83238000000000001,0.70154000000000005,null,0.99111836951073695,null,26.353999999999999,47.572000000000003,28.760999999999999,23.715,28.541,27.064,25.518999999999998,31.263000000000002,35.515000000000001,28.315999999999999,20.385999999999999,null,3.3434069760534717,null,null,0.83238000000000001,0.86983709999999992,0.98792999999999997,null,73.583219999999997]
["Bucharest Ring","Low","Easy","Hard","Very High","Low",3.0710000000000002,80,245.7,8,6,8,146.34,null,14,24,"Normal",null,269.73,654.11,711.39,593.83000000000004,744.57,null,77.480959999999996,null,0.92179999999999995,0.77063000000000004,null,1.0792999999999999,null,27.736000000000001,63.353000000000002,27.626000000000001,30.114000000000001,36.688000000000002,25.61,21.076000000000001,43.326000000000001,54.417999999999999,31.361999999999998,25.187999999999999,null,2.9925217258605152,null,null,0.91180000000000005,0.95283099999999998,0.99470000000000003,null,77.480959999999996]
["Buenos Aires","High","Very Hard","Hard","Very Low","High",4.258,72,306.60000000000002,12,11,9,185.31,null,16,19.5,"Normal",null,901.29277000000002,516.57393000000002,272.05175000000003,654.41483000000005,706.34041999999999,null,190.07916,null,0.78529000000000004,0.57203999999999999,null,1.0688563569284599,null,30.501000000000001,56.566000000000003,23.704000000000001,29.800999999999998,21.513999999999999,18.41,25.457999999999998,56.631,71.400000000000006,50.261000000000003,20.256,null,3.1392456821935393,null,null,0.78529000000000004,0.82062804999999994,0.97950000000000004,null,190.07916]
["Estoril","Medium","Normal","Medium","Medium","Medium",4.3600000000000003,70,305.2,11,8,14,221.29,null,13,22.5,"Low",null,438.52,652.28,302.24,705,575.41999999999996,null,79.459999999999994,null,0.83787,0.71482000000000001,null,1.0845,null,22.175999999999998,53.823999999999998,29.567,24.937999999999999,28.032,19.577000000000002,14.875,37.582000000000001,43.713000000000001,33.954999999999998,13.843999999999999,null,2.7907292636761549,null,null,0.83787,0.87557414999999994,1.05901,null,79.459999999999994]
["Fiorano","Medium","Normal","Hard","Very High","High",3.02,79,238.6,8,6,7,183.62,null,14,16.5,"Low",null,449.29,619.66,301.14999999999998,374.52,895.1,null,99.311440000000005,null,0.93269999999999997,0.83,null,1.0391000000000001,null,28.042000000000002,47.723999999999997,28.027999999999999,31.004999999999999,23.742000000000001,19.573,22.702999999999999,36.521000000000001,46.853000000000002,32.295000000000002,22.805,null,3.3682342342219278,null,null,0.93269999999999997,0.97467149999999991,0.95633000000000001,null,99.311440000000005]
["Fuji","Low","Easy","Medium","Medium","Medium",4.5579999999999998,67,305.39999999999998,13,11,8,191.99,null,16,18.5,"Normal",null,271.38,590.54,628.39,689.16,507.61,null,117.72,null,0.84906999999999999,0.62275999999999998,null,1.0470000000000002,null,31.614999999999998,39.673999999999999,20.213000000000001,23.61,23.731000000000002,22.876000000000001,31.198,27.716999999999999,52.084000000000003,21.954000000000001,20.201000000000001,null,2.9601379483029455,null,null,0.84906999999999999,0.88727814999999988,0.97599999999999998,null,117.72]
["Grobnik","Medium","Hard","Medium","Low","Medium",4.1680000000000001,74,308.39999999999998,8,15,7,0,null,15,13,"Normal",null,646.19316019999997,384.36996169999998,524.54999999999995,768.66,500.29,null,128.81998999999999,null,0.82235999999999998,0.63300000000000001,null,0.85750000000000004,null,30.622697948717999,35.490054871795003,21.910673589744,20.539340769231,22.981849743590001,29.012713333333,26.165746410255998,36.009474358974003,20.851193333333001,41.457720256409999,17.976859230769001,null,3.7927783521899654,null,null,0.82235999999999998,0.85936619999999997,1.0379799999999999,null,128.81998999999999]
["Hockenheim","Medium","Normal","Soft","High","Medium",4.5730000000000004,67,306.39999999999998,12,9,11,238.22,null,12,16.5,"High",null,444.92,647.63,329.61,789.21,291.95999999999998,null,-98.195779999999999,null,0.86929999999999996,0.89900000000000002,null,1.0154702613126501,null,29.559000000000001,64.445999999999998,21.081,23.004000000000001,23.905999999999999,19.978999999999999,20.596,36.725999999999999,50.179000000000002,26.146999999999998,17.552,null,3.130992087707952,null,null,0.86929999999999996,0.90841849999999991,0.96074000000000004,null,-98.195779999999999]
["Hungaroring","High","Very Hard","Medium","Very Low","Very Low",3.968,77,305.5,7,10,13,190.61,null,14,16.5,"Very High",null,853.49,439.1,571.55999999999995,434.45,416.73,null,62.532499999999999,null,0.76568000000000003,0.64900000000000002,null,1.1019000000000001,null,25.364000000000001,38.664999999999999,76.042000000000002,69.27,35.475999999999999,18.675000000000001,15.206,48.393999999999998,31.478000000000002,52.329000000000001,12.683,null,3.2881440136697897,null,null,0.76568000000000003,0.80013559999999995,1.0638799999999999,null,62.532499999999999]
["Imola","Medium","Hard","Medium","Medium","Medium",4.9290000000000003,62,305.60000000000002,12,13,9,215.41,null,16,12,"Low",null,459.77,599.72,672.31,615.44000000000005,455.84,null,19.18066,null,0.86572000000000005,0.6079,null,1.1841999999999999,null,23.242999999999999,43.444000000000003,39.130000000000003,42.268000000000001,32.052999999999997,18.018000000000001,20.619,38.267000000000003,47.406999999999996,38.536000000000001,19.734999999999999,null,0,null,null,0.85572000000000004,0.89422740000000001,1.0555000000000001,null,19.18066]
["Indianapolis","Low","Easy","Medium","High","Medium",4.2,73,306.60000000000002,10,9,11,208.47,null,13,25.5,"High",null,207.55,706.52,465.52,648.5,518.59,null,-35,null,0.89300000000000002,{"$f":"+AA24/1.283","v":0.696024941543258},null,1.0576000000000001,null,46.165999999999997,62.600999999999999,27.553999999999998,33.988,40.731000000000002,37.433,18.05,46.731999999999999,53.591000000000001,52.024000000000001,15.316000000000001,null,2.4702345098310934,null,null,0.89300000000000002,0.93318499999999993,1.01319,null,-35]
["Indianapolis Oval","Low","Very Easy","Soft","Very High","Low",4.0220000000000002,200,{"$f":"+G25*H25","v":804.40000000000009},17,9,2,408.42,null,4,45,"Low",null,-58.62,730.49,21.69,901.36,304.75,null,67.599999999999994,null,0.9042,0.749,null,1.0696000000000001,null,28.952999999999999,107.06,17.515999999999998,20.808,34.491,22.376999999999999,26.346,16.670999999999999,11.849,31.393999999999998,18.808,null,2.1334860679397591,null,null,0.9042,0.94488899999999998,0.99529999999999996,null,67.599999999999994]
["Interlagos","Medium","Normal","Soft","Medium","Medium",4.3079999999999998,71,305.89999999999998,12,9,10,217.49,null,14,18,"High",null,460.91,578.03,555.34,568.26,318.88,null,-26.26585,null,0.84916000000000003,0.68532999999999999,null,1.0578000000000001,null,39.753,57.075000000000003,31.631,23.777000000000001,45.927999999999997,23.305,21.238,32.317,57.65,40.906999999999996,19.765000000000001,null,2.6818662933742927,null,null,0.84916000000000003,0.88737219999999994,1.0420700000000001,null,-26.26585]
["Irungattukottai","Medium","Easy","Medium","Medium","High",3.7160000000000002,79,293.60000000000002,8,12,7,168.61,null,12,14,"High",null,680.12,470.29,626.79,620.22,536.54999999999995,null,13.946009999999999,null,0.84114999999999995,{"$f":"+AA27/1.283","v":0.65561184723304755},null,0.98892279410538875,null,27.620999999999999,52.493000000000002,43.475999999999999,41.082000000000001,36.094999999999999,32.405000000000001,35.082999999999998,44.109000000000002,52.298999999999999,34.093000000000004,20.332000000000001,null,3.2749574112231423,null,null,0.84114999999999995,0.87900174999999992,0.97158999999999995,null,13.946009999999999]
["Istanbul","Medium","Normal","Medium","Medium","Medium",5.3339999999999996,58,309.39999999999998,13,10,14,227.29,null,14,16,"High",null,387.85,544.46,700.97,543.97,659.85,null,118.92,null,0.85599000000000003,0.69399999999999995,null,1.1652,null,27.297999999999998,32.742999999999995,17.294,19.402000000000001,20.073,20.844000000000001,26.818999999999999,21.298999999999999,44.756,19.763999999999999,17.077999999999999,null,2.9108376826681419,null,null,0.85599000000000003,0.89450954999999999,1.1164700000000001,null,118.92]
["Jerez","Medium","Hard","Soft","High","Very High",4.4409999999999998,69,306.39999999999998,8,16,8,199.89,null,14,18,"Low",null,717.6,608.07000000000005,626.86,701.3,321.26,null,143.32667000000001,null,0.88900000000000001,0.61780000000000002,null,1.0230000000000001,null,36.689,60.136000000000003,38.049999999999997,41.692999999999998,34.457000000000001,29.923999999999999,20.888999999999999,32.790999999999997,50.798999999999999,47.78,23.664000000000001,null,3.3557244346512092,null,null,0.88900000000000001,0.92900499999999997,0.9,null,143.32667000000001]
["Jyllands-Ringen","High","Normal","Medium","Low","High",2.2999999999999998,136,312.8,5,9,4,0,null,20,19.5,"Normal",null,769.65535820000002,414.12541779999998,556.76,743.56,524.72,null,106.92562,null,0.82601999999999998,{"$f":"+AA30/1.283","v":0.64381917381137965},null,1.0423,null,13.52,24.75,28.74,27.26,12.18,10.82,9.4,23.12,33,14.91,13.35,null,3.4638577191300084,null,null,0.82601999999999998,0.86319089999999987,0.98582000000000003,null,106.92562]
["Kaunas","Medium","Normal","Medium","Medium","High",3.3010000000000002,80,264.10000000000002,9,10,5,181.6,null,10,11,"Low",null,387.37,635.16999999999996,515.41999999999996,689.48,362.96,null,91.1,null,0.84609999999999996,0.76485000000000003,null,1.0316070555865222,null,24.484999999999999,44.33,29.170999999999999,25.863,30.547999999999998,20.882999999999999,14.686999999999999,21.75,13.329000000000001,44.143000000000001,13.048999999999999,null,3.3290244346623168,null,null,0.84609999999999996,0.88417449999999986,1.0395000000000001,null,91.1]
["Kyalami","High","Hard","Hard","Very Low","Medium",4.2610000000000001,72,306.8,9,12,9,231.38,null,14,15,"Very Low",null,777.15,534.29999999999995,557.47,528.95000000000005,749.84,null,206.85,null,0.80157999999999996,{"$f":"+AA32/1.283","v":0.62477007014809038},null,1.0877578529456735,null,23.079000000000001,36,35.700000000000003,39.813000000000002,20.623999999999999,18.513000000000002,32.57,46.158000000000001,28.459,24.411000000000001,21.704999999999998,null,3.2156779892348042,null,null,0.80157999999999996,0.83765109999999987,1.02227,null,206.85]
["Laguna Seca","Medium","Easy","Soft","Very High","High",3.601,79,284.5,11,8,7,180.7,null,11,16.7,"Very Low",null,481.06,401.03,585.51,619.45000000000005,59,null,54.38,null,0.90200000000000002,0.751,null,1.0682928799034199,null,30.149000000000001,40.567,26.36,17.552,17.187999999999999,15.804,24.428999999999998,39.460999999999999,43.061999999999998,34.92,9.33,null,2.9338066053037868,null,null,0.90200000000000002,0.94258999999999993,1.0149999999999999,null,54.38]
["Magny Cours","Medium","Hard","Medium","Medium","Medium",4.2469999999999999,72,305.8,12,8,11,208.84,null,14,18,"High",null,453.62,564.80999999999995,294.88,588.24,560.42999999999995,null,147.77000000000001,null,0.85499999999999998,{"$f":"+AA34/1.283","v":0.666406858924396},null,0.98750000000000004,null,23.462,50.802999999999997,29.122,25.744,27.428000000000001,20.763999999999999,21.248000000000001,34.838000000000001,52.363,39.866999999999997,13.492000000000001,null,0,null,null,0.86499999999999999,0.90392499999999998,0.94098999999999999,null,147.77000000000001]
["Melbourne","Medium","Hard","Soft","Medium","Medium",5.3029999999999999,58,307.60000000000002,12,15,10,220.25,null,17,16.5,"Low",null,403.36,619,614.44000000000005,757.14332999999999,294.52332999999999,null,8.0433299999999992,null,0.85529999999999995,{"$f":"+AA35/1.283","v":0.66664068589243963},null,1.0289000000000001,null,23.024000000000001,50.597000000000001,27.277999999999999,29.867999999999999,22.382999999999999,21.97,20.655000000000001,32.353000000000002,39.018000000000001,22.364000000000001,18.012,null,3.3551953247875552,null,null,0.87510391000580512,0.91448358595606627,0.89340272514430208,null,8.0433299999999992]
["Mexico City","Medium","Hard","Soft","Low","Medium",4.42,69,305,13,12,7,224.8,null,9,24,"Normal",null,632.08000000000004,700.96,470.54,671.13,323.13,null,48.619140000000002,null,0.83531999999999995,0.68925999999999998,null,1.0741316547510653,null,12.708,27.4,16.454999999999998,14.552,20.387,14.083,19.797000000000001,31.901,13.536,38.081000000000003,17.138999999999999,null,2.7815829141018424,null,null,0.83531999999999995,0.87290939999999984,0.99073999999999995,null,48.619140000000002]
["Monte Carlo","High","Very Hard","Medium","Low","Medium",3.3690000000000002,78,262.8,7,7,12,154.54,null,19,18,"Normal",null,1024.73,373.43,471.04,374.23,494.38,null,100.89447,null,0.82411000000000001,0.621,null,1.1997,null,15.535,21.385999999999999,56.168999999999997,56.534999999999997,29.146000000000001,10.91,15.672000000000001,30.236999999999998,49.777999999999999,39.445,13.509,null,3.8650384737338439,null,null,0.81411,0.85074494999999994,1.05986,null,100.89447]
["Montreal","Medium","Normal","Soft","Medium","Medium",4.42,69,305,12,7,13,209.95,null,12,16.5,"Very Low",null,335.19099,677.81879000000004,566.84333000000004,718.10333000000003,237.85,null,-98.125259999999997,null,0.85529999999999995,0.7349,null,1.135721542765475,null,27.567,51.183999999999997,28.370999999999999,18.38,26.637,19.905000000000001,14.689,38.854999999999997,51.207000000000001,45.235999999999997,14.348000000000001,null,2.7141651204156321,null,null,0.85529999999999995,0.89378849999999987,1.0831,null,-98.125259999999997]
["Monza","Low","Easy","Medium","Very High","Medium",5.7869999999999999,53,306.7,17,12,9,258.83,null,13,25.5,"Very Low",null,124.06626156324771,737.55280334468171,495.65000000000003,870.39,611.13,null,24.635809999999999,null,0.91300000000000003,{"$f":"+AA39/1.283","v":0.71161340607950119},null,1.0723,null,28.948,58.713999999999999,19.443000000000001,14.827,26.672000000000001,23.466999999999999,18.018999999999998,42.241,51.805,28.46,19.818000000000001,null,3,null,null,0.91300000000000003,0.95408499999999996,0.91758409589290524,null,24.635809999999999]
["Mugello","Medium","Hard","Medium","Medium","Medium",5.2469999999999999,58,304.3,11,13,12,246.56,null,14,13.5,"High",null,517.88407389999998,805.54406210000002,893.45,901.34163709999996,601.04,null,-69.400000000000006,null,0.84740000000000004,0.69579999999999997,null,0.99904999999999999,null,25.47,28.701000000000001,26.497,19.143999999999998,27.382000000000001,30.361000000000001,32.436999999999998,36.707000000000001,33.222000000000001,28.027999999999999,17.895,null,3.0098446056008648,null,null,0.84740000000000004,0.88553300000000001,1.0235000000000001,null,-69.400000000000006]
["New Delhi","Medium","Normal","Soft","Medium","Very High",5.1369999999999996,60,308.2,11,15,10,227.27,null,16,19,"Very Low",null,649.99,556.91999999999996,556.38,720.3,150.9,null,-85,null,0.83631999999999995,0.76800000000000002,null,1.13569237774043,null,26.943000000000001,48.639000000000003,37.832999999999998,32.683,24.350999999999999,16.206,20.757999999999999,33.692999999999998,45.595999999999997,41.58,13.045999999999999,null,2.8122564722901804,null,null,0.83631999999999995,0.87395439999999991,1.0330299999999999,null,-97.642470000000003]
["Nurburgring","Medium","Normal","Soft","Very Low","Low",5.1449999999999996,60,308.7,12,12,13,224.22,null,16,15,"Normal",null,650.80999999999995,451.94,626.71,598,149.86000000000001,null,244.16605000000001,null,0.79900000000000004,{"$f":"+AA42/1.283","v":0.62275915822291517},null,1.1474925053228273,null,31.199000000000002,49.887999999999998,26.366,34.613,29.26,16.349,16.626999999999999,31.119,50.161000000000001,46.497,11.736000000000001,null,3.4425815009514507,null,null,0.79900000000000004,0.834955,1.0645,null,244.16605000000001]
["Oesterreichring","Medium","Easy","Medium","High","Medium",5.94,52,308.89999999999998,19,14,9,269.24,null,11,21,"Low",null,442.09,675.58,496.59,729.98,508.34,null,85.42,null,0.86855000000000004,0.65293000000000001,null,1.0801100000000001,null,22.07,52.045000000000002,28.263999999999999,32.384,23.710999999999999,20.454999999999998,23.161000000000001,27.148,39.234999999999999,22.562000000000001,13.545,null,2.4855901274178027,null,null,0.86855000000000004,0.90763474999999993,1.0866400000000001,null,85.42]
["Paul Ricard","Medium","Easy","Medium","High","Very High",3.8610000000000002,79,305,9,11,8,225.75,null,11,19.5,"Very High",null,362.79,732.67,301.68,784.37,575.27,null,182.33332999999999,null,0.91651000000000005,0.77100000000000002,null,1.101,null,29.268000000000001,62.915999999999997,28.35,36.552999999999997,32.316000000000003,16.347000000000001,19.744,30.907,50.353000000000002,25.541,12.8,null,2.8614510699549514,null,null,0.89651000000000003,0.93685295000000002,1.09121,null,182.33332999999999]
["Portimao","High","Easy","Soft","Medium","High",4.6920000000000002,66,309.7,9,14,11,198.24,null,18,15.5,"Low",null,784.36,392.27,486.5,490,295.42,null,180.52475000000001,null,0.83609999999999995,0.70609999999999995,null,1.1084000000000001,null,24.204999999999998,24.994,24.173999999999999,26.233000000000001,45.302999999999997,22.012,21.427,23.003,33.1,48.734000000000002,18.417000000000002,null,2.1558848710159682,null,null,0.83609999999999995,0.8737244999999999,1.0578000000000001,null,180.52475000000001]
["Poznan","Medium","Hard","Medium","Low","Medium",4.0830000000000002,75,306.2,7,14,8,214.42,null,14,14,"Normal",null,742,546.01666999999998,379.02332999999999,718.46,529.96333000000004,null,182.04044999999999,null,0.81728665757813301,{"$f":"+AA46/1.283","v":0.63701220388007251},null,1.1337000000000002,null,29.635000000000002,44.164999999999999,34.024000000000001,40.393999999999998,36.137999999999998,29.957000000000001,25.524000000000001,31.239000000000001,33.659999999999997,26.074999999999999,21.884,null,3.2788603075522329,null,null,0.82386999999999999,0.86094414999999991,1.0863400000000001,null,182.04044999999999]
["Rafaela Oval","Low","Very Easy","Medium","Very High","High",4.7359999999999998,67,317.3,18,10,6,299.89,null,8,10,"Normal",null,128.86020608460177,577.92663128879383,194.66,730.77,309.64,null,67.599999999999994,null,0.90583999999999998,0.76944999999999997,null,1.0505,null,25.050999999999998,95.29,14.663,17.145,30.097000000000001,17.852,23.091999999999999,26.835999999999999,25.515999999999998,35.829000000000001,17.321999999999999,null,2.2635007625552306,null,null,0.90583999999999998,0.94660279999999997,1.0641799999999999,null,67.599999999999994]
["Sakhir","Low","Normal","Soft","Very High","Medium",5.4119999999999999,57,308.5,16,11,9,237.09,null,14,25.5,"Very High",null,126.91,406.55,716.34,609.55999999999995,240.96,null,-21.44472,null,0.91198000000000001,0.71240000000000003,null,1.18023725119545,null,27.167999999999999,62.892000000000003,33.036999999999999,25.882000000000001,26.282,30.852,36.212000000000003,30.797999999999998,36.118000000000002,35.283000000000001,17.693000000000001,null,3.2000611790665965,null,null,0.91198000000000001,0.9530190999999999,1.1762300000000001,null,-21.44472]
["Sepang","Medium","Normal","Medium","Medium","Medium",5.6440000000000001,55,310.39999999999998,14,11,14,217.17,null,17,24,"Very High",null,554,590.12333000000001,653.68700000000001,746.34333000000004,466.41,null,24.6,null,0.84219999999999995,0.65649999999999997,null,1.0164000000000002,null,25.274999999999999,47.984999999999999,32.811,26.302,32.939,18.283000000000001,31.829000000000001,36.601999999999997,43.17,26.006,18.791,null,3.0695816236376792,null,null,0.8630305499325801,0.9018669246795461,1.0443561254213491,null,24.6]
["Serres","High","Hard","Medium","Medium","Medium",3.1859999999999999,80,254.9,5,10,9,197.95,null,16,12,"Normal",null,927.25,414.83,503.01,477.94,522.69000000000005,null,177,null,0.86324999999999996,{"$f":"+AA50/1.283","v":0.67283710054559631},null,0.93879999999999997,null,24.934000000000001,33.625,25.175000000000001,27.54,24.224,20.047000000000001,23.065000000000001,34.234000000000002,28.933,29.658000000000001,20.6,null,3.2230140459053507,null,null,0.86324999999999996,0.90209624999999993,0.92879,null,177]
["Shanghai","Medium","Normal","Soft","Very High","Medium",5.45,56,305.2,9,16,15,217.18,null,10,24,"High",null,429.15152367720026,529.77,641.35,354.61,114.21,null,114.90394000000001,null,0.90522000000000002,0.67435,null,1.0577778506708801,null,20.675000000000001,60.895000000000003,34.115000000000002,39.604999999999997,35.046999999999997,28.213000000000001,26.74,38.844000000000001,43.939,48.878,18.481999999999999,null,2.5865730534089622,null,null,0.90522000000000002,0.94595489999999993,1.0587800000000001,null,114.90394000000001]
["Silverstone","Low","Normal","Medium","High","Low",5.1379999999999999,60,308.3,11,11,16,225.46,null,14,22.5,"Normal",null,283.41000000000003,699.48,590.85,823.25,415.1,null,18.873349999999999,null,0.86929999999999996,0.68100000000000005,null,1.1558000000000002,null,25.015999999999998,56.238999999999997,22.378,26.878,28.286000000000001,17.123999999999999,16.405000000000001,37.582999999999998,27.510999999999999,22.260999999999999,12.316000000000001,null,3.051882989669688,null,null,0.86929999999999996,0.90841849999999991,1.1123000000000001,null,18.873349999999999]
["Singapore","High","Hard","Hard","Medium","High",5.0670000000000002,61,309.10000000000002,7,11,17,214.84,null,23,17,"Low",null,865.61,438.19,578.15,598.96,801.2,null,202.04229000000001,null,0.85399999999999998,0.55213999999999996,null,1.1091,null,29.443999999999999,25.242999999999999,34.673999999999999,30.373999999999999,34.034999999999997,23.699000000000002,29.268000000000001,29.454999999999998,45.579000000000001,26.95,25.68,null,3.9650172649949531,null,null,0.85399999999999998,0.89242999999999995,1.04688,null,202.04229000000001]
["Slovakiaring","Medium","Hard","Medium","High","High",5.923,53,313.89999999999998,17,10,15,219.95,null,14,19.5,"High",null,735.82,439.66,609.73,491.45,431.92,null,184.08430999999999,null,0.88566223600495986,0.79,null,1.0341,null,21.45,49.631999999999998,25.382000000000001,28.821999999999999,37.887,18.696000000000002,16.206,45.566000000000003,31.475000000000001,39.401000000000003,15.185,null,3.2498479839682703,null,null,0.90685000000000004,0.94765825000000004,1.0651999999999999,null,184.08430999999999]
["Sochi","Medium","Hard","Medium","Low","High",5.851,53,310.10000000000002,8,15,18,203.07,null,19,23,"Normal",null,675.39,588.26,587.66,696.24,456.11,null,137.97,null,0.82710719380827002,{"$f":"+AA55/1.283","v":0.64466655791759164},null,1.0856807583652399,null,20.780999999999999,47.414999999999999,26.856000000000002,25.933,24.361999999999998,15.798999999999999,19.082999999999998,30.559000000000001,41.040999999999997,21.771000000000001,16.77,null,3.437044330220524,null,null,0.84040000000000004,0.87821799999999994,1.04166,null,137.97]
["Spa","Medium","Normal","Medium","High","Medium",6.968,44,306.60000000000002,18,16,13,239,null,22,13.5,"Normal",null,585.63901999999996,716.49414000000002,446.82400000000001,609.47063000000003,372.54417000000001,null,50.397829999999999,null,0.88353999999999999,0.45190999999999998,null,1.04702732979622,null,28.515999999999998,51.908999999999999,28.048999999999999,32.094000000000001,31.559000000000001,21.309000000000001,18.466999999999999,38.360999999999997,43.341999999999999,46.582999999999998,17.765999999999998,null,3.3542814158726442,null,null,0.88353999999999999,0.92329929999999993,1.04803,null,50.397829999999999]
["Suzuka","Medium","Hard","Medium","Medium","Medium",5.86,53,310.60000000000002,11,18,13,233.28,null,14,15,"Very High",null,413.56,639.98,515.88,550.25,531.13,null,47.119889999999998,null,0.85699999999999998,0.55079999999999996,null,1.0845,null,17.353000000000002,36.579000000000001,22.036999999999999,28.97,23.434999999999999,15.56,14.46,37.835000000000001,29.292999999999999,31.751000000000001,15.141,null,3.5523833058754533,null,null,0.85699999999999998,0.89556499999999994,1.0326,null,47.119889999999998]
["Valencia","High","Hard","Medium","Medium","Medium",5.44,57,310.10000000000002,11,12,16,214.86,null,25,14.5,"Low",null,837.83,445.95,657.26,652.58000000000004,335.82,null,209.76,null,0.84587000000000001,0.56000000000000005,null,0.98750000000000004,null,26.294,29.260999999999999,45.893000000000001,45.887999999999998,21.529,31.125,16.202999999999999,26.08,31.920999999999999,36.840000000000003,21.256,null,3.4428349688939206,null,null,0.84587000000000001,0.88393414999999997,0.95518000000000003,null,209.76]
["Yas Marina","Medium","Hard","Medium","Low","Medium",5.5549999999999997,55,305.5,12,10,17,214.71,null,21,18.5,"High",null,730.05,459.7,557.69000000000005,476.1,419.98,null,175.25104999999999,null,0.81167,0.70142000000000004,null,0.98849927045812536,null,22.651,18.012999999999998,34.762999999999998,39.488999999999997,28.349,21.120999999999999,28.907,35.283999999999999,41.026000000000003,30.026,20.786999999999999,null,3.3838644001981639,null,null,0.81167,0.8481951499999999,1.0388064269539852,null,175.25104999999999]
["Yeongam","High","Normal","Medium","Medium","High",5.6219999999999999,55,309.2,11,15,13,213.67,null,18,23.5,"Normal",null,781.67,480.86,719.53,689.5,420.63,null,207.40933999999999,null,0.83650000000000002,0.7399,null,1.0326000000000002,null,28.45,46.179000000000002,30.23,33.695999999999998,20.648,22.434999999999999,23.28,25.361999999999998,33.090000000000003,27.452000000000002,19.007000000000001,null,3.5686345932498194,null,null,0.83650000000000002,0.87414249999999993,1.0451999999999999,null,207.40933999999999]
["Zandvoort","Medium","Normal","Hard","Low","Medium",4.2510000000000003,71,301.8,9,13,9,230.5,null,14,22.5,"High",null,551.15,655.26921169408047,415.91,779.13,709.95,null,5.5654199999999996,null,0.83040015694952962,0.58299999999999996,null,1.0571000000000002,null,39.466000000000001,80.409000000000006,48.258000000000003,38.215000000000003,33.243000000000002,28.262,26.167999999999999,36.99,73.522000000000006,54.036000000000001,22.416,null,3.4426118942845809,null,null,0.84019999999999995,0.87800899999999993,1.0181800000000001,null,5.5654199999999996]
["Zolder","Medium","Hard","Medium","Low","Medium",4.2610000000000001,70,298.3,11,9,10,223.26,null,17,19.5,"Low",null,669.42236947406309,616.63702528591102,466.49127064978006,628.46174460449038,539.9,null,193.3,null,0.82860999999999996,0.63653000000000004,null,1.07874,null,17.442,22.855,25.241,22.78,20.504999999999999,22.809000000000001,21.448,40.969000000000001,29.021000000000001,31.952999999999999,18.457000000000001,null,3.3051901142003914,null,null,0.82860999999999996,0.86589744999999985,0.99094000000000004,null,193.3]
[]
[]
[]
[null,null,null,null,null,null,null,null,null,null,null,null,null,null,null,null,null,null,null,null,null,null,null,null,null,null,null,null,null,0.95904999999999996]

{"sheet":"Tyre&Fuel","index":8,"n_rows":35,"n_cols":25,"rows_kept":35,"cut":false,"hidden":true,"merged":[[19,16,19,23],[15,15,16,19],[9,13,10,13],[28,20,28,23],[24,20,24,23],[25,20,25,23],[26,20,26,23],[9,14,10,14],[27,1,27,3],[34,20,34,23],[29,20,29,23],[30,20,30,23],[31,20,31,23],[32,20,32,23],[33,20,33,23],[34,10,34,11],[27,20,27,23],[4,1,4,2],[5,1,5,2],[5,6,5,13],[7,8,7,12],[8,1,8,2],[8,10,8,13],[25,3,25,4],[24,3,24,4],[9,11,10,11],[17,10,17,11],[20,1,20,2],[21,1,21,2],[22,1,22,2],[12,1,12,3],[19,1,19,3],[19,6,19,12],[9,7,10,7],[9,8,10,8],[9,9,10,9],[9,10,10,10],[9,12,10,12],[21,10,21,11]]}
[]
[]
[]
[]
[null,"Race Options"]
[null,"Weather",null,null,null,null,"Determines Lost time due to pitting, fuel load and Tyre choice"]
[null,"Race",{"$f":"+'Setup&WS'!H22","v":"Dry"}]
[null,null,null,null,null,null,"Tyre Wear",10,"(at which point the tyres should be replaced)"]
[null,"Tyres",null,null,null,null,null,null,null,null,"Lost Time (s)",null,null,null,null,null,null,null,null,null,null,null,null,0,"Garder la voiture sur la piste"]
[null,"Brand","Pipirelli",null,null,null,null,"Req. Stops","Fuel Load","Estm. Pit Time","Pits","Fuel Load","TCD","Total","Delta Gomme",null,null,null,null,null,null,null,null,99,"Pousser à la limite"]
[null,"Type",{"$f":"+K18","v":"Hard"},null,null,null,null,null,null,null,null,null,null,null,null,null,null,null,null,null,null,null,null,66,"Pousser fortement la voiture"]
[null,null,null,null,null,null,"Extra Soft",{"$f":"(ROUNDUP(VLOOKUP('Setup&WS'!$F$18,Tracks!$A$3:$I$889,9,0)/(Tables!F55*(100-$H$8)/100),0))-1","v":4},{"$f":"ROUNDUP(VLOOKUP('Setup&WS'!F18,Tracks!$A$3:$AA$889,9,0)*(VLOOKUP('Setup&WS'!F18,Tracks!$A$3:$AB$889,27,0)+Tables!H47)/(H12+1),0)","v":37},{"$f":"I12*Tables!F107+Tables!C113+Tables!F108*'Setup&WS'!H15+Tables!F109*'Setup&WS'!H14+Tables!F110*'Setup&WS'!H11+Tables!F111*'Setup&WS'!H12","v":22.576000000000004},{"$f":"H12*(J12+$D$23)","v":168.30400000000003},{"$f":"0.005*((VLOOKUP('Setup&WS'!F18,Tracks!$A$3:$AA$889,9,0)*(VLOOKUP('Setup&WS'!F18,Tracks!$A$3:$AB$889,27,0)+Tables!H47))*VLOOKUP('Setup&WS'!$F$18,Tracks!$A$3:$I$889,9,0)/(H12+1))/2","v":27.108139001029269},0,{"$f":"SUM(K12:M12)","v":195.41213900102929},0,null,null,null,null,null,null,null,null,33,"Pousser un peu la voiture"]
[null,"Tyre & Fuel Calculations",null,null,null,null,"Soft",{"$f":"(ROUNDUP(VLOOKUP('Setup&WS'!$F$18,Tracks!$A$3:$I$889,9,0)/(Tables!F59*(100-$H$8)/100),0))-1","v":3},{"$f":"ROUNDUP(VLOOKUP('Setup&WS'!F18,Tracks!$A$3:$AA$889,9,0)*(VLOOKUP('Setup&WS'!F18,Tracks!$A$3:$AB$889,27,0)+Tables!H47)/(H13+1),0)","v":46},{"$f":"I13*Tables!F107+Tables!C113+Tables!F108*'Setup&WS'!H15+Tables!F109*'Setup&WS'!H14+Tables!F110*'Setup&WS'!H11+Tables!F111*'Setup&WS'!H12","v":22.900000000000002},{"$f":"H13*(J13+$D$23)","v":127.20000000000002},{"$f":"0.005*((VLOOKUP('Setup&WS'!F18,Tracks!$A$3:$AA$889,9,0)*(VLOOKUP('Setup&WS'!F18,Tracks!$A$3:$AB$889,27,0)+Tables!H47))*VLOOKUP('Setup&WS'!$F$18,Tracks!$A$3:$I$889,9,0)/(H13+1))/2","v":33.885173751286587},{"$f":"VLOOKUP('Setup&WS'!$F$18,Tracks!$A$3:$O$889,8,0)*(VLOOKUP('Setup&WS'!$F$18,Tracks!$A$3:$O$889,15,0)*VLOOKUP('Setup&WS'!$F$18,Tracks!$A$3:$O$889,7,0)*0.00018*(50-'Setup&WS'!$F$22)+VLOOKUP($C$10,Tables!$A$117:$B$125,2,0))","v":11.395339199999999},{"$f":"SUM(K13:M13)","v":172.48051295128661},{"$f":"+M13/$D$22","v":0.14424479999999998}]
[null,null,"L/km","Total L",null,null,"Medium",{"$f":"(ROUNDUP(VLOOKUP('Setup&WS'!$F$18,Tracks!$A$3:$I$889,9,0)/(Tables!F57*(100-$H$8)/100),0))-1","v":2},{"$f":"ROUNDUP(VLOOKUP('Setup&WS'!F18,Tracks!$A$3:$AA$889,9,0)*(VLOOKUP('Setup&WS'!F18,Tracks!$A$3:$AB$889,27,0)+Tables!H47)/(H14+1),0)","v":61},{"$f":"I14*Tables!F107+Tables!C113+Tables!F108*'Setup&WS'!H15+Tables!F109*'Setup&WS'!H14+Tables!F110*'Setup&WS'!H11+Tables!F111*'Setup&WS'!H12","v":23.440000000000005},{"$f":"H14*(J14+$D$23)","v":85.88000000000001},{"$f":"0.005*((VLOOKUP('Setup&WS'!F18,Tracks!$A$3:$AA$889,9,0)*(VLOOKUP('Setup&WS'!F18,Tracks!$A$3:$AB$889,27,0)+Tables!H47))*VLOOKUP('Setup&WS'!$F$18,Tracks!$A$3:$I$889,9,0)/(H14+1))/2","v":45.180231668382113},{"$f":"M13*2","v":22.790678399999997},{"$f":"SUM(K14:M14)","v":153.85091006838212},{"$f":"+M14/$D$22","v":0.28848959999999996}]
[null,"Fuel",{"$f":"IF(C7=\"Dry\",VLOOKUP('Setup&WS'!F18,Tracks!$A$3:$AB$889,27,0),VLOOKUP('Setup&WS'!F18,Tracks!$A$3:$AB$889,28,0))+Tables!H47","v":0.6080651210679815},{"$f":"VLOOKUP('Setup&WS'!F18,Tracks!$A$3:$AA$889,9,0)*C15+IF(C11=\"rain\",0,IF(H29>0,Tables!H50,0))","v":184.56824515089929},null,null,"Hard",{"$f":"(ROUNDUP(VLOOKUP('Setup&WS'!$F$18,Tracks!$A$3:$I$889,9,0)/(Tables!F56*(100-$H$8)/100),0))-1","v":1},{"$f":"ROUNDUP(VLOOKUP('Setup&WS'!F18,Tracks!$A$3:$AA$889,9,0)*(VLOOKUP('Setup&WS'!F18,Tracks!$A$3:$AB$889,27,0)+Tables!H47)/(H15+1),0)","v":91},{"$f":"I15*Tables!F107+Tables!C113+Tables!F108*'Setup&WS'!H15+Tables!F109*'Setup&WS'!H14+Tables!F110*'Setup&WS'!H11+Tables!F111*'Setup&WS'!H12","v":24.520000000000003},{"$f":"H15*(J15+$D$23)","v":44.02},{"$f":"0.005*((VLOOKUP('Setup&WS'!F18,Tracks!$A$3:$AA$889,9,0)*(VLOOKUP('Setup&WS'!F18,Tracks!$A$3:$AB$889,27,0)+Tables!H47))*VLOOKUP('Setup&WS'!$F$18,Tracks!$A$3:$I$889,9,0)/(H15+1))/2","v":67.770347502573173},{"$f":"M13*3","v":34.1860176},{"$f":"SUM(K15:M15)","v":145.9763651025732},{"$f":"+M15/$D$22","v":0.43273440000000002}]
[null,null,null,null,null,null,"Rain",{"$f":"(ROUNDUP(VLOOKUP('Setup&WS'!$F$18,Tracks!$A$3:$I$889,9,0)/(Tables!F58*(100-$H$8)/100),0))-1","v":1},{"$f":"ROUNDUP(VLOOKUP('Setup&WS'!F18,Tracks!$A$3:$AA$889,9,0)*(VLOOKUP('Setup&WS'!F18,Tracks!$A$3:$AB$889,28,0)+Tables!H47)/(H16+1),0)","v":75},{"$f":"I16*Tables!F107+Tables!C113+Tables!F108*'Setup&WS'!H15+Tables!F109*'Setup&WS'!H14+Tables!F110*'Setup&WS'!H11+Tables!F111*'Setup&WS'!H12","v":23.944000000000003},{"$f":"H16*(J16+$D$23)","v":43.444000000000003},{"$f":"0.005*((VLOOKUP('Setup&WS'!F18,Tracks!$A$3:$AA$889,9,0)*(VLOOKUP('Setup&WS'!F18,Tracks!$A$3:$AB$889,28,0)+Tables!H47))*VLOOKUP('Setup&WS'!$F$18,Tracks!$A$3:$I$889,9,0)/(H16+1))/2","v":55.843820828073177},0,{"$f":"SUM(K16:M16)","v":99.28782082807318},{"$f":"+M16/$D$22","v":0}]
[null,null,"Máx. Km","Laps",null,null,null,null,null,null,null,null,null,{"$f":"MIN(N12:N15)","v":145.9763651025732}]
[null,"Tyres",{"$f":"Tables!K82*VLOOKUP('Setup&WS'!$F$18,Tracks!A3:AD889,30,0)*Tables!B77*IF(C11=\"Rain\",1.25,1)","v":182.59539292948594},{"$f":"C18/VLOOKUP('Setup&WS'!F18,Tracks!$A$3:$G$889,7,0)","v":48.305659505155013},null,null,null,null,null,null,{"$f":"IF(N17=N12,G12,IF(N17=N13,G13,IF(N17=N14,G14,G15)))","v":"Hard"},null,{"$f":"IF(K18=G12,J12,IF(K18=G13,J13,IF(K18=G14,J14,J15)))","v":24.520000000000003}]
[]
[null,"Race Details",null,null,null,null,"Chosen pit strategy details",null,null,null,null,null,null,null,null,null,"Estimated Parts Wear"]
[null,"Overtaking",null,{"$f":"VLOOKUP('Setup&WS'!$F$18,Tracks!$A$3:$P$889,3,0)","v":"Hard"}]
[null,"Laps",null,{"$f":"VLOOKUP('Setup&WS'!$F$18,Tracks!$A$3:$P$889,8,0)","v":79},null,null,"Pitstops",{"$f":"VLOOKUP(C11,G12:H16,2,0)","v":1},"CT Risk",30,"à",null,{"$f":"+Tables!T82","v":0.60333209345717531}]
[null,"Pit I/O",null,{"$f":"VLOOKUP('Setup&WS'!$F$18,Tracks!$A$3:$P$889,16,0)","v":19.5},null,null,null,null,"Risk Pluie",0]
[null,null,null,null,null,null,null,"Stint1","Stint2","Stint3","Stint4","Stint5",null,null,null,null,null,"Start","Est.Wear","End"]
[null," Q1",{"$f":"+C29-D29","v":5},"Pousser à la limite",null,{"$f":"LOOKUP(D25,$Y$9:$Y$12,$X$9:$X$12)","v":99},"Laps",{"$f":"IF(SUM(Tables!B86:B87)>0,SUM(Tables!B86:B87)+0.2,\"0\")","v":40.200000000000003},{"$f":"IF(SUM(Tables!C86:C87)>0,SUM(Tables!C86:C87)+0.2,\"0\")","v":39.200000000000003},{"$f":"IF(SUM(Tables!D86:D87)>0,SUM(Tables!D86:D87)+0.2,\"0\")","v":"0"},{"$f":"IF(SUM(Tables!E86:E87)>0,SUM(Tables!E86:E87)+0.2,\"0\")","v":"0"},{"$f":"IF(SUM(Tables!F86:F87)>0,SUM(Tables!F86:F87)+0.2,\"0\")","v":"0"},null,null,null,null,"Chassis",{"$f":"+'Setup&WS'!C26","v":71},{"$f":"VLOOKUP('Setup&WS'!$F$18,Tracks!$A$3:$AP$889,32,0)*VLOOKUP('Setup&WS'!B26,Tables!$B$94:$C$102,2,0)^$J$22*Tables!$B$91","v":21.725696766591405},{"$f":"S25+R25","v":92.725696766591398},{"$f":"IF(T25>=97,Q25,\"NON OK \")","v":"NON OK "}]
[null," Q2",{"$f":"+C30-D30","v":7},"Pousser à la limite",null,{"$f":"LOOKUP(D26,$Y$9:$Y$12,$X$9:$X$12)","v":99},"Tyre Final Wear",{"$f":"IF(H25<>\"-\",100-H25*100*VLOOKUP('Setup&WS'!$F$18,Tracks!$A$3:$G$889,7,0)/$C$18,\"-\")","v":16.779937564644996},{"$f":"IF(I25<>\"-\",100-I25*100*VLOOKUP('Setup&WS'!$F$18,Tracks!$A$3:$G$889,7,0)/$C$18,\"-\")","v":18.850088371494621},{"$f":"IF(J25<>\"-\",100-J25*100*VLOOKUP('Setup&WS'!$F$18,Tracks!$A$3:$G$889,7,0)/$C$18,\"-\")","v":100},{"$f":"IF(K25<>\"-\",100-K25*100*VLOOKUP('Setup&WS'!$F$18,Tracks!$A$3:$G$889,7,0)/$C$18,\"-\")","v":100},{"$f":"IF(L25<>\"-\",100-L25*100*VLOOKUP('Setup&WS'!$F$18,Tracks!$A$3:$G$889,7,0)/$C$18,\"-\")","v":100},"Total",null,null,null,"Engine",{"$f":"+'Setup&WS'!C27","v":0},{"$f":"VLOOKUP('Setup&WS'!$F$18,Tracks!$A$3:$AP$889,33,0)*VLOOKUP('Setup&WS'!B27,Tables!$B$94:$C$102,2,0)^$J$22*Tables!$B$91","v":12.792465518727955},12.792465518727955,{"$f":"IF(T26>=97,Q26,\"NON OK \")","v":"NON OK "}]
[null,null,null,null,null,null,"Fuel Needed",{"$f":"ROUNDUP(IF(H25<>\"-\",($D$15)/$D$22*H25),0.1)","v":94},{"$f":"ROUNDUP(IF(I25<>\"-\",($D$15)/$D$22*I25),0.1)","v":92},0,0,0,{"$f":"SUM(H27:L27)","v":186},null,null,null,"Front wing",{"$f":"+'Setup&WS'!C28","v":31},{"$f":"VLOOKUP('Setup&WS'!$F$18,Tracks!$A$3:$AP$889,34,0)*VLOOKUP('Setup&WS'!B28,Tables!$B$94:$C$102,2,0)^$J$22*Tables!$B$91","v":22.976187787612158},53.976187787612162,"NON OK "]
[null,"energie",null,null,null,null,null,null,null,null,null,null,null,null,null,null,"Rear wing",{"$f":"+'Setup&WS'!C29","v":34},{"$f":"VLOOKUP('Setup&WS'!$F$18,Tracks!$A$3:$AP$889,35,0)*VLOOKUP('Setup&WS'!B29,Tables!$B$94:$C$102,2,0)^$J$22*Tables!$B$91","v":27.05036821093783},61.050368210937833,"NON OK "]
[null," Q1",{"$f":"+IMPORTS!A4*100","v":75},70,null,null,"Boost",3,null,null,null,"Fuel","Pitstop",null,null,null,"Underbody",{"$f":"+'Setup&WS'!C30","v":0},{"$f":"VLOOKUP('Setup&WS'!$F$18,Tracks!$A$3:$AP$889,36,0)*VLOOKUP('Setup&WS'!B30,Tables!$B$94:$C$102,2,0)^$J$22*Tables!$B$91","v":24.524606853733243},24.524606853733243,"NON OK "]
[null," Q2",{"$f":"+D29","v":70},63,null,null,null,null,null,null,"No stop",{"$f":"$M$27","v":186},{"$f":"L30*Tables!F107+Tables!C113+Tables!F108*'Setup&WS'!H15+Tables!F109*'Setup&WS'!H14+Tables!F110*'Setup&WS'!H11+Tables!F111*'Setup&WS'!H12","v":27.940000000000005},null,null,null,"Sidepods",{"$f":"+'Setup&WS'!C31","v":28.000000000000004},{"$f":"VLOOKUP('Setup&WS'!$F$18,Tracks!$A$3:$AP$889,37,0)*VLOOKUP('Setup&WS'!B31,Tables!$B$94:$C$102,2,0)^$J$22*Tables!$B$91","v":14.807081467801018},42.807081467801019,"NON OK "]
[null,null,null," ",null,null,null,null,null,null,"1 Stop",{"$f":"$M$27/2","v":93},{"$f":"L31*Tables!F107+Tables!C113+Tables!F108*'Setup&WS'!H15+Tables!F109*'Setup&WS'!H14+Tables!F110*'Setup&WS'!H11+Tables!F111*'Setup&WS'!H12","v":24.592000000000002},null,null,null,"Cooling",{"$f":"+'Setup&WS'!C32","v":20},{"$f":"VLOOKUP('Setup&WS'!$F$18,Tracks!$A$3:$AP$889,38,0)*VLOOKUP('Setup&WS'!B32,Tables!$B$94:$C$102,2,0)^$J$22*Tables!$B$91","v":17.285589247252748},37.285589247252744,"NON OK "]
[null,null,null,null,null,null,"Custom Stint",1,null,null,"2 Stops",{"$f":"$M$27/3","v":62},{"$f":"L32*Tables!F107+Tables!C113+Tables!F108*'Setup&WS'!H15+Tables!F109*'Setup&WS'!H14+Tables!F110*'Setup&WS'!H11+Tables!F111*'Setup&WS'!H12","v":23.476000000000003},null,null,null,"Gearbox",{"$f":"+'Setup&WS'!C33","v":33},{"$f":"VLOOKUP('Setup&WS'!$F$18,Tracks!$A$3:$AP$889,39,0)*VLOOKUP('Setup&WS'!B33,Tables!$B$94:$C$102,2,0)^$J$22*Tables!$B$91","v":16.446986028886624},49.446986028886627,"NON OK "]
[null,null,null,null,null,null,"Final Wear",{"$f":"IF(H25<>\"-\",100-H32*100*VLOOKUP('Setup&WS'!$F$18,Tracks!$A$3:$G$889,7,0)/$C$18,\"-\")","v":97.929849193150375},null,null,"3 Stops",{"$f":"$M$27/4","v":46.5},{"$f":"L33*Tables!F107+Tables!C113+Tables!F108*'Setup&WS'!H15+Tables!F109*'Setup&WS'!H14+Tables!F110*'Setup&WS'!H11+Tables!F111*'Setup&WS'!H12","v":22.918000000000003},null,null,null,"Brakes",{"$f":"+'Setup&WS'!C34","v":0},{"$f":"VLOOKUP('Setup&WS'!$F$18,Tracks!$A$3:$AP$889,40,0)*VLOOKUP('Setup&WS'!B34,Tables!$B$94:$C$102,2,0)^$J$22*Tables!$B$91","v":13.648216286569344},13.648216286569344,"NON OK "]
[null,null,null,null,null,null,"Fuel Needed",{"$f":"IF(H25<>\"-\",ROUNDUP(H32*$C15*VLOOKUP('Setup&WS'!$F$18,Tracks!$A$3:$G$889,7,0),0),\"-\")","v":3},null,null,"4 Stops",{"$f":"$M$27/5","v":37.200000000000003},{"$f":"L34*Tables!F107+Tables!C113+Tables!F108*'Setup&WS'!H15+Tables!F109*'Setup&WS'!H14+Tables!F110*'Setup&WS'!H11+Tables!F111*'Setup&WS'!H12","v":22.583200000000005},null,null,null,"Suspension",{"$f":"+'Setup&WS'!C35","v":40},{"$f":"VLOOKUP('Setup&WS'!$F$18,Tracks!$A$3:$AP$889,41,0)*VLOOKUP('Setup&WS'!B35,Tables!$B$94:$C$102,2,0)^$J$22*Tables!$B$91","v":8.6036087298801007},48.603608729880101,"NON OK "]
[null,null,null,null,null,null,"Est. Pit time",{"$f":"H34*Tables!F107+Tables!C113+Tables!F108*'Setup&WS'!H15+Tables!F109*'Setup&WS'!H14+Tables!F110*'Setup&WS'!H11+Tables!F111*'Setup&WS'!H12","v":21.352000000000004},null,null,"Avg. Pit time",null,{"$f":"AVERAGE(M30:M34)","v":24.301840000000006},null,null,null,"Electronics",{"$f":"+'Setup&WS'!C36","v":0},{"$f":"VLOOKUP('Setup&WS'!$F$18,Tracks!$A$3:$AP$889,42,0)*VLOOKUP('Setup&WS'!B36,Tables!$B$94:$C$102,2,0)^$J$22*Tables!$B$91","v":12.363149476948941},12.363149476948941,"NON OK "]

{"sheet":"Qualif","index":9,"n_rows":39,"n_cols":55,"rows_kept":39,"cut":false,"hidden":true,"merged":[[0,0,2,21],[31,0,32,4],[32,5,32,6],[32,7,32,8],[32,9,32,10],[6,0,7,1],[11,43,11,44],[12,54,12,55],[14,54,14,55],[23,54,23,55],[24,54,24,55],[25,54,25,55],[26,54,26,55],[11,52,11,53],[11,54,11,55],[15,52,15,53],[15,54,15,55],[12,52,12,53],[14,52,14,53],[26,45,26,47],[26,48,26,49],[26,50,26,51],[23,52,23,53],[24,52,24,53],[25,52,25,53],[26,52,26,53],[12,45,12,47],[12,48,12,49],[14,45,14,47],[14,48,14,49],[14,50,14,51],[15,50,15,51],[23,50,23,51],[24,50,24,51],[25,50,25,51],[15,45,15,47],[23,45,23,47],[24,45,24,47],[25,45,25,47],[15,48,15,49],[23,48,23,49],[24,48,24,49],[25,48,25,49],[37,7,37,8],[37,9,37,20],[38,0,38,1],[38,2,38,5],[38,6,38,11],[38,12,38,18],[38,19,38,20],[29,20,29,21],[30,0,30,4],[30,5,30,6],[30,7,30,8],[30,9,30,10],[36,0,37,4],[36,5,36,6],[36,7,36,8],[36,9,36,20],[37,5,37,6],[31,5,31,6],[31,7,31,8],[31,9,31,10],[30,16,30,17],[30,20,30,21],[30,18,30,19],[29,7,29,8],[29,9,29,10],[29,11,29,12],[29,18,29,19],[28,0,28,2],[28,3,29,4],[28,5,28,6],[28,7,28,8],[28,9,28,10],[28,11,28,12],[28,18,28,19],[28,13,28,15],[29,13,29,15],[28,16,28,17],[29,16,29,17],[29,0,29,2],[29,5,29,6],[26,0,26,2],[26,3,27,4],[26,5,26,6],[26,7,26,8],[26,9,26,10],[26,11,26,12],[27,0,27,2],[27,5,27,6],[27,9,27,10],[27,7,27,8],[8,14,8,15],[9,6,9,7],[9,8,9,9],[23,13,24,15],[12,2,12,3],[12,4,12,5],[12,6,12,7],[12,8,12,9],[23,0,23,2],[23,3,23,4],[23,5,23,6],[23,7,23,8],[23,9,23,10],[23,11,23,12],[24,0,24,2],[24,3,25,4],[24,5,24,6],[24,7,24,8],[24,9,24,10],[24,11,24,12],[25,0,25,2],[25,5,25,6],[25,7,25,8],[25,9,25,10],[8,12,8,13],[8,2,8,3],[8,4,8,5],[9,2,9,3],[9,4,9,5],[23,18,24,19],[6,16,6,17],[6,18,6,19],[7,2,7,3],[7,4,7,5],[10,6,10,7],[10,8,10,9],[10,10,10,11],[10,12,10,13],[10,14,10,15],[10,16,10,17],[10,18,10,19],[7,6,7,7],[7,8,7,9],[7,10,7,11],[7,12,7,13],[7,14,7,15],[7,16,7,17],[7,18,7,19],[5,20,5,21],[5,2,5,3],[5,4,5,5],[5,6,5,7],[5,8,5,9],[5,10,5,11],[5,12,5,13],[6,2,6,3],[6,4,6,5],[6,6,6,7],[6,8,6,9],[6,10,6,11],[6,12,6,13],[6,14,6,15],[4,2,4,3],[4,4,4,5],[4,6,4,7],[4,8,4,9],[9,16,9,17],[9,18,9,19],[10,2,10,3],[10,4,10,5],[12,18,12,19],[11,2,11,3],[11,4,11,5],[11,6,11,7],[11,8,11,9],[11,10,11,11],[11,12,11,13],[11,14,11,15],[11,16,11,17],[11,18,11,19],[5,14,5,15],[5,16,5,17],[5,18,5,19],[8,6,8,7],[8,8,8,9],[8,10,8,11],[9,10,9,11],[9,12,9,13],[25,18,25,19],[25,20,25,21],[23,16,24,17],[25,16,25,17],[25,13,25,15],[27,18,27,19],[27,20,27,21],[27,13,27,15],[26,16,26,17],[27,16,27,17],[26,13,26,15],[26,18,26,19],[26,20,26,21],[12,10,12,11],[12,16,12,17],[9,20,9,21],[25,11,25,12],[12,12,12,13],[12,14,12,15],[19,13,19,15],[17,16,17,21],[27,11,27,12],[3,0,3,21],[39,0,39,21],[36,21,38,21],[35,0,35,21],[33,0,34,4],[33,5,34,6],[33,7,34,8],[33,9,34,10],[4,10,4,11],[4,12,4,13],[4,14,4,15],[4,16,4,17],[4,18,4,19],[4,20,4,21],[8,16,8,17],[8,18,8,19],[10,20,10,21],[8,20,8,21],[9,14,9,15],[6,20,7,21],[23,20,24,21],[11,20,11,21],[12,20,12,21],[20,0,22,21],[18,16,18,21],[19,16,19,21],[31,11,34,21],[17,0,17,3],[19,0,19,3],[18,0,18,3],[16,0,16,3],[16,4,16,6],[16,7,16,9],[16,10,16,12],[16,13,16,15],[17,4,17,6],[18,4,18,6],[19,4,19,6],[17,7,17,9],[17,10,17,12],[17,13,17,15],[18,7,18,9],[18,10,18,12],[18,13,18,15],[19,7,19,9],[19,10,19,12],[28,20,28,21],[16,16,16,21]]}
["Practices &  Qualif de  ……………"]
[]
[]
[null,null,null,null,null,null,null,null,null,null,null,null,null,null,null,null,null,null,null,null,null,null,null,"Qualif 1"]
["Niveau G","Concentrat°","Talent",null,"Aggress",null,"Exp",null,"Con, Tech",null,"Endurance",null,"Charisme",null,"Motivation",null,"Réputation",null,"Poids",null,"Age",null,null,"Pos.","Chrono","Écart"]
[{"$f":"+'Setup&WS'!C8","v":147.12319999999997},{"$f":"+'Setup&WS'!C9","v":205},{"$f":"+'Setup&WS'!C10","v":210},null,{"$f":"+'Setup&WS'!C11","v":0},null,{"$f":"+'Setup&WS'!C12","v":131},null,{"$f":"+'Setup&WS'!C13","v":119},null,{"$f":"+'Setup&WS'!C14","v":96},null,{"$f":"+'Setup&WS'!C15","v":63},null,{"$f":"+'Setup&WS'!C16","v":244},null,{"$f":"+'Setup&WS'!C17","v":0},null,{"$f":"+'Setup&WS'!C18","v":56},null,{"$f":"+'Setup&WS'!C19","v":25},null,null,1,"1:21.188s","+ 0.000s"]
[null,null,"Niveau",null,"Leader",null,"Meca",null,"Elec",null,"Aéro",null,"Exp",null,"Pit",null,"Motiv",null,"Age",null,null,null,null,"Qualif 2"]
[null,null,{"$f":"IMPORTS!I4","v":0},null,{"$f":"IMPORTS!I6","v":0},null,{"$f":"IMPORTS!I8","v":0},null,{"$f":"IMPORTS!I10","v":0},null,{"$f":"IMPORTS!I12","v":0},null,{"$f":"IMPORTS!I14","v":0},null,{"$f":"IMPORTS!I16","v":0},null,{"$f":"IMPORTS!I18","v":0},null,{"$f":"IMPORTS!I22","v":0},null,null,null,null,"Pos.","Chrono","Écart"]
[null,"Chassis","Moteur",null,"Ail Av",null,"Ail Ar",null,"Fond Plat",null,"Pontons",null,"Refroid",null,"B V",null,"Freins",null,"Susp",null,"Elect",null,null,1,"1:22.881s","+ 0.000s"]
["Level",{"$f":"+'Setup&WS'!B26","v":7},{"$f":"+'Setup&WS'!B27","v":7},null,{"$f":"+'Setup&WS'!B28","v":7},null,{"$f":"+'Setup&WS'!B29","v":7},null,{"$f":"+'Setup&WS'!B30","v":7},null,{"$f":"+'Setup&WS'!B31","v":7},null,{"$f":"+'Setup&WS'!B32","v":7},null,{"$f":"+'Setup&WS'!B33","v":6},null,{"$f":"+'Setup&WS'!B34","v":7},null,{"$f":"+'Setup&WS'!B35","v":7},null,{"$f":"+'Setup&WS'!B36","v":7},null,null,"Grille de Départ"]
["% Usure",{"$f":"+'Setup&WS'!C26","v":71},{"$f":"+'Setup&WS'!C27","v":0},null,{"$f":"+'Setup&WS'!C28","v":31},null,{"$f":"+'Setup&WS'!C29","v":34},null,{"$f":"+'Setup&WS'!C30","v":0},null,{"$f":"+'Setup&WS'!C31","v":28.000000000000004},null,{"$f":"+'Setup&WS'!C32","v":20},null,{"$f":"+'Setup&WS'!C33","v":33},null,{"$f":"+'Setup&WS'!C34","v":0},null,{"$f":"+'Setup&WS'!C35","v":40},null,{"$f":"+'Setup&WS'!C36","v":0},null,null,"Pos.","Chrono","Écart"]
["Est Usure",{"$f":"'Tyre&Fuel'!S25","v":21.725696766591405},{"$f":"'Tyre&Fuel'!S26","v":12.792465518727955},null,{"$f":"'Tyre&Fuel'!S27","v":22.976187787612158},null,{"$f":"'Tyre&Fuel'!S28","v":27.05036821093783},null,{"$f":"'Tyre&Fuel'!S29","v":24.524606853733243},null,{"$f":"'Tyre&Fuel'!S30","v":14.807081467801018},null,{"$f":"'Tyre&Fuel'!S31","v":17.285589247252748},null,{"$f":"'Tyre&Fuel'!S32","v":16.446986028886624},null,{"$f":"'Tyre&Fuel'!S33","v":13.648216286569344},null,{"$f":"'Tyre&Fuel'!S34","v":8.6036087298801007},null,{"$f":"'Tyre&Fuel'!S35","v":12.363149476948941},null,null,1,"2:44.069s","+ 0.000s",null,null,null,null,null,null,null,null,null,null,null,null,null,null,null,null,null,null,null,null,null,null,null,null,null,null,"Fuel Dry",null,"Fuel Wet"]
["Fin Race",{"$f":"B11+B12","v":92.725696766591398},{"$f":"C11+C12","v":12.792465518727955},null,53.976187787612162,null,{"$f":"G11+G12","v":61.050368210937833},null,{"$f":"I11+I12","v":24.524606853733243},null,{"$f":"K11+K12","v":42.807081467801019},null,{"$f":"M11+M12","v":37.285589247252744},null,{"$f":"O11+O12","v":49.446986028886627},null,{"$f":"Q11+Q12","v":13.648216286569344},null,{"$f":"S11+S12","v":48.603608729880101},null,{"$f":"U11+U12","v":12.363149476948941},null,null,null,null,null,null,null,null,null,null,null,null,null,null,null,null,null,null,null,null,null,null,null,null,"Nbre de toiurs",null,null,{"$f":"'Tyre&Fuel'!D22","v":79},null,null,null,{"$f":"VLOOKUP('Setup&WS'!F18,Tracks!$A$3:$AB$889,27,0)+Tables!H47","v":0.6080651210679815},null,{"$f":"VLOOKUP('Setup&WS'!F18,Tracks!$A$3:$AB$889,28,0)+Tables!H47","v":0.50105512106798167}]
[null,null,null,null,null,null,null,null,null,null,null,null,null,null,null,null,null,null,null,null,null,null,null,null,null,null,null,null,null,null,null,"REDUIRE A 75%"]
[null,null,null,null,null,null,null,null,null,null,null,null,null,null,null,null,null,null,null,null,null,null,null,null,null,null,null,null,null,null,null,null,null,null,null,null,null,null,null,null,null,null,null,null,null,"Base Wear",null,null,"KM Max",null,"% Pneus",null,{"$f":"VLOOKUP('Setup&WS'!F18,Tracks!$A$3:$AA$889,9,0)*BA13+Tables!H50","v":184.56824515089929},null,{"$f":"VLOOKUP('Setup&WS'!F18,Tracks!$A$3:$AA$889,9,0)*BC13","v":149.61505915089933}]
[null,null,null,null,null,null,null,null,null,null,null,null,null,null,null,null,null,null,null,null,null,null,null,null,null,null,null,null,null,null,null,null,null,null,null,null,null,null,null,null,null,null,null,null,null,{"$f":"+N26","v":"Medium"},null,null,{"$f":"LOOKUP(AT16,Tables!$A$55:$A$59,Tables!$F$55:$F$59)","v":136.8451021458601},null,{"$f":"IF(Q26<>\"-\",100-Q26*100*VLOOKUP('Setup&WS'!$F$18,Tracks!$A$3:$G$889,7,0)/AW16,\"-\")","v":44.755056034508513},null,{"$f":"$BA$15/$AW$13*Q26","v":46.726138012885897},null,{"$f":"$BC$15/$AW$13*Q26","v":37.877230164784642}]
["Poste",null,null,null,"Circuit",null,null,"pma",null,null,"Caisse",null,null,"Delta",null,null,"Adequation"]
["Puissance",null,null,null,{"$f":"VLOOKUP('Setup&WS'!$F$18,Tracks!$A$3:$P$889,10,0)","v":8},null,null,{"$f":"'Setup&WS'!I19","v":82.512171851851861},null,null,{"$f":"+'Setup&WS'!D22","v":93.585450000000009},null,null,{"$f":"+H18-K18","v":-11.073278148148148},null,null,{"$f":"IF(H18=N18,\"OK attaque\",\"Attente CR 0\")","v":"Attente CR 0"}]
["Maniabilite",null,null,null,{"$f":"VLOOKUP('Setup&WS'!$F$18,Tracks!$A$3:$P$889,11,0)","v":9},null,null,{"$f":"'Setup&WS'!I20","v":92.826193333333336},null,null,{"$f":"+'Setup&WS'!D23","v":94.030709999999999},null,null,{"$f":"+H19-K19","v":-1.2045166666666631},null,null,{"$f":"IF(H19=N19,\"OK attaque\",\"Attente CR 0\")","v":"Attente CR 0"}]
["Acceleration",null,null,null,{"$f":"VLOOKUP('Setup&WS'!$F$18,Tracks!$A$3:$P$889,12,0)","v":10},null,null,{"$f":"'Setup&WS'!I21","v":103.14021481481481},null,null,{"$f":"+'Setup&WS'!D24","v":90.86242},null,null,12.277794814814811,null,null,{"$f":"IF(H20=N20,\"OK attaque\",\"Attente CR 0\")","v":"Attente CR 0"}]
[]
[]
[]
[null,null,null,"Balance",null,"Q1",null,"Q2",null,"Race",null,71,null,"Gomme",null,null,"Tours",null,"Run Pneu",null,"Fuel",null,null,null,null,null,null,null,null,null,null,null,null,null,null,null,null,null,null,null,null,null,null,null,null,{"$f":"+N27","v":"Medium"},null,null,{"$f":"LOOKUP(AT24,Tables!$A$55:$A$59,Tables!$F$55:$F$59)","v":136.8451021458601},null,{"$f":"IF(Q27<>\"-\",100-Q27*100*VLOOKUP('Setup&WS'!$F$18,Tracks!$A$3:$G$889,7,0)/AW24,\"-\")","v":47.517303232783085},null,{"$f":"$BA$15/$AW$13*Q27","v":44.389831112241602},null,{"$f":"$BC$15/$AW$13*Q27","v":35.983368656545409}]
["Ailerons Avant",null,null,{"$f":"(J25-J26)/2","v":-63},null,{"$f":"+'Setup&WS'!L9","v":644},null,{"$f":"+'Setup&WS'!L16","v":625},null,{"$f":"+'Setup&WS'!L23","v":615},null,"Normal",null,null,null,null,null,null,null,null,null,null,null,null,null,null,null,null,null,null,null,null,null,null,null,null,null,null,null,null,null,null,null,null,null,{"$f":"+N28","v":"Medium"},null,null,{"$f":"LOOKUP(AT25,Tables!$A$55:$A$59,Tables!$F$55:$F$59)","v":136.8451021458601},null,{"$f":"IF(Q28<>\"-\",100-Q28*100*VLOOKUP('Setup&WS'!$F$18,Tracks!$A$3:$G$889,7,0)/AW25,\"-\")","v":47.517303232783085},null,{"$f":"$BA$15/$AW$13*Q28","v":44.389831112241602},null,{"$f":"$BC$15/$AW$13*Q28","v":35.983368656545409}]
["Ailerons Arriere",null,null,null,null,{"$f":"+'Setup&WS'!L10","v":777},null,{"$f":"+'Setup&WS'!L17","v":754},null,{"$f":"+'Setup&WS'!L24","v":741},null,"Q2",null,"Medium",null,null,20,null,{"$f":"AY16","v":44.755056034508513},null,{"$f":"ROUNDUP(IF(N26=\"Rain\",BC16,BA16),0)","v":47},null,null,{"$f":"+'Tyre&Fuel'!H25","v":40.200000000000003},null,null,null,null,null,null,null,null,null,null,null,null,null,null,null,null,null,null,null,null,null,{"$f":"+N29","v":"Medium"},null,null,{"$f":"LOOKUP(AT26,Tables!$A$55:$A$59,Tables!$F$55:$F$59)","v":136.8451021458601},null,{"$f":"IF(Q29<>\"-\",100-Q29*100*VLOOKUP('Setup&WS'!$F$18,Tracks!$A$3:$G$889,7,0)/AW26,\"-\")","v":55.804044827606809},null,{"$f":"$BA$15/$AW$13*Q29","v":37.380910410308715},null,{"$f":"$BC$15/$AW$13*Q29","v":30.301784131827713}]
["Moteur",null,null,"Risk",null,{"$f":"+'Setup&WS'!L11","v":633},null,{"$f":"+'Setup&WS'!L18","v":651},null,{"$f":"+'Setup&WS'!L25","v":661},null,"1e arret",null,{"$f":"+N26","v":"Medium"},null,null,19,null,{"$f":"AY24","v":47.517303232783085},null,{"$f":"ROUNDUP(IF(N27=\"Rain\",BC24,BA24),0)","v":45},null,null,{"$f":"+'Tyre&Fuel'!I25","v":39.200000000000003},null,null,null,null,null,null,null,null,null,null,null,null,null,null,null,null,null,null,null,null,null,{"$f":"+N30","v":"Medium"},null,null,{"$f":"LOOKUP(AT27,Tables!$A$55:$A$59,Tables!$F$55:$F$59)","v":136.8451021458601},null,{"$f":"IF(Q30<>\"-\",100-Q30*100*VLOOKUP('Setup&WS'!$F$18,Tracks!$A$3:$G$889,7,0)/AW27,\"-\")","v":100},null,{"$f":"$BA$15/$AW$13*Q30","v":0},null,{"$f":"$BC$15/$AW$13*Q30","v":0}]
["Freins",null,null,null,null,{"$f":"+'Setup&WS'!L12","v":365},null,{"$f":"+'Setup&WS'!L19","v":335},null,{"$f":"+'Setup&WS'!L26","v":319},null,"2e arret",null,{"$f":"+N27","v":"Medium"},null,null,19,null,{"$f":"AY25","v":47.517303232783085},null,{"$f":"ROUNDUP(IF(N28=\"Rain\",BC25,BA25),0)","v":45},null,null,{"$f":"+'Tyre&Fuel'!J25","v":"0"}]
["Boite de Vitesse",null,null,{"$f":"+'Tyre&Fuel'!J22","v":30},null,{"$f":"+'Setup&WS'!L13","v":345},null,{"$f":"+'Setup&WS'!L20","v":365},null,{"$f":"+'Setup&WS'!L27","v":376},null,"3e arret",null,{"$f":"+N28","v":"Medium"},null,null,16,null,{"$f":"AY26","v":55.804044827606809},null,{"$f":"ROUNDUP(IF(N29=\"Rain\",BC26,BA26),0)","v":38},null,null,{"$f":"+'Tyre&Fuel'!K25","v":"0"}]
["Suspension",null,null,null,null,{"$f":"+'Setup&WS'!L14","v":692},null,{"$f":"+'Setup&WS'!L21","v":722},null,{"$f":"+'Setup&WS'!L28","v":738},null,"4e arret",null,{"$f":"+N29","v":"Medium"},null,null,0,null,{"$f":"AY27","v":100},null,{"$f":"ROUNDUP(IF(N30=\"Rain\",BC27,BA27),0)","v":0},null,null,{"$f":"+'Tyre&Fuel'!L25","v":"0"},null,"OK"]
["Chronos",null,null,null,null,{"$f":"+Y6","v":"1:21.188s"},null,{"$f":"+Y9","v":"1:22.881s"},null,{"$f":"+Y12","v":"2:44.069s"},null,null,null,null,null,null,{"$f":"IF('Tyre&Fuel'!D22=SUM(Qualif!Q26:R30),\"ok\",'Tyre&Fuel'!D22-SUM(Qualif!Q26:R30))","v":5},null,null,null,{"$f":"SUM(U26:V30)","v":175},null,null,null,null,"KO"]
["Meteo",null,null,null,null,{"$f":"+'Setup&WS'!$H$20","v":"Dry"},null,{"$f":"+'Setup&WS'!$H$21","v":"Dry"},null,{"$f":"+'Setup&WS'!$H$22","v":"Dry"},null,{"$f":"'Setup&WS'!F18","v":"Adelaide"}]
[null,null,null,null,null,{"$f":"'Setup&WS'!F20","v":40},null,{"$f":"'Setup&WS'!F21","v":35},null,{"$f":"'Setup&WS'!F22","v":32.333333333333336}]
[null,null,null,null,null,1,null,35,null,55]
[]
[]
["Energy utilisée en %",null,null,null,null,"Q1",null,{"$f":"+'Tyre&Fuel'!C25","v":5},null,{"$f":"+'Tyre&Fuel'!D25","v":"Pousser à la limite"}]
[null,null,null,null,null,"Q2",null,{"$f":"+'Tyre&Fuel'!C26","v":7},null,{"$f":"+'Tyre&Fuel'!D26","v":"Pousser à la limite"}]
["Nbre de Pts ",null,{"$f":"+Menu!L15","v":0},null,null,null,"OBJECTIF  SAISON",null,null,null,null,null,"Promotion ",null,null,null,null,null,null,"OK"]

{"sheet":"ReverseCalc","index":10,"n_rows":79,"n_cols":22,"rows_kept":79,"cut":false,"hidden":true,"merged":[[1,1,1,8],[3,4,3,5],[3,7,3,8],[5,1,5,2],[11,1,11,8],[53,1,53,12],[57,1,58,1],[63,1,64,1],[69,1,70,1],[23,4,23,8],[25,1,25,9],[37,4,37,9],[39,1,39,11],[51,4,51,11]]}
[]
[null,"Determine the best WS based on 3 laps with different WS"]
[]
[null,"FW+RW",1060,null,"Formula",null,null,"Proposed Wings"]
[null,null,null,null,"Denom",{"$f":"(B8-B9)*(B8-B10)*(B9-B10)","v":-4320},null,"FW",{"$f":"C4/2+F9/2","v":542.7499999999967}]
[null,"Study Laps",null,null,"A",{"$f":"(B10*(C9-C8)+B9*(C8-C10)+B8*(C10-C9))/F5","v":1.1111111111114822E-5},null,"RW",{"$f":"C4-I5","v":517.2500000000033}]
[null,"FW – RW","Time (Secs)",null,"B",{"$f":"(B10*B10*(C8-C9)+B9*B9*(C10-C8)+B8*B8*(C9-C10))/F5","v":-5.6666666666670791E-4},null,"FW – RW",{"$f":"ROUND(I5-I6,0)","v":25}]
[null,0,28.440999999999999,null,"C",{"$f":"(B9*B10*(B9-B10)*C8+B10*B8*(B10-B8)*C9+B8*B9*(B8-B9)*C10)/F5","v":28.440999999999999}]
[null,6,28.437999999999999,null,"XV",{"$f":"-F7/(2*F6)","v":25.499999999993339}]
[null,30,28.434000000000001,null,"YV",{"$f":"F8-F7*F7/(4*F6)","v":28.433775000000001}]
[]
[null,"Determine the Wing Split base value"]
[null,"WS Base","Tal","FW lvl","RW lvl","FW","RW","Temp","Weather"]
[null,{"$f":"IF(C14<>\"\",(F14-G14)/2+0.246534498671854*C14-3.69107049712848*(D14+E14)/2+0.189968386659174*(F14+G14)/2-0.376337780506523*H14-IF(I14=\"Wet\",58.8818967363256,0),0)","v":118.9203356108336},181,7,7,543,517,36,"Dry"]
[null,{"$f":"IF(C15<>\"\",(F15-G15)/2+0.246534498671854*C15-3.69107049712848*(D15+E15)/2+0.189968386659174*(F15+G15)/2-0.376337780506523*H15-IF(I15=\"Wet\",58.8818967363256,0),0)","v":0},null,null,null,null,null,null,"Dry"]
[null,0,null,null,null,null,null,null,"Dry"]
[null,0,null,null,null,null,null,null,"Dry"]
[null,0,null,null,null,null,null,null,"Dry"]
[null,0,null,null,null,null,null,null,"Dry"]
[null,0,null,null,null,null,null,null,"Dry"]
[null,0,null,null,null,null,null,null,"Dry"]
[null,0,null,null,null,null,null,null,"Dry"]
[null,0,null,null,null,null,null,null,"Dry"]
[null,{"$f":"SUM(B14:B23)/COUNTIF(B14:B23,\"<>0\")","v":118.9203356108336},"Average",null,"FW and RW represent the best WS"]
[]
[null,"Determine the Fuel base value ( dry / wet )"]
[null,"Fuel Base","Fuel Used","Km Done","Conc","Agg","Exp","TI","EngLvl","EleLvl"]
[null,{"$f":"IF(D28>0,(C28-((E28*-0.000101165457155397)+(F28*0.0000706080613787091)+(G28*-0.0000866455021527332)+(H28*-0.000163915452803369)+(I28*-0.0126912680856842)+(J28*-0.0083557977071091))*D28)/D28,0)","v":0.90097701500159333},217.6,306.71100000000001,212,22,179,131,6,7]
[null,{"$f":"IF(D29>0,(C29-((E29*-0.000101165457155397)+(F29*0.0000706080613787091)+(G29*-0.0000866455021527332)+(H29*-0.000163915452803369)+(I29*-0.0126912680856842)+(J29*-0.0083557977071091))*D29)/D29,0)","v":0}]
[null,0]
[null,0]
[null,0]
[null,0]
[null,0]
[null,0]
[null,0]
[null,0]
[null,{"$f":"SUM(B28:B37)/COUNTIF(B28:B37,\"<>0\")","v":0.90097701500159333},"Average",null,"If race is full wet or dry then race totals can be used instead of stint totals"]
[]
[null,"Determine the Tyre base value",null,null,null,null,null,null,null,null,null,null,null,null,"Type","Factor",null,"Pipirelli",1,null,"Very high",4]
[null,"Tyre Base","Máx Km","Track Wear","Avg Temp","T Brand","T Type","Susp lvl","Agg","Exp","Weig","CT",null,"Extra Soft",0,0.998163750229071,null,"Yokomama",2,null,"High",3]
[null,{"$f":"IF(C42<>\"\",C42/(0.896416176238624^VLOOKUP($D42,$U$40:$V$44,2,0)*0.988463622^E42*1.048876356^VLOOKUP($F42,$R$40:$S$45,2,0)*1.355293715^VLOOKUP($G42,$N$41:$P$45,2,0)*1.009339294^H42*0.999670155^I42*1.00022936^J42*0.999858329^K42*VLOOKUP($G42,$N$41:$P$45,3,0)^L42*129.776458172062*IF(G42=\"Rain\",0.73,1)),0)","v":1.0734250211880669},82.671000000000006,"Medium",26.38,"Yokomama","Extra Soft",7,22,179,53,100,null,"Soft",1,0.99706484481765401,null,"Dunnolop",4,null,"Medium",2]
[null,{"$f":"IF(C43<>\"\",C43/(0.896416176238624^VLOOKUP($D43,$U$40:$V$44,2,0)*0.988463622^E43*1.048876356^VLOOKUP($F43,$R$40:$S$45,2,0)*1.355293715^VLOOKUP($G43,$N$41:$P$45,2,0)*1.009339294^H43*0.999670155^I43*1.00022936^J43*0.999858329^K43*VLOOKUP($G43,$N$41:$P$45,3,0)^L43*129.776458172062*IF(G43=\"Rain\",0.73,1)),0)","v":1.0694311405176382},81.772999999999996,"Medium",27,"Yokomama","Extra Soft",7,22,179,53,100,null,"Medium",2,0.99638034655434904,null,"Badyear",7,null,"Low",1]
[null,1.0748301217354848,83.59,"Medium",25.54,"Yokomama","Extra Soft",7,22,179,53,100,null,"Hard",3,0.99586252604811198,null,"Michelini",5,null,"Very low",0]
[null,1.0754168599458338,85.281999999999996,"Medium",23.86,"Yokomama","Extra Soft",7,22,179,53,100,null,"Rain",5,0.99608785438452296,null,"Bridgerock",6]
[null,0,null,"Medium",null,"Pipirelli","Medium"]
[null,0,null,"Medium",null,"Pipirelli","Medium"]
[null,0,null,"Medium",null,"Pipirelli","Medium"]
[null,0,null,"Medium",null,"Pipirelli","Medium"]
[null,0,null,"Medium",null,"Pipirelli","Medium"]
[null,0,null,"Medium",null,"Pipirelli","Medium"]
[null,{"$f":"SUM(B42:B51)/COUNTIF(B42:B51,\"<>0\")","v":1.0732757858467559},"Average",null,"If race is full wet or dry then race totals can be used instead of stint totals"]
[]
[null,"Determine the Parts base value",null,null,null,null,null,null,null,null,null,null,null,null,null,"Lvl","Factor"]
[null,"Race 1","Chassis","Engine","Front wing","Rear wing","Underbody","Sidepods","Cooling","Gearbox","Brakes","Suspension","Electronics",null,null,1,1.0193267935988299]
[null,"Level",7,6,7,7,7,7,7,7,6,7,7,null,null,2,1.00995581572653]
[null,"Wear",23,43,15,11,21,18,14,34,39,23,15,null,null,3,1.0073261618496101]
[null,"Driver","Conc","Tal","Exp","CT",null,null,null,null,null,null,null,null,null,4,1.0053141448054901]
[null,null,212,181,179,100,null,null,null,null,null,null,null,null,null,5,1.0043268635857201]
[null,null,null,null,null,null,null,null,null,null,null,null,null,null,null,6,1.0036669136885199]
[null,"Race 2","Chassis","Engine","Front wing","Rear wing","Underbody","Sidepods","Cooling","Gearbox","Brakes","Suspension","Electronics",null,null,7,1.00430482472465]
[null,"Level",3,3,2,3,2,3,3,3,2,3,3,null,null,8,1.0096900118273699]
[null,"Wear",19,36,19,21,20,13,11,25,30,33,9,null,null,9,1.0051519553917501]
[null,"Driver","Conc","Tal","Exp","CT"]
[null,null,199,65,78,0]
[]
[null,"Race 3","Chassis","Engine","Front wing","Rear wing","Underbody","Sidepods","Cooling","Gearbox","Brakes","Suspension","Electronics"]
[null,"Level",3,3,2,3,2,3,3,3,2,3,3]
[null,"Wear",17,33,18,20,21,12,12,26,30,31,10]
[null,"Driver","Conc","Tal","Exp","CT"]
[null,null,199,65,78,0]
[]
[]
[null,"Base Values","Chassis","Engine","Front wing","Rear wing","Underbody","Sidepods","Cooling","Gearbox","Brakes","Suspension","Electronics"]
[null,"Race 1",30.579431895351998,60.920599857992897,19.943107757838298,14.6249456890814,27.920350860973599,23.931729309405899,18.613567240649001,45.204377584433402,55.2535673130633,30.579431895351998,19.943107757838298]
[null,"Race 2",29.008649488958099,54.963756926446898,29.008649488958099,32.0621915404273,30.535420514692699,19.848023334550302,16.794481283081002,38.1692756433659,45.803130772038998,50.383443849242902,13.7409392316117]
[null,"Race 3",25.955107437488799,50.383443849242902,27.481878463223399,30.535420514692699,32.0621915404273,18.321252308815598,18.321252308815598,39.696046669100497,45.803130772038998,47.329901797773701,15.2677102573463]
[null,"Average",{"$f":"AVERAGE(C75:C77)","v":28.51439627393297},55.422600211227568,25.477878570006599,25.740852581400464,30.172654305364535,20.700334984257267,17.909766944181868,41.023233298966602,48.953276285713763,42.76425918078953,16.317252415598766]
[null,null,30.58,60.92,19.940000000000001,14.62,27.92,23.93,18.61,45.2,55.25,30.58,19.940000000000001]

{"sheet":"PMA","index":11,"n_rows":66,"n_cols":26,"rows_kept":66,"cut":false,"hidden":true,"merged":[[13,11,13,12],[14,11,16,12],[17,7,17,9],[21,7,21,9],[1,4,2,8],[6,4,7,4],[6,5,7,5],[13,7,13,9]]}
[null,null,null,null,null,null,null,null,null,null,null,null,null,null,"circuit","Km/tour","Tours","Distance","P ","M","A"]
[null,null,null,null,{"$f":"'Setup&WS'!F18","v":"Adelaide"},null,null,null,null,null,null,null,null,null,"A1-Ring",4.3250000000000002,71,{"$f":"Q2*P2","v":307.07499999999999},13,8,9]
[null,null,null,null,null,null,null,null,null,null,null,null,null,null,"Adelaide",3.78,79,298.62,8,9,10,"P","H","A"]
[null,null,null,null,null,"P","H","A",null,null,null,null,null,null,"Ahvenisto",3.04,80,243.2,5,10,7,{"$f":"F5/(F5+G5+H5)","v":0.29629629629629628},{"$f":"G5/(F5+G5+H5)","v":0.33333333333333331},{"$f":"H5/(F5+G5+H5)","v":0.37037037037037035}]
[null,null,null,null,null,{"$f":"VLOOKUP(E2,O2:U61,5,0)","v":8},{"$f":"VLOOKUP(E2,O2:U61,6,0)","v":9},{"$f":"VLOOKUP(E2,O2:U61,7,0)","v":10},null,null,null,null,null,null,"Anderstorp",4.0259999999999998,70,281.82,9,11,9]
[null,null,null,null,null,null,null,null,null,null,null,null,null,null,"Austin",5.516,56,308.89600000000002,11,18,10]
[null,null,null,null,"km",{"$f":"VLOOKUP(E2,PMA!O2:P61,2,0)","v":3.78},"P","H","A",null,null,null,null,null,"Avus",4.88,64,312.32,22,3,9,"pma total",{"$f":"F15+F16+F17","v":278.47858000000002}]
[null,null,null,null,null,null,1.3161428571428571,0.584952380952381,1.169904761904762,null,null,null,null,null,"Baku City",6.0060000000000002,51,306.30600000000004,18,8,16]
[null,"Chassis","Moteur","Aileron Av","Aileron Ar","Fond Plat","Pontons Lateraux","Refroidissement","Boite de Vitesse","Freins","Suspension","Electronique",null,null,"Barcelona",4.7279999999999998,65,307.32,11,13,8]
["level",{"$f":"'Setup&WS'!B26","v":7},{"$f":"+'Setup&WS'!B27","v":7},{"$f":"'Setup&WS'!B28","v":7},{"$f":"'Setup&WS'!B29","v":7},{"$f":"'Setup&WS'!B30","v":7},{"$f":"'Setup&WS'!B31","v":7},{"$f":"'Setup&WS'!B32","v":7},{"$f":"'Setup&WS'!B33","v":6},{"$f":"'Setup&WS'!B34","v":7},{"$f":"'Setup&WS'!B35","v":7},{"$f":"'Setup&WS'!B36","v":7},null,null,"Brands Hatch",4.2069999999999999,75,315.52499999999998,10,12,8]
["usure",{"$f":"'Setup&WS'!C26","v":71},{"$f":"'Setup&WS'!C27","v":0},{"$f":"'Setup&WS'!C28","v":31},{"$f":"'Setup&WS'!C29","v":34},{"$f":"'Setup&WS'!C30","v":0},{"$f":"'Setup&WS'!C31","v":28.000000000000004},{"$f":"'Setup&WS'!C32","v":20},{"$f":"'Setup&WS'!C33","v":33},{"$f":"'Setup&WS'!C34","v":0},{"$f":"'Setup&WS'!C35","v":40},{"$f":"'Setup&WS'!C36","v":0},null,null,"Brasilia",5.4749999999999996,55,301.125,16,15,7]
["level réel",{"$f":"B10-B11/100","v":6.29},{"$f":"C10-C11/100","v":7},{"$f":"D10-D11/100","v":6.69},6.66,7,6.72,6.8,5.67,7,6.6,7,null,null,"Bremgarten",7.2809999999999997,42,305.80199999999996,8,26,17]
[null,null,null,null,null,null,null,null,null,null,null,null,null,null,"Brno",5.4039999999999999,57,308.02800000000002,12,12,14]
[null,"théorique avant testing","réel avant testing","Points testing","PMA GPRO","PMA réel",null,"PMA ideal",null,null,null,"DELTA TOTAL PMA",null,null,"Bucharest Ring",3.0710000000000002,80,245.68,8,6,8]
["PUISSANCE",{"$f":"SUMPRODUCT(PMA!P64:Z64,PMA!B10:L10)","v":90.686000000000007},{"$f":"PMA!B12*PMA!P64+PMA!C12*PMA!Q64+PMA!D12*PMA!R64+PMA!E12*PMA!S64+PMA!F12*PMA!T64+PMA!G12*PMA!U64+PMA!H12*PMA!V64+PMA!I12*PMA!W64+PMA!J12*PMA!X64+PMA!K12*PMA!Y64+PMA!L12*PMA!Z64","v":88.585450000000009},5,{"$f":"B15+D15","v":95.686000000000007},{"$f":"C15+D15","v":93.585450000000009},null,"P","M","A",null,{"$f":"H24+I24+J24","v":24.555589629629623},null,null,"Buenos Aires",4.258,72,306.57600000000002,12,11,9]
["MANIABILITE",{"$f":"SUMPRODUCT(PMA!P65:Z65,PMA!B10:L10)","v":92.155999999999992},{"$f":"PMA!B12*PMA!P65+PMA!C12*PMA!Q65+PMA!D12*PMA!R65+PMA!E12*PMA!S65+PMA!F12*PMA!T65+PMA!G12*PMA!U65+PMA!H12*PMA!V65+PMA!I12*PMA!W65+PMA!J12*PMA!X65+PMA!K12*PMA!Y65+PMA!L12*PMA!Z65","v":88.030709999999999},6,{"$f":"B16+D16","v":98.155999999999992},{"$f":"C16+D16","v":94.030709999999999},null,{"$f":"W7*V4","v":82.512171851851861},{"$f":"W7*W4","v":92.826193333333336},{"$f":"W7*X4","v":103.14021481481481},null,null,null,null,"Estoril",4.3600000000000003,70,305.20000000000005,11,8,14]
["ACCELERATION",{"$f":"SUMPRODUCT(PMA!P66:Z66,PMA!B10:L10)","v":88.643000000000001},{"$f":"PMA!B12*PMA!P66+PMA!C12*PMA!Q66+PMA!D12*PMA!R66+PMA!E12*PMA!S66+PMA!F12*PMA!T66+PMA!G12*PMA!U66+PMA!H12*PMA!V66+PMA!I12*PMA!W66+PMA!J12*PMA!X66+PMA!K12*PMA!Y66+PMA!L12*PMA!Z66","v":84.86242},6,{"$f":"B17+D17","v":94.643000000000001},{"$f":"C17+D17","v":90.86242},null,null,null,null,null,null,null,null,"Fiorano",3.02,79,238.58,8,6,7]
[null,null,null,null,null,null,null,"Mon PMA",null,null,null,null,null,null,"Fuji",4.5579999999999998,67,305.38599999999997,13,11,8]
[null,null,null,null,null,null,null,"P","M","A",null,null,null,null,"Grobnik",4.1680000000000001,74,308.43200000000002,8,15,7]
[null,null,null,null,null,null,null,{"$f":"+F15","v":93.585450000000009},{"$f":"+F16","v":94.030709999999999},{"$f":"+F17","v":90.86242},null,null,null,null,"Hockenheim",4.5730000000000004,67,306.39100000000002,12,9,11]
[null,null,null,null,null,null,null,null,null,null,null,null,null,null,"Hungaroring",3.968,77,305.536,7,10,13]
[null,null,null,null,null,null,null,"Delta PMA",null,null,null,null,null,null,"Imola",4.9290000000000003,62,305.59800000000001,12,13,9]
[null,null,null,null,null,null,null,"P","M","A",null,null,null,null,"Indianapolis",4.2,73,306.60000000000002,10,9,11]
[null,null,null,null,null,null,null,{"$f":"ABS(H16-H20)","v":11.073278148148148},{"$f":"ABS(I16-I20)","v":1.2045166666666631},12.277794814814811,null,null,null,null,"Indianapolis Oval",4.0220000000000002,200,804.40000000000009,17,9,2]
[null,null,null,null,null,null,null,null,null,null,null,null,null,null,"Interlagos",4.3079999999999998,71,305.86799999999999,12,9,10]
[null,null,null,null,null,null,null,null,null,null,null,null,null,null,"Irungattukottai",3.7160000000000002,79,293.56400000000002,8,12,7]
[null,null,null,null,null,null,null,null,null,null,null,null,null,null,"Istanbul",5.3339999999999996,58,{"$f":"Q27*P27","v":309.37199999999996},13,10,14]
[null,null,null,null,null,null,null,null,null,null,null,null,null,null,"Jerez",4.4409999999999998,69,306.42899999999997,8,16,8]
[null,null,null,null,null,null,null,null,null,null,null,null,null,null,"Jyllands-Ringen",2.2999999999999998,136,312.79999999999995,5,9,4]
[null,null,null,null,null,null,null,null,null,null,null,null,null,null,"Kaunas",3.3010000000000002,80,264.08000000000004,9,10,5]
[null,null,null,null,null,null,null,null,null,null,null,null,null,null,"Kyalami",4.2610000000000001,72,306.79200000000003,9,12,9]
[null,null,null,null,null,null,null,null,null,null,null,null,null,null,"Laguna Seca",3.601,79,284.47899999999998,11,8,7]
[null,null,null,null,null,null,null,null,null,null,null,null,null,null,"Magny Cours",4.2469999999999999,72,305.78399999999999,12,8,11]
[null,null,null,null,null,null,null,null,null,null,null,null,null,null,"Melbourne",5.3029999999999999,58,307.57400000000001,12,15,10]
[null,null,null,null,null,null,null,null,null,null,null,null,null,null,"Mexico City",4.42,69,304.98,13,12,7]
[null,null,null,null,null,null,null,null,null,null,null,null,null,null,"Monte Carlo",3.3690000000000002,78,262.78200000000004,7,7,12]
[null,null,null,null,null,null,null,null,null,null,null,null,null,null,"Montreal",4.42,69,304.98,12,7,13]
[null,null,null,null,null,null,null,null,null,null,null,null,null,null,"Monza",5.7869999999999999,53,306.71100000000001,17,12,9]
[null,null,null,null,null,null,null,null,null,null,null,null,null,null,"Mugello",5.2469999999999999,58,304.32600000000002,11,13,12]
[null,null,null,null,null,null,null,null,null,null,null,null,null,null,"New Delhi",5.1369999999999996,60,308.21999999999997,11,15,10]
[null,null,null,null,null,null,null,null,null,null,null,null,null,null,"Nurburgring",5.1449999999999996,60,308.7,12,12,13]
[null,null,null,null,null,null,null,null,null,null,null,null,null,null,"Oesterreichring",5.94,52,308.88,19,14,9]
[null,null,null,null,null,null,null,null,null,null,null,null,null,null,"Paul Ricard",3.8610000000000002,79,305.01900000000001,9,11,8]
[null,null,null,null,null,null,null,null,null,null,null,null,null,null,"Portimao",4.6920000000000002,66,309.67200000000003,9,14,11]
[null,null,null,null,null,null,null,null,null,null,null,null,null,null,"Poznan",4.0830000000000002,75,306.22500000000002,7,14,8]
[null,null,null,null,null,null,null,null,null,null,null,null,null,null,"Rafaela Oval",4.7359999999999998,67,317.31200000000001,18,10,6]
[null,null,null,null,null,null,null,null,null,null,null,null,null,null,"Sakhir",5.4119999999999999,57,308.48399999999998,16,11,9]
[null,null,null,null,null,null,null,null,null,null,null,null,null,null,"Sepang",5.6440000000000001,55,310.42,14,11,14]
[null,null,null,null,null,null,null,null,null,null,null,null,null,null,"Serres",3.1859999999999999,80,254.88,5,10,9]
[null,null,null,null,null,null,null,null,null,null,null,null,null,null,"Shanghai",5.45,56,305.2,9,16,15]
[null,null,null,null,null,null,null,null,null,null,null,null,null,null,"Silverstone",5.1379999999999999,60,308.27999999999997,11,11,16]
[null,null,null,null,null,null,null,null,null,null,null,null,null,null,"Singapore",5.0670000000000002,61,309.08699999999999,7,11,17]
[null,null,null,null,null,null,null,null,null,null,null,null,null,null,"Slovakiaring",5.923,53,313.91899999999998,17,10,15]
[null,null,null,null,null,null,null,null,null,null,null,null,null,null,"Sochi",5.851,53,310.10300000000001,8,15,18]
[null,null,null,null,null,null,null,null,null,null,null,null,null,null,"Spa",6.968,44,306.59199999999998,18,16,13]
[null,null,null,null,null,null,null,null,null,null,null,null,null,null,"Suzuka",5.86,53,310.58000000000004,11,18,13]
[null,null,null,null,null,null,null,null,null,null,null,null,null,null,"Valencia",5.44,57,310.08000000000004,11,12,16]
[null,null,null,null,null,null,null,null,null,null,null,null,null,null,"Yas Marina",5.5549999999999997,55,305.52499999999998,12,10,17]
[null,null,null,null,null,null,null,null,null,null,null,null,null,null,"Yeongam",5.6219999999999999,55,309.20999999999998,11,15,13]
[null,null,null,null,null,null,null,null,null,null,null,null,null,null,"Zandvoort",4.2510000000000003,71,301.82100000000003,9,13,9]
[null,null,null,null,null,null,null,null,null,null,null,null,null,null,"Zolder",4.2610000000000001,70,298.27,11,9,10]
[]
[null,null,null,null,null,null,null,null,null,null,null,null,null,null,null,"chassis","engine","frontWing","rearWing","underbody","sidepods","cooling","gearbox","brakes","suspension","electronics"]
[null,null,null,null,null,null,null,null,null,null,null,null,null,null,{"$f":"SUM(P64:Z64)","v":13.392000000000003},0.65500000000000114,5.9649999999999999,0.65600000000000058,null,null,0.66000000000000014,1.1910000000000007,3.0579999999999998,null,null,1.2070000000000007]
[null,null,null,null,null,null,null,null,null,null,null,null,null,null,{"$f":"SUM(P65:Z65)","v":13.307999999999998},1.5020000000000007,null,3.1369999999999987,2.1679999999999993,0.74799999999999933,0.76600000000000001,null,1,1.9749999999999996,2.0120000000000005]
[null,null,null,null,null,null,null,null,null,null,null,null,null,null,{"$f":"SUM(P66:Z66)","v":13.277000000000001},1.3480000000000008,2.048,null,2.5229999999999997,0.38000000000000078,null,null,4.2959999999999994,null,1.370000000000001,1.3119999999999994]

{"sheet":"Calc","index":12,"n_rows":400,"n_cols":10,"rows_kept":400,"cut":false,"hidden":true,"merged":[[13,9,15,17]]}
["x","y",null,"t","ÿ","ÿ",500,null,null,{"$f":"\"ÿ = \"&IF(a<>0,a&\"x²\"&IF(b<>0,IF(b<0,\"\",\"+\")&b&\"x\",\"\"),IF(b<>0,b&\"x\",\"\"))&IF(g<>0,IF(g>0,\"+\",\"\")&g,\"\")","v":"ÿ = -2.368475785867E-17x²-3.33333333395526E-05x+93.2015688937475"}]
[{"$f":"'Setup&WS'!A39","v":-132.9331875620619},{"$f":"'Setup&WS'!B39:C39","v":93.206000000000003},null,{"$f":"MIN(x)-(MAX(x)-MIN(x))","v":-222.9331875620619},{"$f":"IF(ISNA(D2),NA(),a*t^2+b*t+g)","v":93.208999999999818},{"$f":"IF(ISNA(D2),NA(),u*(t-mx)^2+v*(t-mx)+w+my)","v":93.208999999999818},{"$f":"IF(ISNA(D2),500,MIN(F1,G1))","v":500},{"$f":"IF(ISNA(D2),H1,IF(E2<G1,D2,H1))","v":-222.9331875620619},null,{"$f":"AVERAGE(y)","v":93.206000000000003}]
[{"$f":"'Setup&WS'!A40","v":-102.9331875620619},{"$f":"'Setup&WS'!B40:C40","v":93.204999999999998},null,{"$f":"IF(D2<=MAX(x)+(MAX(x)-MIN(x))/50,D2+(MAX(x)-MIN(x))/100,NA())","v":-222.33318756206191},{"$f":"IF(ISNA(D3),NA(),a*t^2+b*t+g)","v":93.208979999999812},{"$f":"IF(ISNA(D3),NA(),u*(t-mx)^2+v*(t-mx)+w+my)","v":93.208979999999826},93.208999999999818,-222.33318756206191,null,{"$f":"AVERAGE(x)","v":-132.9331875620619}]
[{"$f":"'Setup&WS'!A41","v":-162.9331875620619},{"$f":"'Setup&WS'!B41:C41","v":93.206999999999994},null,{"$f":"IF(D3<=MAX(x)+(MAX(x)-MIN(x))/50,D3+(MAX(x)-MIN(x))/100,NA())","v":-221.73318756206191},{"$f":"IF(ISNA(D4),NA(),a*t^2+b*t+g)","v":93.20895999999982},{"$f":"IF(ISNA(D4),NA(),u*(t-mx)^2+v*(t-mx)+w+my)","v":93.20895999999982},93.208979999999826,-221.73318756206191,null,{"$f":"(AVERAGE((x-mx)^3)*AVERAGE((y-my)*(x-mx))-AVERAGE((x-mx)^2)*AVERAGE((y-my)*(x-mx)^2))/(AVERAGE((x-mx)^2)^3+AVERAGE((x-mx)^3)^2-AVERAGE((x-mx)^2)*AVERAGE((x-mx)^4))","v":-2.3684757858670008E-17}]
[null,null,null,{"$f":"IF(D4<=MAX(x)+(MAX(x)-MIN(x))/50,D4+(MAX(x)-MIN(x))/100,NA())","v":-221.13318756206192},{"$f":"IF(ISNA(D5),NA(),a*t^2+b*t+g)","v":93.208939999999814},{"$f":"IF(ISNA(D5),NA(),u*(t-mx)^2+v*(t-mx)+w+my)","v":93.208939999999828},93.20895999999982,-221.13318756206192,null,{"$f":"((AVERAGE((x-mx)^2)^2-AVERAGE((x-mx)^4))*AVERAGE((y-my)*(x-mx))+AVERAGE((x-mx)^3)*AVERAGE((y-my)*(x-mx)^2))/(AVERAGE((x-mx)^2)^3+AVERAGE((x-mx)^3)^2-AVERAGE((x-mx)^2)*AVERAGE((x-mx)^4))","v":-3.3333333333255645E-5}]
[null,null,null,{"$f":"IF(D5<=MAX(x)+(MAX(x)-MIN(x))/50,D5+(MAX(x)-MIN(x))/100,NA())","v":-220.53318756206193},{"$f":"IF(ISNA(D6),NA(),a*t^2+b*t+g)","v":93.208919999999821},{"$f":"IF(ISNA(D6),NA(),u*(t-mx)^2+v*(t-mx)+w+my)","v":93.208919999999836},93.208939999999828,-220.53318756206193,null,{"$f":"(-AVERAGE((x-mx)^2)*AVERAGE((x-mx)^3)*AVERAGE((y-my)*(x-mx))+AVERAGE((x-mx)^2)^2*AVERAGE((y-my)*(x-mx)^2))/(AVERAGE((x-mx)^2)^3+AVERAGE((x-mx)^3)^2-AVERAGE((x-mx)^2)*AVERAGE((x-mx)^4))","v":1.4210854715202004E-14}]
[null,null,null,{"$f":"IF(D6<=MAX(x)+(MAX(x)-MIN(x))/50,D6+(MAX(x)-MIN(x))/100,NA())","v":-219.93318756206193},{"$f":"IF(ISNA(D7),NA(),a*t^2+b*t+g)","v":93.208899999999829},{"$f":"IF(ISNA(D7),NA(),u*(t-mx)^2+v*(t-mx)+w+my)","v":93.208899999999829},93.208919999999836,-219.93318756206193,null,{"$f":"u","v":-2.3684757858670008E-17}]
[null,null,null,-219.33318756206194,93.208879999999823,93.208879999999837,93.208899999999829,-219.33318756206194,null,{"$f":"v-2*u*mx","v":-3.3333333339552624E-5}]
[null,null,null,-218.73318756206194,93.208859999999831,93.208859999999831,93.208879999999837,-218.73318756206194,null,{"$f":"w-v*mx+u*mx^2+my","v":93.201568893747535}]
[null,null,null,-218.13318756206195,93.208839999999839,93.208839999999839,93.208859999999831,-218.13318756206195]
[null,null,null,-217.53318756206195,93.208819999999832,93.208819999999847,93.208839999999839,-217.53318756206195,null,{"$f":"MIN(G1:G400)","v":93.202999999999832}]
[null,null,null,-216.93318756206196,93.20879999999984,93.20879999999984,93.208819999999847,-216.93318756206196]
[null,null,null,-216.33318756206197,93.208779999999834,93.208779999999848,93.20879999999984,-216.33318756206197]
[null,null,null,-215.73318756206197,93.208759999999842,93.208759999999842,93.208779999999848,-215.73318756206197,null,"NE PAS TOUCHER CET ONGLET, MERCI ;-)"]
[null,null,null,-215.13318756206198,93.20873999999985,93.20873999999985,93.208759999999842,-215.13318756206198]
[null,null,null,-214.53318756206198,93.208719999999843,93.208719999999857,93.20873999999985,-214.53318756206198]
[null,null,null,-213.93318756206199,93.208699999999851,93.208699999999851,93.208719999999857,-213.93318756206199]
[null,null,null,-213.33318756206199,93.208679999999859,93.208679999999859,93.208699999999851,-213.33318756206199]
[null,null,null,-212.733187562062,93.208659999999853,93.208659999999867,93.208679999999859,-212.733187562062]
[null,null,null,-212.13318756206201,93.20863999999986,93.20863999999986,93.208659999999867,-212.13318756206201]
[null,null,null,-211.53318756206201,93.208619999999854,93.208619999999868,93.20863999999986,-211.53318756206201]
[null,null,null,-210.93318756206202,93.208599999999862,93.208599999999862,93.208619999999868,-210.93318756206202]
[null,null,null,-210.33318756206202,93.20857999999987,93.20857999999987,93.208599999999862,-210.33318756206202]
[null,null,null,-209.73318756206203,93.208559999999864,93.208559999999878,93.20857999999987,-209.73318756206203]
[null,null,null,-209.13318756206203,93.208539999999871,93.208539999999871,93.208559999999878,-209.13318756206203]
[null,null,null,-208.53318756206204,93.208519999999865,93.208519999999879,93.208539999999871,-208.53318756206204]
[null,null,null,-207.93318756206205,93.208499999999873,93.208499999999873,93.208519999999879,-207.93318756206205]
[null,null,null,-207.33318756206205,93.208479999999881,93.208479999999881,93.208499999999873,-207.33318756206205]
[null,null,null,-206.73318756206206,93.208459999999874,93.208459999999889,93.208479999999881,-206.73318756206206]
[null,null,null,-206.13318756206206,93.208439999999882,93.208439999999882,93.208459999999889,-206.13318756206206]
[null,null,null,-205.53318756206207,93.208419999999876,{"$f":"IF(ISNA(D31),NA(),u*(t-mx)^2+v*(t-mx)+w+my)","v":93.20841999999989},93.208439999999882,-205.53318756206207]
[null,null,null,-204.93318756206207,93.208399999999884,93.208399999999884,93.20841999999989,-204.93318756206207]
[null,null,null,-204.33318756206208,93.208379999999892,93.208379999999892,93.208399999999884,-204.33318756206208]
[null,null,null,-203.73318756206208,93.208359999999885,93.2083599999999,93.208379999999892,-203.73318756206208]
[null,null,null,{"$f":"IF(D34<=MAX(x)+(MAX(x)-MIN(x))/50,D34+(MAX(x)-MIN(x))/100,NA())","v":-203.13318756206209},93.208339999999893,93.208339999999893,93.2083599999999,-203.13318756206209]
[null,null,null,-202.5331875620621,93.208319999999887,93.208319999999901,93.208339999999893,-202.5331875620621]
[null,null,null,-201.9331875620621,93.208299999999895,93.208299999999895,93.208319999999901,-201.9331875620621]
[null,null,null,-201.33318756206211,93.208279999999888,93.208279999999903,93.208299999999895,-201.33318756206211]
[null,null,null,-200.73318756206211,93.208259999999896,93.208259999999896,93.208279999999903,-200.73318756206211]
[null,null,null,-200.13318756206212,93.208239999999904,93.208239999999904,93.208259999999896,-200.13318756206212]
[null,null,null,-199.53318756206212,93.208219999999898,93.208219999999912,93.208239999999904,-199.53318756206212]
[null,null,null,-198.93318756206213,93.208199999999906,93.208199999999906,93.208219999999912,-198.93318756206213]
[null,null,null,-198.33318756206214,93.208179999999899,93.208179999999913,93.208199999999906,-198.33318756206214]
[null,null,null,-197.73318756206214,93.208159999999907,93.208159999999907,93.208179999999913,-197.73318756206214]
[null,null,null,-197.13318756206215,93.208139999999915,93.208139999999915,93.208159999999907,-197.13318756206215]
[null,null,null,-196.53318756206215,93.208119999999909,93.208119999999923,93.208139999999915,-196.53318756206215]
[null,null,null,-195.93318756206216,93.208099999999916,93.208099999999916,93.208119999999923,-195.93318756206216]
[null,null,null,-195.33318756206216,93.20807999999991,93.208079999999924,93.208099999999916,-195.33318756206216]
[null,null,null,-194.73318756206217,93.208059999999918,93.208059999999918,93.208079999999924,-194.73318756206217]
[null,null,null,-194.13318756206218,93.208039999999912,93.208039999999926,93.208059999999918,-194.13318756206218]
[null,null,null,-193.53318756206218,93.208019999999919,93.208019999999919,93.208039999999926,-193.53318756206218]
[null,null,null,-192.93318756206219,93.207999999999927,93.207999999999927,93.208019999999919,-192.93318756206219]
[null,null,null,-192.33318756206219,93.207979999999921,93.207979999999935,93.207999999999927,-192.33318756206219]
[null,null,null,-191.7331875620622,93.207959999999929,93.207959999999929,93.207979999999935,-191.7331875620622]
[null,null,null,-191.1331875620622,93.207939999999923,93.207939999999937,93.207959999999929,-191.1331875620622]
[null,null,null,-190.53318756206221,93.20791999999993,93.20791999999993,93.207939999999937,-190.53318756206221]
[null,null,null,-189.93318756206222,93.207899999999924,93.207899999999938,93.20791999999993,-189.93318756206222]
[null,null,null,-189.33318756206222,93.207879999999932,93.207879999999932,93.207899999999938,-189.33318756206222]
[null,null,null,-188.73318756206223,93.20785999999994,93.20785999999994,93.207879999999932,-188.73318756206223]
[null,null,null,-188.13318756206223,93.207839999999933,93.207839999999948,93.20785999999994,-188.13318756206223]
[null,null,null,-187.53318756206224,93.207819999999941,93.207819999999941,93.207839999999948,-187.53318756206224]
[null,null,null,-186.93318756206224,93.207799999999935,93.207799999999949,93.207819999999941,-186.93318756206224]
[null,null,null,-186.33318756206225,93.207779999999943,93.207779999999943,93.207799999999949,-186.33318756206225]
[null,null,null,-185.73318756206226,93.207759999999936,93.207759999999951,93.207779999999943,-185.73318756206226]
[null,null,null,-185.13318756206226,93.207739999999944,93.207739999999944,93.207759999999951,-185.13318756206226]
[null,null,null,-184.53318756206227,93.207719999999938,93.207719999999952,{"$f":"IF(ISNA(D66),500,MIN(F65,G65))","v":93.207739999999944},{"$f":"IF(ISNA(D66),H65,IF(E66<G65,D66,H65))","v":-184.53318756206227}]
[null,null,null,{"$f":"IF(D66<=MAX(x)+(MAX(x)-MIN(x))/50,D66+(MAX(x)-MIN(x))/100,NA())","v":-183.93318756206227},{"$f":"IF(ISNA(D67),NA(),a*t^2+b*t+g)","v":93.207699999999946},93.207699999999946,93.207719999999952,-183.93318756206227]
[null,null,null,-183.33318756206228,93.207679999999954,93.207679999999954,93.207699999999946,-183.33318756206228]
[null,null,null,-182.73318756206228,93.207659999999947,93.207659999999962,93.207679999999954,-182.73318756206228]
[null,null,null,-182.13318756206229,93.207639999999955,93.207639999999955,93.207659999999962,-182.13318756206229]
[null,null,null,-181.5331875620623,93.207619999999949,93.207619999999963,93.207639999999955,-181.5331875620623]
[null,null,null,-180.9331875620623,93.207599999999957,93.207599999999957,93.207619999999963,-180.9331875620623]
[null,null,null,-180.33318756206231,93.20757999999995,93.207579999999965,93.207599999999957,-180.33318756206231]
[null,null,null,-179.73318756206231,93.207559999999958,93.207559999999958,93.207579999999965,-179.73318756206231]
[null,null,null,-179.13318756206232,93.207539999999952,93.207539999999966,93.207559999999958,-179.13318756206232]
[null,null,null,-178.53318756206232,93.20751999999996,93.20751999999996,93.207539999999966,-178.53318756206232]
[null,null,null,-177.93318756206233,93.207499999999953,93.207499999999968,93.20751999999996,-177.93318756206233]
[null,null,null,-177.33318756206234,93.207479999999961,93.207479999999961,93.207499999999968,-177.33318756206234]
[null,null,null,-176.73318756206234,93.207459999999969,93.207459999999969,93.207479999999961,-176.73318756206234]
[null,null,null,-176.13318756206235,93.207439999999963,93.207439999999963,93.207459999999969,-176.13318756206235]
[null,null,null,-175.53318756206235,93.207419999999971,93.207419999999971,93.207439999999963,-175.53318756206235]
[null,null,null,-174.93318756206236,93.207399999999964,93.207399999999978,93.207419999999971,-174.93318756206236]
[null,null,null,-174.33318756206236,93.207379999999972,93.207379999999972,93.207399999999978,-174.33318756206236]
[null,null,null,-173.73318756206237,93.207359999999966,93.20735999999998,93.207379999999972,-173.73318756206237]
[null,null,null,-173.13318756206237,93.207339999999974,93.207339999999974,93.20735999999998,-173.13318756206237]
[null,null,null,-172.53318756206238,93.207319999999967,93.207319999999982,93.207339999999974,-172.53318756206238]
[null,null,null,-171.93318756206239,93.207299999999975,93.207299999999975,93.207319999999982,-171.93318756206239]
[null,null,null,-171.33318756206239,93.207279999999969,93.207279999999983,93.207299999999975,-171.33318756206239]
[null,null,null,-170.7331875620624,93.207259999999977,93.207259999999977,93.207279999999983,-170.7331875620624]
[null,null,null,-170.1331875620624,93.20723999999997,93.207239999999985,93.207259999999977,-170.1331875620624]
[null,null,null,-169.53318756206241,93.207219999999978,93.207219999999978,93.207239999999985,-169.53318756206241]
[null,null,null,-168.93318756206241,93.207199999999972,93.207199999999986,93.207219999999978,-168.93318756206241]
[null,null,null,-168.33318756206242,93.20717999999998,93.20717999999998,93.207199999999986,-168.33318756206242]
[null,null,null,-167.73318756206243,93.207159999999973,93.207159999999988,93.20717999999998,-167.73318756206243]
[null,null,null,-167.13318756206243,93.207139999999981,{"$f":"IF(ISNA(D95),NA(),u*(t-mx)^2+v*(t-mx)+w+my)","v":93.207139999999981},93.207159999999988,-167.13318756206243]
[null,null,null,-166.53318756206244,93.207119999999989,93.207119999999989,93.207139999999981,-166.53318756206244]
[null,null,null,-165.93318756206244,93.207099999999983,93.207099999999983,93.207119999999989,-165.93318756206244]
[null,null,null,-165.33318756206245,93.207079999999991,93.207079999999991,93.207099999999983,-165.33318756206245]
[null,null,null,{"$f":"IF(D98<=MAX(x)+(MAX(x)-MIN(x))/50,D98+(MAX(x)-MIN(x))/100,NA())","v":-164.73318756206245},93.207059999999984,93.207059999999984,93.207079999999991,-164.73318756206245]
[null,null,null,-164.13318756206246,93.207039999999992,93.207039999999992,93.207059999999984,-164.13318756206246]
[null,null,null,-163.53318756206247,93.207019999999986,93.207019999999986,93.207039999999992,-163.53318756206247]
[null,null,null,-162.93318756206247,93.206999999999994,93.206999999999994,93.207019999999986,-162.93318756206247]
[null,null,null,-162.33318756206248,93.206979999999987,93.206980000000001,93.206999999999994,-162.33318756206248]
[null,null,null,-161.73318756206248,93.206959999999995,93.206959999999995,93.206980000000001,-161.73318756206248]
[null,null,null,-161.13318756206249,93.206939999999989,93.206940000000003,93.206959999999995,-161.13318756206249]
[null,null,null,-160.53318756206249,93.206919999999997,93.206919999999997,93.206940000000003,-160.53318756206249]
[null,null,null,-159.9331875620625,93.20689999999999,93.206900000000005,93.206919999999997,-159.9331875620625]
[null,null,null,{"$f":"IF(D107<=MAX(x)+(MAX(x)-MIN(x))/50,D107+(MAX(x)-MIN(x))/100,NA())","v":-159.33318756206251},{"$f":"IF(ISNA(D108),NA(),a*t^2+b*t+g)","v":93.206879999999998},{"$f":"IF(ISNA(D108),NA(),u*(t-mx)^2+v*(t-mx)+w+my)","v":93.206879999999998},93.206900000000005,-159.33318756206251]
[null,null,null,-158.73318756206251,93.206859999999992,93.206860000000006,93.206879999999998,-158.73318756206251]
[null,null,null,-158.13318756206252,93.20684,93.20684,93.206860000000006,-158.13318756206252]
[null,null,null,-157.53318756206252,93.206819999999993,93.206820000000008,93.20684,-157.53318756206252]
[null,null,null,-156.93318756206253,93.206800000000001,93.206800000000001,93.206820000000008,-156.93318756206253]
[null,null,null,-156.33318756206253,93.206779999999995,93.206780000000009,93.206800000000001,-156.33318756206253]
[null,null,null,-155.73318756206254,93.206760000000003,93.206760000000003,93.206780000000009,-155.73318756206254]
[null,null,null,-155.13318756206255,93.206739999999996,93.206740000000011,93.206760000000003,-155.13318756206255]
[null,null,null,-154.53318756206255,93.206720000000004,93.206720000000004,93.206740000000011,-154.53318756206255]
[null,null,null,-153.93318756206256,93.206699999999998,93.206700000000012,93.206720000000004,-153.93318756206256]
[null,null,null,-153.33318756206256,93.206680000000006,93.206680000000006,93.206700000000012,-153.33318756206256]
[null,null,null,-152.73318756206257,93.206659999999999,93.206659999999999,93.206680000000006,-152.73318756206257]
[null,null,null,-152.13318756206257,93.206640000000007,93.206640000000007,{"$f":"IF(ISNA(D120),500,MIN(F119,G119))","v":93.206659999999999},-152.13318756206257]
[null,null,null,-151.53318756206258,93.206620000000001,93.206620000000001,{"$f":"IF(ISNA(D121),500,MIN(F120,G120))","v":93.206640000000007},-151.53318756206258]
[null,null,null,-150.93318756206259,93.206600000000009,93.206600000000009,93.206620000000001,-150.93318756206259]
[null,null,null,-150.33318756206259,93.206580000000002,93.206580000000002,93.206600000000009,-150.33318756206259]
[null,null,null,-149.7331875620626,93.20656000000001,93.20656000000001,93.206580000000002,-149.7331875620626]
[null,null,null,-149.1331875620626,93.206540000000004,93.206540000000004,93.20656000000001,-149.1331875620626]
[null,null,null,-148.53318756206261,93.206519999999998,93.206520000000012,93.206540000000004,-148.53318756206261]
[null,null,null,-147.93318756206261,93.206500000000005,93.206500000000005,93.206520000000012,-147.93318756206261]
[null,null,null,-147.33318756206262,93.206479999999999,93.206480000000013,93.206500000000005,-147.33318756206262]
[null,null,null,-146.73318756206262,93.206460000000007,93.206460000000007,93.206480000000013,-146.73318756206262]
[null,null,null,-146.13318756206263,93.206440000000001,93.206440000000015,93.206460000000007,{"$f":"IF(ISNA(D130),H129,IF(E130<G129,D130,H129))","v":-146.13318756206263}]
[null,null,null,-145.53318756206264,{"$f":"IF(ISNA(D131),NA(),a*t^2+b*t+g)","v":93.206420000000008},93.206420000000008,93.206440000000015,-145.53318756206264]
[null,null,null,-144.93318756206264,93.206400000000002,93.206400000000016,93.206420000000008,-144.93318756206264]
[null,null,null,-144.33318756206265,93.20638000000001,93.20638000000001,93.206400000000016,-144.33318756206265]
[null,null,null,-143.73318756206265,93.206360000000004,93.206360000000018,93.20638000000001,-143.73318756206265]
[null,null,null,-143.13318756206266,93.206340000000012,93.206340000000012,93.206360000000018,-143.13318756206266]
[null,null,null,-142.53318756206266,93.206320000000005,93.206320000000019,93.206340000000012,-142.53318756206266]
[null,null,null,-141.93318756206267,93.206300000000013,93.206300000000013,93.206320000000019,-141.93318756206267]
[null,null,null,-141.33318756206268,93.206280000000007,93.206280000000021,93.206300000000013,-141.33318756206268]
[null,null,null,-140.73318756206268,93.206260000000015,93.206260000000015,93.206280000000021,-140.73318756206268]
[null,null,null,{"$f":"IF(D139<=MAX(x)+(MAX(x)-MIN(x))/50,D139+(MAX(x)-MIN(x))/100,NA())","v":-140.13318756206269},93.206240000000008,93.206240000000022,93.206260000000015,-140.13318756206269]
[null,null,null,-139.53318756206269,93.206220000000016,93.206220000000016,93.206240000000022,-139.53318756206269]
[null,null,null,-138.9331875620627,93.20620000000001,93.20620000000001,93.206220000000016,-138.9331875620627]
[null,null,null,-138.3331875620627,93.206180000000018,93.206180000000018,93.20620000000001,-138.3331875620627]
[null,null,null,-137.73318756206271,93.206160000000011,93.206160000000011,93.206180000000018,-137.73318756206271]
[null,null,null,-137.13318756206272,93.206140000000005,93.206140000000019,93.206160000000011,-137.13318756206272]
[null,null,null,-136.53318756206272,93.206120000000013,93.206120000000013,93.206140000000019,-136.53318756206272]
[null,null,null,-135.93318756206273,93.206100000000006,93.206100000000021,93.206120000000013,-135.93318756206273]
[null,null,null,-135.33318756206273,93.206080000000014,93.206080000000014,93.206100000000021,-135.33318756206273]
[null,null,null,-134.73318756206274,93.206060000000008,93.206060000000022,93.206080000000014,-134.73318756206274]
[null,null,null,-134.13318756206274,93.206040000000016,93.206040000000016,93.206060000000022,-134.13318756206274]
[null,null,null,-133.53318756206275,93.206020000000009,93.206020000000024,93.206040000000016,-133.53318756206275]
[null,null,null,-132.93318756206276,93.206000000000017,93.206000000000017,93.206020000000024,-132.93318756206276]
[null,null,null,-132.33318756206276,93.205980000000011,93.205980000000011,93.206000000000017,-132.33318756206276]
[null,null,null,-131.73318756206277,93.205960000000005,93.205960000000019,93.205980000000011,-131.73318756206277]
[null,null,null,-131.13318756206277,93.205940000000012,93.205940000000012,93.205960000000019,-131.13318756206277]
[null,null,null,-130.53318756206278,93.205920000000006,93.20592000000002,93.205940000000012,-130.53318756206278]
[null,null,null,-129.93318756206278,93.205900000000014,93.205900000000014,93.20592000000002,-129.93318756206278]
[null,null,null,-129.33318756206279,93.205880000000008,93.205880000000022,93.205900000000014,-129.33318756206279]
[null,null,null,-128.7331875620628,93.205860000000015,93.205860000000015,93.205880000000022,-128.7331875620628]
[null,null,null,-128.1331875620628,93.205840000000009,93.205840000000023,93.205860000000015,-128.1331875620628]
[null,null,null,-127.53318756206281,93.205820000000017,93.205820000000017,93.205840000000023,-127.53318756206281]
[null,null,null,-126.93318756206281,93.205800000000011,93.205800000000011,93.205820000000017,-126.93318756206281]
[null,null,null,-126.33318756206282,93.205780000000004,93.205780000000019,93.205800000000011,-126.33318756206282]
[null,null,null,-125.73318756206282,93.205760000000012,93.205760000000012,93.205780000000019,-125.73318756206282]
[null,null,null,-125.13318756206283,93.205740000000006,93.20574000000002,93.205760000000012,-125.13318756206283]
[null,null,null,-124.53318756206284,93.205720000000014,93.205720000000014,93.20574000000002,-124.53318756206284]
[null,null,null,-123.93318756206284,93.205700000000007,93.205700000000022,93.205720000000014,-123.93318756206284]
[null,null,null,-123.33318756206285,93.205680000000015,93.205680000000015,93.205700000000022,-123.33318756206285]
[null,null,null,-122.73318756206285,93.205660000000009,93.205660000000009,93.205680000000015,-122.73318756206285]
[null,null,null,-122.13318756206286,93.205640000000017,93.205640000000017,93.205660000000009,-122.13318756206286]
[null,null,null,-121.53318756206286,93.20562000000001,93.20562000000001,93.205640000000017,-121.53318756206286]
[null,null,null,{"$f":"IF(D171<=MAX(x)+(MAX(x)-MIN(x))/50,D171+(MAX(x)-MIN(x))/100,NA())","v":-120.93318756206287},93.205600000000004,{"$f":"IF(ISNA(D172),NA(),u*(t-mx)^2+v*(t-mx)+w+my)","v":93.205600000000018},93.20562000000001,-120.93318756206287]
[null,null,null,-120.33318756206288,93.205580000000012,93.205580000000012,93.205600000000018,-120.33318756206288]
[null,null,null,-119.73318756206288,93.205560000000006,93.20556000000002,93.205580000000012,-119.73318756206288]
[null,null,null,-119.13318756206289,93.205540000000013,93.205540000000013,93.20556000000002,-119.13318756206289]
[null,null,null,-118.53318756206289,93.205520000000007,93.205520000000007,93.205540000000013,-118.53318756206289]
[null,null,null,-117.9331875620629,93.205500000000001,93.205500000000015,93.205520000000007,-117.9331875620629]
[null,null,null,-117.3331875620629,93.205480000000009,93.205480000000009,93.205500000000015,-117.3331875620629]
[null,null,null,-116.73318756206291,93.205460000000002,93.205460000000016,93.205480000000009,-116.73318756206291]
[null,null,null,-116.13318756206291,93.20544000000001,93.20544000000001,93.205460000000016,-116.13318756206291]
[null,null,null,-115.53318756206292,93.205420000000004,93.205420000000018,93.20544000000001,-115.53318756206292]
[null,null,null,-114.93318756206293,93.205400000000012,93.205400000000012,93.205420000000018,-114.93318756206293]
[null,null,null,-114.33318756206293,93.205380000000005,93.205380000000005,93.205400000000012,-114.33318756206293]
[null,null,null,-113.73318756206294,93.205359999999999,93.205360000000013,93.205380000000005,-113.73318756206294]
[null,null,null,-113.13318756206294,93.205340000000007,93.205340000000007,{"$f":"IF(ISNA(D185),500,MIN(F184,G184))","v":93.205360000000013},-113.13318756206294]
[null,null,null,-112.53318756206295,93.20532,93.205320000000015,93.205340000000007,-112.53318756206295]
[null,null,null,-111.93318756206295,93.205300000000008,93.205300000000008,93.205320000000015,-111.93318756206295]
[null,null,null,-111.33318756206296,93.205280000000002,93.205280000000002,93.205300000000008,-111.33318756206296]
[null,null,null,{"$f":"IF(D188<=MAX(x)+(MAX(x)-MIN(x))/50,D188+(MAX(x)-MIN(x))/100,NA())","v":-110.73318756206297},93.205259999999996,{"$f":"IF(ISNA(D189),NA(),u*(t-mx)^2+v*(t-mx)+w+my)","v":93.20526000000001},93.205280000000002,-110.73318756206297]
[null,null,null,-110.13318756206297,93.205240000000003,93.205240000000003,93.20526000000001,-110.13318756206297]
[null,null,null,-109.53318756206298,93.205219999999997,93.205220000000011,93.205240000000003,-109.53318756206298]
[null,null,null,-108.93318756206298,93.205200000000005,93.205200000000005,93.205220000000011,-108.93318756206298]
[null,null,null,-108.33318756206299,93.205179999999999,93.205179999999999,93.205200000000005,-108.33318756206299]
[null,null,null,-107.73318756206299,93.205159999999992,93.205160000000006,93.205179999999999,{"$f":"IF(ISNA(D194),H193,IF(E194<G193,D194,H193))","v":-107.73318756206299}]
[null,null,null,-107.133187562063,{"$f":"IF(ISNA(D195),NA(),a*t^2+b*t+g)","v":93.20514},93.20514,93.205160000000006,-107.133187562063]
[null,null,null,-106.53318756206301,93.205119999999994,93.205120000000008,93.20514,-106.53318756206301]
[null,null,null,-105.93318756206301,93.205100000000002,93.205100000000002,93.205120000000008,-105.93318756206301]
[null,null,null,-105.33318756206302,93.205079999999995,93.205079999999995,93.205100000000002,-105.33318756206302]
[null,null,null,-104.73318756206302,93.205059999999989,93.205060000000003,93.205079999999995,-104.73318756206302]
[null,null,null,-104.13318756206303,93.205039999999997,93.205039999999997,93.205060000000003,-104.13318756206303]
[null,null,null,-103.53318756206303,93.20501999999999,93.205020000000005,93.205039999999997,-103.53318756206303]
[null,null,null,-102.93318756206304,93.204999999999998,93.204999999999998,93.205020000000005,-102.93318756206304]
[null,null,null,-102.33318756206305,93.204979999999992,93.204979999999992,93.204999999999998,-102.33318756206305]
[null,null,null,-101.73318756206305,93.204959999999986,93.20496,93.204979999999992,-101.73318756206305]
[null,null,null,{"$f":"IF(D204<=MAX(x)+(MAX(x)-MIN(x))/50,D204+(MAX(x)-MIN(x))/100,NA())","v":-101.13318756206306},93.204939999999993,93.204939999999993,93.20496,-101.13318756206306]
[null,null,null,{"$f":"IF(D205<=MAX(x)+(MAX(x)-MIN(x)),D205+(MAX(x)-MIN(x))/100,NA())","v":-100.53318756206306},93.204919999999987,93.204920000000001,93.204939999999993,-100.53318756206306]
[null,null,null,-99.933187562063068,93.204899999999995,{"$f":"IF(ISNA(D207),NA(),u*(t-mx)^2+v*(t-mx)+w+my)","v":93.204899999999995},93.204920000000001,-99.933187562063068]
[null,null,null,-99.333187562063074,93.204879999999989,93.204879999999989,93.204899999999995,-99.333187562063074]
[null,null,null,-98.73318756206308,93.204859999999982,93.204859999999996,93.204879999999989,-98.73318756206308]
[null,null,null,-98.133187562063085,93.20483999999999,93.20483999999999,93.204859999999996,-98.133187562063085]
[null,null,null,-97.533187562063091,93.204819999999984,93.204819999999984,93.20483999999999,-97.533187562063091]
[null,null,null,-96.933187562063097,93.204799999999977,93.204799999999992,93.204819999999984,-96.933187562063097]
[null,null,null,-96.333187562063102,93.204779999999985,93.204779999999985,93.204799999999992,-96.333187562063102]
[null,null,null,-95.733187562063108,93.204759999999979,93.204759999999993,93.204779999999985,-95.733187562063108]
[null,null,null,-95.133187562063114,93.204739999999987,93.204739999999987,93.204759999999993,-95.133187562063114]
[null,null,null,-94.533187562063119,93.20471999999998,93.20471999999998,93.204739999999987,-94.533187562063119]
[null,null,null,-93.933187562063125,93.204699999999974,93.204699999999988,93.20471999999998,-93.933187562063125]
[null,null,null,-93.333187562063131,93.204679999999982,93.204679999999982,93.204699999999988,-93.333187562063131]
[null,null,null,-92.733187562063137,93.204659999999976,93.204659999999976,93.204679999999982,-92.733187562063137]
[null,null,null,-92.133187562063142,93.204639999999969,93.204639999999984,93.204659999999976,-92.133187562063142]
[null,null,null,-91.533187562063148,93.204619999999977,93.204619999999977,93.204639999999984,-91.533187562063148]
[null,null,null,-90.933187562063154,93.204599999999971,93.204599999999985,93.204619999999977,-90.933187562063154]
[null,null,null,-90.333187562063159,93.204579999999979,93.204579999999979,93.204599999999985,-90.333187562063159]
[null,null,null,-89.733187562063165,93.204559999999972,93.204559999999972,93.204579999999979,-89.733187562063165]
[null,null,null,-89.133187562063171,93.204539999999966,93.20453999999998,93.204559999999972,-89.133187562063171]
[null,null,null,-88.533187562063176,93.204519999999974,93.204519999999974,93.20453999999998,-88.533187562063176]
[null,null,null,-87.933187562063182,93.204499999999967,93.204499999999967,93.204519999999974,-87.933187562063182]
[null,null,null,-87.333187562063188,93.204479999999961,93.204479999999975,93.204499999999967,-87.333187562063188]
[null,null,null,-86.733187562063193,93.204459999999969,93.204459999999969,93.204479999999975,-86.733187562063193]
[null,null,null,-86.133187562063199,93.204439999999963,93.204439999999963,93.204459999999969,-86.133187562063199]
[null,null,null,-85.533187562063205,93.204419999999956,93.204419999999971,93.204439999999963,-85.533187562063205]
[null,null,null,-84.93318756206321,93.204399999999964,93.204399999999964,93.204419999999971,-84.93318756206321]
[null,null,null,-84.333187562063216,93.204379999999958,93.204379999999972,93.204399999999964,-84.333187562063216]
[null,null,null,-83.733187562063222,93.204359999999951,93.204359999999966,93.204379999999972,-83.733187562063222]
[null,null,null,-83.133187562063227,93.204339999999959,93.204339999999959,93.204359999999966,-83.133187562063227]
[null,null,null,-82.533187562063233,93.204319999999953,93.204319999999967,93.204339999999959,-82.533187562063233]
[null,null,null,-81.933187562063239,93.204299999999961,93.204299999999961,93.204319999999967,-81.933187562063239]
[null,null,null,{"$f":"IF(D237<=MAX(x)+(MAX(x)-MIN(x)),D237+(MAX(x)-MIN(x))/100,NA())","v":-81.333187562063245},93.204279999999954,93.204279999999954,93.204299999999961,-81.333187562063245]
[null,null,null,-80.73318756206325,93.204259999999948,93.204259999999962,93.204279999999954,-80.73318756206325]
[null,null,null,-80.133187562063256,93.204239999999956,93.204239999999956,93.204259999999962,-80.133187562063256]
[null,null,null,-79.533187562063262,93.20421999999995,93.20421999999995,93.204239999999956,-79.533187562063262]
[null,null,null,-78.933187562063267,93.204199999999943,93.204199999999958,93.20421999999995,-78.933187562063267]
[null,null,null,-78.333187562063273,93.204179999999951,93.204179999999951,93.204199999999958,-78.333187562063273]
[null,null,null,-77.733187562063279,93.204159999999945,93.204159999999945,93.204179999999951,-77.733187562063279]
[null,null,null,-77.133187562063284,93.204139999999938,93.204139999999953,93.204159999999945,-77.133187562063284]
[null,null,null,-76.53318756206329,93.204119999999946,93.204119999999946,93.204139999999953,-76.53318756206329]
[null,null,null,-75.933187562063296,93.20409999999994,93.20409999999994,93.204119999999946,-75.933187562063296]
[null,null,null,-75.333187562063301,93.204079999999934,93.204079999999948,93.20409999999994,-75.333187562063301]
[null,null,null,-74.733187562063307,93.204059999999942,93.204059999999942,{"$f":"IF(ISNA(D249),500,MIN(F248,G248))","v":93.204079999999948},-74.733187562063307]
[null,null,null,-74.133187562063313,93.204039999999935,93.204039999999935,93.204059999999942,-74.133187562063313]
[null,null,null,-73.533187562063318,93.204019999999929,93.204019999999943,93.204039999999935,-73.533187562063318]
[null,null,null,-72.933187562063324,93.203999999999937,93.203999999999937,93.204019999999943,-72.933187562063324]
[null,null,null,-72.33318756206333,93.20397999999993,93.20397999999993,93.203999999999937,-72.33318756206333]
[null,null,null,-71.733187562063335,93.203959999999924,93.203959999999938,93.20397999999993,-71.733187562063335]
[null,null,null,-71.133187562063341,93.203939999999932,93.203939999999932,93.203959999999938,-71.133187562063341]
[null,null,null,-70.533187562063347,93.203919999999925,93.203919999999925,93.203939999999932,-70.533187562063347]
[null,null,null,-69.933187562063353,93.203899999999919,93.203899999999933,93.203919999999925,-69.933187562063353]
[null,null,null,-69.333187562063358,93.203879999999927,93.203879999999927,93.203899999999933,{"$f":"IF(ISNA(D258),H257,IF(E258<G257,D258,H257))","v":-69.333187562063358}]
[null,null,null,-68.733187562063364,{"$f":"IF(ISNA(D259),NA(),a*t^2+b*t+g)","v":93.203859999999921},93.203859999999921,93.203879999999927,-68.733187562063364]
[null,null,null,-68.13318756206337,93.203839999999914,93.203839999999929,93.203859999999921,-68.13318756206337]
[null,null,null,-67.533187562063375,93.203819999999922,93.203819999999922,93.203839999999929,-67.533187562063375]
[null,null,null,-66.933187562063381,93.203799999999916,93.203799999999916,93.203819999999922,-66.933187562063381]
[null,null,null,-66.333187562063387,93.203779999999909,93.203779999999924,93.203799999999916,-66.333187562063387]
[null,null,null,-65.733187562063392,93.203759999999903,93.203759999999917,93.203779999999924,-65.733187562063392]
[null,null,null,-65.133187562063398,93.203739999999911,93.203739999999911,93.203759999999917,-65.133187562063398]
[null,null,null,-64.533187562063404,93.203719999999905,93.203719999999919,93.203739999999911,-64.533187562063404]
[null,null,null,-63.933187562063402,93.203699999999898,93.203699999999913,93.203719999999919,-63.933187562063402]
[null,null,null,-63.333187562063401,93.203679999999906,93.203679999999906,93.203699999999913,-63.333187562063401]
[null,null,null,-62.733187562063399,93.2036599999999,93.2036599999999,93.203679999999906,-62.733187562063399]
[null,null,null,{"$f":"IF(D269<=MAX(x)+(MAX(x)-MIN(x)),D269+(MAX(x)-MIN(x))/100,NA())","v":-62.133187562063398},93.203639999999893,93.203639999999908,93.2036599999999,-62.133187562063398]
[null,null,null,-61.533187562063397,93.203619999999901,{"$f":"IF(ISNA(D271),NA(),u*(t-mx)^2+v*(t-mx)+w+my)","v":93.203619999999901},93.203639999999908,-61.533187562063397]
[null,null,null,-60.933187562063395,93.203599999999895,93.203599999999895,93.203619999999901,-60.933187562063395]
[null,null,null,-60.333187562063394,93.203579999999889,93.203579999999903,93.203599999999895,-60.333187562063394]
[null,null,null,-59.733187562063392,93.203559999999896,93.203559999999896,93.203579999999903,-59.733187562063392]
[null,null,null,-59.133187562063391,93.20353999999989,93.20353999999989,93.203559999999896,-59.133187562063391]
[null,null,null,-58.533187562063389,93.203519999999884,93.203519999999898,93.20353999999989,-58.533187562063389]
[null,null,null,-57.933187562063388,93.203499999999877,93.203499999999892,93.203519999999898,-57.933187562063388]
[null,null,null,-57.333187562063387,93.203479999999885,93.203479999999885,93.203499999999892,-57.333187562063387]
[null,null,null,-56.733187562063385,93.203459999999879,93.203459999999879,93.203479999999885,-56.733187562063385]
[null,null,null,-56.133187562063384,93.203439999999873,93.203439999999887,93.203459999999879,-56.133187562063384]
[null,null,null,-55.533187562063382,93.20341999999988,93.20341999999988,93.203439999999887,-55.533187562063382]
[null,null,null,-54.933187562063381,93.203399999999874,93.203399999999874,93.20341999999988,-54.933187562063381]
[null,null,null,-54.33318756206338,93.203379999999868,93.203379999999882,93.203399999999874,-54.33318756206338]
[null,null,null,-53.733187562063378,93.203359999999876,93.203359999999876,93.203379999999882,-53.733187562063378]
[null,null,null,-53.133187562063377,93.203339999999869,93.203339999999869,93.203359999999876,-53.133187562063377]
[null,null,null,-52.533187562063375,93.203319999999863,93.203319999999877,93.203339999999869,-52.533187562063375]
[null,null,null,-51.933187562063374,93.203299999999857,93.203299999999871,93.203319999999877,-51.933187562063374]
[null,null,null,-51.333187562063372,93.203279999999864,93.203279999999864,93.203299999999871,-51.333187562063372]
[null,null,null,-50.733187562063371,93.203259999999858,93.203259999999858,93.203279999999864,-50.733187562063371]
[null,null,null,-50.13318756206337,93.203239999999852,93.203239999999866,93.203259999999858,-50.13318756206337]
[null,null,null,-49.533187562063368,93.20321999999986,93.20321999999986,93.203239999999866,-49.533187562063368]
[null,null,null,-48.933187562063367,93.203199999999853,93.203199999999853,93.20321999999986,-48.933187562063367]
[null,null,null,-48.333187562063365,93.203179999999847,93.203179999999861,93.203199999999853,-48.333187562063365]
[null,null,null,-47.733187562063364,93.203159999999841,93.203159999999855,93.203179999999861,-47.733187562063364]
[null,null,null,-47.133187562063362,93.203139999999848,93.203139999999848,93.203159999999855,-47.133187562063362]
[null,null,null,-46.533187562063361,93.203119999999842,93.203119999999842,93.203139999999848,-46.533187562063361]
[null,null,null,-45.93318756206336,93.203099999999836,93.20309999999985,93.203119999999842,-45.93318756206336]
[null,null,null,-45.333187562063358,93.203079999999844,93.203079999999844,93.20309999999985,-45.333187562063358]
[null,null,null,-44.733187562063357,93.203059999999837,93.203059999999837,93.203079999999844,-44.733187562063357]
[null,null,null,-44.133187562063355,93.203039999999831,93.203039999999831,93.203059999999837,-44.133187562063355]
[null,null,null,-43.533187562063354,93.203019999999825,93.203019999999839,93.203039999999831,-43.533187562063354]
[null,null,null,{"$f":"IF(D301<=MAX(x)+(MAX(x)-MIN(x)),D301+(MAX(x)-MIN(x))/100,NA())","v":-42.933187562063353},93.202999999999832,93.202999999999832,93.203019999999839,-42.933187562063353]
[null,null,null,-42.333187562063351,93.202979999999826,93.202979999999826,93.202999999999832,-42.333187562063351]
[null,null,null,{"$error":"#N/A"},{"$f":"IF(ISNA(D304),NA(),a*t^2+b*t+g)","v":{"$error":"#N/A"}},{"$error":"#N/A"},{"$f":"IF(ISNA(D304),500,MIN(F303,G303))","v":500},{"$f":"IF(ISNA(D304),H303,IF(E304<G303,D304,H303))","v":-42.333187562063351}]
[null,null,null,{"$error":"#N/A"},{"$error":"#N/A"},{"$error":"#N/A"},500,{"$f":"IF(ISNA(D305),H304,IF(E305<G304,D305,H304))","v":-42.333187562063351}]
[null,null,null,{"$error":"#N/A"},{"$error":"#N/A"},{"$error":"#N/A"},500,-42.333187562063351]
[null,null,null,{"$error":"#N/A"},{"$error":"#N/A"},{"$error":"#N/A"},500,-42.333187562063351]
[null,null,null,{"$error":"#N/A"},{"$error":"#N/A"},{"$error":"#N/A"},500,-42.333187562063351]
[null,null,null,{"$error":"#N/A"},{"$error":"#N/A"},{"$error":"#N/A"},500,-42.333187562063351]
[null,null,null,{"$error":"#N/A"},{"$error":"#N/A"},{"$error":"#N/A"},500,-42.333187562063351]
[null,null,null,{"$error":"#N/A"},{"$error":"#N/A"},{"$error":"#N/A"},500,-42.333187562063351]
[null,null,null,{"$error":"#N/A"},{"$error":"#N/A"},{"$error":"#N/A"},500,-42.333187562063351]
[null,null,null,{"$error":"#N/A"},{"$error":"#N/A"},{"$error":"#N/A"},{"$f":"IF(ISNA(D313),500,MIN(F312,G312))","v":500},-42.333187562063351]
[null,null,null,{"$error":"#N/A"},{"$error":"#N/A"},{"$error":"#N/A"},500,-42.333187562063351]
[null,null,null,{"$error":"#N/A"},{"$error":"#N/A"},{"$error":"#N/A"},500,-42.333187562063351]
[null,null,null,{"$error":"#N/A"},{"$error":"#N/A"},{"$error":"#N/A"},500,-42.333187562063351]
[null,null,null,{"$error":"#N/A"},{"$error":"#N/A"},{"$error":"#N/A"},500,-42.333187562063351]
[null,null,null,{"$error":"#N/A"},{"$error":"#N/A"},{"$error":"#N/A"},500,-42.333187562063351]
[null,null,null,{"$error":"#N/A"},{"$error":"#N/A"},{"$error":"#N/A"},500,-42.333187562063351]
[null,null,null,{"$error":"#N/A"},{"$error":"#N/A"},{"$error":"#N/A"},500,-42.333187562063351]
[null,null,null,{"$error":"#N/A"},{"$error":"#N/A"},{"$error":"#N/A"},500,-42.333187562063351]
[null,null,null,{"$error":"#N/A"},{"$error":"#N/A"},{"$error":"#N/A"},500,-42.333187562063351]
[null,null,null,{"$error":"#N/A"},{"$f":"IF(ISNA(D323),NA(),a*t^2+b*t+g)","v":{"$error":"#N/A"}},{"$error":"#N/A"},500,-42.333187562063351]
[null,null,null,{"$error":"#N/A"},{"$error":"#N/A"},{"$error":"#N/A"},500,-42.333187562063351]
[null,null,null,{"$error":"#N/A"},{"$error":"#N/A"},{"$error":"#N/A"},500,-42.333187562063351]
[null,null,null,{"$error":"#N/A"},{"$error":"#N/A"},{"$error":"#N/A"},500,-42.333187562063351]
[null,null,null,{"$error":"#N/A"},{"$error":"#N/A"},{"$error":"#N/A"},500,-42.333187562063351]
[null,null,null,{"$error":"#N/A"},{"$error":"#N/A"},{"$error":"#N/A"},500,-42.333187562063351]
[null,null,null,{"$error":"#N/A"},{"$error":"#N/A"},{"$error":"#N/A"},500,-42.333187562063351]
[null,null,null,{"$error":"#N/A"},{"$error":"#N/A"},{"$error":"#N/A"},500,-42.333187562063351]
[null,null,null,{"$error":"#N/A"},{"$error":"#N/A"},{"$error":"#N/A"},500,-42.333187562063351]
[null,null,null,{"$error":"#N/A"},{"$error":"#N/A"},{"$error":"#N/A"},500,-42.333187562063351]
[null,null,null,{"$error":"#N/A"},{"$error":"#N/A"},{"$error":"#N/A"},500,-42.333187562063351]
[null,null,null,{"$f":"IF(D333<=MAX(x)+(MAX(x)-MIN(x)),D333+(MAX(x)-MIN(x))/100,NA())","v":{"$error":"#N/A"}},{"$error":"#N/A"},{"$error":"#N/A"},500,-42.333187562063351]
[null,null,null,{"$error":"#N/A"},{"$error":"#N/A"},{"$f":"IF(ISNA(D335),NA(),u*(t-mx)^2+v*(t-mx)+w+my)","v":{"$error":"#N/A"}},500,-42.333187562063351]
[null,null,null,{"$error":"#N/A"},{"$error":"#N/A"},{"$error":"#N/A"},500,-42.333187562063351]
[null,null,null,{"$error":"#N/A"},{"$error":"#N/A"},{"$error":"#N/A"},500,-42.333187562063351]
[null,null,null,{"$error":"#N/A"},{"$error":"#N/A"},{"$error":"#N/A"},500,-42.333187562063351]
[null,null,null,{"$error":"#N/A"},{"$error":"#N/A"},{"$error":"#N/A"},500,-42.333187562063351]
[null,null,null,{"$error":"#N/A"},{"$error":"#N/A"},{"$error":"#N/A"},500,-42.333187562063351]
[null,null,null,{"$error":"#N/A"},{"$error":"#N/A"},{"$error":"#N/A"},500,-42.333187562063351]
[null,null,null,{"$error":"#N/A"},{"$error":"#N/A"},{"$error":"#N/A"},500,-42.333187562063351]
[null,null,null,{"$error":"#N/A"},{"$error":"#N/A"},{"$error":"#N/A"},500,-42.333187562063351]
[null,null,null,{"$error":"#N/A"},{"$error":"#N/A"},{"$error":"#N/A"},500,-42.333187562063351]
[null,null,null,{"$error":"#N/A"},{"$error":"#N/A"},{"$error":"#N/A"},500,-42.333187562063351]
[null,null,null,{"$error":"#N/A"},{"$error":"#N/A"},{"$error":"#N/A"},500,-42.333187562063351]
[null,null,null,{"$error":"#N/A"},{"$error":"#N/A"},{"$error":"#N/A"},500,-42.333187562063351]
[null,null,null,{"$error":"#N/A"},{"$error":"#N/A"},{"$error":"#N/A"},500,-42.333187562063351]
[null,null,null,{"$error":"#N/A"},{"$error":"#N/A"},{"$error":"#N/A"},500,-42.333187562063351]
[null,null,null,{"$error":"#N/A"},{"$error":"#N/A"},{"$error":"#N/A"},500,-42.333187562063351]
[null,null,null,{"$error":"#N/A"},{"$error":"#N/A"},{"$error":"#N/A"},500,-42.333187562063351]
[null,null,null,{"$error":"#N/A"},{"$error":"#N/A"},{"$error":"#N/A"},500,-42.333187562063351]
[null,null,null,{"$error":"#N/A"},{"$error":"#N/A"},{"$error":"#N/A"},500,-42.333187562063351]
[null,null,null,{"$error":"#N/A"},{"$error":"#N/A"},{"$error":"#N/A"},500,-42.333187562063351]
[null,null,null,{"$error":"#N/A"},{"$error":"#N/A"},{"$error":"#N/A"},500,-42.333187562063351]
[null,null,null,{"$error":"#N/A"},{"$error":"#N/A"},{"$error":"#N/A"},500,-42.333187562063351]
[null,null,null,{"$error":"#N/A"},{"$error":"#N/A"},{"$error":"#N/A"},500,-42.333187562063351]
[null,null,null,{"$error":"#N/A"},{"$error":"#N/A"},{"$error":"#N/A"},500,-42.333187562063351]
[null,null,null,{"$error":"#N/A"},{"$error":"#N/A"},{"$error":"#N/A"},500,-42.333187562063351]
[null,null,null,{"$error":"#N/A"},{"$error":"#N/A"},{"$error":"#N/A"},500,-42.333187562063351]
[null,null,null,{"$error":"#N/A"},{"$error":"#N/A"},{"$error":"#N/A"},500,-42.333187562063351]
[null,null,null,{"$error":"#N/A"},{"$error":"#N/A"},{"$error":"#N/A"},500,-42.333187562063351]
[null,null,null,{"$error":"#N/A"},{"$error":"#N/A"},{"$error":"#N/A"},500,-42.333187562063351]
[null,null,null,{"$error":"#N/A"},{"$error":"#N/A"},{"$error":"#N/A"},500,-42.333187562063351]
[null,null,null,{"$error":"#N/A"},{"$error":"#N/A"},{"$error":"#N/A"},500,-42.333187562063351]
[null,null,null,{"$f":"IF(D365<=MAX(x)+(MAX(x)-MIN(x)),D365+(MAX(x)-MIN(x))/100,NA())","v":{"$error":"#N/A"}},{"$error":"#N/A"},{"$error":"#N/A"},500,-42.333187562063351]
[null,null,null,{"$error":"#N/A"},{"$error":"#N/A"},{"$error":"#N/A"},500,-42.333187562063351]
[null,null,null,{"$error":"#N/A"},{"$error":"#N/A"},{"$error":"#N/A"},500,-42.333187562063351]
[null,null,null,{"$error":"#N/A"},{"$error":"#N/A"},{"$error":"#N/A"},500,{"$f":"IF(ISNA(D369),H368,IF(E369<G368,D369,H368))","v":-42.333187562063351}]
[null,null,null,{"$error":"#N/A"},{"$error":"#N/A"},{"$error":"#N/A"},500,-42.333187562063351]
[null,null,null,{"$error":"#N/A"},{"$error":"#N/A"},{"$error":"#N/A"},500,-42.333187562063351]
[null,null,null,{"$error":"#N/A"},{"$error":"#N/A"},{"$error":"#N/A"},500,-42.333187562063351]
[null,null,null,{"$error":"#N/A"},{"$error":"#N/A"},{"$error":"#N/A"},500,-42.333187562063351]
[null,null,null,{"$error":"#N/A"},{"$error":"#N/A"},{"$error":"#N/A"},500,-42.333187562063351]
[null,null,null,{"$error":"#N/A"},{"$error":"#N/A"},{"$error":"#N/A"},500,-42.333187562063351]
[null,null,null,{"$error":"#N/A"},{"$error":"#N/A"},{"$error":"#N/A"},500,-42.333187562063351]
[null,null,null,{"$error":"#N/A"},{"$error":"#N/A"},{"$error":"#N/A"},{"$f":"IF(ISNA(D377),500,MIN(F376,G376))","v":500},-42.333187562063351]
[null,null,null,{"$error":"#N/A"},{"$error":"#N/A"},{"$error":"#N/A"},500,-42.333187562063351]
[null,null,null,{"$error":"#N/A"},{"$error":"#N/A"},{"$error":"#N/A"},500,-42.333187562063351]
[null,null,null,{"$error":"#N/A"},{"$error":"#N/A"},{"$error":"#N/A"},500,-42.333187562063351]
[null,null,null,{"$error":"#N/A"},{"$error":"#N/A"},{"$error":"#N/A"},500,-42.333187562063351]
[null,null,null,{"$error":"#N/A"},{"$error":"#N/A"},{"$error":"#N/A"},500,-42.333187562063351]
[null,null,null,{"$error":"#N/A"},{"$error":"#N/A"},{"$error":"#N/A"},500,-42.333187562063351]
[null,null,null,{"$error":"#N/A"},{"$error":"#N/A"},{"$error":"#N/A"},500,-42.333187562063351]
[null,null,null,{"$error":"#N/A"},{"$error":"#N/A"},{"$error":"#N/A"},500,-42.333187562063351]
[null,null,null,{"$error":"#N/A"},{"$error":"#N/A"},{"$error":"#N/A"},500,-42.333187562063351]
[null,null,null,{"$error":"#N/A"},{"$f":"IF(ISNA(D387),NA(),a*t^2+b*t+g)","v":{"$error":"#N/A"}},{"$error":"#N/A"},500,-42.333187562063351]
[null,null,null,{"$error":"#N/A"},{"$error":"#N/A"},{"$error":"#N/A"},500,-42.333187562063351]
[null,null,null,{"$error":"#N/A"},{"$error":"#N/A"},{"$error":"#N/A"},500,-42.333187562063351]
[null,null,null,{"$error":"#N/A"},{"$error":"#N/A"},{"$error":"#N/A"},500,-42.333187562063351]
[null,null,null,{"$error":"#N/A"},{"$error":"#N/A"},{"$error":"#N/A"},500,-42.333187562063351]
[null,null,null,{"$error":"#N/A"},{"$error":"#N/A"},{"$error":"#N/A"},500,-42.333187562063351]
[null,null,null,{"$error":"#N/A"},{"$error":"#N/A"},{"$error":"#N/A"},500,-42.333187562063351]
[null,null,null,{"$error":"#N/A"},{"$error":"#N/A"},{"$error":"#N/A"},500,-42.333187562063351]
[null,null,null,{"$error":"#N/A"},{"$error":"#N/A"},{"$error":"#N/A"},500,-42.333187562063351]
[null,null,null,{"$error":"#N/A"},{"$error":"#N/A"},{"$error":"#N/A"},500,-42.333187562063351]
[null,null,null,{"$error":"#N/A"},{"$error":"#N/A"},{"$error":"#N/A"},500,-42.333187562063351]
[null,null,null,{"$error":"#N/A"},{"$error":"#N/A"},{"$error":"#N/A"},500,-42.333187562063351]
[null,null,null,{"$error":"#N/A"},{"$error":"#N/A"},{"$f":"IF(ISNA(D399),NA(),u*(t-mx)^2+v*(t-mx)+w+my)","v":{"$error":"#N/A"}},500,-42.333187562063351]
[null,null,null,{"$error":"#N/A"},{"$error":"#N/A"},{"$f":"IF(ISNA(D400),NA(),u*(t-mx)^2+v*(t-mx)+w+my)","v":{"$error":"#N/A"}},500,-42.333187562063351]