{"text_format":"1","workbook":"xlsx","n_sheets":16,"sheets":["OCT","NOV","DEC","JAN","FEV","MARS","AVRIL","MAI","JUIN","JUILLET","AOUT","SEPT","Fermetures & jours fériés","H productives","Menus déroulants","Listes"],"not_rendered":{"charts":0,"images":0,"macros":1,"external_links":1,"defined_names":9,"comments":12,"pivot_tables":1},"unopened":[],"bounds":{"document_bytes":16777216,"sheet_cells":100000,"rows_first":2000,"rows_last":500,"rows_between":2000,"halvings":0,"cell_chars":16384,"cell_head_chars":4096},"cells_cut":0,"cells_raw":0,"read":"whole","date_system":"1900"}

{"sheet":"OCT","index":0,"n_rows":25,"n_cols":25,"rows_kept":25,"cut":false,"hidden":false,"merged":[[0,0,0,14],[1,11,1,14],[5,16,5,17],[12,6,13,13],[12,4,13,5],[4,0,4,7],[1,1,1,2],[1,6,1,7],[1,8,1,9],[11,4,11,8],[10,4,10,8],[1,4,1,5]]}
[{"$f":"\"PLAN DE CHARGE DU MOIS D'OCTOBRE \"&'Fermetures & jours fériés'!D1","v":"PLAN DE CHARGE DU MOIS D'OCTOBRE 2019"},null,null,null,null,null,null,null,null,null,null,null,null,null,null,null,{"$f":"DATE('Fermetures & jours fériés'!D1,S5,1)","v":"2019-10-01"}]
["Légende :","Chantier fait",null,"Cellule à définir avec feuille de marge réelle","= H estimatives",null,"< H estimatives",null,"> H estimatives",null,"Pose prév. Impératif","Rechercher un client : Ctrl+F > Options > Dans \"Classeur\" > Décocher \"Totalité de la cellule\" > Entrer NOM"]
[null,null,null,null,null,null,null,null,null,40,{"$f":"IF(J3<52,J3+1,1)","v":41},{"$f":"IF(K3<52,K3+1,1)","v":42},{"$f":"IF(L3<52,L3+1,1)","v":43},44]
[null,null,null,null,null,null,null,null,{"$f":"IF(SUMIFS(PDC_OCT[H estim.],PDC_OCT[Projet],\"BOZARC\",PDC_OCT[Pose prév. S],PDC_OCT[[#Headers],[40]])>87.5,\"Trop de BozArc prévu\",\"\")","v":""},{"$f":"IF(SUMIFS(PDC_OCT[H estim.],PDC_OCT[Projet],\"BOZARC\",PDC_OCT[Pose prév. S],PDC_OCT[[#Headers],[41]])>70,\"Trop de BozArc prévu\",\"\")","v":""},{"$f":"IF(SUMIFS(PDC_OCT[H estim.],PDC_OCT[Projet],\"BOZARC\",PDC_OCT[Pose prév. S],PDC_OCT[[#Headers],[41]])>87.5,\"Trop de BozArc prévu\",\"\")","v":""},{"$f":"IF(SUMIFS(PDC_OCT[H estim.],PDC_OCT[Projet],\"BOZARC\",PDC_OCT[Pose prév. S],PDC_OCT[[#Headers],[43]])>70,\"Trop de BozArc prévu\",\"\")","v":""},{"$f":"IF(SUMIFS(PDC_OCT[H estim.],PDC_OCT[Projet],\"BOZARC\",PDC_OCT[Pose prév. S],PDC_OCT[[#Headers],[44]])>87.5,\"Trop de BozArc prévu\",\"\")","v":""}]
[{"$f":"IF(R7>=R13,\"MOIS COMPLET - PLUS DE SAISIE\",\"\")","v":""},null,null,null,null,null,null,null,null,{"$f":"IF(SUMIF(PDC_OCT[Pose prév. S],PDC_OCT[[#Headers],[40]],PDC_OCT[H estim.])>=U$16,\"Semaine complète\",\"\")","v":""},{"$f":"IF(SUMIF(PDC_OCT[Pose prév. S],PDC_OCT[[#Headers],[41]],PDC_OCT[H estim.])>=V$16,\"Semaine complète\",\"\")","v":""},{"$f":"IF(SUMIF(PDC_OCT[Pose prév. S],PDC_OCT[[#Headers],[42]],PDC_OCT[H estim.])>=W$16,\"Semaine complète\",\"\")","v":""},{"$f":"IF(SUMIF(PDC_OCT[Pose prév. S],PDC_OCT[[#Headers],[43]],PDC_OCT[H estim.])>=X$16,\"Semaine complète\",\"\")","v":""},{"$f":"IF(SUMIF(PDC_OCT[Pose prév. S],PDC_OCT[[#Headers],[44]],PDC_OCT[H estim.])>=Y$16,\"Semaine complète\",\"\")","v":""},null,null,null,null,10]
["Chantiers","Ccial","Projet","Ville","H estim.","H réalisées","CA","S de liv.","Pose prév. S","40","41","42","43","44","Plannifié et validé",null,"Indicateurs",null,null,"Éxécutants","40","41","42","43","44"]
[null,null,null,null,null,null,null,null,null,{"$f":"IF(PDC_OCT[[#This Row],[Pose prév. S]]=J$3,PDC_OCT[[#This Row],[CA]],\"\")","v":""},{"$f":"IF(PDC_OCT[[#This Row],[Pose prév. S]]=K$3,PDC_OCT[[#This Row],[CA]],\"\")","v":""},{"$f":"IF(PDC_OCT[[#This Row],[Pose prév. S]]=L$3,PDC_OCT[[#This Row],[CA]],\"\")","v":""},{"$f":"IF(PDC_OCT[[#This Row],[Pose prév. S]]=M$3,PDC_OCT[[#This Row],[CA]],\"\")","v":""},{"$f":"IF(PDC_OCT[[#This Row],[Pose prév. S]]=N$3,PDC_OCT[[#This Row],[CA]],\"\")","v":""},null,null,"Heures estimatives",{"$f":"PDC_OCT[[#Totals],[H estim.]]","v":0},null,"Poseur 1",{"$f":"INDEX(H_productives[],MATCH(U$6&$S$5,H_productives[N°S]&H_productives[N°Mois],0),MATCH($T7,H_productives[#Headers],0))","v":34.25},{"$f":"INDEX(H_productives[],MATCH(V$6&$S$5,H_productives[N°S]&H_productives[N°Mois],0),MATCH($T7,H_productives[#Headers],0))","v":26.25},{"$f":"INDEX(H_productives[],MATCH(W$6&$S$5,H_productives[N°S]&H_productives[N°Mois],0),MATCH($T7,H_productives[#Headers],0))","v":43},{"$f":"INDEX(H_productives[],MATCH(X$6&$S$5,H_productives[N°S]&H_productives[N°Mois],0),MATCH($T7,H_productives[#Headers],0))","v":35},{"$f":"INDEX(H_productives[],MATCH(Y$6&$S$5,H_productives[N°S]&H_productives[N°Mois],0),MATCH($T7,H_productives[#Headers],0))","v":35}]
[null,null,null,null,null,null,null,null,null,{"$f":"IF(PDC_OCT[[#This Row],[Pose prév. S]]=J$3,PDC_OCT[[#This Row],[CA]],\"\")","v":""},{"$f":"IF(PDC_OCT[[#This Row],[Pose prév. S]]=K$3,PDC_OCT[[#This Row],[CA]],\"\")","v":""},{"$f":"IF(PDC_OCT[[#This Row],[Pose prév. S]]=L$3,PDC_OCT[[#This Row],[CA]],\"\")","v":""},{"$f":"IF(PDC_OCT[[#This Row],[Pose prév. S]]=M$3,PDC_OCT[[#This Row],[CA]],\"\")","v":""},{"$f":"IF(PDC_OCT[[#This Row],[Pose prév. S]]=N$3,PDC_OCT[[#This Row],[CA]],\"\")","v":""},null,null,"Heures estimatives cumulées",{"$f":"R7","v":0},null,"Poseur 2",{"$f":"INDEX(H_productives[],MATCH(U$6&$S$5,H_productives[N°S]&H_productives[N°Mois],0),MATCH($T8,H_productives[#Headers],0))","v":34.25},{"$f":"INDEX(H_productives[],MATCH(V$6&$S$5,H_productives[N°S]&H_productives[N°Mois],0),MATCH($T8,H_productives[#Headers],0))","v":26.25},{"$f":"INDEX(H_productives[],MATCH(W$6&$S$5,H_productives[N°S]&H_productives[N°Mois],0),MATCH($T8,H_productives[#Headers],0))","v":43},{"$f":"INDEX(H_productives[],MATCH(X$6&$S$5,H_productives[N°S]&H_productives[N°Mois],0),MATCH($T8,H_productives[#Headers],0))","v":35},{"$f":"INDEX(H_productives[],MATCH(Y$6&$S$5,H_productives[N°S]&H_productives[N°Mois],0),MATCH($T8,H_productives[#Headers],0))","v":35}]
[null,null,null,null,null,null,null,null,null,{"$f":"IF(PDC_OCT[[#This Row],[Pose prév. S]]=J$3,PDC_OCT[[#This Row],[CA]],\"\")","v":""},{"$f":"IF(PDC_OCT[[#This Row],[Pose prév. S]]=K$3,PDC_OCT[[#This Row],[CA]],\"\")","v":""},{"$f":"IF(PDC_OCT[[#This Row],[Pose prév. S]]=L$3,PDC_OCT[[#This Row],[CA]],\"\")","v":""},{"$f":"IF(PDC_OCT[[#This Row],[Pose prév. S]]=M$3,PDC_OCT[[#This Row],[CA]],\"\")","v":""},{"$f":"IF(PDC_OCT[[#This Row],[Pose prév. S]]=N$3,PDC_OCT[[#This Row],[CA]],\"\")","v":""},null,null,null,null,null,"Poseur 3",{"$f":"INDEX(H_productives[],MATCH(U$6&$S$5,H_productives[N°S]&H_productives[N°Mois],0),MATCH($T9,H_productives[#Headers],0))","v":34.25},{"$f":"INDEX(H_productives[],MATCH(V$6&$S$5,H_productives[N°S]&H_productives[N°Mois],0),MATCH($T9,H_productives[#Headers],0))","v":26.25},{"$f":"INDEX(H_productives[],MATCH(W$6&$S$5,H_productives[N°S]&H_productives[N°Mois],0),MATCH($T9,H_productives[#Headers],0))","v":43},{"$f":"INDEX(H_productives[],MATCH(X$6&$S$5,H_productives[N°S]&H_productives[N°Mois],0),MATCH($T9,H_productives[#Headers],0))","v":35},{"$f":"INDEX(H_productives[],MATCH(Y$6&$S$5,H_productives[N°S]&H_productives[N°Mois],0),MATCH($T9,H_productives[#Headers],0))","v":35}]
[{"$f":"SUBTOTAL(103,PDC_OCT[Chantiers])","v":0},null,null,null,{"$f":"SUBTOTAL(109,PDC_OCT[H estim.])","v":0},{"$f":"SUBTOTAL(109,PDC_OCT[H réalisées])","v":0},{"$f":"SUBTOTAL(109,PDC_OCT[CA])","v":0},null,null,{"$f":"SUBTOTAL(109,PDC_OCT[40])","v":0},{"$f":"SUBTOTAL(109,PDC_OCT[41])","v":0},{"$f":"SUBTOTAL(109,PDC_OCT[42])","v":0},{"$f":"SUBTOTAL(109,PDC_OCT[43])","v":0},{"$f":"SUBTOTAL(109,PDC_OCT[44])","v":0},{"$f":"SUBTOTAL(103,PDC_OCT[Plannifié et validé])","v":0},null,"Heures en surplus (à décaler)",{"$f":"IF(TODAY()<=Q1,IF(Q2>0,IF((R7+Q2)>R13,(R7+Q2)-R13,0),IF(R7>R13,R7-R13,0)),IF(R7>R13,R7-R13,0))","v":0},null,"Poseur 4",{"$f":"INDEX(H_productives[],MATCH(U$6&$S$5,H_productives[N°S]&H_productives[N°Mois],0),MATCH($T10,H_productives[#Headers],0))","v":34.25},{"$f":"INDEX(H_productives[],MATCH(V$6&$S$5,H_productives[N°S]&H_productives[N°Mois],0),MATCH($T10,H_productives[#Headers],0))","v":26.25},{"$f":"INDEX(H_productives[],MATCH(W$6&$S$5,H_productives[N°S]&H_productives[N°Mois],0),MATCH($T10,H_productives[#Headers],0))","v":43},{"$f":"INDEX(H_productives[],MATCH(X$6&$S$5,H_productives[N°S]&H_productives[N°Mois],0),MATCH($T10,H_productives[#Headers],0))","v":35},{"$f":"INDEX(H_productives[],MATCH(Y$6&$S$5,H_productives[N°S]&H_productives[N°Mois],0),MATCH($T10,H_productives[#Headers],0))","v":35}]
[null,null,null,null,"Nombre d'h prévues :",null,null,null,null,{"$f":"SUMIF(PDC_OCT[Pose prév. S],PDC_OCT[[#Headers],[40]],PDC_OCT[H estim.])","v":0},{"$f":"SUMIF(PDC_OCT[Pose prév. S],PDC_OCT[[#Headers],[41]],PDC_OCT[H estim.])","v":0},{"$f":"SUMIF(PDC_OCT[Pose prév. S],PDC_OCT[[#Headers],[42]],PDC_OCT[H estim.])","v":0},{"$f":"SUMIF(PDC_OCT[Pose prév. S],PDC_OCT[[#Headers],[43]],PDC_OCT[H estim.])","v":0},{"$f":"SUMIF(PDC_OCT[Pose prév. S],PDC_OCT[[#Headers],[44]],PDC_OCT[H estim.])","v":0},null,null,"Heures restantes",{"$f":"IF(R10=0,R13-(R7),0)","v":884.85},null,"Poseur 5",{"$f":"INDEX(H_productives[],MATCH(U$6&$S$5,H_productives[N°S]&H_productives[N°Mois],0),MATCH($T11,H_productives[#Headers],0))","v":34.25},{"$f":"INDEX(H_productives[],MATCH(V$6&$S$5,H_productives[N°S]&H_productives[N°Mois],0),MATCH($T11,H_productives[#Headers],0))","v":26.25},{"$f":"INDEX(H_productives[],MATCH(W$6&$S$5,H_productives[N°S]&H_productives[N°Mois],0),MATCH($T11,H_productives[#Headers],0))","v":43},{"$f":"INDEX(H_productives[],MATCH(X$6&$S$5,H_productives[N°S]&H_productives[N°Mois],0),MATCH($T11,H_productives[#Headers],0))","v":35},{"$f":"INDEX(H_productives[],MATCH(Y$6&$S$5,H_productives[N°S]&H_productives[N°Mois],0),MATCH($T11,H_productives[#Headers],0))","v":35}]
[null,null,null,null,"Différence d'h (H prévues - H prod.) :",null,null,null,null,{"$f":"J11-U16","v":-174.67500000000001},{"$f":"K11-V16","v":-133.875},{"$f":"L11-W16","v":-219.3},{"$f":"M11-X16","v":-178.5},{"$f":"N11-Y16","v":-178.5},null,null,null,null,null,"Poseur 6",{"$f":"INDEX(H_productives[],MATCH(U$6&$S$5,H_productives[N°S]&H_productives[N°Mois],0),MATCH($T12,H_productives[#Headers],0))","v":34.25},{"$f":"INDEX(H_productives[],MATCH(V$6&$S$5,H_productives[N°S]&H_productives[N°Mois],0),MATCH($T12,H_productives[#Headers],0))","v":26.25},{"$f":"INDEX(H_productives[],MATCH(W$6&$S$5,H_productives[N°S]&H_productives[N°Mois],0),MATCH($T12,H_productives[#Headers],0))","v":43},{"$f":"INDEX(H_productives[],MATCH(X$6&$S$5,H_productives[N°S]&H_productives[N°Mois],0),MATCH($T12,H_productives[#Headers],0))","v":35},{"$f":"INDEX(H_productives[],MATCH(Y$6&$S$5,H_productives[N°S]&H_productives[N°Mois],0),MATCH($T12,H_productives[#Headers],0))","v":35}]
[null,null,null,null,"CA/mois\nTOTAL",null,{"$f":"SUMIF(PDC_OCT[Plannifié et validé],\"ü\",PDC_OCT[CA])","v":0},null,null,null,null,null,null,null,null,null,"Heures prod.",{"$f":"SUM(U16:Y16)","v":884.85},null,"Poseur 7",{"$f":"INDEX(H_productives[],MATCH(U$6&$S$5,H_productives[N°S]&H_productives[N°Mois],0),MATCH($T13,H_productives[#Headers],0))","v":0},{"$f":"INDEX(H_productives[],MATCH(V$6&$S$5,H_productives[N°S]&H_productives[N°Mois],0),MATCH($T13,H_productives[#Headers],0))","v":0},{"$f":"INDEX(H_productives[],MATCH(W$6&$S$5,H_productives[N°S]&H_productives[N°Mois],0),MATCH($T13,H_productives[#Headers],0))","v":0},{"$f":"INDEX(H_productives[],MATCH(X$6&$S$5,H_productives[N°S]&H_productives[N°Mois],0),MATCH($T13,H_productives[#Headers],0))","v":0},{"$f":"INDEX(H_productives[],MATCH(Y$6&$S$5,H_productives[N°S]&H_productives[N°Mois],0),MATCH($T13,H_productives[#Headers],0))","v":0}]
[null,null,null,null,null,null,null,null,null,null,null,null,null,null,null,null,"Heures prod. cumulées",{"$f":"R13","v":884.85},null,"Total",{"$f":"SUBTOTAL(109,Tps_travaillées_OCT[40])","v":205.5},{"$f":"SUBTOTAL(109,Tps_travaillées_OCT[41])","v":157.5},{"$f":"SUBTOTAL(109,Tps_travaillées_OCT[42])","v":258},{"$f":"SUBTOTAL(109,Tps_travaillées_OCT[43])","v":210},{"$f":"SUBTOTAL(109,Tps_travaillées_OCT[44])","v":210}]
[null,null,null,null,null,null,null,null,null,null,null,null,null,null,null,null,null,null,null,-0.15,{"$f":"Tps_travaillées_OCT[[#Totals],[40]]*$T$15","v":-30.824999999999999},{"$f":"Tps_travaillées_OCT[[#Totals],[41]]*$T$15","v":-23.625},{"$f":"Tps_travaillées_OCT[[#Totals],[42]]*$T$15","v":-38.699999999999996},{"$f":"Tps_travaillées_OCT[[#Totals],[43]]*$T$15","v":-31.5},{"$f":"Tps_travaillées_OCT[[#Totals],[44]]*$T$15","v":-31.5}]
[null,null,null,null,null,null,null,null,null,null,null,null,null,null,null,null,"Heures réelles réalisées",{"$f":"PDC_OCT[[#Totals],[H réalisées]]","v":0},null,"Heure productives",{"$f":"SUM(U14:U15)","v":174.67500000000001},{"$f":"SUM(V14:V15)","v":133.875},{"$f":"SUM(W14:W15)","v":219.3},{"$f":"SUM(X14:X15)","v":178.5},{"$f":"SUM(Y14:Y15)","v":178.5}]
[null,null,null,null,null,null,null,null,null,null,null,null,null,null,null,null,"Heures réelles réalisées cumulées",{"$f":"R16","v":0},null,"Soit en JOURS",{"$f":"U16/8.75","v":19.962857142857143},{"$f":"V16/8.75","v":15.3},{"$f":"W16/8.75","v":25.062857142857144},{"$f":"X16/8.75","v":20.399999999999999},{"$f":"Y16/8.75","v":20.399999999999999}]
[]
[null,null,null,null,null,null,null,null,null,null,null,null,null,null,null,null,"Moyenne CA/h estimatives",{"$f":"SUM(PDC_OCT[[#Totals],[CA]]/E10)","v":{"$error":"#DIV/0!"}}]
[null,null,null,null,null,null,null,null,null,null,null,null,null,null,null,null,"Moyenne CA/h réalisées",{"$f":"G13/PDC_OCT[[#Totals],[H réalisées]]","v":{"$error":"#DIV/0!"}}]
[null,null,null,null,null,null,null,null,null,null,null,null,null,null,null,null,"Moyenne CA/h réalisées cumulées",{"$f":"R25/R17","v":{"$error":"#DIV/0!"}}]
[]
[null,null,null,null,null,null,null,null,null,null,null,null,null,null,null,null,"CA prévi. à poser au cours de l'année",{"$f":"PDC_OCT[[#Totals],[CA]]+NOV!R23","v":0}]
[null,null,null,null,null,null,null,null,null,null,null,null,null,null,null,null,"CA prévision cumulé",{"$f":"PDC_OCT[[#Totals],[CA]]","v":0}]
[null,null,null,null,null,null,null,null,null,null,null,null,null,null,null,null,"CA réel cumulé",{"$f":"G13","v":0}]

{"sheet":"NOV","index":1,"n_rows":25,"n_cols":25,"rows_kept":25,"cut":false,"hidden":false,"merged":[[1,11,1,14],[5,16,5,17],[12,6,13,14],[4,0,4,8],[0,0,0,14],[1,1,1,2],[10,4,10,8],[11,4,11,8],[12,4,13,5],[1,4,1,5],[1,6,1,7],[1,8,1,9]]}
[{"$f":"\"PLAN DE CHARGE DU MOIS DE NOVEMBRE \"&'Fermetures & jours fériés'!D1","v":"PLAN DE CHARGE DU MOIS DE NOVEMBRE 2019"},null,null,null,null,null,null,null,null,null,null,null,null,null,null,null,{"$f":"EDATE(OCT!Q1,1)","v":"2019-11-01"}]
["Légende :","Chantier fait",null,"Cellule à définir avec feuille de marge réelle","= H estimatives",null,"< H estimatives",null,"> H estimatives",null,"Pose prév. Impératif","Rechercher un client : Ctrl+F > Options > Dans \"Classeur\" > Décocher \"Totalité de la cellule\" > Entrer NOM"]
[null,null,null,null,null,null,null,null,null,44,{"$f":"IF(J3<52,J3+1,1)","v":45},{"$f":"IF(K3<52,K3+1,1)","v":46},47,48]
[null,null,null,null,null,null,null,null,null,{"$f":"IF(SUMIFS(PDC_NOV[H estimatives],PDC_NOV[Projet],\"BOZARC\",PDC_NOV[Pose prév. S],PDC_NOV[[#Headers],[44]])>87.5,\"Trop de BozArc prévu\",\"\")","v":""},{"$f":"IF(SUMIFS(PDC_NOV[H estimatives],PDC_NOV[Projet],\"BOZARC\",PDC_NOV[Pose prév. S],PDC_NOV[[#Headers],[45]])>70,\"Trop de BozArc prévu\",\"\")","v":""},{"$f":"IF(SUMIFS(PDC_NOV[H estimatives],PDC_NOV[Projet],\"BOZARC\",PDC_NOV[Pose prév. S],PDC_NOV[[#Headers],[46]])>87.5,\"Trop de BozArc prévu\",\"\")","v":""},{"$f":"IF(SUMIFS(PDC_NOV[H estimatives],PDC_NOV[Projet],\"BOZARC\",PDC_NOV[Pose prév. S],PDC_NOV[[#Headers],[47]])>70,\"Trop de BozArc prévu\",\"\")","v":""},{"$f":"IF(SUMIFS(PDC_NOV[H estimatives],PDC_NOV[Projet],\"BOZARC\",PDC_NOV[Pose prév. S],PDC_NOV[[#Headers],[48]])>87.5,\"Trop de BozArc prévu\",\"\")","v":""}]
[{"$f":"IF(OR(R7>=R13,R10>0),\"MOIS COMPLET - PLUS DE SAISIE\",\"\")","v":""},null,null,null,null,null,null,null,null,{"$f":"IF(SUMIF(PDC_NOV[Pose prév. S],PDC_NOV[[#Headers],[44]],PDC_NOV[H estimatives])>=U$16,\"Semaine complète\",\"\")","v":"Semaine complète"},{"$f":"IF(SUMIF(PDC_NOV[Pose prév. S],PDC_NOV[[#Headers],[45]],PDC_NOV[H estimatives])>=V$16,\"Semaine complète\",\"\")","v":""},{"$f":"IF(SUMIF(PDC_NOV[Pose prév. S],PDC_NOV[[#Headers],[46]],PDC_NOV[H estimatives])>=W$16,\"Semaine complète\",\"\")","v":""},{"$f":"IF(SUMIF(PDC_NOV[Pose prév. S],PDC_NOV[[#Headers],[47]],PDC_NOV[H estimatives])>=X$16,\"Semaine complète\",\"\")","v":""},{"$f":"IF(SUMIF(PDC_NOV[Pose prév. S],PDC_NOV[[#Headers],[48]],PDC_NOV[H estimatives])>=Y$16,\"Semaine complète\",\"\")","v":""},null,null,null,null,null,{"$f":"OCT!S5+1","v":11}]
["Chantiers","Ccial","Projet","Ville","H estimatives","H réelles réalisées","CA","S de liv.","Pose prév. S","44","45","46","47","48","Plannifié et validé",null,"Indicateurs",null,null,"Éxécutants","44","45","46","47","48"]
[null,null,null,null,null,null,null,null,null,{"$f":"IF(PDC_NOV[[#This Row],[Pose prév. S]]=J$3,PDC_NOV[[#This Row],[CA]],\"\")","v":""},{"$f":"IF(PDC_NOV[[#This Row],[Pose prév. S]]=K$3,PDC_NOV[[#This Row],[CA]],\"\")","v":""},{"$f":"IF(PDC_NOV[[#This Row],[Pose prév. S]]=L$3,PDC_NOV[[#This Row],[CA]],\"\")","v":""},{"$f":"IF(PDC_NOV[[#This Row],[Pose prév. S]]=M$3,PDC_NOV[[#This Row],[CA]],\"\")","v":""},{"$f":"IF(PDC_NOV[[#This Row],[Pose prév. S]]=N$3,PDC_NOV[[#This Row],[CA]],\"\")","v":""},null,null,"Heures estimatives",{"$f":"PDC_NOV[[#Totals],[H estimatives]]","v":0},null,"Poseur 1",{"$f":"INDEX(H_productives[],MATCH(U$6&$T$5,H_productives[N°S]&H_productives[N°Mois],0),MATCH($T7,H_productives[#Headers],0))","v":0},{"$f":"INDEX(H_productives[],MATCH(V$6&$T$5,H_productives[N°S]&H_productives[N°Mois],0),MATCH($T7,H_productives[#Headers],0))","v":35},{"$f":"INDEX(H_productives[],MATCH(W$6&$T$5,H_productives[N°S]&H_productives[N°Mois],0),MATCH($T7,H_productives[#Headers],0))","v":34.25},{"$f":"INDEX(H_productives[],MATCH(X$6&$T$5,H_productives[N°S]&H_productives[N°Mois],0),MATCH($T7,H_productives[#Headers],0))","v":35},{"$f":"INDEX(H_productives[],MATCH(Y$6&$T$5,H_productives[N°S]&H_productives[N°Mois],0),MATCH($T7,H_productives[#Headers],0))","v":43}]
[null,null,null,null,null,null,null,null,null,{"$f":"IF(PDC_NOV[[#This Row],[Pose prév. S]]=J$3,PDC_NOV[[#This Row],[CA]],\"\")","v":""},{"$f":"IF(PDC_NOV[[#This Row],[Pose prév. S]]=K$3,PDC_NOV[[#This Row],[CA]],\"\")","v":""},{"$f":"IF(PDC_NOV[[#This Row],[Pose prév. S]]=L$3,PDC_NOV[[#This Row],[CA]],\"\")","v":""},{"$f":"IF(PDC_NOV[[#This Row],[Pose prév. S]]=M$3,PDC_NOV[[#This Row],[CA]],\"\")","v":""},{"$f":"IF(PDC_NOV[[#This Row],[Pose prév. S]]=N$3,PDC_NOV[[#This Row],[CA]],\"\")","v":""},null,null,"Heures estimatives cumulées",{"$f":"R7+OCT!R8","v":0},null,"Poseur 2",{"$f":"INDEX(H_productives[],MATCH(U$6&$T$5,H_productives[N°S]&H_productives[N°Mois],0),MATCH($T8,H_productives[#Headers],0))","v":0},{"$f":"INDEX(H_productives[],MATCH(V$6&$T$5,H_productives[N°S]&H_productives[N°Mois],0),MATCH($T8,H_productives[#Headers],0))","v":35},{"$f":"INDEX(H_productives[],MATCH(W$6&$T$5,H_productives[N°S]&H_productives[N°Mois],0),MATCH($T8,H_productives[#Headers],0))","v":34.25},{"$f":"INDEX(H_productives[],MATCH(X$6&$T$5,H_productives[N°S]&H_productives[N°Mois],0),MATCH($T8,H_productives[#Headers],0))","v":35},{"$f":"INDEX(H_productives[],MATCH(Y$6&$T$5,H_productives[N°S]&H_productives[N°Mois],0),MATCH($T8,H_productives[#Headers],0))","v":43}]
[null,null,null,null,null,null,null,null,null,{"$f":"IF(PDC_NOV[[#This Row],[Pose prév. S]]=J$3,PDC_NOV[[#This Row],[CA]],\"\")","v":""},{"$f":"IF(PDC_NOV[[#This Row],[Pose prév. S]]=K$3,PDC_NOV[[#This Row],[CA]],\"\")","v":""},{"$f":"IF(PDC_NOV[[#This Row],[Pose prév. S]]=L$3,PDC_NOV[[#This Row],[CA]],\"\")","v":""},{"$f":"IF(PDC_NOV[[#This Row],[Pose prév. S]]=M$3,PDC_NOV[[#This Row],[CA]],\"\")","v":""},{"$f":"IF(PDC_NOV[[#This Row],[Pose prév. S]]=N$3,PDC_NOV[[#This Row],[CA]],\"\")","v":""},null,null,null,null,null,"Poseur 3",{"$f":"INDEX(H_productives[],MATCH(U$6&$T$5,H_productives[N°S]&H_productives[N°Mois],0),MATCH($T9,H_productives[#Headers],0))","v":0},{"$f":"INDEX(H_productives[],MATCH(V$6&$T$5,H_productives[N°S]&H_productives[N°Mois],0),MATCH($T9,H_productives[#Headers],0))","v":35},{"$f":"INDEX(H_productives[],MATCH(W$6&$T$5,H_productives[N°S]&H_productives[N°Mois],0),MATCH($T9,H_productives[#Headers],0))","v":34.25},{"$f":"INDEX(H_productives[],MATCH(X$6&$T$5,H_productives[N°S]&H_productives[N°Mois],0),MATCH($T9,H_productives[#Headers],0))","v":35},{"$f":"INDEX(H_productives[],MATCH(Y$6&$T$5,H_productives[N°S]&H_productives[N°Mois],0),MATCH($T9,H_productives[#Headers],0))","v":43}]
[{"$f":"SUBTOTAL(103,PDC_NOV[Chantiers])","v":0},null,null,null,{"$f":"SUBTOTAL(109,PDC_NOV[H estimatives])","v":0},{"$f":"SUBTOTAL(109,PDC_NOV[H réelles réalisées])","v":0},{"$f":"SUBTOTAL(109,PDC_NOV[CA])","v":0},null,null,{"$f":"SUBTOTAL(109,PDC_NOV[44])","v":0},{"$f":"SUBTOTAL(109,PDC_NOV[45])","v":0},{"$f":"SUBTOTAL(109,PDC_NOV[46])","v":0},{"$f":"SUBTOTAL(109,PDC_NOV[47])","v":0},{"$f":"SUBTOTAL(109,PDC_NOV[48])","v":0},null,null,"Heures en surplus (à décaler)",{"$f":"IF(TODAY()<=Q1,IF(OCT!R10>0,IF((R7+OCT!R10)>R13,(R7+OCT!R10)-R13,0),IF(R7>R13,R7-R13,0)),IF(R7>R13,R7-R13,0))","v":0},null,"Poseur 4",{"$f":"INDEX(H_productives[],MATCH(U$6&$T$5,H_productives[N°S]&H_productives[N°Mois],0),MATCH($T10,H_productives[#Headers],0))","v":0},{"$f":"INDEX(H_productives[],MATCH(V$6&$T$5,H_productives[N°S]&H_productives[N°Mois],0),MATCH($T10,H_productives[#Headers],0))","v":35},{"$f":"INDEX(H_productives[],MATCH(W$6&$T$5,H_productives[N°S]&H_productives[N°Mois],0),MATCH($T10,H_productives[#Headers],0))","v":34.25},{"$f":"INDEX(H_productives[],MATCH(X$6&$T$5,H_productives[N°S]&H_productives[N°Mois],0),MATCH($T10,H_productives[#Headers],0))","v":35},{"$f":"INDEX(H_productives[],MATCH(Y$6&$T$5,H_productives[N°S]&H_productives[N°Mois],0),MATCH($T10,H_productives[#Headers],0))","v":43}]
[null,null,null,null,"Nombre d'h prévues :",null,null,null,null,{"$f":"SUMIF(PDC_NOV[Pose prév. S],PDC_NOV[[#Headers],[44]],PDC_NOV[H estimatives])","v":0},{"$f":"SUMIF(PDC_NOV[Pose prév. S],PDC_NOV[[#Headers],[45]],PDC_NOV[H estimatives])","v":0},{"$f":"SUMIF(PDC_NOV[Pose prév. S],PDC_NOV[[#Headers],[46]],PDC_NOV[H estimatives])","v":0},{"$f":"SUMIF(PDC_NOV[Pose prév. S],PDC_NOV[[#Headers],[47]],PDC_NOV[H estimatives])","v":0},{"$f":"SUMIF(PDC_NOV[Pose prév. S],PDC_NOV[[#Headers],[48]],PDC_NOV[H estimatives])","v":0},null,null,"Heures restantes",{"$f":"IF(R10=0,IF(TODAY()<=Q1,R13-(R7+OCT!R10),R13-R7),0)","v":810.47499999999991},null,"Poseur 5",{"$f":"INDEX(H_productives[],MATCH(U$6&$T$5,H_productives[N°S]&H_productives[N°Mois],0),MATCH($T11,H_productives[#Headers],0))","v":0},{"$f":"INDEX(H_productives[],MATCH(V$6&$T$5,H_productives[N°S]&H_productives[N°Mois],0),MATCH($T11,H_productives[#Headers],0))","v":35},{"$f":"INDEX(H_productives[],MATCH(W$6&$T$5,H_productives[N°S]&H_productives[N°Mois],0),MATCH($T11,H_productives[#Headers],0))","v":34.25},{"$f":"INDEX(H_productives[],MATCH(X$6&$T$5,H_productives[N°S]&H_productives[N°Mois],0),MATCH($T11,H_productives[#Headers],0))","v":35},{"$f":"INDEX(H_productives[],MATCH(Y$6&$T$5,H_productives[N°S]&H_productives[N°Mois],0),MATCH($T11,H_productives[#Headers],0))","v":43}]
[null,null,null,null,"Différence d'h (H prévues - H prod.) :",null,null,null,null,{"$f":"J11-U16","v":0},{"$f":"K11-V16","v":-178.5},{"$f":"L11-W16","v":-174.67500000000001},{"$f":"M11-X16","v":-208.25},{"$f":"N11-Y16","v":-249.05},null,null,null,null,null,"Poseur 6",{"$f":"INDEX(H_productives[],MATCH(U$6&$T$5,H_productives[N°S]&H_productives[N°Mois],0),MATCH($T12,H_productives[#Headers],0))","v":0},{"$f":"INDEX(H_productives[],MATCH(V$6&$T$5,H_productives[N°S]&H_productives[N°Mois],0),MATCH($T12,H_productives[#Headers],0))","v":35},{"$f":"INDEX(H_productives[],MATCH(W$6&$T$5,H_productives[N°S]&H_productives[N°Mois],0),MATCH($T12,H_productives[#Headers],0))","v":34.25},{"$f":"INDEX(H_productives[],MATCH(X$6&$T$5,H_productives[N°S]&H_productives[N°Mois],0),MATCH($T12,H_productives[#Headers],0))","v":35},{"$f":"INDEX(H_productives[],MATCH(Y$6&$T$5,H_productives[N°S]&H_productives[N°Mois],0),MATCH($T12,H_productives[#Headers],0))","v":43}]
[null,null,null,null,"CA/mois\nTOTAL",null,{"$f":"SUMIF(PDC_NOV[Plannifié et validé],\"ü\",PDC_NOV[CA])","v":0},null,null,null,null,null,null,null,null,null,"Heures prod.",{"$f":"SUM(U16:Y16)","v":810.47499999999991},null,"Poseur 7",{"$f":"INDEX(H_productives[],MATCH(U$6&$T$5,H_productives[N°S]&H_productives[N°Mois],0),MATCH($T13,H_productives[#Headers],0))","v":0},{"$f":"INDEX(H_productives[],MATCH(V$6&$T$5,H_productives[N°S]&H_productives[N°Mois],0),MATCH($T13,H_productives[#Headers],0))","v":0},{"$f":"INDEX(H_productives[],MATCH(W$6&$T$5,H_productives[N°S]&H_productives[N°Mois],0),MATCH($T13,H_productives[#Headers],0))","v":0},{"$f":"INDEX(H_productives[],MATCH(X$6&$T$5,H_productives[N°S]&H_productives[N°Mois],0),MATCH($T13,H_productives[#Headers],0))","v":35},{"$f":"INDEX(H_productives[],MATCH(Y$6&$T$5,H_productives[N°S]&H_productives[N°Mois],0),MATCH($T13,H_productives[#Headers],0))","v":35}]
[null,null,null,null,null,null,null,null,null,null,null,null,null,null,null,null,"Heures prod. cumulées",{"$f":"R13+OCT!R14","v":1695.3249999999998},null,"Total",{"$f":"SUBTOTAL(109,Tps_travaillées_OCT381[44])","v":0},{"$f":"SUBTOTAL(109,Tps_travaillées_OCT381[45])","v":210},{"$f":"SUBTOTAL(109,Tps_travaillées_OCT381[46])","v":205.5},{"$f":"SUBTOTAL(109,Tps_travaillées_OCT381[47])","v":245},{"$f":"SUBTOTAL(109,Tps_travaillées_OCT381[48])","v":293}]
[null,null,null,null,null,null,null,null,null,null,null,null,null,null,null,null,null,null,null,-0.15,{"$f":"Tps_travaillées_OCT381[[#Totals],[44]]*$T$15","v":0},{"$f":"Tps_travaillées_OCT381[[#Totals],[45]]*$T$15","v":-31.5},{"$f":"Tps_travaillées_OCT381[[#Totals],[46]]*$T$15","v":-30.824999999999999},{"$f":"Tps_travaillées_OCT381[[#Totals],[47]]*$T$15","v":-36.75},{"$f":"Tps_travaillées_OCT381[[#Totals],[48]]*$T$15","v":-43.949999999999996}]
[null,null,null,null,null,null,null,null,null,null,null,null,null,null,null,null,"Heures réelles réalisées",{"$f":"PDC_NOV[[#Totals],[H réelles réalisées]]","v":0},null,"Heure réelles travaillées",{"$f":"SUM(U14:U15)","v":0},{"$f":"SUM(V14:V15)","v":178.5},{"$f":"SUM(W14:W15)","v":174.67500000000001},{"$f":"SUM(X14:X15)","v":208.25},{"$f":"SUM(Y14:Y15)","v":249.05}]
[null,null,null,null,null,null,null,null,null,null,null,null,null,null,null,null,"Heures réelles réalisées cumulées",{"$f":"R16+OCT!R17","v":0},null,"Soit en JOURS",{"$f":"U16/8.75","v":0},{"$f":"V16/8.75","v":20.399999999999999},{"$f":"W16/8.75","v":19.962857142857143},{"$f":"X16/8.75","v":23.8},{"$f":"Y16/8.75","v":28.462857142857143}]
[]
[null,null,null,null,null,null,null,null,null,null,null,null,null,null,null,null,"Moyenne CA/h estimatives",{"$f":"SUM(PDC_NOV[[#Totals],[CA]]/E10)","v":{"$error":"#DIV/0!"}}]
[null,null,null,null,null,null,null,null,null,null,null,null,null,null,null,null,"Moyenne CA/h réalisées",{"$f":"G13/PDC_NOV[[#Totals],[H réelles réalisées]]","v":{"$error":"#DIV/0!"}}]
[null,null,null,null,null,null,null,null,null,null,null,null,null,null,null,null,"Moyenne CA/h réalisées cumulées",{"$f":"R25/R17","v":{"$error":"#DIV/0!"}}]
[]
[null,null,null,null,null,null,null,null,null,null,null,null,null,null,null,null,"CA prévi. à poser au cours de l'année",{"$f":"PDC_NOV[[#Totals],[CA]]+DEC!S23","v":0}]
[null,null,null,null,null,null,null,null,null,null,null,null,null,null,null,null,"CA prévision cumulé",{"$f":"PDC_NOV[[#Totals],[CA]]+OCT!R24","v":0}]
[null,null,null,null,null,null,null,null,null,null,null,null,null,null,null,null,"CA réel cumulé",{"$f":"G13+OCT!R25","v":0}]

{"sheet":"DEC","index":2,"n_rows":25,"n_cols":27,"rows_kept":25,"cut":false,"hidden":false,"merged":[[1,12,1,15],[5,17,5,18],[12,5,13,5],[4,0,4,8],[0,0,0,14],[1,1,1,2],[12,6,13,15],[10,5,10,8],[11,5,11,8],[1,4,1,5],[1,6,1,7],[1,8,1,9]]}
[{"$f":"\"PLAN DE CHARGE DU MOIS DE DECEMBRE \"&'Fermetures & jours fériés'!D1","v":"PLAN DE CHARGE DU MOIS DE DECEMBRE 2019"},null,null,null,null,null,null,null,null,null,null,null,null,null,null,null,null,{"$f":"EDATE(NOV!Q1,1)","v":"2019-12-01"}]
["Légende :","Chantier fait",null,"Cellule à définir avec feuille de marge réelle","= H estimatives",null,"< H estimatives",null,"> H estimatives",null,"Pose prév. Impératif",null,"Rechercher un client : Ctrl+F > Options > Dans \"Classeur\" > Décocher \"Totalité de la cellule\" > Entrer NOM"]
[null,null,null,null,null,null,null,null,null,48,{"$f":"IF(J3<52,J3+1,1)","v":49},{"$f":"IF(K3<52,K3+1,1)","v":50},51,52,1]
[null,null,null,null,null,null,null,null,null,{"$f":"IF(SUMIFS(PDC_DEC[H estimatives],PDC_DEC[Projet],\"BOZARC\",PDC_DEC[Pose prév. S],PDC_DEC[[#Headers],[48]])>87.5,\"Trop de BozArc prévu\",\"\")","v":""},{"$f":"IF(SUMIFS(PDC_DEC[H estimatives],PDC_DEC[Projet],\"BOZARC\",PDC_DEC[Pose prév. S],PDC_DEC[[#Headers],[49]])>70,\"Trop de BozArc prévu\",\"\")","v":""},{"$f":"IF(SUMIFS(PDC_DEC[H estimatives],PDC_DEC[Projet],\"BOZARC\",PDC_DEC[Pose prév. S],PDC_DEC[[#Headers],[50]])>87.5,\"Trop de BozArc prévu\",\"\")","v":""},{"$f":"IF(SUMIFS(PDC_DEC[H estimatives],PDC_DEC[Projet],\"BOZARC\",PDC_DEC[Pose prév. S],PDC_DEC[[#Headers],[51]])>70,\"Trop de BozArc prévu\",\"\")","v":""},{"$f":"IF(SUMIFS(PDC_DEC[H estimatives],PDC_DEC[Projet],\"BOZARC\",PDC_DEC[Pose prév. S],PDC_DEC[[#Headers],[52]])>87.5,\"Trop de BozArc prévu\",\"\")","v":""},{"$f":"IF(SUMIFS(PDC_DEC[H estimatives],PDC_DEC[Projet],\"BOZARC\",PDC_DEC[Pose prév. S],PDC_DEC[[#Headers],[1]])>70,\"Trop de BozArc prévu\",\"\")","v":""}]
[{"$f":"IF(OR(S7>=S13,S10>0),\"MOIS COMPLET - PLUS DE SAISIE\",\"\")","v":""},null,null,null,null,null,null,null,null,{"$f":"IF(SUMIF(PDC_DEC[Pose prév. S],PDC_DEC[[#Headers],[48]],PDC_DEC[H estimatives])>=V$16,\"Semaine complète\",\"\")","v":"Semaine complète"},{"$f":"IF(SUMIF(PDC_DEC[Pose prév. S],PDC_DEC[[#Headers],[49]],PDC_DEC[H estimatives])>=W$16,\"Semaine complète\",\"\")","v":""},{"$f":"IF(SUMIF(PDC_DEC[Pose prév. S],PDC_DEC[[#Headers],[50]],PDC_DEC[H estimatives])>=X$16,\"Semaine complète\",\"\")","v":""},{"$f":"IF(SUMIF(PDC_DEC[Pose prév. S],PDC_DEC[[#Headers],[51]],PDC_DEC[H estimatives])>=Y$16,\"Semaine complète\",\"\")","v":""},{"$f":"IF(SUMIF(PDC_DEC[Pose prév. S],PDC_DEC[[#Headers],[52]],PDC_DEC[H estimatives])>=Z$16,\"Semaine complète\",\"\")","v":""},{"$f":"IF(SUMIF(PDC_DEC[Pose prév. S],PDC_DEC[[#Headers],[1]],PDC_DEC[H estimatives])>=AA$16,\"Semaine complète\",\"\")","v":"Semaine complète"},null,null,null,null,null,{"$f":"NOV!T5+1","v":12}]
["Chantiers","Ccial","Projet","Ville","H estimatives","H réelles réalisées","CA","S de liv.","Pose prév. S","48","49","50","51","52","1","Plannifié et validé",null,"Indicateurs",null,null,"Éxécutants","48","49","50","51","52","1"]
[null,null,null,null,null,null,null,null,null,{"$f":"IF(PDC_DEC[[#This Row],[Pose prév. S]]=J$3,PDC_DEC[[#This Row],[CA]],\"\")","v":""},{"$f":"IF(PDC_DEC[[#This Row],[Pose prév. S]]=K$3,PDC_DEC[[#This Row],[CA]],\"\")","v":""},{"$f":"IF(PDC_DEC[[#This Row],[Pose prév. S]]=L$3,PDC_DEC[[#This Row],[CA]],\"\")","v":""},{"$f":"IF(PDC_DEC[[#This Row],[Pose prév. S]]=M$3,PDC_DEC[[#This Row],[CA]],\"\")","v":""},{"$f":"IF(PDC_DEC[[#This Row],[Pose prév. S]]=N$3,PDC_DEC[[#This Row],[CA]],\"\")","v":""},{"$f":"IF(PDC_DEC[[#This Row],[Pose prév. S]]=O$3,PDC_DEC[[#This Row],[CA]],\"\")","v":""},null,null,"Heures estimatives",{"$f":"PDC_DEC[[#Totals],[H estimatives]]","v":0},null,"Poseur 1",{"$f":"INDEX(H_productives[],MATCH(V$6&$U$5,H_productives[N°S]&H_productives[N°Mois],0),MATCH($U7,H_productives[#Headers],0))","v":0},{"$f":"INDEX(H_productives[],MATCH(W$6&$U$5,H_productives[N°S]&H_productives[N°Mois],0),MATCH($U7,H_productives[#Headers],0))","v":35},{"$f":"INDEX(H_productives[],MATCH(X$6&$U$5,H_productives[N°S]&H_productives[N°Mois],0),MATCH($U7,H_productives[#Headers],0))","v":43},{"$f":"INDEX(H_productives[],MATCH(Y$6&$U$5,H_productives[N°S]&H_productives[N°Mois],0),MATCH($U7,H_productives[#Headers],0))","v":35},{"$f":"INDEX(H_productives[],MATCH(Z$6&$U$5,H_productives[N°S]&H_productives[N°Mois],0),MATCH($U7,H_productives[#Headers],0))","v":17.5},{"$f":"INDEX(H_productives[],MATCH(AA$6&$U$5,H_productives[N°S]&H_productives[N°Mois],0),MATCH($U7,H_productives[#Headers],0))","v":0}]
[null,null,null,null,null,null,null,null,null,{"$f":"IF(PDC_DEC[[#This Row],[Pose prév. S]]=J$3,PDC_DEC[[#This Row],[CA]],\"\")","v":""},{"$f":"IF(PDC_DEC[[#This Row],[Pose prév. S]]=K$3,PDC_DEC[[#This Row],[CA]],\"\")","v":""},{"$f":"IF(PDC_DEC[[#This Row],[Pose prév. S]]=L$3,PDC_DEC[[#This Row],[CA]],\"\")","v":""},{"$f":"IF(PDC_DEC[[#This Row],[Pose prév. S]]=M$3,PDC_DEC[[#This Row],[CA]],\"\")","v":""},{"$f":"IF(PDC_DEC[[#This Row],[Pose prév. S]]=N$3,PDC_DEC[[#This Row],[CA]],\"\")","v":""},{"$f":"IF(PDC_DEC[[#This Row],[Pose prév. S]]=O$3,PDC_DEC[[#This Row],[CA]],\"\")","v":""},null,null,"Heures estimatives cumulées",{"$f":"S7+NOV!R8","v":0},null,"Poseur 2",{"$f":"INDEX(H_productives[],MATCH(V$6&$U$5,H_productives[N°S]&H_productives[N°Mois],0),MATCH($U8,H_productives[#Headers],0))","v":0},{"$f":"INDEX(H_productives[],MATCH(W$6&$U$5,H_productives[N°S]&H_productives[N°Mois],0),MATCH($U8,H_productives[#Headers],0))","v":35},{"$f":"INDEX(H_productives[],MATCH(X$6&$U$5,H_productives[N°S]&H_productives[N°Mois],0),MATCH($U8,H_productives[#Headers],0))","v":43},{"$f":"INDEX(H_productives[],MATCH(Y$6&$U$5,H_productives[N°S]&H_productives[N°Mois],0),MATCH($U8,H_productives[#Headers],0))","v":35},{"$f":"INDEX(H_productives[],MATCH(Z$6&$U$5,H_productives[N°S]&H_productives[N°Mois],0),MATCH($U8,H_productives[#Headers],0))","v":17.5},{"$f":"INDEX(H_productives[],MATCH(AA$6&$U$5,H_productives[N°S]&H_productives[N°Mois],0),MATCH($U8,H_productives[#Headers],0))","v":0}]
[null,null,null,null,null,null,null,null,null,{"$f":"IF(PDC_DEC[[#This Row],[Pose prév. S]]=J$3,PDC_DEC[[#This Row],[CA]],\"\")","v":""},{"$f":"IF(PDC_DEC[[#This Row],[Pose prév. S]]=K$3,PDC_DEC[[#This Row],[CA]],\"\")","v":""},{"$f":"IF(PDC_DEC[[#This Row],[Pose prév. S]]=L$3,PDC_DEC[[#This Row],[CA]],\"\")","v":""},{"$f":"IF(PDC_DEC[[#This Row],[Pose prév. S]]=M$3,PDC_DEC[[#This Row],[CA]],\"\")","v":""},{"$f":"IF(PDC_DEC[[#This Row],[Pose prév. S]]=N$3,PDC_DEC[[#This Row],[CA]],\"\")","v":""},{"$f":"IF(PDC_DEC[[#This Row],[Pose prév. S]]=O$3,PDC_DEC[[#This Row],[CA]],\"\")","v":""},null,null,null,null,null,"Poseur 3",{"$f":"INDEX(H_productives[],MATCH(V$6&$U$5,H_productives[N°S]&H_productives[N°Mois],0),MATCH($U9,H_productives[#Headers],0))","v":0},{"$f":"INDEX(H_productives[],MATCH(W$6&$U$5,H_productives[N°S]&H_productives[N°Mois],0),MATCH($U9,H_productives[#Headers],0))","v":35},{"$f":"INDEX(H_productives[],MATCH(X$6&$U$5,H_productives[N°S]&H_productives[N°Mois],0),MATCH($U9,H_productives[#Headers],0))","v":43},{"$f":"INDEX(H_productives[],MATCH(Y$6&$U$5,H_productives[N°S]&H_productives[N°Mois],0),MATCH($U9,H_productives[#Headers],0))","v":35},{"$f":"INDEX(H_productives[],MATCH(Z$6&$U$5,H_productives[N°S]&H_productives[N°Mois],0),MATCH($U9,H_productives[#Headers],0))","v":17.5},{"$f":"INDEX(H_productives[],MATCH(AA$6&$U$5,H_productives[N°S]&H_productives[N°Mois],0),MATCH($U9,H_productives[#Headers],0))","v":0}]
[{"$f":"SUBTOTAL(103,PDC_DEC[Chantiers])","v":0},null,null,null,{"$f":"SUBTOTAL(109,PDC_DEC[H estimatives])","v":0},{"$f":"SUBTOTAL(109,PDC_DEC[H réelles réalisées])","v":0},{"$f":"SUBTOTAL(109,PDC_DEC[CA])","v":0},null,null,null,null,null,null,null,null,null,null,"Heures en surplus (à décaler)",{"$f":"IF(TODAY()<=R1,IF(NOV!R10>0,IF((S7+NOV!R10)>S13,(S7+NOV!R10)-S13,0),IF(S7>S13,S7-S13,0)),IF(S7>S13,S7-S13,0))","v":0},null,"Poseur 4",{"$f":"INDEX(H_productives[],MATCH(V$6&$U$5,H_productives[N°S]&H_productives[N°Mois],0),MATCH($U10,H_productives[#Headers],0))","v":0},{"$f":"INDEX(H_productives[],MATCH(W$6&$U$5,H_productives[N°S]&H_productives[N°Mois],0),MATCH($U10,H_productives[#Headers],0))","v":35},{"$f":"INDEX(H_productives[],MATCH(X$6&$U$5,H_productives[N°S]&H_productives[N°Mois],0),MATCH($U10,H_productives[#Headers],0))","v":43},{"$f":"INDEX(H_productives[],MATCH(Y$6&$U$5,H_productives[N°S]&H_productives[N°Mois],0),MATCH($U10,H_productives[#Headers],0))","v":35},{"$f":"INDEX(H_productives[],MATCH(Z$6&$U$5,H_productives[N°S]&H_productives[N°Mois],0),MATCH($U10,H_productives[#Headers],0))","v":17.5},{"$f":"INDEX(H_productives[],MATCH(AA$6&$U$5,H_productives[N°S]&H_productives[N°Mois],0),MATCH($U10,H_productives[#Headers],0))","v":0}]
[null,null,null,null,null,"Nombre d'h prévues :",null,null,null,{"$f":"SUMIF(PDC_DEC[Pose prév. S],PDC_DEC[[#Headers],[48]],PDC_DEC[H estimatives])","v":0},{"$f":"SUMIF(PDC_DEC[Pose prév. S],PDC_DEC[[#Headers],[49]],PDC_DEC[H estimatives])","v":0},{"$f":"SUMIF(PDC_DEC[Pose prév. S],PDC_DEC[[#Headers],[50]],PDC_DEC[H estimatives])","v":0},{"$f":"SUMIF(PDC_DEC[Pose prév. S],PDC_DEC[[#Headers],[51]],PDC_DEC[H estimatives])","v":0},{"$f":"SUMIF(PDC_DEC[Pose prév. S],PDC_DEC[[#Headers],[52]],PDC_DEC[H estimatives])","v":0},{"$f":"SUMIF(PDC_DEC[Pose prév. S],PDC_DEC[[#Headers],[1]],PDC_DEC[H estimatives])","v":0},null,null,"Heures restantes",{"$f":"IF(S10=0,IF(TODAY()<=R1,S13-(S7+NOV!R10),S13-S7),0)","v":769.67499999999995},null,"Poseur 5",{"$f":"INDEX(H_productives[],MATCH(V$6&$U$5,H_productives[N°S]&H_productives[N°Mois],0),MATCH($U11,H_productives[#Headers],0))","v":0},{"$f":"INDEX(H_productives[],MATCH(W$6&$U$5,H_productives[N°S]&H_productives[N°Mois],0),MATCH($U11,H_productives[#Headers],0))","v":35},{"$f":"INDEX(H_productives[],MATCH(X$6&$U$5,H_productives[N°S]&H_productives[N°Mois],0),MATCH($U11,H_productives[#Headers],0))","v":43},{"$f":"INDEX(H_productives[],MATCH(Y$6&$U$5,H_productives[N°S]&H_productives[N°Mois],0),MATCH($U11,H_productives[#Headers],0))","v":35},{"$f":"INDEX(H_productives[],MATCH(Z$6&$U$5,H_productives[N°S]&H_productives[N°Mois],0),MATCH($U11,H_productives[#Headers],0))","v":17.5},{"$f":"INDEX(H_productives[],MATCH(AA$6&$U$5,H_productives[N°S]&H_productives[N°Mois],0),MATCH($U11,H_productives[#Headers],0))","v":0}]
[null,null,null,null,null,"Différence d'h (H prévues - H prod.) :",null,null,null,{"$f":"J11-V16","v":0},{"$f":"K11-W16","v":-208.25},{"$f":"L11-X16","v":-249.05},{"$f":"M11-Y16","v":-208.25},{"$f":"N11-Z16","v":-104.125},{"$f":"O11-AA16","v":0},null,null,null,null,null,"Poseur 6",{"$f":"INDEX(H_productives[],MATCH(V$6&$U$5,H_productives[N°S]&H_productives[N°Mois],0),MATCH($U12,H_productives[#Headers],0))","v":0},{"$f":"INDEX(H_productives[],MATCH(W$6&$U$5,H_productives[N°S]&H_productives[N°Mois],0),MATCH($U12,H_productives[#Headers],0))","v":35},{"$f":"INDEX(H_productives[],MATCH(X$6&$U$5,H_productives[N°S]&H_productives[N°Mois],0),MATCH($U12,H_productives[#Headers],0))","v":43},{"$f":"INDEX(H_productives[],MATCH(Y$6&$U$5,H_productives[N°S]&H_productives[N°Mois],0),MATCH($U12,H_productives[#Headers],0))","v":35},{"$f":"INDEX(H_productives[],MATCH(Z$6&$U$5,H_productives[N°S]&H_productives[N°Mois],0),MATCH($U12,H_productives[#Headers],0))","v":17.5},{"$f":"INDEX(H_productives[],MATCH(AA$6&$U$5,H_productives[N°S]&H_productives[N°Mois],0),MATCH($U12,H_productives[#Headers],0))","v":0}]
[null,null,null,null,null,"CA/mois\nTOTAL",{"$f":"SUMIF(PDC_DEC[Plannifié et validé],\"ü\",PDC_DEC[CA])","v":0},null,null,null,null,null,null,null,null,null,null,"Heures prod.",{"$f":"SUM(V16:AA16)","v":769.67499999999995},null,"Poseur 7",{"$f":"INDEX(H_productives[],MATCH(V$6&$U$5,H_productives[N°S]&H_productives[N°Mois],0),MATCH($U13,H_productives[#Headers],0))","v":0},{"$f":"INDEX(H_productives[],MATCH(W$6&$U$5,H_productives[N°S]&H_productives[N°Mois],0),MATCH($U13,H_productives[#Headers],0))","v":35},{"$f":"INDEX(H_productives[],MATCH(X$6&$U$5,H_productives[N°S]&H_productives[N°Mois],0),MATCH($U13,H_productives[#Headers],0))","v":35},{"$f":"INDEX(H_productives[],MATCH(Y$6&$U$5,H_productives[N°S]&H_productives[N°Mois],0),MATCH($U13,H_productives[#Headers],0))","v":35},{"$f":"INDEX(H_productives[],MATCH(Z$6&$U$5,H_productives[N°S]&H_productives[N°Mois],0),MATCH($U13,H_productives[#Headers],0))","v":17.5},{"$f":"INDEX(H_productives[],MATCH(AA$6&$U$5,H_productives[N°S]&H_productives[N°Mois],0),MATCH($U13,H_productives[#Headers],0))","v":0}]
[null,null,null,null,null,null,null,null,null,null,null,null,null,null,null,null,null,"Heures prod. cumulées",{"$f":"S13+NOV!R14","v":2465},null,"Total",{"$f":"SUBTOTAL(109,Tps_travaillées_OCT381382[48])","v":0},{"$f":"SUBTOTAL(109,Tps_travaillées_OCT381382[49])","v":245},{"$f":"SUBTOTAL(109,Tps_travaillées_OCT381382[50])","v":293},{"$f":"SUBTOTAL(109,Tps_travaillées_OCT381382[51])","v":245},{"$f":"SUBTOTAL(109,Tps_travaillées_OCT381382[52])","v":122.5},{"$f":"SUBTOTAL(109,Tps_travaillées_OCT381382[1])","v":0}]
[null,null,null,null,null,null,null,null,null,null,null,null,null,null,null,null,null,null,null,null,-0.15,{"$f":"Tps_travaillées_OCT381382[[#Totals],[48]]*$U$15","v":0},{"$f":"Tps_travaillées_OCT381382[[#Totals],[49]]*$U$15","v":-36.75},{"$f":"Tps_travaillées_OCT381382[[#Totals],[50]]*$U$15","v":-43.949999999999996},{"$f":"Tps_travaillées_OCT381382[[#Totals],[51]]*$U$15","v":-36.75},{"$f":"Tps_travaillées_OCT381382[[#Totals],[52]]*$U$15","v":-18.375},{"$f":"Tps_travaillées_OCT381382[[#Totals],[1]]*$U$15","v":0}]
[null,null,null,null,null,null,null,null,null,null,null,null,null,null,null,null,null,"Heures réelles réalisées",{"$f":"PDC_DEC[[#Totals],[H réelles réalisées]]","v":0},null,"Heure réelles travaillées",{"$f":"SUM(V14:V15)","v":0},208.25,249.05,208.25,104.125,0]
[null,null,null,null,null,null,null,null,null,null,null,null,null,null,null,null,null,"Heures réelles réalisées cumulées",{"$f":"S16+NOV!R17","v":0},null,"Soit en JOURS",{"$f":"V16/8.75","v":0},23.8,28.462857142857143,23.8,11.9,0]
[]
[null,null,null,null,null,null,null,null,null,null,null,null,null,null,null,null,null,"Moyenne CA/h estimatives",{"$f":"SUM(PDC_DEC[[#Totals],[CA]]/E10)","v":{"$error":"#DIV/0!"}}]
[null,null,null,null,null,null,null,null,null,null,null,null,null,null,null,null,null,"Moyenne CA/h réalisées",{"$f":"G13/PDC_DEC[[#Totals],[H réelles réalisées]]","v":{"$error":"#DIV/0!"}}]
[null,null,null,null,null,null,null,null,null,null,null,null,null,null,null,null,null,"Moyenne CA/h réalisées cumulées",{"$f":"S25/S17","v":{"$error":"#DIV/0!"}}]
[]
[null,null,null,null,null,null,null,null,null,null,null,null,null,null,null,null,null,"CA prévi. à poser au cours de l'année",{"$f":"PDC_DEC[[#Totals],[CA]]+JAN!R23","v":0}]
[null,null,null,null,null,null,null,null,null,null,null,null,null,null,null,null,null,"CA prévision cumulé",{"$f":"PDC_DEC[[#Totals],[CA]]+NOV!R24","v":0}]
[null,null,null,null,null,null,null,null,null,null,null,null,null,null,null,null,null,"CA réel cumulé",{"$f":"G13+NOV!R25","v":0}]

{"sheet":"JAN","index":3,"n_rows":25,"n_cols":25,"rows_kept":25,"cut":false,"hidden":false,"merged":[[5,16,5,17],[12,5,13,5],[12,6,13,14],[4,0,4,8],[0,0,0,14],[1,1,1,2],[10,5,10,8],[11,5,11,8],[1,4,1,5],[1,6,1,7],[1,8,1,9],[1,11,1,14]]}
[{"$f":"\"PLAN DE CHARGE DU MOIS DE JANVIER \"&'Fermetures & jours fériés'!D2","v":"PLAN DE CHARGE DU MOIS DE JANVIER 2020"},null,null,null,null,null,null,null,null,null,null,null,null,null,null,null,{"$f":"EDATE(DEC!R1,1)","v":"2020-01-01"}]
["Légende :","Chantier fait",null,"Cellule à définir avec feuille de marge réelle","= H estimatives",null,"< H estimatives",null,"> H estimatives",null,"Pose prév. Impératif","Rechercher un client : Ctrl+F > Options > Dans \"Classeur\" > Décocher \"Totalité de la cellule\" > Entrer NOM"]
[null,null,null,null,null,null,null,null,null,1,{"$f":"IF(J3<52,J3+1,1)","v":2},{"$f":"IF(K3<52,K3+1,1)","v":3},4,5]
[null,null,null,null,null,null,null,null,null,{"$f":"IF(SUMIFS(PDC_JAN[H estimatives],PDC_JAN[Projet],\"BOZARC\",PDC_JAN[Pose prév. S],PDC_JAN[[#Headers],[1]])>70,\"Trop de BozArc prévu\",\"\")","v":""},{"$f":"IF(SUMIFS(PDC_JAN[H estimatives],PDC_JAN[Projet],\"BOZARC\",PDC_JAN[Pose prév. S],PDC_JAN[[#Headers],[2]])>87.5,\"Trop de BozArc prévu\",\"\")","v":""},{"$f":"IF(SUMIFS(PDC_JAN[H estimatives],PDC_JAN[Projet],\"BOZARC\",PDC_JAN[Pose prév. S],PDC_JAN[[#Headers],[3]])>70,\"Trop de BozArc prévu\",\"\")","v":""},{"$f":"IF(SUMIFS(PDC_JAN[H estimatives],PDC_JAN[Projet],\"BOZARC\",PDC_JAN[Pose prév. S],PDC_JAN[[#Headers],[4]])>87.5,\"Trop de BozArc prévu\",\"\")","v":""},{"$f":"IF(SUMIFS(PDC_JAN[H estimatives],PDC_JAN[Projet],\"BOZARC\",PDC_JAN[Pose prév. S],PDC_JAN[[#Headers],[5]])>70,\"Trop de BozArc prévu\",\"\")","v":""}]
[{"$f":"IF(OR(R7>=R13,R10>0),\"MOIS COMPLET - PLUS DE SAISIE\",\"\")","v":""},null,null,null,null,null,null,null,null,{"$f":"IF(SUMIF(PDC_JAN[Pose prév. S],PDC_JAN[[#Headers],[1]],PDC_JAN[H estimatives])>=U$16,\"Semaine complète\",\"\")","v":""},{"$f":"IF(SUMIF(PDC_JAN[Pose prév. S],PDC_JAN[[#Headers],[2]],PDC_JAN[H estimatives])>=V$16,\"Semaine complète\",\"\")","v":""},{"$f":"IF(SUMIF(PDC_JAN[Pose prév. S],PDC_JAN[[#Headers],[3]],PDC_JAN[H estimatives])>=W$16,\"Semaine complète\",\"\")","v":""},{"$f":"IF(SUMIF(PDC_JAN[Pose prév. S],PDC_JAN[[#Headers],[4]],PDC_JAN[H estimatives])>=X$16,\"Semaine complète\",\"\")","v":""},{"$f":"IF(SUMIF(PDC_JAN[Pose prév. S],PDC_JAN[[#Headers],[5]],PDC_JAN[H estimatives])>=Y$16,\"Semaine complète\",\"\")","v":""},null,null,null,null,null,1]
["Chantiers","Ccial","Projet","Ville","H estimatives","H réelles réalisées","CA","S de liv.","Pose prév. S","1","2","3","4","5","Plannifié et validé",null,"Indicateurs",null,null,"Éxécutants","1","2","3","4","5"]
[null,null,null,null,null,null,null,null,null,{"$f":"IF(PDC_JAN[[#This Row],[Pose prév. S]]=J$3,PDC_JAN[[#This Row],[CA]],\"\")","v":""},{"$f":"IF(PDC_JAN[[#This Row],[Pose prév. S]]=K$3,PDC_JAN[[#This Row],[CA]],\"\")","v":""},{"$f":"IF(PDC_JAN[[#This Row],[Pose prév. S]]=L$3,PDC_JAN[[#This Row],[CA]],\"\")","v":""},{"$f":"IF(PDC_JAN[[#This Row],[Pose prév. S]]=M$3,PDC_JAN[[#This Row],[CA]],\"\")","v":""},{"$f":"IF(PDC_JAN[[#This Row],[Pose prév. S]]=N$3,PDC_JAN[[#This Row],[CA]],\"\")","v":""},null,null,"Heures estimatives",{"$f":"PDC_JAN[[#Totals],[H estimatives]]","v":0},null,"Poseur 1",{"$f":"INDEX(H_productives[],MATCH(U$6&$T$5,H_productives[N°S]&H_productives[N°Mois],0),MATCH($T7,H_productives[#Headers],0))","v":0},{"$f":"INDEX(H_productives[],MATCH(V$6&$T$5,H_productives[N°S]&H_productives[N°Mois],0),MATCH($T7,H_productives[#Headers],0))","v":43},{"$f":"INDEX(H_productives[],MATCH(W$6&$T$5,H_productives[N°S]&H_productives[N°Mois],0),MATCH($T7,H_productives[#Headers],0))","v":35},{"$f":"INDEX(H_productives[],MATCH(X$6&$T$5,H_productives[N°S]&H_productives[N°Mois],0),MATCH($T7,H_productives[#Headers],0))","v":43},{"$f":"INDEX(H_productives[],MATCH(Y$6&$T$5,H_productives[N°S]&H_productives[N°Mois],0),MATCH($T7,H_productives[#Headers],0))","v":35}]
[null,null,null,null,null,null,null,null,null,{"$f":"IF(PDC_JAN[[#This Row],[Pose prév. S]]=J$3,PDC_JAN[[#This Row],[CA]],\"\")","v":""},{"$f":"IF(PDC_JAN[[#This Row],[Pose prév. S]]=K$3,PDC_JAN[[#This Row],[CA]],\"\")","v":""},{"$f":"IF(PDC_JAN[[#This Row],[Pose prév. S]]=L$3,PDC_JAN[[#This Row],[CA]],\"\")","v":""},{"$f":"IF(PDC_JAN[[#This Row],[Pose prév. S]]=M$3,PDC_JAN[[#This Row],[CA]],\"\")","v":""},{"$f":"IF(PDC_JAN[[#This Row],[Pose prév. S]]=N$3,PDC_JAN[[#This Row],[CA]],\"\")","v":""},null,null,"Heures estimatives cumulées",{"$f":"R7+DEC!S8","v":0},null,"Poseur 2",{"$f":"INDEX(H_productives[],MATCH(U$6&$T$5,H_productives[N°S]&H_productives[N°Mois],0),MATCH($T8,H_productives[#Headers],0))","v":0},{"$f":"INDEX(H_productives[],MATCH(V$6&$T$5,H_productives[N°S]&H_productives[N°Mois],0),MATCH($T8,H_productives[#Headers],0))","v":43},{"$f":"INDEX(H_productives[],MATCH(W$6&$T$5,H_productives[N°S]&H_productives[N°Mois],0),MATCH($T8,H_productives[#Headers],0))","v":35},{"$f":"INDEX(H_productives[],MATCH(X$6&$T$5,H_productives[N°S]&H_productives[N°Mois],0),MATCH($T8,H_productives[#Headers],0))","v":43},{"$f":"INDEX(H_productives[],MATCH(Y$6&$T$5,H_productives[N°S]&H_productives[N°Mois],0),MATCH($T8,H_productives[#Headers],0))","v":35}]
[null,null,null,null,null,null,null,null,null,{"$f":"IF(PDC_JAN[[#This Row],[Pose prév. S]]=J$3,PDC_JAN[[#This Row],[CA]],\"\")","v":""},{"$f":"IF(PDC_JAN[[#This Row],[Pose prév. S]]=K$3,PDC_JAN[[#This Row],[CA]],\"\")","v":""},{"$f":"IF(PDC_JAN[[#This Row],[Pose prév. S]]=L$3,PDC_JAN[[#This Row],[CA]],\"\")","v":""},{"$f":"IF(PDC_JAN[[#This Row],[Pose prév. S]]=M$3,PDC_JAN[[#This Row],[CA]],\"\")","v":""},{"$f":"IF(PDC_JAN[[#This Row],[Pose prév. S]]=N$3,PDC_JAN[[#This Row],[CA]],\"\")","v":""},null,null,null,null,null,"Poseur 3",{"$f":"INDEX(H_productives[],MATCH(U$6&$T$5,H_productives[N°S]&H_productives[N°Mois],0),MATCH($T9,H_productives[#Headers],0))","v":0},{"$f":"INDEX(H_productives[],MATCH(V$6&$T$5,H_productives[N°S]&H_productives[N°Mois],0),MATCH($T9,H_productives[#Headers],0))","v":43},{"$f":"INDEX(H_productives[],MATCH(W$6&$T$5,H_productives[N°S]&H_productives[N°Mois],0),MATCH($T9,H_productives[#Headers],0))","v":35},{"$f":"INDEX(H_productives[],MATCH(X$6&$T$5,H_productives[N°S]&H_productives[N°Mois],0),MATCH($T9,H_productives[#Headers],0))","v":43},{"$f":"INDEX(H_productives[],MATCH(Y$6&$T$5,H_productives[N°S]&H_productives[N°Mois],0),MATCH($T9,H_productives[#Headers],0))","v":35}]
[{"$f":"SUBTOTAL(103,PDC_JAN[Chantiers])","v":0},null,null,null,{"$f":"SUBTOTAL(109,PDC_JAN[H estimatives])","v":0},{"$f":"SUBTOTAL(109,PDC_JAN[H réelles réalisées])","v":0},{"$f":"SUBTOTAL(109,PDC_JAN[CA])","v":0},null,null,null,null,null,null,null,null,null,"Heures en surplus (à décaler)",{"$f":"IF(TODAY()<=Q1,IF(DEC!S10>0,IF((R7+DEC!S10)>R13,(R7+DEC!S10)-R13,0),IF(R7>R13,R7-R13,0)),IF(R7>R13,R7-R13,0))","v":0},null,"Poseur 4",{"$f":"INDEX(H_productives[],MATCH(U$6&$T$5,H_productives[N°S]&H_productives[N°Mois],0),MATCH($T10,H_productives[#Headers],0))","v":0},{"$f":"INDEX(H_productives[],MATCH(V$6&$T$5,H_productives[N°S]&H_productives[N°Mois],0),MATCH($T10,H_productives[#Headers],0))","v":43},{"$f":"INDEX(H_productives[],MATCH(W$6&$T$5,H_productives[N°S]&H_productives[N°Mois],0),MATCH($T10,H_productives[#Headers],0))","v":35},{"$f":"INDEX(H_productives[],MATCH(X$6&$T$5,H_productives[N°S]&H_productives[N°Mois],0),MATCH($T10,H_productives[#Headers],0))","v":43},{"$f":"INDEX(H_productives[],MATCH(Y$6&$T$5,H_productives[N°S]&H_productives[N°Mois],0),MATCH($T10,H_productives[#Headers],0))","v":35}]
[null,null,null,null,null,"Nombre d'h prévues :",null,null,null,{"$f":"SUMIF(PDC_JAN[Pose prév. S],PDC_JAN[[#Headers],[1]],PDC_JAN[H estimatives])","v":0},{"$f":"SUMIF(PDC_JAN[Pose prév. S],PDC_JAN[[#Headers],[2]],PDC_JAN[H estimatives])","v":0},{"$f":"SUMIF(PDC_JAN[Pose prév. S],PDC_JAN[[#Headers],[3]],PDC_JAN[H estimatives])","v":0},{"$f":"SUMIF(PDC_JAN[Pose prév. S],PDC_JAN[[#Headers],[4]],PDC_JAN[H estimatives])","v":0},{"$f":"SUMIF(PDC_JAN[Pose prév. S],PDC_JAN[[#Headers],[5]],PDC_JAN[H estimatives])","v":0},null,null,"Heures restantes",{"$f":"IF(R10=0,IF(TODAY()<=Q1,R13-(R7+DEC!S10),R13-R7),0)","v":944.35},null,"Poseur 5",{"$f":"INDEX(H_productives[],MATCH(U$6&$T$5,H_productives[N°S]&H_productives[N°Mois],0),MATCH($T11,H_productives[#Headers],0))","v":0},{"$f":"INDEX(H_productives[],MATCH(V$6&$T$5,H_productives[N°S]&H_productives[N°Mois],0),MATCH($T11,H_productives[#Headers],0))","v":43},{"$f":"INDEX(H_productives[],MATCH(W$6&$T$5,H_productives[N°S]&H_productives[N°Mois],0),MATCH($T11,H_productives[#Headers],0))","v":35},{"$f":"INDEX(H_productives[],MATCH(X$6&$T$5,H_productives[N°S]&H_productives[N°Mois],0),MATCH($T11,H_productives[#Headers],0))","v":43},{"$f":"INDEX(H_productives[],MATCH(Y$6&$T$5,H_productives[N°S]&H_productives[N°Mois],0),MATCH($T11,H_productives[#Headers],0))","v":35}]
[null,null,null,null,null,"Différence d'h (H prévues - H prod.) :",null,null,null,{"$f":"J11-U16","v":-29.75},{"$f":"K11-V16","v":-249.05},{"$f":"L11-W16","v":-208.25},{"$f":"M11-X16","v":-249.05},{"$f":"N11-Y16","v":-208.25},null,null,null,null,null,"Poseur 6",{"$f":"INDEX(H_productives[],MATCH(U$6&$T$5,H_productives[N°S]&H_productives[N°Mois],0),MATCH($T12,H_productives[#Headers],0))","v":0},{"$f":"INDEX(H_productives[],MATCH(V$6&$T$5,H_productives[N°S]&H_productives[N°Mois],0),MATCH($T12,H_productives[#Headers],0))","v":43},{"$f":"INDEX(H_productives[],MATCH(W$6&$T$5,H_productives[N°S]&H_productives[N°Mois],0),MATCH($T12,H_productives[#Headers],0))","v":35},{"$f":"INDEX(H_productives[],MATCH(X$6&$T$5,H_productives[N°S]&H_productives[N°Mois],0),MATCH($T12,H_productives[#Headers],0))","v":43},{"$f":"INDEX(H_productives[],MATCH(Y$6&$T$5,H_productives[N°S]&H_productives[N°Mois],0),MATCH($T12,H_productives[#Headers],0))","v":35}]
[null,null,null,null,null,"CA/mois\nTOTAL",{"$f":"SUMIF(PDC_JAN[Plannifié et validé],\"ü\",PDC_JAN[CA])","v":0},null,null,null,null,null,null,null,null,null,"Heures prod.",{"$f":"SUM(U16:Y16)","v":944.35},null,"Poseur 7",{"$f":"INDEX(H_productives[],MATCH(U$6&$T$5,H_productives[N°S]&H_productives[N°Mois],0),MATCH($T13,H_productives[#Headers],0))","v":35},{"$f":"INDEX(H_productives[],MATCH(V$6&$T$5,H_productives[N°S]&H_productives[N°Mois],0),MATCH($T13,H_productives[#Headers],0))","v":35},{"$f":"INDEX(H_productives[],MATCH(W$6&$T$5,H_productives[N°S]&H_productives[N°Mois],0),MATCH($T13,H_productives[#Headers],0))","v":35},{"$f":"INDEX(H_productives[],MATCH(X$6&$T$5,H_productives[N°S]&H_productives[N°Mois],0),MATCH($T13,H_productives[#Headers],0))","v":35},{"$f":"INDEX(H_productives[],MATCH(Y$6&$T$5,H_productives[N°S]&H_productives[N°Mois],0),MATCH($T13,H_productives[#Headers],0))","v":35}]
[null,null,null,null,null,null,null,null,null,null,null,null,null,null,null,null,"Heures prod. cumulées",{"$f":"R13+DEC!S14","v":3409.35},null,"Total",{"$f":"SUBTOTAL(109,Tps_travaillées_OCT381382383[1])","v":35},{"$f":"SUBTOTAL(109,Tps_travaillées_OCT381382383[2])","v":293},{"$f":"SUBTOTAL(109,Tps_travaillées_OCT381382383[3])","v":245},{"$f":"SUBTOTAL(109,Tps_travaillées_OCT381382383[4])","v":293},{"$f":"SUBTOTAL(109,Tps_travaillées_OCT381382383[5])","v":245}]
[null,null,null,null,null,null,null,null,null,null,null,null,null,null,null,null,null,null,null,-0.15,{"$f":"Tps_travaillées_OCT381382383[[#Totals],[1]]*$T$15","v":-5.25},{"$f":"Tps_travaillées_OCT381382383[[#Totals],[2]]*$T$15","v":-43.949999999999996},{"$f":"Tps_travaillées_OCT381382383[[#Totals],[3]]*$T$15","v":-36.75},{"$f":"Tps_travaillées_OCT381382383[[#Totals],[4]]*$T$15","v":-43.949999999999996},{"$f":"Tps_travaillées_OCT381382383[[#Totals],[5]]*$T$15","v":-36.75}]
[null,null,null,null,null,null,null,null,null,null,null,null,null,null,null,null,"Heures réelles réalisées",{"$f":"PDC_JAN[[#Totals],[H réelles réalisées]]","v":0},null,"Heure réelles travaillées",{"$f":"SUM(U14:U15)","v":29.75},{"$f":"SUM(V14:V15)","v":249.05},{"$f":"SUM(W14:W15)","v":208.25},{"$f":"SUM(X14:X15)","v":249.05},{"$f":"SUM(Y14:Y15)","v":208.25}]
[null,null,null,null,null,null,null,null,null,null,null,null,null,null,null,null,"Heures réelles réalisées cumulées",{"$f":"R16+DEC!S17","v":0},null,"Soit en JOURS",{"$f":"U16/8.75","v":3.4},{"$f":"V16/8.75","v":28.462857142857143},{"$f":"W16/8.75","v":23.8},{"$f":"X16/8.75","v":28.462857142857143},{"$f":"Y16/8.75","v":23.8}]
[]
[null,null,null,null,null,null,null,null,null,null,null,null,null,null,null,null,"Moyenne CA/h estimatives",{"$f":"SUM(PDC_JAN[[#Totals],[CA]]/E10)","v":{"$error":"#DIV/0!"}}]
[null,null,null,null,null,null,null,null,null,null,null,null,null,null,null,null,"Moyenne CA/h réalisées",{"$f":"G13/PDC_JAN[[#Totals],[H réelles réalisées]]","v":{"$error":"#DIV/0!"}}]
[null,null,null,null,null,null,null,null,null,null,null,null,null,null,null,null,"Moyenne CA/h réalisées cumulées",{"$f":"R25/R17","v":{"$error":"#DIV/0!"}}]
[]
[null,null,null,null,null,null,null,null,null,null,null,null,null,null,null,null,"CA prévi. à poser au cours de l'année",{"$f":"PDC_JAN[[#Totals],[CA]]+FEV!R23","v":0}]
[null,null,null,null,null,null,null,null,null,null,null,null,null,null,null,null,"CA prévision cumulé",{"$f":"PDC_JAN[[#Totals],[CA]]+DEC!S24","v":0}]
[null,null,null,null,null,null,null,null,null,null,null,null,null,null,null,null,"CA réel cumulé",{"$f":"G13+DEC!S25","v":0}]

{"sheet":"FEV","index":4,"n_rows":25,"n_cols":25,"rows_kept":25,"cut":false,"hidden":false,"merged":[[5,16,5,17],[12,5,13,5],[12,6,13,14],[4,0,4,8],[0,0,0,14],[1,1,1,2],[11,5,11,8],[10,5,10,8],[1,4,1,5],[1,6,1,7],[1,8,1,9],[1,11,1,14]]}
[{"$f":"\"PLAN DE CHARGE DU MOIS DE FEVRIER \"&'Fermetures & jours fériés'!D2","v":"PLAN DE CHARGE DU MOIS DE FEVRIER 2020"},null,null,null,null,null,null,null,null,null,null,null,null,null,null,{"$f":"EDATE(JAN!P1,1)","v":"1900-01-31"},{"$f":"DATE('Fermetures & jours fériés'!D2,T5,1)","v":"2020-02-01"}]
["Légende :","Chantier fait",null,"Cellule à définir avec feuille de marge réelle","= H estimatives",null,"< H estimatives",null,"> H estimatives",null,"Pose prév. Impératif","Rechercher un client : Ctrl+F > Options > Dans \"Classeur\" > Décocher \"Totalité de la cellule\" > Entrer NOM"]
[null,null,null,null,null,null,null,null,null,5,{"$f":"IF(J3<52,J3+1,1)","v":6},{"$f":"IF(K3<52,K3+1,1)","v":7},8,9]
[null,null,null,null,null,null,null,null,null,{"$f":"IF(SUMIFS(PDC_FEV[H estimatives],PDC_FEV[Projet],\"BOZARC\",PDC_FEV[Pose prév. S],PDC_FEV[[#Headers],[5]])>70,\"Trop de BozArc prévu\",\"\")","v":""},{"$f":"IF(SUMIFS(PDC_FEV[H estimatives],PDC_FEV[Projet],\"BOZARC\",PDC_FEV[Pose prév. S],PDC_FEV[[#Headers],[6]])>87.5,\"Trop de BozArc prévu\",\"\")","v":""},{"$f":"IF(SUMIFS(PDC_FEV[H estimatives],PDC_FEV[Projet],\"BOZARC\",PDC_FEV[Pose prév. S],PDC_FEV[[#Headers],[7]])>70,\"Trop de BozArc prévu\",\"\")","v":""},{"$f":"IF(SUMIFS(PDC_FEV[H estimatives],PDC_FEV[Projet],\"BOZARC\",PDC_FEV[Pose prév. S],PDC_FEV[[#Headers],[8]])>87.5,\"Trop de BozArc prévu\",\"\")","v":""},{"$f":"IF(SUMIFS(PDC_FEV[H estimatives],PDC_FEV[Projet],\"BOZARC\",PDC_FEV[Pose prév. S],PDC_FEV[[#Headers],[9]])>70,\"Trop de BozArc prévu\",\"\")","v":""}]
[{"$f":"IF(OR(R7>=R13,R10>0),\"MOIS COMPLET - PLUS DE SAISIE\",\"\")","v":""},null,null,null,null,null,null,null,null,{"$f":"IF(SUMIF(PDC_FEV[Pose prév. S],PDC_FEV[[#Headers],[5]],PDC_FEV[H estimatives])>=U$16,\"Semaine complète\",\"\")","v":"Semaine complète"},{"$f":"IF(SUMIF(PDC_FEV[Pose prév. S],PDC_FEV[[#Headers],[6]],PDC_FEV[H estimatives])>=V$16,\"Semaine complète\",\"\")","v":""},{"$f":"IF(SUMIF(PDC_FEV[Pose prév. S],PDC_FEV[[#Headers],[7]],PDC_FEV[H estimatives])>=W$16,\"Semaine complète\",\"\")","v":""},{"$f":"IF(SUMIF(PDC_FEV[Pose prév. S],PDC_FEV[[#Headers],[8]],PDC_FEV[H estimatives])>=X$16,\"Semaine complète\",\"\")","v":""},{"$f":"IF(SUMIF(PDC_FEV[Pose prév. S],PDC_FEV[[#Headers],[9]],PDC_FEV[H estimatives])>=Y$16,\"Semaine complète\",\"\")","v":""},"Décalage",null,null,null,null,{"$f":"JAN!T5+1","v":2}]
["Chantiers","Ccial","Projet","Ville","H estimatives","H réelles réalisées","CA","S de liv.","Pose prév. S","5","6","7","8","9","Plannifié et validé",null,"Indicateurs",null,null,"Éxécutants","5","6","7","8","9"]
[null,null,null,null,null,null,null,null,null,{"$f":"IF(PDC_FEV[[#This Row],[Pose prév. S]]=J$3,PDC_FEV[[#This Row],[CA]],\"\")","v":""},{"$f":"IF(PDC_FEV[[#This Row],[Pose prév. S]]=K$3,PDC_FEV[[#This Row],[CA]],\"\")","v":""},{"$f":"IF(PDC_FEV[[#This Row],[Pose prév. S]]=L$3,PDC_FEV[[#This Row],[CA]],\"\")","v":""},{"$f":"IF(PDC_FEV[[#This Row],[Pose prév. S]]=M$3,PDC_FEV[[#This Row],[CA]],\"\")","v":""},{"$f":"IF(PDC_FEV[[#This Row],[Pose prév. S]]=N$3,PDC_FEV[[#This Row],[CA]],\"\")","v":""},null,null,"Heures estimatives",{"$f":"PDC_FEV[[#Totals],[H estimatives]]","v":0},null,"Poseur 1",{"$f":"INDEX(H_productives[],MATCH(U$6&$T$5,H_productives[N°S]&H_productives[N°Mois],0),MATCH($T7,H_productives[#Headers],0))","v":0},{"$f":"INDEX(H_productives[],MATCH(V$6&$T$5,H_productives[N°S]&H_productives[N°Mois],0),MATCH($T7,H_productives[#Headers],0))","v":43},{"$f":"INDEX(H_productives[],MATCH(W$6&$T$5,H_productives[N°S]&H_productives[N°Mois],0),MATCH($T7,H_productives[#Headers],0))","v":35},{"$f":"INDEX(H_productives[],MATCH(X$6&$T$5,H_productives[N°S]&H_productives[N°Mois],0),MATCH($T7,H_productives[#Headers],0))","v":43},{"$f":"INDEX(H_productives[],MATCH(Y$6&$T$5,H_productives[N°S]&H_productives[N°Mois],0),MATCH($T7,H_productives[#Headers],0))","v":35}]
[null,null,null,null,null,null,null,null,null,{"$f":"IF(PDC_FEV[[#This Row],[Pose prév. S]]=J$3,PDC_FEV[[#This Row],[CA]],\"\")","v":""},{"$f":"IF(PDC_FEV[[#This Row],[Pose prév. S]]=K$3,PDC_FEV[[#This Row],[CA]],\"\")","v":""},{"$f":"IF(PDC_FEV[[#This Row],[Pose prév. S]]=L$3,PDC_FEV[[#This Row],[CA]],\"\")","v":""},{"$f":"IF(PDC_FEV[[#This Row],[Pose prév. S]]=M$3,PDC_FEV[[#This Row],[CA]],\"\")","v":""},{"$f":"IF(PDC_FEV[[#This Row],[Pose prév. S]]=N$3,PDC_FEV[[#This Row],[CA]],\"\")","v":""},null,null,"Heures estimatives cumulées",{"$f":"R7+JAN!R8","v":0},null,"Poseur 2",{"$f":"INDEX(H_productives[],MATCH(U$6&$T$5,H_productives[N°S]&H_productives[N°Mois],0),MATCH($T8,H_productives[#Headers],0))","v":0},{"$f":"INDEX(H_productives[],MATCH(V$6&$T$5,H_productives[N°S]&H_productives[N°Mois],0),MATCH($T8,H_productives[#Headers],0))","v":43},{"$f":"INDEX(H_productives[],MATCH(W$6&$T$5,H_productives[N°S]&H_productives[N°Mois],0),MATCH($T8,H_productives[#Headers],0))","v":35},{"$f":"INDEX(H_productives[],MATCH(X$6&$T$5,H_productives[N°S]&H_productives[N°Mois],0),MATCH($T8,H_productives[#Headers],0))","v":43},{"$f":"INDEX(H_productives[],MATCH(Y$6&$T$5,H_productives[N°S]&H_productives[N°Mois],0),MATCH($T8,H_productives[#Headers],0))","v":35}]
[null,null,null,null,null,null,null,null,null,{"$f":"IF(PDC_FEV[[#This Row],[Pose prév. S]]=J$3,PDC_FEV[[#This Row],[CA]],\"\")","v":""},{"$f":"IF(PDC_FEV[[#This Row],[Pose prév. S]]=K$3,PDC_FEV[[#This Row],[CA]],\"\")","v":""},{"$f":"IF(PDC_FEV[[#This Row],[Pose prév. S]]=L$3,PDC_FEV[[#This Row],[CA]],\"\")","v":""},{"$f":"IF(PDC_FEV[[#This Row],[Pose prév. S]]=M$3,PDC_FEV[[#This Row],[CA]],\"\")","v":""},{"$f":"IF(PDC_FEV[[#This Row],[Pose prév. S]]=N$3,PDC_FEV[[#This Row],[CA]],\"\")","v":""},null,null,null,null,null,"Poseur 3",{"$f":"INDEX(H_productives[],MATCH(U$6&$T$5,H_productives[N°S]&H_productives[N°Mois],0),MATCH($T9,H_productives[#Headers],0))","v":0},{"$f":"INDEX(H_productives[],MATCH(V$6&$T$5,H_productives[N°S]&H_productives[N°Mois],0),MATCH($T9,H_productives[#Headers],0))","v":43},{"$f":"INDEX(H_productives[],MATCH(W$6&$T$5,H_productives[N°S]&H_productives[N°Mois],0),MATCH($T9,H_productives[#Headers],0))","v":35},{"$f":"INDEX(H_productives[],MATCH(X$6&$T$5,H_productives[N°S]&H_productives[N°Mois],0),MATCH($T9,H_productives[#Headers],0))","v":43},{"$f":"INDEX(H_productives[],MATCH(Y$6&$T$5,H_productives[N°S]&H_productives[N°Mois],0),MATCH($T9,H_productives[#Headers],0))","v":35}]
[{"$f":"SUBTOTAL(103,PDC_FEV[Chantiers])","v":0},null,null,null,{"$f":"SUBTOTAL(109,PDC_FEV[H estimatives])","v":0},{"$f":"SUBTOTAL(109,PDC_FEV[H réelles réalisées])","v":0},{"$f":"SUBTOTAL(109,PDC_FEV[CA])","v":0},null,null,null,null,null,null,null,null,null,"Heures en surplus (à décaler)",{"$f":"IF(TODAY()<=Q1,IF(JAN!R10>0,IF((R7+JAN!R10)>R13,(R7+JAN!R10)-R13,0),IF(R7>R13,R7-R13,0)),IF(R7>R13,R7-R13,0))","v":0},null,"Poseur 4",{"$f":"INDEX(H_productives[],MATCH(U$6&$T$5,H_productives[N°S]&H_productives[N°Mois],0),MATCH($T10,H_productives[#Headers],0))","v":0},{"$f":"INDEX(H_productives[],MATCH(V$6&$T$5,H_productives[N°S]&H_productives[N°Mois],0),MATCH($T10,H_productives[#Headers],0))","v":43},{"$f":"INDEX(H_productives[],MATCH(W$6&$T$5,H_productives[N°S]&H_productives[N°Mois],0),MATCH($T10,H_productives[#Headers],0))","v":35},{"$f":"INDEX(H_productives[],MATCH(X$6&$T$5,H_productives[N°S]&H_productives[N°Mois],0),MATCH($T10,H_productives[#Headers],0))","v":43},{"$f":"INDEX(H_productives[],MATCH(Y$6&$T$5,H_productives[N°S]&H_productives[N°Mois],0),MATCH($T10,H_productives[#Headers],0))","v":35}]
[null,null,null,null,null,"Nombre d'h prévues :",null,null,null,{"$f":"SUMIF(PDC_FEV[Pose prév. S],PDC_FEV[[#Headers],[5]],PDC_FEV[H estimatives])","v":0},{"$f":"SUMIF(PDC_FEV[Pose prév. S],PDC_FEV[[#Headers],[6]],PDC_FEV[H estimatives])","v":0},{"$f":"SUMIF(PDC_FEV[Pose prév. S],PDC_FEV[[#Headers],[7]],PDC_FEV[H estimatives])","v":0},{"$f":"SUMIF(PDC_FEV[Pose prév. S],PDC_FEV[[#Headers],[8]],PDC_FEV[H estimatives])","v":0},{"$f":"SUMIF(PDC_FEV[Pose prév. S],PDC_FEV[[#Headers],[9]],PDC_FEV[H estimatives])","v":0},null,null,"Heures restantes",{"$f":"IF(R10=0,IF(TODAY()<=Q1,R13-(R7+JAN!R10),R13-R7),0)","v":1076},null,"Poseur 5",{"$f":"INDEX(H_productives[],MATCH(U$6&$T$5,H_productives[N°S]&H_productives[N°Mois],0),MATCH($T11,H_productives[#Headers],0))","v":0},{"$f":"INDEX(H_productives[],MATCH(V$6&$T$5,H_productives[N°S]&H_productives[N°Mois],0),MATCH($T11,H_productives[#Headers],0))","v":43},{"$f":"INDEX(H_productives[],MATCH(W$6&$T$5,H_productives[N°S]&H_productives[N°Mois],0),MATCH($T11,H_productives[#Headers],0))","v":35},{"$f":"INDEX(H_productives[],MATCH(X$6&$T$5,H_productives[N°S]&H_productives[N°Mois],0),MATCH($T11,H_productives[#Headers],0))","v":43},{"$f":"INDEX(H_productives[],MATCH(Y$6&$T$5,H_productives[N°S]&H_productives[N°Mois],0),MATCH($T11,H_productives[#Headers],0))","v":35}]
[null,null,null,null,null,"Différence d'h (H prévues - H prod.) :",null,null,null,{"$f":"J11-U16","v":0},{"$f":"K11-V16","v":-249.05},{"$f":"L11-W16","v":-208.25},{"$f":"M11-X16","v":-249.05},{"$f":"N11-Y16","v":-208.25},null,null,null,null,null,"Poseur 6",{"$f":"INDEX(H_productives[],MATCH(U$6&$T$5,H_productives[N°S]&H_productives[N°Mois],0),MATCH($T12,H_productives[#Headers],0))","v":0},{"$f":"INDEX(H_productives[],MATCH(V$6&$T$5,H_productives[N°S]&H_productives[N°Mois],0),MATCH($T12,H_productives[#Headers],0))","v":43},{"$f":"INDEX(H_productives[],MATCH(W$6&$T$5,H_productives[N°S]&H_productives[N°Mois],0),MATCH($T12,H_productives[#Headers],0))","v":35},{"$f":"INDEX(H_productives[],MATCH(X$6&$T$5,H_productives[N°S]&H_productives[N°Mois],0),MATCH($T12,H_productives[#Headers],0))","v":43},{"$f":"INDEX(H_productives[],MATCH(Y$6&$T$5,H_productives[N°S]&H_productives[N°Mois],0),MATCH($T12,H_productives[#Headers],0))","v":35}]
[null,null,null,null,null,"CA/mois\nTOTAL",{"$f":"SUMIF(PDC_FEV[Plannifié et validé],\"ü\",PDC_FEV[CA])","v":0},null,null,null,null,null,null,null,null,null,"Heures prod.",{"$f":"SUM(Tps_travaillées_OCT384[[#Totals],[5]:[9]])","v":1076},null,"Poseur 7",{"$f":"INDEX(H_productives[],MATCH(U$6&$T$5,H_productives[N°S]&H_productives[N°Mois],0),MATCH($T13,H_productives[#Headers],0))","v":0},{"$f":"INDEX(H_productives[],MATCH(V$6&$T$5,H_productives[N°S]&H_productives[N°Mois],0),MATCH($T13,H_productives[#Headers],0))","v":35},{"$f":"INDEX(H_productives[],MATCH(W$6&$T$5,H_productives[N°S]&H_productives[N°Mois],0),MATCH($T13,H_productives[#Headers],0))","v":35},{"$f":"INDEX(H_productives[],MATCH(X$6&$T$5,H_productives[N°S]&H_productives[N°Mois],0),MATCH($T13,H_productives[#Headers],0))","v":35},{"$f":"INDEX(H_productives[],MATCH(Y$6&$T$5,H_productives[N°S]&H_productives[N°Mois],0),MATCH($T13,H_productives[#Headers],0))","v":35}]
[null,null,null,null,null,null,null,null,null,null,null,null,null,null,null,null,"Heures prod. cumulées",{"$f":"R13+JAN!R14","v":4485.3500000000004},null,"Total",{"$f":"SUBTOTAL(109,Tps_travaillées_OCT384[5])","v":0},{"$f":"SUBTOTAL(109,Tps_travaillées_OCT384[6])","v":293},{"$f":"SUBTOTAL(109,Tps_travaillées_OCT384[7])","v":245},{"$f":"SUBTOTAL(109,Tps_travaillées_OCT384[8])","v":293},{"$f":"SUBTOTAL(109,Tps_travaillées_OCT384[9])","v":245}]
[null,null,null,null,null,null,null,null,null,null,null,null,null,null,null,null,null,null,null,-0.15,{"$f":"Tps_travaillées_OCT384[[#Totals],[5]]*$T$15","v":0},{"$f":"Tps_travaillées_OCT384[[#Totals],[6]]*$T$15","v":-43.949999999999996},{"$f":"Tps_travaillées_OCT384[[#Totals],[7]]*$T$15","v":-36.75},{"$f":"Tps_travaillées_OCT384[[#Totals],[8]]*$T$15","v":-43.949999999999996},{"$f":"Tps_travaillées_OCT384[[#Totals],[9]]*$T$15","v":-36.75}]
[null,null,null,null,null,null,null,null,null,null,null,null,null,null,null,null,"Heures réelles réalisées",{"$f":"PDC_FEV[[#Totals],[H réelles réalisées]]","v":0},null,"Heure réelles travaillées",{"$f":"SUM(U14:U15)","v":0},{"$f":"SUM(V14:V15)","v":249.05},{"$f":"SUM(W14:W15)","v":208.25},{"$f":"SUM(X14:X15)","v":249.05},{"$f":"SUM(Y14:Y15)","v":208.25}]
[null,null,null,null,null,null,null,null,null,null,null,null,null,null,null,null,"Heures réelles réalisées cumulées",{"$f":"R16+JAN!R17","v":0},null,"Soit en JOURS",{"$f":"U16/8.75","v":0},{"$f":"V16/8.75","v":28.462857142857143},{"$f":"W16/8.75","v":23.8},{"$f":"X16/8.75","v":28.462857142857143},{"$f":"Y16/8.75","v":23.8}]
[]
[null,null,null,null,null,null,null,null,null,null,null,null,null,null,null,null,"Moyenne CA/h estimatives",{"$f":"SUM(PDC_FEV[[#Totals],[CA]]/E10)","v":{"$error":"#DIV/0!"}}]
[null,null,null,null,null,null,null,null,null,null,null,null,null,null,null,null,"Moyenne CA/h réalisées",{"$f":"G13/PDC_FEV[[#Totals],[H réelles réalisées]]","v":{"$error":"#DIV/0!"}}]
[null,null,null,null,null,null,null,null,null,null,null,null,null,null,null,null,"Moyenne CA/h réalisées cumulées",{"$f":"R25/R17","v":{"$error":"#DIV/0!"}}]
[]
[null,null,null,null,null,null,null,null,null,null,null,null,null,null,null,null,"CA prévi. à poser au cours de l'année",{"$f":"PDC_FEV[[#Totals],[CA]]+MARS!S23","v":0}]
[null,null,null,null,null,null,null,null,null,null,null,null,null,null,null,null,"CA prévision cumulé",{"$f":"PDC_FEV[[#Totals],[CA]]+JAN!R24","v":0}]
[null,null,null,null,null,null,null,null,null,null,null,null,null,null,null,null,"CA réel cumulé",{"$f":"G13+JAN!R25","v":0}]

{"sheet":"MARS","index":5,"n_rows":25,"n_cols":27,"rows_kept":25,"cut":false,"hidden":false,"merged":[[1,12,1,15],[5,17,5,18],[12,5,13,5],[4,0,4,8],[0,0,0,14],[1,1,1,2],[10,5,10,8],[11,5,11,8],[12,6,13,15],[1,4,1,5],[1,6,1,7],[1,8,1,9]]}
[{"$f":"\"PLAN DE CHARGE DU MOIS DE MARS \"&'Fermetures & jours fériés'!D2","v":"PLAN DE CHARGE DU MOIS DE MARS 2020"},null,null,null,null,null,null,null,null,null,null,null,null,null,null,null,null,{"$f":"DATE('Fermetures & jours fériés'!D2,U5,1)","v":"2020-03-01"}]
["Légende :","Chantier fait",null,"Cellule à définir avec feuille de marge réelle","= H estimatives",null,"< H estimatives",null,"> H estimatives",null,"Pose prév. Impératif",null,"Rechercher un client : Ctrl+F > Options > Dans \"Classeur\" > Décocher \"Totalité de la cellule\" > Entrer NOM"]
[null,null,null,null,null,null,null,null,null,9,{"$f":"IF(J3<52,J3+1,1)","v":10},{"$f":"IF(K3<52,K3+1,1)","v":11},12,13,14]
[null,null,null,null,null,null,null,null,null,{"$f":"IF(SUMIFS(PDC_MARS[H estimatives],PDC_MARS[Projet],\"BOZARC\",PDC_MARS[Pose prév. S],PDC_MARS[[#Headers],[9]])>70,\"Trop de BozArc prévu\",\"\")","v":""},{"$f":"IF(SUMIFS(PDC_MARS[H estimatives],PDC_MARS[Projet],\"BOZARC\",PDC_MARS[Pose prév. S],PDC_MARS[[#Headers],[10]])>87.5,\"Trop de BozArc prévu\",\"\")","v":""},{"$f":"IF(SUMIFS(PDC_MARS[H estimatives],PDC_MARS[Projet],\"BOZARC\",PDC_MARS[Pose prév. S],PDC_MARS[[#Headers],[11]])>70,\"Trop de BozArc prévu\",\"\")","v":""},{"$f":"IF(SUMIFS(PDC_MARS[H estimatives],PDC_MARS[Projet],\"BOZARC\",PDC_MARS[Pose prév. S],PDC_MARS[[#Headers],[12]])>87.5,\"Trop de BozArc prévu\",\"\")","v":""},{"$f":"IF(SUMIFS(PDC_MARS[H estimatives],PDC_MARS[Projet],\"BOZARC\",PDC_MARS[Pose prév. S],PDC_MARS[[#Headers],[13]])>70,\"Trop de BozArc prévu\",\"\")","v":""},{"$f":"IF(SUMIFS(PDC_MARS[H estimatives],PDC_MARS[Projet],\"BOZARC\",PDC_MARS[Pose prév. S],PDC_MARS[[#Headers],[14]])>87.5,\"Trop de BozArc prévu\",\"\")","v":""}]
[{"$f":"IF(OR(S7>=S13,S10>0),\"MOIS COMPLET - PLUS DE SAISIE\",\"\")","v":""},null,null,null,null,null,null,null,null,{"$f":"IF(SUMIF(PDC_MARS[Pose prév. S],PDC_MARS[[#Headers],[9]],PDC_MARS[H estimatives])>=V$16,\"Semaine complète\",\"\")","v":"Semaine complète"},{"$f":"IF(SUMIF(PDC_MARS[Pose prév. S],PDC_MARS[[#Headers],[10]],PDC_MARS[H estimatives])>=W$16,\"Semaine complète\",\"\")","v":""},{"$f":"IF(SUMIF(PDC_MARS[Pose prév. S],PDC_MARS[[#Headers],[11]],PDC_MARS[H estimatives])>=X$16,\"Semaine complète\",\"\")","v":""},{"$f":"IF(SUMIF(PDC_MARS[Pose prév. S],PDC_MARS[[#Headers],[12]],PDC_MARS[H estimatives])>=Y$16,\"Semaine complète\",\"\")","v":""},{"$f":"IF(SUMIF(PDC_MARS[Pose prév. S],PDC_MARS[[#Headers],[13]],PDC_MARS[H estimatives])>=Z$16,\"Semaine complète\",\"\")","v":""},{"$f":"IF(SUMIF(PDC_MARS[Pose prév. S],PDC_MARS[[#Headers],[14]],PDC_MARS[H estimatives])>=AA$16,\"Semaine complète\",\"\")","v":""},"Décalage",null,null,null,null,{"$f":"FEV!T5+1","v":3}]
["Chantiers","Ccial","Projet","Ville","H estimatives","H réelles réalisées","CA","S de liv.","Pose prév. S","9","10","11","12","13","14","Plannifié et validé",null,"Indicateurs",null,null,"Éxécutants","9","10","11","12","13","14"]
[null,null,null,null,null,null,null,null,null,{"$f":"IF(PDC_MARS[[#This Row],[Pose prév. S]]=J$3,PDC_MARS[[#This Row],[CA]],\"\")","v":""},{"$f":"IF(PDC_MARS[[#This Row],[Pose prév. S]]=K$3,PDC_MARS[[#This Row],[CA]],\"\")","v":""},{"$f":"IF(PDC_MARS[[#This Row],[Pose prév. S]]=L$3,PDC_MARS[[#This Row],[CA]],\"\")","v":""},{"$f":"IF(PDC_MARS[[#This Row],[Pose prév. S]]=M$3,PDC_MARS[[#This Row],[CA]],\"\")","v":""},{"$f":"IF(PDC_MARS[[#This Row],[Pose prév. S]]=N$3,PDC_MARS[[#This Row],[CA]],\"\")","v":""},{"$f":"IF(PDC_MARS[[#This Row],[Pose prév. S]]=O$3,PDC_MARS[[#This Row],[CA]],\"\")","v":""},null,null,"Heures estimatives",{"$f":"PDC_MARS[[#Totals],[H estimatives]]","v":0},null,"Poseur 1",{"$f":"INDEX(H_productives[],MATCH(V$6&$U$5,H_productives[N°S]&H_productives[N°Mois],0),MATCH($U7,H_productives[#Headers],0))","v":0},{"$f":"INDEX(H_productives[],MATCH(W$6&$U$5,H_productives[N°S]&H_productives[N°Mois],0),MATCH($U7,H_productives[#Headers],0))","v":43},{"$f":"INDEX(H_productives[],MATCH(X$6&$U$5,H_productives[N°S]&H_productives[N°Mois],0),MATCH($U7,H_productives[#Headers],0))","v":35},{"$f":"INDEX(H_productives[],MATCH(Y$6&$U$5,H_productives[N°S]&H_productives[N°Mois],0),MATCH($U7,H_productives[#Headers],0))","v":43},{"$f":"INDEX(H_productives[],MATCH(Z$6&$U$5,H_productives[N°S]&H_productives[N°Mois],0),MATCH($U7,H_productives[#Headers],0))","v":35},{"$f":"INDEX(H_productives[],MATCH(AA$6&$U$5,H_productives[N°S]&H_productives[N°Mois],0),MATCH($U7,H_productives[#Headers],0))","v":17.5}]
[null,null,null,null,null,null,null,null,null,{"$f":"IF(PDC_MARS[[#This Row],[Pose prév. S]]=J$3,PDC_MARS[[#This Row],[CA]],\"\")","v":""},{"$f":"IF(PDC_MARS[[#This Row],[Pose prév. S]]=K$3,PDC_MARS[[#This Row],[CA]],\"\")","v":""},{"$f":"IF(PDC_MARS[[#This Row],[Pose prév. S]]=L$3,PDC_MARS[[#This Row],[CA]],\"\")","v":""},{"$f":"IF(PDC_MARS[[#This Row],[Pose prév. S]]=M$3,PDC_MARS[[#This Row],[CA]],\"\")","v":""},{"$f":"IF(PDC_MARS[[#This Row],[Pose prév. S]]=N$3,PDC_MARS[[#This Row],[CA]],\"\")","v":""},{"$f":"IF(PDC_MARS[[#This Row],[Pose prév. S]]=O$3,PDC_MARS[[#This Row],[CA]],\"\")","v":""},null,null,"Heures estimatives cumulées",{"$f":"S7+FEV!R8","v":0},null,"Poseur 2",{"$f":"INDEX(H_productives[],MATCH(V$6&$U$5,H_productives[N°S]&H_productives[N°Mois],0),MATCH($U8,H_productives[#Headers],0))","v":0},{"$f":"INDEX(H_productives[],MATCH(W$6&$U$5,H_productives[N°S]&H_productives[N°Mois],0),MATCH($U8,H_productives[#Headers],0))","v":43},{"$f":"INDEX(H_productives[],MATCH(X$6&$U$5,H_productives[N°S]&H_productives[N°Mois],0),MATCH($U8,H_productives[#Headers],0))","v":35},{"$f":"INDEX(H_productives[],MATCH(Y$6&$U$5,H_productives[N°S]&H_productives[N°Mois],0),MATCH($U8,H_productives[#Headers],0))","v":43},{"$f":"INDEX(H_productives[],MATCH(Z$6&$U$5,H_productives[N°S]&H_productives[N°Mois],0),MATCH($U8,H_productives[#Headers],0))","v":35},{"$f":"INDEX(H_productives[],MATCH(AA$6&$U$5,H_productives[N°S]&H_productives[N°Mois],0),MATCH($U8,H_productives[#Headers],0))","v":17.5}]
[null,null,null,null,null,null,null,null,null,{"$f":"IF(PDC_MARS[[#This Row],[Pose prév. S]]=J$3,PDC_MARS[[#This Row],[CA]],\"\")","v":""},{"$f":"IF(PDC_MARS[[#This Row],[Pose prév. S]]=K$3,PDC_MARS[[#This Row],[CA]],\"\")","v":""},{"$f":"IF(PDC_MARS[[#This Row],[Pose prév. S]]=L$3,PDC_MARS[[#This Row],[CA]],\"\")","v":""},{"$f":"IF(PDC_MARS[[#This Row],[Pose prév. S]]=M$3,PDC_MARS[[#This Row],[CA]],\"\")","v":""},{"$f":"IF(PDC_MARS[[#This Row],[Pose prév. S]]=N$3,PDC_MARS[[#This Row],[CA]],\"\")","v":""},{"$f":"IF(PDC_MARS[[#This Row],[Pose prév. S]]=O$3,PDC_MARS[[#This Row],[CA]],\"\")","v":""},null,null,null,null,null,"Poseur 3",{"$f":"INDEX(H_productives[],MATCH(V$6&$U$5,H_productives[N°S]&H_productives[N°Mois],0),MATCH($U9,H_productives[#Headers],0))","v":0},{"$f":"INDEX(H_productives[],MATCH(W$6&$U$5,H_productives[N°S]&H_productives[N°Mois],0),MATCH($U9,H_productives[#Headers],0))","v":43},{"$f":"INDEX(H_productives[],MATCH(X$6&$U$5,H_productives[N°S]&H_productives[N°Mois],0),MATCH($U9,H_productives[#Headers],0))","v":35},{"$f":"INDEX(H_productives[],MATCH(Y$6&$U$5,H_productives[N°S]&H_productives[N°Mois],0),MATCH($U9,H_productives[#Headers],0))","v":43},{"$f":"INDEX(H_productives[],MATCH(Z$6&$U$5,H_productives[N°S]&H_productives[N°Mois],0),MATCH($U9,H_productives[#Headers],0))","v":35},{"$f":"INDEX(H_productives[],MATCH(AA$6&$U$5,H_productives[N°S]&H_productives[N°Mois],0),MATCH($U9,H_productives[#Headers],0))","v":17.5}]
[{"$f":"SUBTOTAL(103,PDC_MARS[Chantiers])","v":0},null,null,null,{"$f":"SUBTOTAL(109,PDC_MARS[H estimatives])","v":0},{"$f":"SUBTOTAL(109,PDC_MARS[H réelles réalisées])","v":0},{"$f":"SUBTOTAL(109,PDC_MARS[CA])","v":0},null,null,null,null,null,null,null,null,null,null,"Heures en surplus (à décaler)",{"$f":"IF(TODAY()<=R1,IF(FEV!R10>0,IF((S7+FEV!R10)>S13,(S7+FEV!R10)-S13,0),IF(S7>S13,S7-S13,0)),IF(S7>S13,S7-S13,0))","v":0},null,"Poseur 4",{"$f":"INDEX(H_productives[],MATCH(V$6&$U$5,H_productives[N°S]&H_productives[N°Mois],0),MATCH($U10,H_productives[#Headers],0))","v":0},{"$f":"INDEX(H_productives[],MATCH(W$6&$U$5,H_productives[N°S]&H_productives[N°Mois],0),MATCH($U10,H_productives[#Headers],0))","v":43},{"$f":"INDEX(H_productives[],MATCH(X$6&$U$5,H_productives[N°S]&H_productives[N°Mois],0),MATCH($U10,H_productives[#Headers],0))","v":35},{"$f":"INDEX(H_productives[],MATCH(Y$6&$U$5,H_productives[N°S]&H_productives[N°Mois],0),MATCH($U10,H_productives[#Headers],0))","v":43},{"$f":"INDEX(H_productives[],MATCH(Z$6&$U$5,H_productives[N°S]&H_productives[N°Mois],0),MATCH($U10,H_productives[#Headers],0))","v":35},{"$f":"INDEX(H_productives[],MATCH(AA$6&$U$5,H_productives[N°S]&H_productives[N°Mois],0),MATCH($U10,H_productives[#Headers],0))","v":17.5}]
[null,null,null,null,null,"Nombre d'h prévues :",null,null,null,{"$f":"SUMIF(PDC_MARS[Pose prév. S],PDC_MARS[[#Headers],[9]],PDC_MARS[H estimatives])","v":0},{"$f":"SUMIF(PDC_MARS[Pose prév. S],PDC_MARS[[#Headers],[10]],PDC_MARS[H estimatives])","v":0},{"$f":"SUMIF(PDC_MARS[Pose prév. S],PDC_MARS[[#Headers],[11]],PDC_MARS[H estimatives])","v":0},{"$f":"SUMIF(PDC_MARS[Pose prév. S],PDC_MARS[[#Headers],[12]],PDC_MARS[H estimatives])","v":0},{"$f":"SUMIF(PDC_MARS[Pose prév. S],PDC_MARS[[#Headers],[13]],PDC_MARS[H estimatives])","v":0},{"$f":"SUMIF(PDC_MARS[Pose prév. S],PDC_MARS[[#Headers],[14]],PDC_MARS[H estimatives])","v":0},null,null,"Heures restantes",{"$f":"IF(S10=0,IF(TODAY()<=R1,S13-(S7+FEV!R10),S13-S7),0)","v":1216},null,"Poseur 5",{"$f":"INDEX(H_productives[],MATCH(V$6&$U$5,H_productives[N°S]&H_productives[N°Mois],0),MATCH($U11,H_productives[#Headers],0))","v":0},{"$f":"INDEX(H_productives[],MATCH(W$6&$U$5,H_productives[N°S]&H_productives[N°Mois],0),MATCH($U11,H_productives[#Headers],0))","v":43},{"$f":"INDEX(H_productives[],MATCH(X$6&$U$5,H_productives[N°S]&H_productives[N°Mois],0),MATCH($U11,H_productives[#Headers],0))","v":35},{"$f":"INDEX(H_productives[],MATCH(Y$6&$U$5,H_productives[N°S]&H_productives[N°Mois],0),MATCH($U11,H_productives[#Headers],0))","v":43},{"$f":"INDEX(H_productives[],MATCH(Z$6&$U$5,H_productives[N°S]&H_productives[N°Mois],0),MATCH($U11,H_productives[#Headers],0))","v":35},{"$f":"INDEX(H_productives[],MATCH(AA$6&$U$5,H_productives[N°S]&H_productives[N°Mois],0),MATCH($U11,H_productives[#Headers],0))","v":17.5}]
[null,null,null,null,null,"Différence d'h (H prévues - H prod.) :",null,null,null,{"$f":"J11-V16","v":0},{"$f":"K11-W16","v":-249.05},{"$f":"L11-X16","v":-208.25},{"$f":"M11-Y16","v":-249.05},{"$f":"N11-Z16","v":-208.25},{"$f":"O11-AA16","v":-119},null,null,null,null,null,"Poseur 6",{"$f":"INDEX(H_productives[],MATCH(V$6&$U$5,H_productives[N°S]&H_productives[N°Mois],0),MATCH($U12,H_productives[#Headers],0))","v":0},{"$f":"INDEX(H_productives[],MATCH(W$6&$U$5,H_productives[N°S]&H_productives[N°Mois],0),MATCH($U12,H_productives[#Headers],0))","v":43},{"$f":"INDEX(H_productives[],MATCH(X$6&$U$5,H_productives[N°S]&H_productives[N°Mois],0),MATCH($U12,H_productives[#Headers],0))","v":35},{"$f":"INDEX(H_productives[],MATCH(Y$6&$U$5,H_productives[N°S]&H_productives[N°Mois],0),MATCH($U12,H_productives[#Headers],0))","v":43},{"$f":"INDEX(H_productives[],MATCH(Z$6&$U$5,H_productives[N°S]&H_productives[N°Mois],0),MATCH($U12,H_productives[#Headers],0))","v":35},{"$f":"INDEX(H_productives[],MATCH(AA$6&$U$5,H_productives[N°S]&H_productives[N°Mois],0),MATCH($U12,H_productives[#Headers],0))","v":17.5}]
[null,null,null,null,null,"CA/mois\nTOTAL",{"$f":"SUMIF(PDC_MARS[Plannifié et validé],\"ü\",PDC_MARS[CA])","v":0},null,null,null,null,null,null,null,null,null,null,"Heures prod.",{"$f":"SUM(Tps_travaillées_OCT381382385[[#Totals],[9]:[14]])","v":1216},null,"Poseur 7",{"$f":"INDEX(H_productives[],MATCH(V$6&$U$5,H_productives[N°S]&H_productives[N°Mois],0),MATCH($U13,H_productives[#Headers],0))","v":0},{"$f":"INDEX(H_productives[],MATCH(W$6&$U$5,H_productives[N°S]&H_productives[N°Mois],0),MATCH($U13,H_productives[#Headers],0))","v":35},{"$f":"INDEX(H_productives[],MATCH(X$6&$U$5,H_productives[N°S]&H_productives[N°Mois],0),MATCH($U13,H_productives[#Headers],0))","v":35},{"$f":"INDEX(H_productives[],MATCH(Y$6&$U$5,H_productives[N°S]&H_productives[N°Mois],0),MATCH($U13,H_productives[#Headers],0))","v":35},{"$f":"INDEX(H_productives[],MATCH(Z$6&$U$5,H_productives[N°S]&H_productives[N°Mois],0),MATCH($U13,H_productives[#Headers],0))","v":35},{"$f":"INDEX(H_productives[],MATCH(AA$6&$U$5,H_productives[N°S]&H_productives[N°Mois],0),MATCH($U13,H_productives[#Headers],0))","v":35}]
[null,null,null,null,null,null,null,null,null,null,null,null,null,null,null,null,null,"Heures prod. cumulées",{"$f":"S13+FEV!R14","v":5701.35},null,"Total",{"$f":"SUBTOTAL(109,Tps_travaillées_OCT381382385[9])","v":0},{"$f":"SUBTOTAL(109,Tps_travaillées_OCT381382385[10])","v":293},{"$f":"SUBTOTAL(109,Tps_travaillées_OCT381382385[11])","v":245},{"$f":"SUBTOTAL(109,Tps_travaillées_OCT381382385[12])","v":293},{"$f":"SUBTOTAL(109,Tps_travaillées_OCT381382385[13])","v":245},{"$f":"SUBTOTAL(109,Tps_travaillées_OCT381382385[14])","v":140}]
[null,null,null,null,null,null,null,null,null,null,null,null,null,null,null,null,null,null,null,null,-0.15,{"$f":"Tps_travaillées_OCT381382385[[#Totals],[9]]*$U$15","v":0},{"$f":"Tps_travaillées_OCT381382385[[#Totals],[10]]*$U$15","v":-43.949999999999996},{"$f":"Tps_travaillées_OCT381382385[[#Totals],[11]]*$U$15","v":-36.75},{"$f":"Tps_travaillées_OCT381382385[[#Totals],[12]]*$U$15","v":-43.949999999999996},{"$f":"Tps_travaillées_OCT381382385[[#Totals],[13]]*$U$15","v":-36.75},{"$f":"Tps_travaillées_OCT381382385[[#Totals],[14]]*$U$15","v":-21}]
[null,null,null,null,null,null,null,null,null,null,null,null,null,null,null,null,null,"Heures réelles réalisées",{"$f":"PDC_MARS[[#Totals],[H réelles réalisées]]","v":0},null,"Heure réelles travaillées",{"$f":"SUM(V14:V15)","v":0},249.05,208.25,249.05,208.25,119]
[null,null,null,null,null,null,null,null,null,null,null,null,null,null,null,null,null,"Heures réelles réalisées cumulées",{"$f":"S16+FEV!R17","v":0},null,"Soit en JOURS",{"$f":"V16/8.75","v":0},28.462857142857143,23.8,28.462857142857143,23.8,13.6]
[]
[null,null,null,null,null,null,null,null,null,null,null,null,null,null,null,null,null,"Moyenne CA/h estimatives",{"$f":"SUM(PDC_MARS[[#Totals],[CA]]/E10)","v":{"$error":"#DIV/0!"}}]
[null,null,null,null,null,null,null,null,null,null,null,null,null,null,null,null,null,"Moyenne CA/h réalisées",{"$f":"G13/PDC_MARS[[#Totals],[H réelles réalisées]]","v":{"$error":"#DIV/0!"}}]
[null,null,null,null,null,null,null,null,null,null,null,null,null,null,null,null,null,"Moyenne CA/h réalisées cumulées",{"$f":"S25/S17","v":{"$error":"#DIV/0!"}}]
[]
[null,null,null,null,null,null,null,null,null,null,null,null,null,null,null,null,null,"CA prévi. à poser au cours de l'année",{"$f":"PDC_MARS[[#Totals],[CA]]+AVRIL!R23","v":0}]
[null,null,null,null,null,null,null,null,null,null,null,null,null,null,null,null,null,"CA prévision cumulé",{"$f":"PDC_MARS[[#Totals],[CA]]+FEV!R24","v":0}]
[null,null,null,null,null,null,null,null,null,null,null,null,null,null,null,null,null,"CA réel cumulé",{"$f":"G13+FEV!R25","v":0}]

{"sheet":"AVRIL","index":6,"n_rows":25,"n_cols":25,"rows_kept":25,"cut":false,"hidden":false,"merged":[[5,16,5,17],[12,5,13,5],[12,6,13,14],[4,0,4,8],[0,0,0,14],[1,1,1,2],[10,5,10,8],[11,5,11,8],[1,4,1,5],[1,6,1,7],[1,8,1,9],[1,11,1,14]]}
[{"$f":"\"PLAN DE CHARGE DU MOIS D'AVRIL \"&'Fermetures & jours fériés'!D2","v":"PLAN DE CHARGE DU MOIS D'AVRIL 2020"},null,null,null,null,null,null,null,null,null,null,null,null,null,null,{"$f":"EDATE(MARS!R1,1)","v":"2020-04-01"},{"$f":"DATE('Fermetures & jours fériés'!D2,T5,1)","v":"2020-04-01"}]
["Légende :","Chantier fait",null,"Cellule à définir avec feuille de marge réelle","= H estimatives",null,"< H estimatives",null,"> H estimatives",null,"Pose prév. Impératif","Rechercher un client : Ctrl+F > Options > Dans \"Classeur\" > Décocher \"Totalité de la cellule\" > Entrer NOM"]
[null,null,null,null,null,null,null,null,null,14,{"$f":"IF(J3<52,J3+1,1)","v":15},{"$f":"IF(K3<52,K3+1,1)","v":16},17,18]
[null,null,null,null,null,null,null,null,null,{"$f":"IF(SUMIFS(PDC_AVRIL[H estimatives],PDC_AVRIL[Projet],\"BOZARC\",PDC_AVRIL[Pose prév. S],PDC_AVRIL[[#Headers],[14]])>87.5,\"Trop de BozArc prévu\",\"\")","v":""},{"$f":"IF(SUMIFS(PDC_AVRIL[H estimatives],PDC_AVRIL[Projet],\"BOZARC\",PDC_AVRIL[Pose prév. S],PDC_AVRIL[[#Headers],[15]])>70,\"Trop de BozArc prévu\",\"\")","v":""},{"$f":"IF(SUMIFS(PDC_AVRIL[H estimatives],PDC_AVRIL[Projet],\"BOZARC\",PDC_AVRIL[Pose prév. S],PDC_AVRIL[[#Headers],[16]])>87.5,\"Trop de BozArc prévu\",\"\")","v":""},{"$f":"IF(SUMIFS(PDC_AVRIL[H estimatives],PDC_AVRIL[Projet],\"BOZARC\",PDC_AVRIL[Pose prév. S],PDC_AVRIL[[#Headers],[17]])>70,\"Trop de BozArc prévu\",\"\")","v":""},{"$f":"IF(SUMIFS(PDC_AVRIL[H estimatives],PDC_AVRIL[Projet],\"BOZARC\",PDC_AVRIL[Pose prév. S],PDC_AVRIL[[#Headers],[18]])>87.5,\"Trop de BozArc prévu\",\"\")","v":""}]
[{"$f":"IF(OR(R7>=R13,R10>0),\"MOIS COMPLET - PLUS DE SAISIE\",\"\")","v":""},null,null,null,null,null,null,null,null,{"$f":"IF(SUMIF(PDC_AVRIL[Pose prév. S],PDC_AVRIL[[#Headers],[14]],PDC_AVRIL[H estimatives])>=U$16,\"Semaine complète\",\"\")","v":""},{"$f":"IF(SUMIF(PDC_AVRIL[Pose prév. S],PDC_AVRIL[[#Headers],[15]],PDC_AVRIL[H estimatives])>=V$16,\"Semaine complète\",\"\")","v":""},{"$f":"IF(SUMIF(PDC_AVRIL[Pose prév. S],PDC_AVRIL[[#Headers],[16]],PDC_AVRIL[H estimatives])>=W$16,\"Semaine complète\",\"\")","v":""},{"$f":"IF(SUMIF(PDC_AVRIL[Pose prév. S],PDC_AVRIL[[#Headers],[17]],PDC_AVRIL[H estimatives])>=X$16,\"Semaine complète\",\"\")","v":""},{"$f":"IF(SUMIF(PDC_AVRIL[Pose prév. S],PDC_AVRIL[[#Headers],[18]],PDC_AVRIL[H estimatives])>=Y$16,\"Semaine complète\",\"\")","v":""},"Décalage",null,null,null,null,{"$f":"MARS!U5+1","v":4}]
["Chantiers","Ccial","Projet","Ville","H estimatives","H réelles réalisées","CA","S de liv.","Pose prév. S","14","15","16","17","18","Plannifié et validé",null,"Indicateurs",null,null,"Éxécutants","14","15","16","17","18"]
[null,null,null,null,null,null,null,null,null,{"$f":"IF(PDC_AVRIL[[#This Row],[Pose prév. S]]=J$3,PDC_AVRIL[[#This Row],[CA]],\"\")","v":""},{"$f":"IF(PDC_AVRIL[[#This Row],[Pose prév. S]]=K$3,PDC_AVRIL[[#This Row],[CA]],\"\")","v":""},{"$f":"IF(PDC_AVRIL[[#This Row],[Pose prév. S]]=L$3,PDC_AVRIL[[#This Row],[CA]],\"\")","v":""},{"$f":"IF(PDC_AVRIL[[#This Row],[Pose prév. S]]=M$3,PDC_AVRIL[[#This Row],[CA]],\"\")","v":""},{"$f":"IF(PDC_AVRIL[[#This Row],[Pose prév. S]]=N$3,PDC_AVRIL[[#This Row],[CA]],\"\")","v":""},null,null,"Heures estimatives",{"$f":"PDC_AVRIL[[#Totals],[H estimatives]]","v":0},null,"Poseur 1",{"$f":"INDEX(H_productives[],MATCH(U$6&$T$5,H_productives[N°S]&H_productives[N°Mois],0),MATCH($T7,H_productives[#Headers],0))","v":25.5},{"$f":"INDEX(H_productives[],MATCH(V$6&$T$5,H_productives[N°S]&H_productives[N°Mois],0),MATCH($T7,H_productives[#Headers],0))","v":35},{"$f":"INDEX(H_productives[],MATCH(W$6&$T$5,H_productives[N°S]&H_productives[N°Mois],0),MATCH($T7,H_productives[#Headers],0))","v":34.25},{"$f":"INDEX(H_productives[],MATCH(X$6&$T$5,H_productives[N°S]&H_productives[N°Mois],0),MATCH($T7,H_productives[#Headers],0))","v":35},{"$f":"INDEX(H_productives[],MATCH(Y$6&$T$5,H_productives[N°S]&H_productives[N°Mois],0),MATCH($T7,H_productives[#Headers],0))","v":35}]
[null,null,null,null,null,null,null,null,null,{"$f":"IF(PDC_AVRIL[[#This Row],[Pose prév. S]]=J$3,PDC_AVRIL[[#This Row],[CA]],\"\")","v":""},{"$f":"IF(PDC_AVRIL[[#This Row],[Pose prév. S]]=K$3,PDC_AVRIL[[#This Row],[CA]],\"\")","v":""},{"$f":"IF(PDC_AVRIL[[#This Row],[Pose prév. S]]=L$3,PDC_AVRIL[[#This Row],[CA]],\"\")","v":""},{"$f":"IF(PDC_AVRIL[[#This Row],[Pose prév. S]]=M$3,PDC_AVRIL[[#This Row],[CA]],\"\")","v":""},{"$f":"IF(PDC_AVRIL[[#This Row],[Pose prév. S]]=N$3,PDC_AVRIL[[#This Row],[CA]],\"\")","v":""},null,null,"Heures estimatives cumulées",{"$f":"R7+MARS!S8","v":0},null,"Poseur 2",{"$f":"INDEX(H_productives[],MATCH(U$6&$T$5,H_productives[N°S]&H_productives[N°Mois],0),MATCH($T8,H_productives[#Headers],0))","v":25.5},{"$f":"INDEX(H_productives[],MATCH(V$6&$T$5,H_productives[N°S]&H_productives[N°Mois],0),MATCH($T8,H_productives[#Headers],0))","v":35},{"$f":"INDEX(H_productives[],MATCH(W$6&$T$5,H_productives[N°S]&H_productives[N°Mois],0),MATCH($T8,H_productives[#Headers],0))","v":34.25},{"$f":"INDEX(H_productives[],MATCH(X$6&$T$5,H_productives[N°S]&H_productives[N°Mois],0),MATCH($T8,H_productives[#Headers],0))","v":35},{"$f":"INDEX(H_productives[],MATCH(Y$6&$T$5,H_productives[N°S]&H_productives[N°Mois],0),MATCH($T8,H_productives[#Headers],0))","v":35}]
[null,null,null,null,null,null,null,null,null,{"$f":"IF(PDC_AVRIL[[#This Row],[Pose prév. S]]=J$3,PDC_AVRIL[[#This Row],[CA]],\"\")","v":""},{"$f":"IF(PDC_AVRIL[[#This Row],[Pose prév. S]]=K$3,PDC_AVRIL[[#This Row],[CA]],\"\")","v":""},{"$f":"IF(PDC_AVRIL[[#This Row],[Pose prév. S]]=L$3,PDC_AVRIL[[#This Row],[CA]],\"\")","v":""},{"$f":"IF(PDC_AVRIL[[#This Row],[Pose prév. S]]=M$3,PDC_AVRIL[[#This Row],[CA]],\"\")","v":""},{"$f":"IF(PDC_AVRIL[[#This Row],[Pose prév. S]]=N$3,PDC_AVRIL[[#This Row],[CA]],\"\")","v":""},null,null,null,null,null,"Poseur 3",{"$f":"INDEX(H_productives[],MATCH(U$6&$T$5,H_productives[N°S]&H_productives[N°Mois],0),MATCH($T9,H_productives[#Headers],0))","v":25.5},{"$f":"INDEX(H_productives[],MATCH(V$6&$T$5,H_productives[N°S]&H_productives[N°Mois],0),MATCH($T9,H_productives[#Headers],0))","v":35},{"$f":"INDEX(H_productives[],MATCH(W$6&$T$5,H_productives[N°S]&H_productives[N°Mois],0),MATCH($T9,H_productives[#Headers],0))","v":34.25},{"$f":"INDEX(H_productives[],MATCH(X$6&$T$5,H_productives[N°S]&H_productives[N°Mois],0),MATCH($T9,H_productives[#Headers],0))","v":35},{"$f":"INDEX(H_productives[],MATCH(Y$6&$T$5,H_productives[N°S]&H_productives[N°Mois],0),MATCH($T9,H_productives[#Headers],0))","v":35}]
[{"$f":"SUBTOTAL(103,PDC_AVRIL[Chantiers])","v":0},null,null,null,{"$f":"SUBTOTAL(109,PDC_AVRIL[H estimatives])","v":0},{"$f":"SUBTOTAL(109,PDC_AVRIL[H réelles réalisées])","v":0},{"$f":"SUBTOTAL(109,PDC_AVRIL[CA])","v":0},null,null,null,null,null,null,null,null,null,"Heures en surplus (à décaler)",{"$f":"IF(TODAY()<=Q1,IF(MARS!S10>0,IF((R7+MARS!S10)>R13,(R7+MARS!S10)-R13,0),IF(R7>R13,R7-R13,0)),IF(R7>R13,R7-R13,0))","v":0},null,"Poseur 4",{"$f":"INDEX(H_productives[],MATCH(U$6&$T$5,H_productives[N°S]&H_productives[N°Mois],0),MATCH($T10,H_productives[#Headers],0))","v":25.5},{"$f":"INDEX(H_productives[],MATCH(V$6&$T$5,H_productives[N°S]&H_productives[N°Mois],0),MATCH($T10,H_productives[#Headers],0))","v":35},{"$f":"INDEX(H_productives[],MATCH(W$6&$T$5,H_productives[N°S]&H_productives[N°Mois],0),MATCH($T10,H_productives[#Headers],0))","v":34.25},{"$f":"INDEX(H_productives[],MATCH(X$6&$T$5,H_productives[N°S]&H_productives[N°Mois],0),MATCH($T10,H_productives[#Headers],0))","v":35},{"$f":"INDEX(H_productives[],MATCH(Y$6&$T$5,H_productives[N°S]&H_productives[N°Mois],0),MATCH($T10,H_productives[#Headers],0))","v":35}]
[null,null,null,null,null,"Nombre d'h prévues :",null,null,null,{"$f":"SUMIF(PDC_AVRIL[Pose prév. S],PDC_AVRIL[[#Headers],[14]],PDC_AVRIL[H estimatives])","v":0},{"$f":"SUMIF(PDC_AVRIL[Pose prév. S],PDC_AVRIL[[#Headers],[15]],PDC_AVRIL[H estimatives])","v":0},{"$f":"SUMIF(PDC_AVRIL[Pose prév. S],PDC_AVRIL[[#Headers],[16]],PDC_AVRIL[H estimatives])","v":0},{"$f":"SUMIF(PDC_AVRIL[Pose prév. S],PDC_AVRIL[[#Headers],[17]],PDC_AVRIL[H estimatives])","v":0},{"$f":"SUMIF(PDC_AVRIL[Pose prév. S],PDC_AVRIL[[#Headers],[18]],PDC_AVRIL[H estimatives])","v":0},null,null,"Heures restantes",{"$f":"IF(R10=0,IF(TODAY()<=Q1,R13-(R7+MARS!S10),R13-R7),0)","v":1156.5},null,"Poseur 5",{"$f":"INDEX(H_productives[],MATCH(U$6&$T$5,H_productives[N°S]&H_productives[N°Mois],0),MATCH($T11,H_productives[#Headers],0))","v":25.5},{"$f":"INDEX(H_productives[],MATCH(V$6&$T$5,H_productives[N°S]&H_productives[N°Mois],0),MATCH($T11,H_productives[#Headers],0))","v":35},{"$f":"INDEX(H_productives[],MATCH(W$6&$T$5,H_productives[N°S]&H_productives[N°Mois],0),MATCH($T11,H_productives[#Headers],0))","v":34.25},{"$f":"INDEX(H_productives[],MATCH(X$6&$T$5,H_productives[N°S]&H_productives[N°Mois],0),MATCH($T11,H_productives[#Headers],0))","v":35},{"$f":"INDEX(H_productives[],MATCH(Y$6&$T$5,H_productives[N°S]&H_productives[N°Mois],0),MATCH($T11,H_productives[#Headers],0))","v":35}]
[null,null,null,null,null,"Différence d'h (H prévues - H prod.) :",null,null,null,{"$f":"J11-U16","v":-150.44999999999999},{"$f":"K11-V16","v":-212.5},{"$f":"L11-W16","v":-201.875},{"$f":"M11-X16","v":-212.5},{"$f":"N11-Y16","v":-205.7},null,null,null,null,null,"Poseur 6",{"$f":"INDEX(H_productives[],MATCH(U$6&$T$5,H_productives[N°S]&H_productives[N°Mois],0),MATCH($T12,H_productives[#Headers],0))","v":25.5},{"$f":"INDEX(H_productives[],MATCH(V$6&$T$5,H_productives[N°S]&H_productives[N°Mois],0),MATCH($T12,H_productives[#Headers],0))","v":35},{"$f":"INDEX(H_productives[],MATCH(W$6&$T$5,H_productives[N°S]&H_productives[N°Mois],0),MATCH($T12,H_productives[#Headers],0))","v":34.25},{"$f":"INDEX(H_productives[],MATCH(X$6&$T$5,H_productives[N°S]&H_productives[N°Mois],0),MATCH($T12,H_productives[#Headers],0))","v":35},{"$f":"INDEX(H_productives[],MATCH(Y$6&$T$5,H_productives[N°S]&H_productives[N°Mois],0),MATCH($T12,H_productives[#Headers],0))","v":35}]
[null,null,null,null,null,"CA/mois\nTOTAL",{"$f":"SUMIF(PDC_AVRIL[Plannifié et validé],\"ü\",PDC_AVRIL[CA])","v":0},null,null,null,null,null,null,null,null,null,"Heures prod.",{"$f":"SUM(Tps_travaillées_OCT384386[[#Totals],[14]:[18]])","v":1156.5},null,"Poseur 7",{"$f":"INDEX(H_productives[],MATCH(U$6&$T$5,H_productives[N°S]&H_productives[N°Mois],0),MATCH($T13,H_productives[#Headers],0))","v":24},{"$f":"INDEX(H_productives[],MATCH(V$6&$T$5,H_productives[N°S]&H_productives[N°Mois],0),MATCH($T13,H_productives[#Headers],0))","v":40},{"$f":"INDEX(H_productives[],MATCH(W$6&$T$5,H_productives[N°S]&H_productives[N°Mois],0),MATCH($T13,H_productives[#Headers],0))","v":32},{"$f":"INDEX(H_productives[],MATCH(X$6&$T$5,H_productives[N°S]&H_productives[N°Mois],0),MATCH($T13,H_productives[#Headers],0))","v":40},{"$f":"INDEX(H_productives[],MATCH(Y$6&$T$5,H_productives[N°S]&H_productives[N°Mois],0),MATCH($T13,H_productives[#Headers],0))","v":32}]
[null,null,null,null,null,null,null,null,null,null,null,null,null,null,null,null,"Heures prod. cumulées",{"$f":"R13+MARS!S14","v":6857.85},null,"Total",{"$f":"SUBTOTAL(109,Tps_travaillées_OCT384386[14])","v":177},{"$f":"SUBTOTAL(109,Tps_travaillées_OCT384386[15])","v":250},{"$f":"SUBTOTAL(109,Tps_travaillées_OCT384386[16])","v":237.5},{"$f":"SUBTOTAL(109,Tps_travaillées_OCT384386[17])","v":250},{"$f":"SUBTOTAL(109,Tps_travaillées_OCT384386[18])","v":242}]
[null,null,null,null,null,null,null,null,null,null,null,null,null,null,null,null,null,null,null,-0.15,{"$f":"Tps_travaillées_OCT384386[[#Totals],[14]]*$T$15","v":-26.55},{"$f":"Tps_travaillées_OCT384386[[#Totals],[15]]*$T$15","v":-37.5},{"$f":"Tps_travaillées_OCT384386[[#Totals],[16]]*$T$15","v":-35.625},{"$f":"Tps_travaillées_OCT384386[[#Totals],[17]]*$T$15","v":-37.5},{"$f":"Tps_travaillées_OCT384386[[#Totals],[18]]*$T$15","v":-36.299999999999997}]
[null,null,null,null,null,null,null,null,null,null,null,null,null,null,null,null,"Heures réelles réalisées",{"$f":"PDC_AVRIL[[#Totals],[H réelles réalisées]]","v":0},null,"Heure réelles travaillées",{"$f":"SUM(U14:U15)","v":150.44999999999999},{"$f":"SUM(V14:V15)","v":212.5},{"$f":"SUM(W14:W15)","v":201.875},{"$f":"SUM(X14:X15)","v":212.5},{"$f":"SUM(Y14:Y15)","v":205.7}]
[null,null,null,null,null,null,null,null,null,null,null,null,null,null,null,null,"Heures réelles réalisées cumulées",{"$f":"R16+MARS!S17","v":0},null,"Soit en JOURS",{"$f":"U16/8.75","v":17.194285714285712},{"$f":"V16/8.75","v":24.285714285714285},{"$f":"W16/8.75","v":23.071428571428573},{"$f":"X16/8.75","v":24.285714285714285},{"$f":"Y16/8.75","v":23.508571428571429}]
[]
[null,null,null,null,null,null,null,null,null,null,null,null,null,null,null,null,"Moyenne CA/h estimatives",{"$f":"SUM(PDC_AVRIL[[#Totals],[CA]]/E10)","v":{"$error":"#DIV/0!"}}]
[null,null,null,null,null,null,null,null,null,null,null,null,null,null,null,null,"Moyenne CA/h réalisées",{"$f":"G13/PDC_AVRIL[[#Totals],[H réelles réalisées]]","v":{"$error":"#DIV/0!"}}]
[null,null,null,null,null,null,null,null,null,null,null,null,null,null,null,null,"Moyenne CA/h réalisées cumulées",{"$f":"R25/R17","v":{"$error":"#DIV/0!"}}]
[]
[null,null,null,null,null,null,null,null,null,null,null,null,null,null,null,null,"CA prévi. à poser au cours de l'année",{"$f":"PDC_AVRIL[[#Totals],[CA]]+MAI!R23","v":0}]
[null,null,null,null,null,null,null,null,null,null,null,null,null,null,null,null,"CA prévision cumulé",{"$f":"PDC_AVRIL[[#Totals],[CA]]+MARS!S24","v":0}]
[null,null,null,null,null,null,null,null,null,null,null,null,null,null,null,null,"CA réel cumulé",{"$f":"G13+MARS!S25","v":0}]

{"sheet":"MAI","index":7,"n_rows":25,"n_cols":25,"rows_kept":25,"cut":false,"hidden":false,"merged":[[5,16,5,17],[12,5,13,5],[12,6,13,14],[4,0,4,8],[0,0,0,14],[1,1,1,2],[10,5,10,8],[11,5,11,8],[1,4,1,5],[1,6,1,7],[1,8,1,9],[1,11,1,14]]}
[{"$f":"\"PLAN DE CHARGE DU MOIS DE MAI \"&'Fermetures & jours fériés'!D2","v":"PLAN DE CHARGE DU MOIS DE MAI 2020"},null,null,null,null,null,null,null,null,null,null,null,null,null,null,{"$f":"EDATE(AVRIL!P1,1)","v":"2020-05-01"},{"$f":"DATE('Fermetures & jours fériés'!D2,T5,1)","v":"2020-05-01"}]
["Légende :","Chantier fait",null,"Cellule à définir avec feuille de marge réelle","= H estimatives",null,"< H estimatives",null,"> H estimatives",null,"Pose prév. Impératif","Rechercher un client : Ctrl+F > Options > Dans \"Classeur\" > Décocher \"Totalité de la cellule\" > Entrer NOM"]
[null,null,null,null,null,null,null,null,null,18,{"$f":"IF(J3<52,J3+1,1)","v":19},{"$f":"IF(K3<52,K3+1,1)","v":20},21,22]
[null,null,null,null,null,null,null,null,null,{"$f":"IF(SUMIFS(PDC_MAI[H estimatives],PDC_MAI[Projet],\"BOZARC\",PDC_MAI[Pose prév. S],PDC_MAI[[#Headers],[18]])>87.5,\"Trop de BozArc prévu\",\"\")","v":""},{"$f":"IF(SUMIFS(PDC_MAI[H estimatives],PDC_MAI[Projet],\"BOZARC\",PDC_MAI[Pose prév. S],PDC_MAI[[#Headers],[19]])>70,\"Trop de BozArc prévu\",\"\")","v":""},{"$f":"IF(SUMIFS(PDC_MAI[H estimatives],PDC_MAI[Projet],\"BOZARC\",PDC_MAI[Pose prév. S],PDC_MAI[[#Headers],[20]])>87.5,\"Trop de BozArc prévu\",\"\")","v":""},{"$f":"IF(SUMIFS(PDC_MAI[H estimatives],PDC_MAI[Projet],\"BOZARC\",PDC_MAI[Pose prév. S],PDC_MAI[[#Headers],[21]])>70,\"Trop de BozArc prévu\",\"\")","v":""},{"$f":"IF(SUMIFS(PDC_MAI[H estimatives],PDC_MAI[Projet],\"BOZARC\",PDC_MAI[Pose prév. S],PDC_MAI[[#Headers],[22]])>87.5,\"Trop de BozArc prévu\",\"\")","v":""}]
[{"$f":"IF(OR(R7>=R13,R10>0),\"MOIS COMPLET - PLUS DE SAISIE\",\"\")","v":""},null,null,null,null,null,null,null,null,{"$f":"IF(SUMIF(PDC_MAI[Pose prév. S],PDC_MAI[[#Headers],[18]],PDC_MAI[H estimatives])>=U$16,\"Semaine complète\",\"\")","v":"Semaine complète"},{"$f":"IF(SUMIF(PDC_MAI[Pose prév. S],PDC_MAI[[#Headers],[19]],PDC_MAI[H estimatives])>=V$16,\"Semaine complète\",\"\")","v":""},{"$f":"IF(SUMIF(PDC_MAI[Pose prév. S],PDC_MAI[[#Headers],[20]],PDC_MAI[H estimatives])>=W$16,\"Semaine complète\",\"\")","v":""},{"$f":"IF(SUMIF(PDC_MAI[Pose prév. S],PDC_MAI[[#Headers],[21]],PDC_MAI[H estimatives])>=X$16,\"Semaine complète\",\"\")","v":""},{"$f":"IF(SUMIF(PDC_MAI[Pose prév. S],PDC_MAI[[#Headers],[22]],PDC_MAI[H estimatives])>=Y$16,\"Semaine complète\",\"\")","v":""},"Décalage",null,null,null,null,{"$f":"AVRIL!T5+1","v":5}]
["Chantiers","Ccial","Projet","Ville","H estimatives","H réelles réalisées","CA","S de liv.","Pose prév. S","18","19","20","21","22","Plannifié et validé",null,"Indicateurs",null,null,"Éxécutants","18","19","20","21","22"]
[null,null,null,null,null,null,null,null,null,{"$f":"IF(PDC_MAI[[#This Row],[Pose prév. S]]=J$3,PDC_MAI[[#This Row],[CA]],\"\")","v":""},{"$f":"IF(PDC_MAI[[#This Row],[Pose prév. S]]=K$3,PDC_MAI[[#This Row],[CA]],\"\")","v":""},{"$f":"IF(PDC_MAI[[#This Row],[Pose prév. S]]=L$3,PDC_MAI[[#This Row],[CA]],\"\")","v":""},{"$f":"IF(PDC_MAI[[#This Row],[Pose prév. S]]=M$3,PDC_MAI[[#This Row],[CA]],\"\")","v":""},{"$f":"IF(PDC_MAI[[#This Row],[Pose prév. S]]=N$3,PDC_MAI[[#This Row],[CA]],\"\")","v":""},null,null,"Heures estimatives",{"$f":"PDC_MAI[[#Totals],[H estimatives]]","v":0},null,"Poseur 1",{"$f":"INDEX(H_productives[],MATCH(U$6&$T$5,H_productives[N°S]&H_productives[N°Mois],0),MATCH($T7,H_productives[#Headers],0))","v":0},{"$f":"INDEX(H_productives[],MATCH(V$6&$T$5,H_productives[N°S]&H_productives[N°Mois],0),MATCH($T7,H_productives[#Headers],0))","v":35},{"$f":"INDEX(H_productives[],MATCH(W$6&$T$5,H_productives[N°S]&H_productives[N°Mois],0),MATCH($T7,H_productives[#Headers],0))","v":43},{"$f":"INDEX(H_productives[],MATCH(X$6&$T$5,H_productives[N°S]&H_productives[N°Mois],0),MATCH($T7,H_productives[#Headers],0))","v":26.25},{"$f":"INDEX(H_productives[],MATCH(Y$6&$T$5,H_productives[N°S]&H_productives[N°Mois],0),MATCH($T7,H_productives[#Headers],0))","v":43}]
[null,null,null,null,null,null,null,null,null,{"$f":"IF(PDC_MAI[[#This Row],[Pose prév. S]]=J$3,PDC_MAI[[#This Row],[CA]],\"\")","v":""},{"$f":"IF(PDC_MAI[[#This Row],[Pose prév. S]]=K$3,PDC_MAI[[#This Row],[CA]],\"\")","v":""},{"$f":"IF(PDC_MAI[[#This Row],[Pose prév. S]]=L$3,PDC_MAI[[#This Row],[CA]],\"\")","v":""},{"$f":"IF(PDC_MAI[[#This Row],[Pose prév. S]]=M$3,PDC_MAI[[#This Row],[CA]],\"\")","v":""},{"$f":"IF(PDC_MAI[[#This Row],[Pose prév. S]]=N$3,PDC_MAI[[#This Row],[CA]],\"\")","v":""},null,null,"Heures estimatives cumulées",{"$f":"R7+AVRIL!R8","v":0},null,"Poseur 2",{"$f":"INDEX(H_productives[],MATCH(U$6&$T$5,H_productives[N°S]&H_productives[N°Mois],0),MATCH($T8,H_productives[#Headers],0))","v":0},{"$f":"INDEX(H_productives[],MATCH(V$6&$T$5,H_productives[N°S]&H_productives[N°Mois],0),MATCH($T8,H_productives[#Headers],0))","v":35},{"$f":"INDEX(H_productives[],MATCH(W$6&$T$5,H_productives[N°S]&H_productives[N°Mois],0),MATCH($T8,H_productives[#Headers],0))","v":43},{"$f":"INDEX(H_productives[],MATCH(X$6&$T$5,H_productives[N°S]&H_productives[N°Mois],0),MATCH($T8,H_productives[#Headers],0))","v":26.25},{"$f":"INDEX(H_productives[],MATCH(Y$6&$T$5,H_productives[N°S]&H_productives[N°Mois],0),MATCH($T8,H_productives[#Headers],0))","v":43}]
[null,null,null,null,null,null,null,null,null,{"$f":"IF(PDC_MAI[[#This Row],[Pose prév. S]]=J$3,PDC_MAI[[#This Row],[CA]],\"\")","v":""},{"$f":"IF(PDC_MAI[[#This Row],[Pose prév. S]]=K$3,PDC_MAI[[#This Row],[CA]],\"\")","v":""},{"$f":"IF(PDC_MAI[[#This Row],[Pose prév. S]]=L$3,PDC_MAI[[#This Row],[CA]],\"\")","v":""},{"$f":"IF(PDC_MAI[[#This Row],[Pose prév. S]]=M$3,PDC_MAI[[#This Row],[CA]],\"\")","v":""},{"$f":"IF(PDC_MAI[[#This Row],[Pose prév. S]]=N$3,PDC_MAI[[#This Row],[CA]],\"\")","v":""},null,null,null,null,null,"Poseur 3",{"$f":"INDEX(H_productives[],MATCH(U$6&$T$5,H_productives[N°S]&H_productives[N°Mois],0),MATCH($T9,H_productives[#Headers],0))","v":0},{"$f":"INDEX(H_productives[],MATCH(V$6&$T$5,H_productives[N°S]&H_productives[N°Mois],0),MATCH($T9,H_productives[#Headers],0))","v":35},{"$f":"INDEX(H_productives[],MATCH(W$6&$T$5,H_productives[N°S]&H_productives[N°Mois],0),MATCH($T9,H_productives[#Headers],0))","v":43},{"$f":"INDEX(H_productives[],MATCH(X$6&$T$5,H_productives[N°S]&H_productives[N°Mois],0),MATCH($T9,H_productives[#Headers],0))","v":26.25},{"$f":"INDEX(H_productives[],MATCH(Y$6&$T$5,H_productives[N°S]&H_productives[N°Mois],0),MATCH($T9,H_productives[#Headers],0))","v":43}]
[{"$f":"SUBTOTAL(103,PDC_MAI[Chantiers])","v":0},null,null,null,{"$f":"SUBTOTAL(109,PDC_MAI[H estimatives])","v":0},{"$f":"SUBTOTAL(109,PDC_MAI[H réelles réalisées])","v":0},{"$f":"SUBTOTAL(109,PDC_MAI[CA])","v":0},null,null,null,null,null,null,null,null,null,"Heures en surplus (à décaler)",{"$f":"IF(TODAY()<=Q1,IF(AVRIL!R10>0,IF((R7+AVRIL!R10)>R13,(R7+AVRIL!R10)-R13,0),IF(R7>R13,R7-R13,0)),IF(R7>R13,R7-R13,0))","v":0},null,"Poseur 4",{"$f":"INDEX(H_productives[],MATCH(U$6&$T$5,H_productives[N°S]&H_productives[N°Mois],0),MATCH($T10,H_productives[#Headers],0))","v":0},{"$f":"INDEX(H_productives[],MATCH(V$6&$T$5,H_productives[N°S]&H_productives[N°Mois],0),MATCH($T10,H_productives[#Headers],0))","v":35},{"$f":"INDEX(H_productives[],MATCH(W$6&$T$5,H_productives[N°S]&H_productives[N°Mois],0),MATCH($T10,H_productives[#Headers],0))","v":43},{"$f":"INDEX(H_productives[],MATCH(X$6&$T$5,H_productives[N°S]&H_productives[N°Mois],0),MATCH($T10,H_productives[#Headers],0))","v":26.25},{"$f":"INDEX(H_productives[],MATCH(Y$6&$T$5,H_productives[N°S]&H_productives[N°Mois],0),MATCH($T10,H_productives[#Headers],0))","v":43}]
[null,null,null,null,null,"Nombre d'h prévues :",null,null,null,{"$f":"SUMIF(PDC_MAI[Pose prév. S],PDC_MAI[[#Headers],[18]],PDC_MAI[H estimatives])","v":0},{"$f":"SUMIF(PDC_MAI[Pose prév. S],PDC_MAI[[#Headers],[19]],PDC_MAI[H estimatives])","v":0},{"$f":"SUMIF(PDC_MAI[Pose prév. S],PDC_MAI[[#Headers],[20]],PDC_MAI[H estimatives])","v":0},{"$f":"SUMIF(PDC_MAI[Pose prév. S],PDC_MAI[[#Headers],[21]],PDC_MAI[H estimatives])","v":0},{"$f":"SUMIF(PDC_MAI[Pose prév. S],PDC_MAI[[#Headers],[22]],PDC_MAI[H estimatives])","v":0},null,null,"Heures restantes",{"$f":"IF(R10=0,IF(TODAY()<=Q1,R13-(R7+AVRIL!R10),R13-R7),0)","v":1035.5},null,"Poseur 5",{"$f":"INDEX(H_productives[],MATCH(U$6&$T$5,H_productives[N°S]&H_productives[N°Mois],0),MATCH($T11,H_productives[#Headers],0))","v":0},{"$f":"INDEX(H_productives[],MATCH(V$6&$T$5,H_productives[N°S]&H_productives[N°Mois],0),MATCH($T11,H_productives[#Headers],0))","v":35},{"$f":"INDEX(H_productives[],MATCH(W$6&$T$5,H_productives[N°S]&H_productives[N°Mois],0),MATCH($T11,H_productives[#Headers],0))","v":43},{"$f":"INDEX(H_productives[],MATCH(X$6&$T$5,H_productives[N°S]&H_productives[N°Mois],0),MATCH($T11,H_productives[#Headers],0))","v":26.25},{"$f":"INDEX(H_productives[],MATCH(Y$6&$T$5,H_productives[N°S]&H_productives[N°Mois],0),MATCH($T11,H_productives[#Headers],0))","v":43}]
[null,null,null,null,null,"Différence d'h (H prévues - H prod.) :",null,null,null,{"$f":"J11-U16","v":0},{"$f":"K11-V16","v":-212.5},{"$f":"L11-W16","v":-253.3},{"$f":"M11-X16","v":-161.07499999999999},{"$f":"N11-Y16","v":-253.3},null,null,null,null,null,"Poseur 6",{"$f":"INDEX(H_productives[],MATCH(U$6&$T$5,H_productives[N°S]&H_productives[N°Mois],0),MATCH($T12,H_productives[#Headers],0))","v":0},{"$f":"INDEX(H_productives[],MATCH(V$6&$T$5,H_productives[N°S]&H_productives[N°Mois],0),MATCH($T12,H_productives[#Headers],0))","v":35},{"$f":"INDEX(H_productives[],MATCH(W$6&$T$5,H_productives[N°S]&H_productives[N°Mois],0),MATCH($T12,H_productives[#Headers],0))","v":43},{"$f":"INDEX(H_productives[],MATCH(X$6&$T$5,H_productives[N°S]&H_productives[N°Mois],0),MATCH($T12,H_productives[#Headers],0))","v":26.25},{"$f":"INDEX(H_productives[],MATCH(Y$6&$T$5,H_productives[N°S]&H_productives[N°Mois],0),MATCH($T12,H_productives[#Headers],0))","v":43}]
[null,null,null,null,null,"CA/mois\nTOTAL",{"$f":"SUMIF(PDC_MAI[Plannifié et validé],\"ü\",PDC_MAI[CA])","v":0},null,null,null,null,null,null,null,null,null,"Heures prod.",{"$f":"SUM(Tps_travaillées_OCT384386387[[#Totals],[18]:[22]])","v":1035.5},null,"Poseur 7",{"$f":"INDEX(H_productives[],MATCH(U$6&$T$5,H_productives[N°S]&H_productives[N°Mois],0),MATCH($T13,H_productives[#Headers],0))","v":0},{"$f":"INDEX(H_productives[],MATCH(V$6&$T$5,H_productives[N°S]&H_productives[N°Mois],0),MATCH($T13,H_productives[#Headers],0))","v":40},{"$f":"INDEX(H_productives[],MATCH(W$6&$T$5,H_productives[N°S]&H_productives[N°Mois],0),MATCH($T13,H_productives[#Headers],0))","v":40},{"$f":"INDEX(H_productives[],MATCH(X$6&$T$5,H_productives[N°S]&H_productives[N°Mois],0),MATCH($T13,H_productives[#Headers],0))","v":32},{"$f":"INDEX(H_productives[],MATCH(Y$6&$T$5,H_productives[N°S]&H_productives[N°Mois],0),MATCH($T13,H_productives[#Headers],0))","v":40}]
[null,null,null,null,null,null,null,null,null,null,null,null,null,null,null,null,"Heures prod. cumulées",{"$f":"R13+AVRIL!R14","v":7893.35},null,"Total",{"$f":"SUBTOTAL(109,Tps_travaillées_OCT384386387[18])","v":0},{"$f":"SUBTOTAL(109,Tps_travaillées_OCT384386387[19])","v":250},{"$f":"SUBTOTAL(109,Tps_travaillées_OCT384386387[20])","v":298},{"$f":"SUBTOTAL(109,Tps_travaillées_OCT384386387[21])","v":189.5},{"$f":"SUBTOTAL(109,Tps_travaillées_OCT384386387[22])","v":298}]
[null,null,null,null,null,null,null,null,null,null,null,null,null,null,null,null,null,null,null,-0.15,{"$f":"Tps_travaillées_OCT384386387[[#Totals],[18]]*$T$15","v":0},{"$f":"Tps_travaillées_OCT384386387[[#Totals],[19]]*$T$15","v":-37.5},{"$f":"Tps_travaillées_OCT384386387[[#Totals],[20]]*$T$15","v":-44.699999999999996},{"$f":"Tps_travaillées_OCT384386387[[#Totals],[21]]*$T$15","v":-28.425000000000001},{"$f":"Tps_travaillées_OCT384386387[[#Totals],[22]]*$T$15","v":-44.699999999999996}]
[null,null,null,null,null,null,null,null,null,null,null,null,null,null,null,null,"Heures réelles réalisées",{"$f":"PDC_MAI[[#Totals],[H réelles réalisées]]","v":0},null,"Heure réelles travaillées",{"$f":"SUM(U14:U15)","v":0},{"$f":"SUM(V14:V15)","v":212.5},{"$f":"SUM(W14:W15)","v":253.3},{"$f":"SUM(X14:X15)","v":161.07499999999999},{"$f":"SUM(Y14:Y15)","v":253.3}]
[null,null,null,null,null,null,null,null,null,null,null,null,null,null,null,null,"Heures réelles réalisées cumulées",{"$f":"R16+AVRIL!R17","v":0},null,"Soit en JOURS",{"$f":"U16/8.75","v":0},{"$f":"V16/8.75","v":24.285714285714285},{"$f":"W16/8.75","v":28.94857142857143},{"$f":"X16/8.75","v":18.408571428571427},{"$f":"Y16/8.75","v":28.94857142857143}]
[]
[null,null,null,null,null,null,null,null,null,null,null,null,null,null,null,null,"Moyenne CA/h estimatives",{"$f":"SUM(PDC_MAI[[#Totals],[CA]]/E10)","v":{"$error":"#DIV/0!"}}]
[null,null,null,null,null,null,null,null,null,null,null,null,null,null,null,null,"Moyenne CA/h réalisées",{"$f":"G13/PDC_MAI[[#Totals],[H réelles réalisées]]","v":{"$error":"#DIV/0!"}}]
[null,null,null,null,null,null,null,null,null,null,null,null,null,null,null,null,"Moyenne CA/h réalisées cumulées",{"$f":"R25/R17","v":{"$error":"#DIV/0!"}}]
[]
[null,null,null,null,null,null,null,null,null,null,null,null,null,null,null,null,"CA prévi. à poser au cours de l'année",{"$f":"PDC_MAI[[#Totals],[CA]]+JUIN!R23","v":0}]
[null,null,null,null,null,null,null,null,null,null,null,null,null,null,null,null,"CA prévision cumulé",{"$f":"PDC_MAI[[#Totals],[CA]]+AVRIL!R24","v":0}]
[null,null,null,null,null,null,null,null,null,null,null,null,null,null,null,null,"CA réel cumulé",{"$f":"G13+AVRIL!R25","v":0}]

{"sheet":"JUIN","index":8,"n_rows":25,"n_cols":25,"rows_kept":25,"cut":false,"hidden":false,"merged":[[5,16,5,17],[12,5,13,5],[12,6,13,14],[4,0,4,8],[0,0,0,14],[1,1,1,2],[10,5,10,8],[11,5,11,8],[1,4,1,5],[1,6,1,7],[1,8,1,9],[1,11,1,14]]}
[{"$f":"\"PLAN DE CHARGE DU MOIS DE JUIN \"&'Fermetures & jours fériés'!D2","v":"PLAN DE CHARGE DU MOIS DE JUIN 2020"},null,null,null,null,null,null,null,null,null,null,null,null,null,null,{"$f":"EDATE(MAI!P1,1)","v":"2020-06-01"},{"$f":"DATE('Fermetures & jours fériés'!D2,T5,1)","v":"2020-06-01"}]
["Légende :","Chantier fait",null,"Cellule à définir avec feuille de marge réelle","= H estimatives",null,"< H estimatives",null,"> H estimatives",null,"Pose prév. Impératif","Rechercher un client : Ctrl+F > Options > Dans \"Classeur\" > Décocher \"Totalité de la cellule\" > Entrer NOM"]
[null,null,null,null,null,null,null,null,null,23,{"$f":"IF(J3<52,J3+1,1)","v":24},{"$f":"IF(K3<52,K3+1,1)","v":25},26,27]
[null,null,null,null,null,null,null,null,null,{"$f":"IF(SUMIFS(PDC_JUIN[H estimatives],PDC_JUIN[Projet],\"BOZARC\",PDC_JUIN[Pose prév. S],PDC_JUIN[[#Headers],[23]])>70,\"Trop de BozArc prévu\",\"\")","v":""},{"$f":"IF(SUMIFS(PDC_JUIN[H estimatives],PDC_JUIN[Projet],\"BOZARC\",PDC_JUIN[Pose prév. S],PDC_JUIN[[#Headers],[24]])>87.5,\"Trop de BozArc prévu\",\"\")","v":""},{"$f":"IF(SUMIFS(PDC_JUIN[H estimatives],PDC_JUIN[Projet],\"BOZARC\",PDC_JUIN[Pose prév. S],PDC_JUIN[[#Headers],[25]])>70,\"Trop de BozArc prévu\",\"\")","v":""},{"$f":"IF(SUMIFS(PDC_JUIN[H estimatives],PDC_JUIN[Projet],\"BOZARC\",PDC_JUIN[Pose prév. S],PDC_JUIN[[#Headers],[26]])>87.5,\"Trop de BozArc prévu\",\"\")","v":""},{"$f":"IF(SUMIFS(PDC_JUIN[H estimatives],PDC_JUIN[Projet],\"BOZARC\",PDC_JUIN[Pose prév. S],PDC_JUIN[[#Headers],[27]])>70,\"Trop de BozArc prévu\",\"\")","v":""}]
[{"$f":"IF(OR(R7>=R13,R10>0),\"MOIS COMPLET - PLUS DE SAISIE\",\"\")","v":""},null,null,null,null,null,null,null,null,{"$f":"IF(SUMIF(PDC_JUIN[Pose prév. S],PDC_JUIN[[#Headers],[23]],PDC_JUIN[H estimatives])>=U$16,\"Semaine complète\",\"\")","v":""},{"$f":"IF(SUMIF(PDC_JUIN[Pose prév. S],PDC_JUIN[[#Headers],[24]],PDC_JUIN[H estimatives])>=V$16,\"Semaine complète\",\"\")","v":""},{"$f":"IF(SUMIF(PDC_JUIN[Pose prév. S],PDC_JUIN[[#Headers],[25]],PDC_JUIN[H estimatives])>=W$16,\"Semaine complète\",\"\")","v":""},{"$f":"IF(SUMIF(PDC_JUIN[Pose prév. S],PDC_JUIN[[#Headers],[26]],PDC_JUIN[H estimatives])>=X$16,\"Semaine complète\",\"\")","v":""},{"$f":"IF(SUMIF(PDC_JUIN[Pose prév. S],PDC_JUIN[[#Headers],[27]],PDC_JUIN[H estimatives])>=Y$16,\"Semaine complète\",\"\")","v":""},"Décalage",null,null,null,null,{"$f":"MAI!T5+1","v":6}]
["Chantiers","Ccial","Projet","Ville","H estimatives","H réelles réalisées","CA","S de liv.","Pose prév. S","23","24","25","26","27","Plannifié et validé",null,"Indicateurs",null,null,"Éxécutants","23","24","25","26","27"]
[null,null,null,null,null,null,null,null,null,{"$f":"IF(PDC_JUIN[[#This Row],[Pose prév. S]]=J$3,PDC_JUIN[[#This Row],[CA]],\"\")","v":""},{"$f":"IF(PDC_JUIN[[#This Row],[Pose prév. S]]=K$3,PDC_JUIN[[#This Row],[CA]],\"\")","v":""},{"$f":"IF(PDC_JUIN[[#This Row],[Pose prév. S]]=L$3,PDC_JUIN[[#This Row],[CA]],\"\")","v":""},{"$f":"IF(PDC_JUIN[[#This Row],[Pose prév. S]]=M$3,PDC_JUIN[[#This Row],[CA]],\"\")","v":""},{"$f":"IF(PDC_JUIN[[#This Row],[Pose prév. S]]=N$3,PDC_JUIN[[#This Row],[CA]],\"\")","v":""},null,null,"Heures estimatives",{"$f":"PDC_JUIN[[#Totals],[H estimatives]]","v":0},null,"Poseur 1",{"$f":"INDEX(H_productives[],MATCH(U$6&$T$5,H_productives[N°S]&H_productives[N°Mois],0),MATCH($T7,H_productives[#Headers],0))","v":26.25},{"$f":"INDEX(H_productives[],MATCH(V$6&$T$5,H_productives[N°S]&H_productives[N°Mois],0),MATCH($T7,H_productives[#Headers],0))","v":43},{"$f":"INDEX(H_productives[],MATCH(W$6&$T$5,H_productives[N°S]&H_productives[N°Mois],0),MATCH($T7,H_productives[#Headers],0))","v":35},{"$f":"INDEX(H_productives[],MATCH(X$6&$T$5,H_productives[N°S]&H_productives[N°Mois],0),MATCH($T7,H_productives[#Headers],0))","v":43},{"$f":"INDEX(H_productives[],MATCH(Y$6&$T$5,H_productives[N°S]&H_productives[N°Mois],0),MATCH($T7,H_productives[#Headers],0))","v":17.5}]
[null,null,null,null,null,null,null,null,null,{"$f":"IF(PDC_JUIN[[#This Row],[Pose prév. S]]=J$3,PDC_JUIN[[#This Row],[CA]],\"\")","v":""},{"$f":"IF(PDC_JUIN[[#This Row],[Pose prév. S]]=K$3,PDC_JUIN[[#This Row],[CA]],\"\")","v":""},{"$f":"IF(PDC_JUIN[[#This Row],[Pose prév. S]]=L$3,PDC_JUIN[[#This Row],[CA]],\"\")","v":""},{"$f":"IF(PDC_JUIN[[#This Row],[Pose prév. S]]=M$3,PDC_JUIN[[#This Row],[CA]],\"\")","v":""},{"$f":"IF(PDC_JUIN[[#This Row],[Pose prév. S]]=N$3,PDC_JUIN[[#This Row],[CA]],\"\")","v":""},null,null,"Heures estimatives cumulées",{"$f":"R7+MAI!R8","v":0},null,"Poseur 2",{"$f":"INDEX(H_productives[],MATCH(U$6&$T$5,H_productives[N°S]&H_productives[N°Mois],0),MATCH($T8,H_productives[#Headers],0))","v":26.25},{"$f":"INDEX(H_productives[],MATCH(V$6&$T$5,H_productives[N°S]&H_productives[N°Mois],0),MATCH($T8,H_productives[#Headers],0))","v":43},{"$f":"INDEX(H_productives[],MATCH(W$6&$T$5,H_productives[N°S]&H_productives[N°Mois],0),MATCH($T8,H_productives[#Headers],0))","v":35},{"$f":"INDEX(H_productives[],MATCH(X$6&$T$5,H_productives[N°S]&H_productives[N°Mois],0),MATCH($T8,H_productives[#Headers],0))","v":43},{"$f":"INDEX(H_productives[],MATCH(Y$6&$T$5,H_productives[N°S]&H_productives[N°Mois],0),MATCH($T8,H_productives[#Headers],0))","v":17.5}]
[null,null,null,null,null,null,null,null,null,{"$f":"IF(PDC_JUIN[[#This Row],[Pose prév. S]]=J$3,PDC_JUIN[[#This Row],[CA]],\"\")","v":""},{"$f":"IF(PDC_JUIN[[#This Row],[Pose prév. S]]=K$3,PDC_JUIN[[#This Row],[CA]],\"\")","v":""},{"$f":"IF(PDC_JUIN[[#This Row],[Pose prév. S]]=L$3,PDC_JUIN[[#This Row],[CA]],\"\")","v":""},{"$f":"IF(PDC_JUIN[[#This Row],[Pose prév. S]]=M$3,PDC_JUIN[[#This Row],[CA]],\"\")","v":""},{"$f":"IF(PDC_JUIN[[#This Row],[Pose prév. S]]=N$3,PDC_JUIN[[#This Row],[CA]],\"\")","v":""},null,null,null,null,null,"Poseur 3",{"$f":"INDEX(H_productives[],MATCH(U$6&$T$5,H_productives[N°S]&H_productives[N°Mois],0),MATCH($T9,H_productives[#Headers],0))","v":26.25},{"$f":"INDEX(H_productives[],MATCH(V$6&$T$5,H_productives[N°S]&H_productives[N°Mois],0),MATCH($T9,H_productives[#Headers],0))","v":43},{"$f":"INDEX(H_productives[],MATCH(W$6&$T$5,H_productives[N°S]&H_productives[N°Mois],0),MATCH($T9,H_productives[#Headers],0))","v":35},{"$f":"INDEX(H_productives[],MATCH(X$6&$T$5,H_productives[N°S]&H_productives[N°Mois],0),MATCH($T9,H_productives[#Headers],0))","v":43},{"$f":"INDEX(H_productives[],MATCH(Y$6&$T$5,H_productives[N°S]&H_productives[N°Mois],0),MATCH($T9,H_productives[#Headers],0))","v":17.5}]
[{"$f":"SUBTOTAL(103,PDC_JUIN[Chantiers])","v":0},null,null,null,{"$f":"SUBTOTAL(109,PDC_JUIN[H estimatives])","v":0},{"$f":"SUBTOTAL(109,PDC_JUIN[H réelles réalisées])","v":0},{"$f":"SUBTOTAL(109,PDC_JUIN[CA])","v":0},null,null,null,null,null,null,null,null,null,"Heures en surplus (à décaler)",{"$f":"IF(TODAY()<=Q1,IF(MAI!R10>0,IF((R7+MAI!R10)>R13,(R7+MAI!R10)-R13,0),IF(R7>R13,R7-R13,0)),IF(R7>R13,R7-R13,0))","v":0},null,"Poseur 4",{"$f":"INDEX(H_productives[],MATCH(U$6&$T$5,H_productives[N°S]&H_productives[N°Mois],0),MATCH($T10,H_productives[#Headers],0))","v":26.25},{"$f":"INDEX(H_productives[],MATCH(V$6&$T$5,H_productives[N°S]&H_productives[N°Mois],0),MATCH($T10,H_productives[#Headers],0))","v":43},{"$f":"INDEX(H_productives[],MATCH(W$6&$T$5,H_productives[N°S]&H_productives[N°Mois],0),MATCH($T10,H_productives[#Headers],0))","v":35},{"$f":"INDEX(H_productives[],MATCH(X$6&$T$5,H_productives[N°S]&H_productives[N°Mois],0),MATCH($T10,H_productives[#Headers],0))","v":43},{"$f":"INDEX(H_productives[],MATCH(Y$6&$T$5,H_productives[N°S]&H_productives[N°Mois],0),MATCH($T10,H_productives[#Headers],0))","v":17.5}]
[null,null,null,null,null,"Nombre d'h prévues :",null,null,null,{"$f":"SUMIF(PDC_JUIN[Pose prév. S],PDC_JUIN[[#Headers],[23]],PDC_JUIN[H estimatives])","v":0},{"$f":"SUMIF(PDC_JUIN[Pose prév. S],PDC_JUIN[[#Headers],[24]],PDC_JUIN[H estimatives])","v":0},{"$f":"SUMIF(PDC_JUIN[Pose prév. S],PDC_JUIN[[#Headers],[25]],PDC_JUIN[H estimatives])","v":0},{"$f":"SUMIF(PDC_JUIN[Pose prév. S],PDC_JUIN[[#Headers],[26]],PDC_JUIN[H estimatives])","v":0},{"$f":"SUMIF(PDC_JUIN[Pose prév. S],PDC_JUIN[[#Headers],[27]],PDC_JUIN[H estimatives])","v":0},null,null,"Heures restantes",{"$f":"IF(R10=0,IF(TODAY()<=Q1,R13-(R7+MAI!R10),R13-R7),0)","v":1156.5},null,"Poseur 5",{"$f":"INDEX(H_productives[],MATCH(U$6&$T$5,H_productives[N°S]&H_productives[N°Mois],0),MATCH($T11,H_productives[#Headers],0))","v":26.25},{"$f":"INDEX(H_productives[],MATCH(V$6&$T$5,H_productives[N°S]&H_productives[N°Mois],0),MATCH($T11,H_productives[#Headers],0))","v":43},{"$f":"INDEX(H_productives[],MATCH(W$6&$T$5,H_productives[N°S]&H_productives[N°Mois],0),MATCH($T11,H_productives[#Headers],0))","v":35},{"$f":"INDEX(H_productives[],MATCH(X$6&$T$5,H_productives[N°S]&H_productives[N°Mois],0),MATCH($T11,H_productives[#Headers],0))","v":43},{"$f":"INDEX(H_productives[],MATCH(Y$6&$T$5,H_productives[N°S]&H_productives[N°Mois],0),MATCH($T11,H_productives[#Headers],0))","v":17.5}]
[null,null,null,null,null,"Différence d'h (H prévues - H prod.) :",null,null,null,{"$f":"J11-U16","v":-161.07499999999999},{"$f":"K11-V16","v":-253.3},{"$f":"L11-W16","v":-212.5},{"$f":"M11-X16","v":-253.3},{"$f":"N11-Y16","v":-102.85},null,null,null,null,null,"Poseur 6",{"$f":"INDEX(H_productives[],MATCH(U$6&$T$5,H_productives[N°S]&H_productives[N°Mois],0),MATCH($T12,H_productives[#Headers],0))","v":26.25},{"$f":"INDEX(H_productives[],MATCH(V$6&$T$5,H_productives[N°S]&H_productives[N°Mois],0),MATCH($T12,H_productives[#Headers],0))","v":43},{"$f":"INDEX(H_productives[],MATCH(W$6&$T$5,H_productives[N°S]&H_productives[N°Mois],0),MATCH($T12,H_productives[#Headers],0))","v":35},{"$f":"INDEX(H_productives[],MATCH(X$6&$T$5,H_productives[N°S]&H_productives[N°Mois],0),MATCH($T12,H_productives[#Headers],0))","v":43},{"$f":"INDEX(H_productives[],MATCH(Y$6&$T$5,H_productives[N°S]&H_productives[N°Mois],0),MATCH($T12,H_productives[#Headers],0))","v":17.5}]
[null,null,null,null,null,"CA/mois\nTOTAL",{"$f":"SUMIF(PDC_JUIN[Plannifié et validé],\"ü\",PDC_JUIN[CA])","v":0},null,null,null,null,null,null,null,null,null,"Heures prod.",{"$f":"SUM(Tps_travaillées_OCT384386387388[[#Totals],[23]:[27]])","v":1156.5},null,"Poseur 7",{"$f":"INDEX(H_productives[],MATCH(U$6&$T$5,H_productives[N°S]&H_productives[N°Mois],0),MATCH($T13,H_productives[#Headers],0))","v":32},{"$f":"INDEX(H_productives[],MATCH(V$6&$T$5,H_productives[N°S]&H_productives[N°Mois],0),MATCH($T13,H_productives[#Headers],0))","v":40},{"$f":"INDEX(H_productives[],MATCH(W$6&$T$5,H_productives[N°S]&H_productives[N°Mois],0),MATCH($T13,H_productives[#Headers],0))","v":40},{"$f":"INDEX(H_productives[],MATCH(X$6&$T$5,H_productives[N°S]&H_productives[N°Mois],0),MATCH($T13,H_productives[#Headers],0))","v":40},{"$f":"INDEX(H_productives[],MATCH(Y$6&$T$5,H_productives[N°S]&H_productives[N°Mois],0),MATCH($T13,H_productives[#Headers],0))","v":16}]
[null,null,null,null,null,null,null,null,null,null,null,null,null,null,null,null,"Heures prod. cumulées",{"$f":"R13+MAI!R14","v":9049.85},null,"Total",{"$f":"SUBTOTAL(109,Tps_travaillées_OCT384386387388[23])","v":189.5},{"$f":"SUBTOTAL(109,Tps_travaillées_OCT384386387388[24])","v":298},{"$f":"SUBTOTAL(109,Tps_travaillées_OCT384386387388[25])","v":250},{"$f":"SUBTOTAL(109,Tps_travaillées_OCT384386387388[26])","v":298},{"$f":"SUBTOTAL(109,Tps_travaillées_OCT384386387388[27])","v":121}]
[null,null,null,null,null,null,null,null,null,null,null,null,null,null,null,null,null,null,null,-0.15,{"$f":"Tps_travaillées_OCT384386387388[[#Totals],[23]]*$T$15","v":-28.425000000000001},{"$f":"Tps_travaillées_OCT384386387388[[#Totals],[24]]*$T$15","v":-44.699999999999996},{"$f":"Tps_travaillées_OCT384386387388[[#Totals],[25]]*$T$15","v":-37.5},{"$f":"Tps_travaillées_OCT384386387388[[#Totals],[26]]*$T$15","v":-44.699999999999996},{"$f":"Tps_travaillées_OCT384386387388[[#Totals],[27]]*$T$15","v":-18.149999999999999}]
[null,null,null,null,null,null,null,null,null,null,null,null,null,null,null,null,"Heures réelles réalisées",{"$f":"PDC_JUIN[[#Totals],[H réelles réalisées]]","v":0},null,"Heure réelles travaillées",{"$f":"SUM(U14:U15)","v":161.07499999999999},{"$f":"SUM(V14:V15)","v":253.3},{"$f":"SUM(W14:W15)","v":212.5},{"$f":"SUM(X14:X15)","v":253.3},{"$f":"SUM(Y14:Y15)","v":102.85}]
[null,null,null,null,null,null,null,null,null,null,null,null,null,null,null,null,"Heures réelles réalisées cumulées",{"$f":"R16+MAI!R17","v":0},null,"Soit en JOURS",{"$f":"U16/8.75","v":18.408571428571427},{"$f":"V16/8.75","v":28.94857142857143},{"$f":"W16/8.75","v":24.285714285714285},{"$f":"X16/8.75","v":28.94857142857143},{"$f":"Y16/8.75","v":11.754285714285714}]
[]
[null,null,null,null,null,null,null,null,null,null,null,null,null,null,null,null,"Moyenne CA/h estimatives",{"$f":"SUM(PDC_JUIN[[#Totals],[CA]]/E10)","v":{"$error":"#DIV/0!"}}]
[null,null,null,null,null,null,null,null,null,null,null,null,null,null,null,null,"Moyenne CA/h réalisées",{"$f":"G13/PDC_JUIN[[#Totals],[H réelles réalisées]]","v":{"$error":"#DIV/0!"}}]
[null,null,null,null,null,null,null,null,null,null,null,null,null,null,null,null,"Moyenne CA/h réalisées cumulées",{"$f":"R25/R17","v":{"$error":"#DIV/0!"}}]
[]
[null,null,null,null,null,null,null,null,null,null,null,null,null,null,null,null,"CA prévi. à poser au cours de l'année",{"$f":"PDC_JUIN[[#Totals],[CA]]+JUILLET!R23","v":0}]
[null,null,null,null,null,null,null,null,null,null,null,null,null,null,null,null,"CA prévision cumulé",{"$f":"PDC_JUIN[[#Totals],[CA]]+MAI!R24","v":0}]
[null,null,null,null,null,null,null,null,null,null,null,null,null,null,null,null,"CA réel cumulé",{"$f":"G13+MAI!R25","v":0}]

{"sheet":"JUILLET","index":9,"n_rows":25,"n_cols":25,"rows_kept":25,"cut":false,"hidden":false,"merged":[[5,16,5,17],[12,5,13,5],[12,6,13,14],[4,0,4,8],[0,0,0,14],[1,1,1,2],[10,5,10,8],[11,5,11,8],[1,4,1,5],[1,6,1,7],[1,8,1,9],[1,11,1,14]]}
[{"$f":"\"PLAN DE CHARGE DU MOIS DE JUILLET \"&'Fermetures & jours fériés'!D2","v":"PLAN DE CHARGE DU MOIS DE JUILLET 2020"},null,null,null,null,null,null,null,null,null,null,null,null,null,null,{"$f":"EDATE(JUIN!P1,1)","v":"2020-07-01"},{"$f":"DATE('Fermetures & jours fériés'!D2,T5,1)","v":"2020-07-01"}]
["Légende :","Chantier fait",null,"Cellule à définir avec feuille de marge réelle","= H estimatives",null,"< H estimatives",null,"> H estimatives",null,"Pose prév. Impératif","Rechercher un client : Ctrl+F > Options > Dans \"Classeur\" > Décocher \"Totalité de la cellule\" > Entrer NOM"]
[null,null,null,null,null,null,null,null,null,27,{"$f":"IF(J3<52,J3+1,1)","v":28},{"$f":"IF(K3<52,K3+1,1)","v":29},30,31]
[null,null,null,null,null,null,null,null,null,{"$f":"IF(SUMIFS(PDC_JUILLET[H estimatives],PDC_JUILLET[Projet],\"BOZARC\",PDC_JUILLET[Pose prév. S],PDC_JUILLET[27])>70,\"Trop de BozArc prévu\",\"\")","v":""},{"$f":"IF(SUMIFS(PDC_JUILLET[H estimatives],PDC_JUILLET[Projet],\"BOZARC\",PDC_JUILLET[Pose prév. S],PDC_JUILLET[28])>87.5,\"Trop de BozArc prévu\",\"\")","v":""},{"$f":"IF(SUMIFS(PDC_JUILLET[H estimatives],PDC_JUILLET[Projet],\"BOZARC\",PDC_JUILLET[Pose prév. S],PDC_JUILLET[29])>70,\"Trop de BozArc prévu\",\"\")","v":""},{"$f":"IF(SUMIFS(PDC_JUILLET[H estimatives],PDC_JUILLET[Projet],\"BOZARC\",PDC_JUILLET[Pose prév. S],PDC_JUILLET[30])>87.5,\"Trop de BozArc prévu\",\"\")","v":""},{"$f":"IF(SUMIFS(PDC_JUILLET[H estimatives],PDC_JUILLET[Projet],\"BOZARC\",PDC_JUILLET[Pose prév. S],PDC_JUILLET[31])>70,\"Trop de BozArc prévu\",\"\")","v":""}]
[{"$f":"IF(OR(R7>=R13,R10>0),\"MOIS COMPLET - PLUS DE SAISIE\",\"\")","v":""},null,null,null,null,null,null,null,null,{"$f":"IF(SUMIF(PDC_JUILLET[Pose prév. S],PDC_JUILLET[[#Headers],[27]],PDC_JUILLET[H estimatives])>=U$16,\"Semaine complète\",\"\")","v":""},{"$f":"IF(SUMIF(PDC_JUILLET[Pose prév. S],PDC_JUILLET[[#Headers],[28]],PDC_JUILLET[H estimatives])>=V$16,\"Semaine complète\",\"\")","v":""},{"$f":"IF(SUMIF(PDC_JUILLET[Pose prév. S],PDC_JUILLET[[#Headers],[29]],PDC_JUILLET[H estimatives])>=W$16,\"Semaine complète\",\"\")","v":""},{"$f":"IF(SUMIF(PDC_JUILLET[Pose prév. S],PDC_JUILLET[[#Headers],[30]],PDC_JUILLET[H estimatives])>=X$16,\"Semaine complète\",\"\")","v":""},{"$f":"IF(SUMIF(PDC_JUILLET[Pose prév. S],PDC_JUILLET[[#Headers],[31]],PDC_JUILLET[H estimatives])>=Y$16,\"Semaine complète\",\"\")","v":""},"Décalage",null,null,null,null,{"$f":"JUIN!T5+1","v":7}]
["Chantiers","Ccial","Projet","Ville","H estimatives","H réelles réalisées","CA","S de liv.","Pose prév. S","27","28","29","30","31","Plannifié et validé",null,"Indicateurs",null,null,"Éxécutants","27","28","29","30","31"]
[null,null,null,null,null,null,null,null,null,{"$f":"IF(PDC_JUILLET[[#This Row],[Pose prév. S]]=J$3,PDC_JUILLET[[#This Row],[CA]],\"\")","v":""},{"$f":"IF(PDC_JUILLET[[#This Row],[Pose prév. S]]=K$3,PDC_JUILLET[[#This Row],[CA]],\"\")","v":""},{"$f":"IF(PDC_JUILLET[[#This Row],[Pose prév. S]]=L$3,PDC_JUILLET[[#This Row],[CA]],\"\")","v":""},{"$f":"IF(PDC_JUILLET[[#This Row],[Pose prév. S]]=M$3,PDC_JUILLET[[#This Row],[CA]],\"\")","v":""},{"$f":"IF(PDC_JUILLET[[#This Row],[Pose prév. S]]=N$3,PDC_JUILLET[[#This Row],[CA]],\"\")","v":""},null,null,"Heures estimatives",{"$f":"PDC_JUILLET[[#Totals],[H estimatives]]","v":0},null,"Poseur 1",{"$f":"INDEX(H_productives[],MATCH(U$6&$T$5,H_productives[N°S]&H_productives[N°Mois],0),MATCH($T7,H_productives[#Headers],0))","v":17.5},{"$f":"INDEX(H_productives[],MATCH(V$6&$T$5,H_productives[N°S]&H_productives[N°Mois],0),MATCH($T7,H_productives[#Headers],0))","v":43},{"$f":"INDEX(H_productives[],MATCH(W$6&$T$5,H_productives[N°S]&H_productives[N°Mois],0),MATCH($T7,H_productives[#Headers],0))","v":26.25},{"$f":"INDEX(H_productives[],MATCH(X$6&$T$5,H_productives[N°S]&H_productives[N°Mois],0),MATCH($T7,H_productives[#Headers],0))","v":43},{"$f":"INDEX(H_productives[],MATCH(Y$6&$T$5,H_productives[N°S]&H_productives[N°Mois],0),MATCH($T7,H_productives[#Headers],0))","v":35}]
[null,null,null,null,null,null,null,null,null,{"$f":"IF(PDC_JUILLET[[#This Row],[Pose prév. S]]=J$3,PDC_JUILLET[[#This Row],[CA]],\"\")","v":""},{"$f":"IF(PDC_JUILLET[[#This Row],[Pose prév. S]]=K$3,PDC_JUILLET[[#This Row],[CA]],\"\")","v":""},{"$f":"IF(PDC_JUILLET[[#This Row],[Pose prév. S]]=L$3,PDC_JUILLET[[#This Row],[CA]],\"\")","v":""},{"$f":"IF(PDC_JUILLET[[#This Row],[Pose prév. S]]=M$3,PDC_JUILLET[[#This Row],[CA]],\"\")","v":""},{"$f":"IF(PDC_JUILLET[[#This Row],[Pose prév. S]]=N$3,PDC_JUILLET[[#This Row],[CA]],\"\")","v":""},null,null,"Heures estimatives cumulées",{"$f":"R7+JUIN!R8","v":0},null,"Poseur 2",{"$f":"INDEX(H_productives[],MATCH(U$6&$T$5,H_productives[N°S]&H_productives[N°Mois],0),MATCH($T8,H_productives[#Headers],0))","v":17.5},{"$f":"INDEX(H_productives[],MATCH(V$6&$T$5,H_productives[N°S]&H_productives[N°Mois],0),MATCH($T8,H_productives[#Headers],0))","v":43},{"$f":"INDEX(H_productives[],MATCH(W$6&$T$5,H_productives[N°S]&H_productives[N°Mois],0),MATCH($T8,H_productives[#Headers],0))","v":26.25},{"$f":"INDEX(H_productives[],MATCH(X$6&$T$5,H_productives[N°S]&H_productives[N°Mois],0),MATCH($T8,H_productives[#Headers],0))","v":43},{"$f":"INDEX(H_productives[],MATCH(Y$6&$T$5,H_productives[N°S]&H_productives[N°Mois],0),MATCH($T8,H_productives[#Headers],0))","v":35}]
[null,null,null,null,null,null,null,null,null,{"$f":"IF(PDC_JUILLET[[#This Row],[Pose prév. S]]=J$3,PDC_JUILLET[[#This Row],[CA]],\"\")","v":""},{"$f":"IF(PDC_JUILLET[[#This Row],[Pose prév. S]]=K$3,PDC_JUILLET[[#This Row],[CA]],\"\")","v":""},{"$f":"IF(PDC_JUILLET[[#This Row],[Pose prév. S]]=L$3,PDC_JUILLET[[#This Row],[CA]],\"\")","v":""},{"$f":"IF(PDC_JUILLET[[#This Row],[Pose prév. S]]=M$3,PDC_JUILLET[[#This Row],[CA]],\"\")","v":""},{"$f":"IF(PDC_JUILLET[[#This Row],[Pose prév. S]]=N$3,PDC_JUILLET[[#This Row],[CA]],\"\")","v":""},null,null,null,null,null,"Poseur 3",{"$f":"INDEX(H_productives[],MATCH(U$6&$T$5,H_productives[N°S]&H_productives[N°Mois],0),MATCH($T9,H_productives[#Headers],0))","v":17.5},{"$f":"INDEX(H_productives[],MATCH(V$6&$T$5,H_productives[N°S]&H_productives[N°Mois],0),MATCH($T9,H_productives[#Headers],0))","v":43},{"$f":"INDEX(H_productives[],MATCH(W$6&$T$5,H_productives[N°S]&H_productives[N°Mois],0),MATCH($T9,H_productives[#Headers],0))","v":26.25},{"$f":"INDEX(H_productives[],MATCH(X$6&$T$5,H_productives[N°S]&H_productives[N°Mois],0),MATCH($T9,H_productives[#Headers],0))","v":43},{"$f":"INDEX(H_productives[],MATCH(Y$6&$T$5,H_productives[N°S]&H_productives[N°Mois],0),MATCH($T9,H_productives[#Headers],0))","v":35}]
[{"$f":"SUBTOTAL(103,PDC_JUILLET[Chantiers])","v":0},null,null,null,{"$f":"SUBTOTAL(109,PDC_JUILLET[H estimatives])","v":0},{"$f":"SUBTOTAL(109,PDC_JUILLET[H réelles réalisées])","v":0},{"$f":"SUBTOTAL(109,PDC_JUILLET[CA])","v":0},null,null,null,null,null,null,null,null,null,"Heures en surplus (à décaler)",{"$f":"IF(TODAY()<=Q1,IF(JUIN!R10>0,IF((R7+JUIN!R10)>R13,(R7+JUIN!R10)-R13,0),IF(R7>R13,R7-R13,0)),IF(R7>R13,R7-R13,0))","v":0},null,"Poseur 4",{"$f":"INDEX(H_productives[],MATCH(U$6&$T$5,H_productives[N°S]&H_productives[N°Mois],0),MATCH($T10,H_productives[#Headers],0))","v":17.5},{"$f":"INDEX(H_productives[],MATCH(V$6&$T$5,H_productives[N°S]&H_productives[N°Mois],0),MATCH($T10,H_productives[#Headers],0))","v":43},{"$f":"INDEX(H_productives[],MATCH(W$6&$T$5,H_productives[N°S]&H_productives[N°Mois],0),MATCH($T10,H_productives[#Headers],0))","v":26.25},{"$f":"INDEX(H_productives[],MATCH(X$6&$T$5,H_productives[N°S]&H_productives[N°Mois],0),MATCH($T10,H_productives[#Headers],0))","v":43},{"$f":"INDEX(H_productives[],MATCH(Y$6&$T$5,H_productives[N°S]&H_productives[N°Mois],0),MATCH($T10,H_productives[#Headers],0))","v":35}]
[null,null,null,null,null,"Nombre d'h prévues :",null,null,null,{"$f":"SUMIF(PDC_JUILLET[Pose prév. S],PDC_JUILLET[[#Headers],[27]],PDC_JUILLET[H estimatives])","v":0},{"$f":"SUMIF(PDC_JUILLET[Pose prév. S],PDC_JUILLET[[#Headers],[28]],PDC_JUILLET[H estimatives])","v":0},{"$f":"SUMIF(PDC_JUILLET[Pose prév. S],PDC_JUILLET[[#Headers],[29]],PDC_JUILLET[H estimatives])","v":0},{"$f":"SUMIF(PDC_JUILLET[Pose prév. S],PDC_JUILLET[[#Headers],[30]],PDC_JUILLET[H estimatives])","v":0},{"$f":"SUMIF(PDC_JUILLET[Pose prév. S],PDC_JUILLET[[#Headers],[31]],PDC_JUILLET[H estimatives])","v":0},null,null,"Heures restantes",{"$f":"IF(R10=0,IF(TODAY()<=Q1,R13-(R7+JUIN!R10),R13-R7),0)","v":1164.5},null,"Poseur 5",{"$f":"INDEX(H_productives[],MATCH(U$6&$T$5,H_productives[N°S]&H_productives[N°Mois],0),MATCH($T11,H_productives[#Headers],0))","v":17.5},{"$f":"INDEX(H_productives[],MATCH(V$6&$T$5,H_productives[N°S]&H_productives[N°Mois],0),MATCH($T11,H_productives[#Headers],0))","v":43},{"$f":"INDEX(H_productives[],MATCH(W$6&$T$5,H_productives[N°S]&H_productives[N°Mois],0),MATCH($T11,H_productives[#Headers],0))","v":26.25},{"$f":"INDEX(H_productives[],MATCH(X$6&$T$5,H_productives[N°S]&H_productives[N°Mois],0),MATCH($T11,H_productives[#Headers],0))","v":43},{"$f":"INDEX(H_productives[],MATCH(Y$6&$T$5,H_productives[N°S]&H_productives[N°Mois],0),MATCH($T11,H_productives[#Headers],0))","v":35}]
[null,null,null,null,null,"Différence d'h (H prévues - H prod.) :",null,null,null,{"$f":"J11-U16","v":-109.65},{"$f":"K11-V16","v":-253.3},{"$f":"L11-W16","v":-161.07499999999999},{"$f":"M11-X16","v":-253.3},{"$f":"N11-Y16","v":-212.5},null,null,null,null,null,"Poseur 6",{"$f":"INDEX(H_productives[],MATCH(U$6&$T$5,H_productives[N°S]&H_productives[N°Mois],0),MATCH($T12,H_productives[#Headers],0))","v":17.5},{"$f":"INDEX(H_productives[],MATCH(V$6&$T$5,H_productives[N°S]&H_productives[N°Mois],0),MATCH($T12,H_productives[#Headers],0))","v":43},{"$f":"INDEX(H_productives[],MATCH(W$6&$T$5,H_productives[N°S]&H_productives[N°Mois],0),MATCH($T12,H_productives[#Headers],0))","v":26.25},{"$f":"INDEX(H_productives[],MATCH(X$6&$T$5,H_productives[N°S]&H_productives[N°Mois],0),MATCH($T12,H_productives[#Headers],0))","v":43},{"$f":"INDEX(H_productives[],MATCH(Y$6&$T$5,H_productives[N°S]&H_productives[N°Mois],0),MATCH($T12,H_productives[#Headers],0))","v":35}]
[null,null,null,null,null,"CA/mois\nTOTAL",{"$f":"SUMIF(PDC_JUILLET[Plannifié et validé],\"ü\",PDC_JUILLET[CA])","v":0},null,null,null,null,null,null,null,null,null,"Heures prod.",{"$f":"SUM(Tps_travaillées_OCT384386387388389[[#Totals],[27]:[31]])","v":1164.5},null,"Poseur 7",{"$f":"INDEX(H_productives[],MATCH(U$6&$T$5,H_productives[N°S]&H_productives[N°Mois],0),MATCH($T13,H_productives[#Headers],0))","v":24},{"$f":"INDEX(H_productives[],MATCH(V$6&$T$5,H_productives[N°S]&H_productives[N°Mois],0),MATCH($T13,H_productives[#Headers],0))","v":40},{"$f":"INDEX(H_productives[],MATCH(W$6&$T$5,H_productives[N°S]&H_productives[N°Mois],0),MATCH($T13,H_productives[#Headers],0))","v":32},{"$f":"INDEX(H_productives[],MATCH(X$6&$T$5,H_productives[N°S]&H_productives[N°Mois],0),MATCH($T13,H_productives[#Headers],0))","v":40},{"$f":"INDEX(H_productives[],MATCH(Y$6&$T$5,H_productives[N°S]&H_productives[N°Mois],0),MATCH($T13,H_productives[#Headers],0))","v":40}]
[null,null,null,null,null,null,null,null,null,null,null,null,null,null,null,null,"Heures prod. cumulées",{"$f":"R13+JUIN!R14","v":10214.35},null,"Total",{"$f":"SUBTOTAL(109,Tps_travaillées_OCT384386387388389[27])","v":129},{"$f":"SUBTOTAL(109,Tps_travaillées_OCT384386387388389[28])","v":298},{"$f":"SUBTOTAL(109,Tps_travaillées_OCT384386387388389[29])","v":189.5},{"$f":"SUBTOTAL(109,Tps_travaillées_OCT384386387388389[30])","v":298},{"$f":"SUBTOTAL(109,Tps_travaillées_OCT384386387388389[31])","v":250}]
[null,null,null,null,null,null,null,null,null,null,null,null,null,null,null,null,null,null,null,-0.15,{"$f":"Tps_travaillées_OCT384386387388389[[#Totals],[27]]*$T$15","v":-19.349999999999998},{"$f":"Tps_travaillées_OCT384386387388389[[#Totals],[28]]*$T$15","v":-44.699999999999996},{"$f":"Tps_travaillées_OCT384386387388389[[#Totals],[29]]*$T$15","v":-28.425000000000001},{"$f":"Tps_travaillées_OCT384386387388389[[#Totals],[30]]*$T$15","v":-44.699999999999996},{"$f":"Tps_travaillées_OCT384386387388389[[#Totals],[31]]*$T$15","v":-37.5}]
[null,null,null,null,null,null,null,null,null,null,null,null,null,null,null,null,"Heures réelles réalisées",{"$f":"PDC_JUILLET[[#Totals],[H réelles réalisées]]","v":0},null,"Heure réelles travaillées",{"$f":"SUM(U14:U15)","v":109.65},{"$f":"SUM(V14:V15)","v":253.3},{"$f":"SUM(W14:W15)","v":161.07499999999999},{"$f":"SUM(X14:X15)","v":253.3},{"$f":"SUM(Y14:Y15)","v":212.5}]
[null,null,null,null,null,null,null,null,null,null,null,null,null,null,null,null,"Heures réelles réalisées cumulées",{"$f":"R16+JUIN!R17","v":0},null,"Soit en JOURS",{"$f":"U16/8.75","v":12.531428571428572},{"$f":"V16/8.75","v":28.94857142857143},{"$f":"W16/8.75","v":18.408571428571427},{"$f":"X16/8.75","v":28.94857142857143},{"$f":"Y16/8.75","v":24.285714285714285}]
[]
[null,null,null,null,null,null,null,null,null,null,null,null,null,null,null,null,"Moyenne CA/h estimatives",{"$f":"SUM(PDC_JUILLET[[#Totals],[CA]]/E10)","v":{"$error":"#DIV/0!"}}]
[null,null,null,null,null,null,null,null,null,null,null,null,null,null,null,null,"Moyenne CA/h réalisées",{"$f":"G13/PDC_JUILLET[[#Totals],[H réelles réalisées]]","v":{"$error":"#DIV/0!"}}]
[null,null,null,null,null,null,null,null,null,null,null,null,null,null,null,null,"Moyenne CA/h réalisées cumulées",{"$f":"R25/R17","v":{"$error":"#DIV/0!"}}]
[]
[null,null,null,null,null,null,null,null,null,null,null,null,null,null,null,null,"CA prévi. à poser au cours de l'année",{"$f":"PDC_JUILLET[[#Totals],[CA]]+AOUT!S23","v":0}]
[null,null,null,null,null,null,null,null,null,null,null,null,null,null,null,null,"CA prévision cumulé",{"$f":"PDC_JUILLET[[#Totals],[CA]]+JUIN!R24","v":0}]
[null,null,null,null,null,null,null,null,null,null,null,null,null,null,null,null,"CA réel cumulé",{"$f":"G13+JUIN!R25","v":0}]

{"sheet":"AOUT","index":10,"n_rows":25,"n_cols":27,"rows_kept":25,"cut":false,"hidden":false,"merged":[[5,17,5,18],[12,5,13,5],[12,6,13,15],[4,0,4,8],[0,0,0,14],[1,1,1,2],[10,5,10,8],[11,5,11,8],[1,4,1,5],[1,6,1,7],[1,8,1,9],[1,12,1,15]]}
[{"$f":"\"PLAN DE CHARGE DU MOIS D'AOUT \"&'Fermetures & jours fériés'!D2","v":"PLAN DE CHARGE DU MOIS D'AOUT 2020"},null,null,null,null,null,null,null,null,null,null,null,null,null,null,null,null,{"$f":"DATE('Fermetures & jours fériés'!D2,U5,1)","v":"2020-08-01"}]
["Légende :","Chantier fait",null,"Cellule à définir avec feuille de marge réelle","= H estimatives",null,"< H estimatives",null,"> H estimatives",null,"Pose prév. Impératif",null,"Rechercher un client : Ctrl+F > Options > Dans \"Classeur\" > Décocher \"Totalité de la cellule\" > Entrer NOM"]
[null,null,null,null,null,null,null,null,null,31,{"$f":"IF(J3<52,J3+1,1)","v":32},{"$f":"IF(K3<52,K3+1,1)","v":33},34,35,36]
[null,null,null,null,null,null,null,null,null,{"$f":"IF(SUMIFS(PDC_AOUT[H estimatives],PDC_AOUT[Projet],\"BOZARC\",PDC_AOUT[Pose prév. S],PDC_AOUT[[#Headers],[31]])>70,\"Trop de BozArc prévu\",\"\")","v":""},{"$f":"IF(SUMIFS(PDC_AOUT[H estimatives],PDC_AOUT[Projet],\"BOZARC\",PDC_AOUT[Pose prév. S],PDC_AOUT[[#Headers],[32]])>87.5,\"Trop de BozArc prévu\",\"\")","v":""},{"$f":"IF(SUMIFS(PDC_AOUT[H estimatives],PDC_AOUT[Projet],\"BOZARC\",PDC_AOUT[Pose prév. S],PDC_AOUT[[#Headers],[33]])>70,\"Trop de BozArc prévu\",\"\")","v":""},{"$f":"IF(SUMIFS(PDC_AOUT[H estimatives],PDC_AOUT[Projet],\"BOZARC\",PDC_AOUT[Pose prév. S],PDC_AOUT[[#Headers],[34]])>87.5,\"Trop de BozArc prévu\",\"\")","v":""},{"$f":"IF(SUMIFS(PDC_AOUT[H estimatives],PDC_AOUT[Projet],\"BOZARC\",PDC_AOUT[Pose prév. S],PDC_AOUT[[#Headers],[35]])>70,\"Trop de BozArc prévu\",\"\")","v":""},{"$f":"IF(SUMIFS(PDC_AOUT[H estimatives],PDC_AOUT[Projet],\"BOZARC\",PDC_AOUT[Pose prév. S],PDC_AOUT[[#Headers],[36]])>87.5,\"Trop de BozArc prévu\",\"\")","v":""}]
[{"$f":"IF(OR(S7>=S13,S10>0),\"MOIS COMPLET - PLUS DE SAISIE\",\"\")","v":""},null,null,null,null,null,null,null,null,{"$f":"IF(SUMIF(PDC_AOUT[Pose prév. S],PDC_AOUT[[#Headers],[31]],PDC_AOUT[H estimatives])>=V$16,\"Semaine complète\",\"\")","v":"Semaine complète"},{"$f":"IF(SUMIF(PDC_AOUT[Pose prév. S],PDC_AOUT[[#Headers],[32]],PDC_AOUT[H estimatives])>=W$16,\"Semaine complète\",\"\")","v":""},{"$f":"IF(SUMIF(PDC_AOUT[Pose prév. S],PDC_AOUT[[#Headers],[33]],PDC_AOUT[H estimatives])>=X$16,\"Semaine complète\",\"\")","v":""},{"$f":"IF(SUMIF(PDC_AOUT[Pose prév. S],PDC_AOUT[[#Headers],[34]],PDC_AOUT[H estimatives])>=Y$16,\"Semaine complète\",\"\")","v":""},{"$f":"IF(SUMIF(PDC_AOUT[Pose prév. S],PDC_AOUT[[#Headers],[35]],PDC_AOUT[H estimatives])>=Z$16,\"Semaine complète\",\"\")","v":""},{"$f":"IF(SUMIF(PDC_AOUT[Pose prév. S],PDC_AOUT[[#Headers],[36]],PDC_AOUT[H estimatives])>=AA$16,\"Semaine complète\",\"\")","v":""},"Décalage",null,null,null,null,{"$f":"JUILLET!T5+1","v":8}]
["Chantiers","Ccial","Projet","Ville","H estimatives","H réelles réalisées","CA","S de liv.","Pose prév. S","31","32","33","34","35","36","Plannifié et validé",null,"Indicateurs",null,null,"Éxécutants","31","32","33","34","35","36"]
[null,null,null,null,null,null,null,null,null,{"$f":"IF(PDC_AOUT[[#This Row],[Pose prév. S]]=J$3,PDC_AOUT[[#This Row],[CA]],\"\")","v":""},{"$f":"IF(PDC_AOUT[[#This Row],[Pose prév. S]]=K$3,PDC_AOUT[[#This Row],[CA]],\"\")","v":""},{"$f":"IF(PDC_AOUT[[#This Row],[Pose prév. S]]=L$3,PDC_AOUT[[#This Row],[CA]],\"\")","v":""},{"$f":"IF(PDC_AOUT[[#This Row],[Pose prév. S]]=M$3,PDC_AOUT[[#This Row],[CA]],\"\")","v":""},{"$f":"IF(PDC_AOUT[[#This Row],[Pose prév. S]]=N$3,PDC_AOUT[[#This Row],[CA]],\"\")","v":""},{"$f":"IF(PDC_AOUT[[#This Row],[Pose prév. S]]=O$3,PDC_AOUT[[#This Row],[CA]],\"\")","v":""},null,null,"Heures estimatives",{"$f":"PDC_AOUT[[#Totals],[H estimatives]]","v":0},null,"Poseur 1",{"$f":"INDEX(H_productives[],MATCH(V$6&$U$5,H_productives[N°S]&H_productives[N°Mois],0),MATCH($U7,H_productives[#Headers],0))","v":0},{"$f":"INDEX(H_productives[],MATCH(W$6&$U$5,H_productives[N°S]&H_productives[N°Mois],0),MATCH($U7,H_productives[#Headers],0))","v":43},{"$f":"INDEX(H_productives[],MATCH(X$6&$U$5,H_productives[N°S]&H_productives[N°Mois],0),MATCH($U7,H_productives[#Headers],0))","v":35},{"$f":"INDEX(H_productives[],MATCH(Y$6&$U$5,H_productives[N°S]&H_productives[N°Mois],0),MATCH($U7,H_productives[#Headers],0))","v":43},{"$f":"INDEX(H_productives[],MATCH(Z$6&$U$5,H_productives[N°S]&H_productives[N°Mois],0),MATCH($U7,H_productives[#Headers],0))","v":35},{"$f":"INDEX(H_productives[],MATCH(AA$6&$U$5,H_productives[N°S]&H_productives[N°Mois],0),MATCH($U7,H_productives[#Headers],0))","v":8.75}]
[null,null,null,null,null,null,null,null,null,{"$f":"IF(PDC_AOUT[[#This Row],[Pose prév. S]]=J$3,PDC_AOUT[[#This Row],[CA]],\"\")","v":""},{"$f":"IF(PDC_AOUT[[#This Row],[Pose prév. S]]=K$3,PDC_AOUT[[#This Row],[CA]],\"\")","v":""},{"$f":"IF(PDC_AOUT[[#This Row],[Pose prév. S]]=L$3,PDC_AOUT[[#This Row],[CA]],\"\")","v":""},{"$f":"IF(PDC_AOUT[[#This Row],[Pose prév. S]]=M$3,PDC_AOUT[[#This Row],[CA]],\"\")","v":""},{"$f":"IF(PDC_AOUT[[#This Row],[Pose prév. S]]=N$3,PDC_AOUT[[#This Row],[CA]],\"\")","v":""},{"$f":"IF(PDC_AOUT[[#This Row],[Pose prév. S]]=O$3,PDC_AOUT[[#This Row],[CA]],\"\")","v":""},null,null,"Heures estimatives cumulées",{"$f":"S7+JUILLET!R8","v":0},null,"Poseur 2",{"$f":"INDEX(H_productives[],MATCH(V$6&$U$5,H_productives[N°S]&H_productives[N°Mois],0),MATCH($U8,H_productives[#Headers],0))","v":0},{"$f":"INDEX(H_productives[],MATCH(W$6&$U$5,H_productives[N°S]&H_productives[N°Mois],0),MATCH($U8,H_productives[#Headers],0))","v":43},{"$f":"INDEX(H_productives[],MATCH(X$6&$U$5,H_productives[N°S]&H_productives[N°Mois],0),MATCH($U8,H_productives[#Headers],0))","v":35},{"$f":"INDEX(H_productives[],MATCH(Y$6&$U$5,H_productives[N°S]&H_productives[N°Mois],0),MATCH($U8,H_productives[#Headers],0))","v":43},{"$f":"INDEX(H_productives[],MATCH(Z$6&$U$5,H_productives[N°S]&H_productives[N°Mois],0),MATCH($U8,H_productives[#Headers],0))","v":35},{"$f":"INDEX(H_productives[],MATCH(AA$6&$U$5,H_productives[N°S]&H_productives[N°Mois],0),MATCH($U8,H_productives[#Headers],0))","v":8.75}]
[null,null,null,null,null,null,null,null,null,{"$f":"IF(PDC_AOUT[[#This Row],[Pose prév. S]]=J$3,PDC_AOUT[[#This Row],[CA]],\"\")","v":""},{"$f":"IF(PDC_AOUT[[#This Row],[Pose prév. S]]=K$3,PDC_AOUT[[#This Row],[CA]],\"\")","v":""},{"$f":"IF(PDC_AOUT[[#This Row],[Pose prév. S]]=L$3,PDC_AOUT[[#This Row],[CA]],\"\")","v":""},{"$f":"IF(PDC_AOUT[[#This Row],[Pose prév. S]]=M$3,PDC_AOUT[[#This Row],[CA]],\"\")","v":""},{"$f":"IF(PDC_AOUT[[#This Row],[Pose prév. S]]=N$3,PDC_AOUT[[#This Row],[CA]],\"\")","v":""},{"$f":"IF(PDC_AOUT[[#This Row],[Pose prév. S]]=O$3,PDC_AOUT[[#This Row],[CA]],\"\")","v":""},null,null,null,null,null,"Poseur 3",{"$f":"INDEX(H_productives[],MATCH(V$6&$U$5,H_productives[N°S]&H_productives[N°Mois],0),MATCH($U9,H_productives[#Headers],0))","v":0},{"$f":"INDEX(H_productives[],MATCH(W$6&$U$5,H_productives[N°S]&H_productives[N°Mois],0),MATCH($U9,H_productives[#Headers],0))","v":43},{"$f":"INDEX(H_productives[],MATCH(X$6&$U$5,H_productives[N°S]&H_productives[N°Mois],0),MATCH($U9,H_productives[#Headers],0))","v":35},{"$f":"INDEX(H_productives[],MATCH(Y$6&$U$5,H_productives[N°S]&H_productives[N°Mois],0),MATCH($U9,H_productives[#Headers],0))","v":43},{"$f":"INDEX(H_productives[],MATCH(Z$6&$U$5,H_productives[N°S]&H_productives[N°Mois],0),MATCH($U9,H_productives[#Headers],0))","v":35},{"$f":"INDEX(H_productives[],MATCH(AA$6&$U$5,H_productives[N°S]&H_productives[N°Mois],0),MATCH($U9,H_productives[#Headers],0))","v":8.75}]
[{"$f":"SUBTOTAL(103,PDC_AOUT[Chantiers])","v":0},null,null,null,{"$f":"SUBTOTAL(109,PDC_AOUT[H estimatives])","v":0},{"$f":"SUBTOTAL(109,PDC_AOUT[H réelles réalisées])","v":0},{"$f":"SUBTOTAL(109,PDC_AOUT[CA])","v":0},null,null,null,null,null,null,null,null,null,null,"Heures en surplus (à décaler)",{"$f":"IF(TODAY()<=R1,IF(JUILLET!R10>0,IF((S7+JUILLET!R10)>S13,(S7+JUILLET!R10)-S13,0),IF(S7>S13,S7-S13,0)),IF(S7>S13,S7-S13,0))","v":0},null,"Poseur 4",{"$f":"INDEX(H_productives[],MATCH(V$6&$U$5,H_productives[N°S]&H_productives[N°Mois],0),MATCH($U10,H_productives[#Headers],0))","v":0},{"$f":"INDEX(H_productives[],MATCH(W$6&$U$5,H_productives[N°S]&H_productives[N°Mois],0),MATCH($U10,H_productives[#Headers],0))","v":43},{"$f":"INDEX(H_productives[],MATCH(X$6&$U$5,H_productives[N°S]&H_productives[N°Mois],0),MATCH($U10,H_productives[#Headers],0))","v":35},{"$f":"INDEX(H_productives[],MATCH(Y$6&$U$5,H_productives[N°S]&H_productives[N°Mois],0),MATCH($U10,H_productives[#Headers],0))","v":43},{"$f":"INDEX(H_productives[],MATCH(Z$6&$U$5,H_productives[N°S]&H_productives[N°Mois],0),MATCH($U10,H_productives[#Headers],0))","v":35},{"$f":"INDEX(H_productives[],MATCH(AA$6&$U$5,H_productives[N°S]&H_productives[N°Mois],0),MATCH($U10,H_productives[#Headers],0))","v":8.75}]
[null,null,null,null,null,"Nombre d'h prévues :",null,null,null,{"$f":"SUMIF(PDC_AOUT[Pose prév. S],PDC_AOUT[[#Headers],[31]],PDC_AOUT[H estimatives])","v":0},{"$f":"SUMIF(PDC_AOUT[Pose prév. S],PDC_AOUT[[#Headers],[32]],PDC_AOUT[H estimatives])","v":0},{"$f":"SUMIF(PDC_AOUT[Pose prév. S],PDC_AOUT[[#Headers],[33]],PDC_AOUT[H estimatives])","v":0},{"$f":"SUMIF(PDC_AOUT[Pose prév. S],PDC_AOUT[[#Headers],[34]],PDC_AOUT[H estimatives])","v":0},{"$f":"SUMIF(PDC_AOUT[Pose prév. S],PDC_AOUT[[#Headers],[35]],PDC_AOUT[H estimatives])","v":0},{"$f":"SUMIF(PDC_AOUT[Pose prév. S],PDC_AOUT[[#Headers],[36]],PDC_AOUT[H estimatives])","v":0},null,null,"Heures restantes",{"$f":"IF(S10=0,IF(TODAY()<=R1,S13-(S7+JUILLET!R10),S13-S7),0)","v":1156.5},null,"Poseur 5",{"$f":"INDEX(H_productives[],MATCH(V$6&$U$5,H_productives[N°S]&H_productives[N°Mois],0),MATCH($U11,H_productives[#Headers],0))","v":0},{"$f":"INDEX(H_productives[],MATCH(W$6&$U$5,H_productives[N°S]&H_productives[N°Mois],0),MATCH($U11,H_productives[#Headers],0))","v":43},{"$f":"INDEX(H_productives[],MATCH(X$6&$U$5,H_productives[N°S]&H_productives[N°Mois],0),MATCH($U11,H_productives[#Headers],0))","v":35},{"$f":"INDEX(H_productives[],MATCH(Y$6&$U$5,H_productives[N°S]&H_productives[N°Mois],0),MATCH($U11,H_productives[#Headers],0))","v":43},{"$f":"INDEX(H_productives[],MATCH(Z$6&$U$5,H_productives[N°S]&H_productives[N°Mois],0),MATCH($U11,H_productives[#Headers],0))","v":35},{"$f":"INDEX(H_productives[],MATCH(AA$6&$U$5,H_productives[N°S]&H_productives[N°Mois],0),MATCH($U11,H_productives[#Headers],0))","v":8.75}]
[null,null,null,null,null,"Différence d'h (H prévues - H prod.) :",null,null,null,{"$f":"J11-V16","v":0},{"$f":"K11-W16","v":-253.3},{"$f":"L11-X16","v":-212.5},{"$f":"M11-Y16","v":-253.3},{"$f":"N11-Z16","v":-212.5},{"$f":"O11-AA16","v":-51.424999999999997},null,null,null,null,null,"Poseur 6",{"$f":"INDEX(H_productives[],MATCH(V$6&$U$5,H_productives[N°S]&H_productives[N°Mois],0),MATCH($U12,H_productives[#Headers],0))","v":0},{"$f":"INDEX(H_productives[],MATCH(W$6&$U$5,H_productives[N°S]&H_productives[N°Mois],0),MATCH($U12,H_productives[#Headers],0))","v":43},{"$f":"INDEX(H_productives[],MATCH(X$6&$U$5,H_productives[N°S]&H_productives[N°Mois],0),MATCH($U12,H_productives[#Headers],0))","v":35},{"$f":"INDEX(H_productives[],MATCH(Y$6&$U$5,H_productives[N°S]&H_productives[N°Mois],0),MATCH($U12,H_productives[#Headers],0))","v":43},{"$f":"INDEX(H_productives[],MATCH(Z$6&$U$5,H_productives[N°S]&H_productives[N°Mois],0),MATCH($U12,H_productives[#Headers],0))","v":35},{"$f":"INDEX(H_productives[],MATCH(AA$6&$U$5,H_productives[N°S]&H_productives[N°Mois],0),MATCH($U12,H_productives[#Headers],0))","v":8.75}]
[null,null,null,null,null,"CA/mois\nTOTAL",{"$f":"SUMIF(PDC_AOUT[Plannifié et validé],\"ü\",PDC_AOUT[CA])","v":0},null,null,null,null,null,null,null,null,null,null,"Heures prod.",{"$f":"SUM(Tps_travaillées_OCT381382385390[[#Totals],[31]:[36]])","v":1156.5},null,"Poseur 7",{"$f":"INDEX(H_productives[],MATCH(V$6&$U$5,H_productives[N°S]&H_productives[N°Mois],0),MATCH($U13,H_productives[#Headers],0))","v":0},{"$f":"INDEX(H_productives[],MATCH(W$6&$U$5,H_productives[N°S]&H_productives[N°Mois],0),MATCH($U13,H_productives[#Headers],0))","v":40},{"$f":"INDEX(H_productives[],MATCH(X$6&$U$5,H_productives[N°S]&H_productives[N°Mois],0),MATCH($U13,H_productives[#Headers],0))","v":40},{"$f":"INDEX(H_productives[],MATCH(Y$6&$U$5,H_productives[N°S]&H_productives[N°Mois],0),MATCH($U13,H_productives[#Headers],0))","v":40},{"$f":"INDEX(H_productives[],MATCH(Z$6&$U$5,H_productives[N°S]&H_productives[N°Mois],0),MATCH($U13,H_productives[#Headers],0))","v":40},{"$f":"INDEX(H_productives[],MATCH(AA$6&$U$5,H_productives[N°S]&H_productives[N°Mois],0),MATCH($U13,H_productives[#Headers],0))","v":8}]
[null,null,null,null,null,null,null,null,null,null,null,null,null,null,null,null,null,"Heures prod. cumulées",{"$f":"S13+JUILLET!R14","v":11370.85},null,"Total",{"$f":"SUBTOTAL(109,Tps_travaillées_OCT381382385390[31])","v":0},{"$f":"SUBTOTAL(109,Tps_travaillées_OCT381382385390[32])","v":298},{"$f":"SUBTOTAL(109,Tps_travaillées_OCT381382385390[33])","v":250},{"$f":"SUBTOTAL(109,Tps_travaillées_OCT381382385390[34])","v":298},{"$f":"SUBTOTAL(109,Tps_travaillées_OCT381382385390[35])","v":250},{"$f":"SUBTOTAL(109,Tps_travaillées_OCT381382385390[36])","v":60.5}]
[null,null,null,null,null,null,null,null,null,null,null,null,null,null,null,null,null,null,null,null,-0.15,{"$f":"Tps_travaillées_OCT381382385390[[#Totals],[31]]*$U$15","v":0},{"$f":"Tps_travaillées_OCT381382385390[[#Totals],[32]]*$U$15","v":-44.699999999999996},{"$f":"Tps_travaillées_OCT381382385390[[#Totals],[33]]*$U$15","v":-37.5},{"$f":"Tps_travaillées_OCT381382385390[[#Totals],[34]]*$U$15","v":-44.699999999999996},{"$f":"Tps_travaillées_OCT381382385390[[#Totals],[35]]*$U$15","v":-37.5},{"$f":"Tps_travaillées_OCT381382385390[[#Totals],[36]]*$U$15","v":-9.0749999999999993}]
[null,null,null,null,null,null,null,null,null,null,null,null,null,null,null,null,null,"Heures réelles réalisées",{"$f":"PDC_AOUT[[#Totals],[H réelles réalisées]]","v":0},null,"Heure réelles travaillées",{"$f":"SUM(V14:V15)","v":0},253.3,212.5,253.3,212.5,51.424999999999997]
[null,null,null,null,null,null,null,null,null,null,null,null,null,null,null,null,null,"Heures réelles réalisées cumulées",{"$f":"S16+JUILLET!R17","v":0},null,"Soit en JOURS",{"$f":"V16/8.75","v":0},28.94857142857143,24.285714285714285,28.94857142857143,24.285714285714285,5.8771428571428572]
[]
[null,null,null,null,null,null,null,null,null,null,null,null,null,null,null,null,null,"Moyenne CA/h estimatives",{"$f":"SUM(PDC_AOUT[[#Totals],[CA]]/E10)","v":{"$error":"#DIV/0!"}}]
[null,null,null,null,null,null,null,null,null,null,null,null,null,null,null,null,null,"Moyenne CA/h réalisées",{"$f":"G13/PDC_AOUT[[#Totals],[H réelles réalisées]]","v":{"$error":"#DIV/0!"}}]
[null,null,null,null,null,null,null,null,null,null,null,null,null,null,null,null,null,"Moyenne CA/h réalisées cumulées",{"$f":"S25/S17","v":{"$error":"#DIV/0!"}}]
[]
[null,null,null,null,null,null,null,null,null,null,null,null,null,null,null,null,null,"CA prévi. à poser au cours de l'année",{"$f":"PDC_AOUT[[#Totals],[CA]]+SEPT!R23","v":0}]
[null,null,null,null,null,null,null,null,null,null,null,null,null,null,null,null,null,"CA prévision cumulé",{"$f":"PDC_AOUT[[#Totals],[CA]]+JUILLET!R24","v":0}]
[null,null,null,null,null,null,null,null,null,null,null,null,null,null,null,null,null,"CA réel cumulé",{"$f":"G13+JUILLET!R25","v":0}]

{"sheet":"SEPT","index":11,"n_rows":25,"n_cols":25,"rows_kept":25,"cut":false,"hidden":false,"merged":[[5,16,5,17],[12,5,13,5],[12,6,13,14],[4,0,4,8],[0,0,0,14],[1,1,1,2],[10,5,10,8],[11,5,11,8],[1,4,1,5],[1,6,1,7],[1,8,1,9],[1,11,1,14]]}
[{"$f":"\"PLAN DE CHARGE DU MOIS DE SEPTEMBRE \"&'Fermetures & jours fériés'!D2","v":"PLAN DE CHARGE DU MOIS DE SEPTEMBRE 2020"},null,null,null,null,null,null,null,null,null,null,null,null,null,null,{"$f":"EDATE(AOUT!R1,1)","v":"2020-09-01"},{"$f":"DATE('Fermetures & jours fériés'!D2,T5,1)","v":"2020-09-01"}]
["Légende :","Chantier fait",null,"Cellule à définir avec feuille de marge réelle","= H estimatives",null,"< H estimatives",null,"> H estimatives",null,"Pose prév. Impératif","Rechercher un client : Ctrl+F > Options > Dans \"Classeur\" > Décocher \"Totalité de la cellule\" > Entrer NOM"]
[null,null,null,null,null,null,null,null,null,36,{"$f":"IF(J3<52,J3+1,1)","v":37},{"$f":"IF(K3<52,K3+1,1)","v":38},39,40]
[null,null,null,null,null,null,null,null,null,{"$f":"IF(SUMIFS(PDC_SEPT[H estimatives],PDC_SEPT[Projet],\"BOZARC\",PDC_SEPT[Pose prév. S],PDC_SEPT[[#Headers],[36]])>87.5,\"Trop de BozArc prévu\",\"\")","v":""},{"$f":"IF(SUMIFS(PDC_SEPT[H estimatives],PDC_SEPT[Projet],\"BOZARC\",PDC_SEPT[Pose prév. S],PDC_SEPT[[#Headers],[37]])>70,\"Trop de BozArc prévu\",\"\")","v":""},{"$f":"IF(SUMIFS(PDC_SEPT[H estimatives],PDC_SEPT[Projet],\"BOZARC\",PDC_SEPT[Pose prév. S],PDC_SEPT[[#Headers],[38]])>87.5,\"Trop de BozArc prévu\",\"\")","v":""},{"$f":"IF(SUMIFS(PDC_SEPT[H estimatives],PDC_SEPT[Projet],\"BOZARC\",PDC_SEPT[Pose prév. S],PDC_SEPT[[#Headers],[39]])>70,\"Trop de BozArc prévu\",\"\")","v":""},{"$f":"IF(SUMIFS(PDC_SEPT[H estimatives],PDC_SEPT[Projet],\"BOZARC\",PDC_SEPT[Pose prév. S],PDC_SEPT[[#Headers],[40]])>87.5,\"Trop de BozArc prévu\",\"\")","v":""}]
[{"$f":"IF(OR(R7>=R13,R10>0),\"MOIS COMPLET - PLUS DE SAISIE\",\"\")","v":""},null,null,null,null,null,null,null,null,{"$f":"IF(SUMIF(PDC_SEPT[Pose prév. S],PDC_SEPT[[#Headers],[36]],PDC_SEPT[H estimatives])>=U$16,\"Semaine complète\",\"\")","v":""},{"$f":"IF(SUMIF(PDC_SEPT[Pose prév. S],PDC_SEPT[[#Headers],[37]],PDC_SEPT[H estimatives])>=V$16,\"Semaine complète\",\"\")","v":""},{"$f":"IF(SUMIF(PDC_SEPT[Pose prév. S],PDC_SEPT[[#Headers],[38]],PDC_SEPT[H estimatives])>=W$16,\"Semaine complète\",\"\")","v":""},{"$f":"IF(SUMIF(PDC_SEPT[Pose prév. S],PDC_SEPT[[#Headers],[39]],PDC_SEPT[H estimatives])>=X$16,\"Semaine complète\",\"\")","v":""},{"$f":"IF(SUMIF(PDC_SEPT[Pose prév. S],PDC_SEPT[[#Headers],[40]],PDC_SEPT[H estimatives])>=Y$16,\"Semaine complète\",\"\")","v":""},"Décalage",null,null,null,null,{"$f":"AOUT!U5+1","v":9}]
["Chantiers","Ccial","Projet","Ville","H estimatives","H réelles réalisées","CA","S de liv.","Pose prév. S","36","37","38","39","40","Plannifié et validé",null,"Indicateurs",null,null,"Éxécutants","36","37","38","39","40"]
[null,null,null,null,null,null,null,null,null,{"$f":"IF(PDC_SEPT[[#This Row],[Pose prév. S]]=J$3,PDC_SEPT[[#This Row],[CA]],\"\")","v":""},{"$f":"IF(PDC_SEPT[[#This Row],[Pose prév. S]]=K$3,PDC_SEPT[[#This Row],[CA]],\"\")","v":""},{"$f":"IF(PDC_SEPT[[#This Row],[Pose prév. S]]=L$3,PDC_SEPT[[#This Row],[CA]],\"\")","v":""},{"$f":"IF(PDC_SEPT[[#This Row],[Pose prév. S]]=M$3,PDC_SEPT[[#This Row],[CA]],\"\")","v":""},{"$f":"IF(PDC_SEPT[[#This Row],[Pose prév. S]]=N$3,PDC_SEPT[[#This Row],[CA]],\"\")","v":""},null,null,"Heures estimatives",{"$f":"PDC_SEPT[[#Totals],[H estimatives]]","v":0},null,"Poseur 1",{"$f":"INDEX(H_productives[],MATCH(U$6&$T$5,H_productives[N°S]&H_productives[N°Mois],0),MATCH($T7,H_productives[#Headers],0))","v":34.25},{"$f":"INDEX(H_productives[],MATCH(V$6&$T$5,H_productives[N°S]&H_productives[N°Mois],0),MATCH($T7,H_productives[#Headers],0))","v":35},{"$f":"INDEX(H_productives[],MATCH(W$6&$T$5,H_productives[N°S]&H_productives[N°Mois],0),MATCH($T7,H_productives[#Headers],0))","v":43},{"$f":"INDEX(H_productives[],MATCH(X$6&$T$5,H_productives[N°S]&H_productives[N°Mois],0),MATCH($T7,H_productives[#Headers],0))","v":35},{"$f":"INDEX(H_productives[],MATCH(Y$6&$T$5,H_productives[N°S]&H_productives[N°Mois],0),MATCH($T7,H_productives[#Headers],0))","v":26.25}]
[null,null,null,null,null,null,null,null,null,{"$f":"IF(PDC_SEPT[[#This Row],[Pose prév. S]]=J$3,PDC_SEPT[[#This Row],[CA]],\"\")","v":""},{"$f":"IF(PDC_SEPT[[#This Row],[Pose prév. S]]=K$3,PDC_SEPT[[#This Row],[CA]],\"\")","v":""},{"$f":"IF(PDC_SEPT[[#This Row],[Pose prév. S]]=L$3,PDC_SEPT[[#This Row],[CA]],\"\")","v":""},{"$f":"IF(PDC_SEPT[[#This Row],[Pose prév. S]]=M$3,PDC_SEPT[[#This Row],[CA]],\"\")","v":""},{"$f":"IF(PDC_SEPT[[#This Row],[Pose prév. S]]=N$3,PDC_SEPT[[#This Row],[CA]],\"\")","v":""},null,null,"Heures estimatives cumulées",{"$f":"R7+AOUT!S8","v":0},null,"Poseur 2",{"$f":"INDEX(H_productives[],MATCH(U$6&$T$5,H_productives[N°S]&H_productives[N°Mois],0),MATCH($T8,H_productives[#Headers],0))","v":34.25},{"$f":"INDEX(H_productives[],MATCH(V$6&$T$5,H_productives[N°S]&H_productives[N°Mois],0),MATCH($T8,H_productives[#Headers],0))","v":35},{"$f":"INDEX(H_productives[],MATCH(W$6&$T$5,H_productives[N°S]&H_productives[N°Mois],0),MATCH($T8,H_productives[#Headers],0))","v":43},{"$f":"INDEX(H_productives[],MATCH(X$6&$T$5,H_productives[N°S]&H_productives[N°Mois],0),MATCH($T8,H_productives[#Headers],0))","v":35},{"$f":"INDEX(H_productives[],MATCH(Y$6&$T$5,H_productives[N°S]&H_productives[N°Mois],0),MATCH($T8,H_productives[#Headers],0))","v":26.25}]
[null,null,null,null,null,null,null,null,null,{"$f":"IF(PDC_SEPT[[#This Row],[Pose prév. S]]=J$3,PDC_SEPT[[#This Row],[CA]],\"\")","v":""},{"$f":"IF(PDC_SEPT[[#This Row],[Pose prév. S]]=K$3,PDC_SEPT[[#This Row],[CA]],\"\")","v":""},{"$f":"IF(PDC_SEPT[[#This Row],[Pose prév. S]]=L$3,PDC_SEPT[[#This Row],[CA]],\"\")","v":""},{"$f":"IF(PDC_SEPT[[#This Row],[Pose prév. S]]=M$3,PDC_SEPT[[#This Row],[CA]],\"\")","v":""},{"$f":"IF(PDC_SEPT[[#This Row],[Pose prév. S]]=N$3,PDC_SEPT[[#This Row],[CA]],\"\")","v":""},null,null,null,null,null,"Poseur 3",{"$f":"INDEX(H_productives[],MATCH(U$6&$T$5,H_productives[N°S]&H_productives[N°Mois],0),MATCH($T9,H_productives[#Headers],0))","v":34.25},{"$f":"INDEX(H_productives[],MATCH(V$6&$T$5,H_productives[N°S]&H_productives[N°Mois],0),MATCH($T9,H_productives[#Headers],0))","v":35},{"$f":"INDEX(H_productives[],MATCH(W$6&$T$5,H_productives[N°S]&H_productives[N°Mois],0),MATCH($T9,H_productives[#Headers],0))","v":43},{"$f":"INDEX(H_productives[],MATCH(X$6&$T$5,H_productives[N°S]&H_productives[N°Mois],0),MATCH($T9,H_productives[#Headers],0))","v":35},{"$f":"INDEX(H_productives[],MATCH(Y$6&$T$5,H_productives[N°S]&H_productives[N°Mois],0),MATCH($T9,H_productives[#Headers],0))","v":26.25}]
[{"$f":"SUBTOTAL(103,PDC_SEPT[Chantiers])","v":0},null,null,null,{"$f":"SUBTOTAL(109,PDC_SEPT[H estimatives])","v":0},{"$f":"SUBTOTAL(109,PDC_SEPT[H réelles réalisées])","v":0},{"$f":"SUBTOTAL(109,PDC_SEPT[CA])","v":0},null,null,null,null,null,null,null,null,null,"Heures en surplus (à décaler)",{"$f":"IF(TODAY()<=Q1,IF(AOUT!S10>0,IF((R7+AOUT!S10)>R13,(R7+AOUT!S10)-R13,0),IF(R7>R13,R7-R13,0)),IF(R7>R13,R7-R13,0))","v":0},null,"Poseur 4",{"$f":"INDEX(H_productives[],MATCH(U$6&$T$5,H_productives[N°S]&H_productives[N°Mois],0),MATCH($T10,H_productives[#Headers],0))","v":34.25},{"$f":"INDEX(H_productives[],MATCH(V$6&$T$5,H_productives[N°S]&H_productives[N°Mois],0),MATCH($T10,H_productives[#Headers],0))","v":35},{"$f":"INDEX(H_productives[],MATCH(W$6&$T$5,H_productives[N°S]&H_productives[N°Mois],0),MATCH($T10,H_productives[#Headers],0))","v":43},{"$f":"INDEX(H_productives[],MATCH(X$6&$T$5,H_productives[N°S]&H_productives[N°Mois],0),MATCH($T10,H_productives[#Headers],0))","v":35},{"$f":"INDEX(H_productives[],MATCH(Y$6&$T$5,H_productives[N°S]&H_productives[N°Mois],0),MATCH($T10,H_productives[#Headers],0))","v":26.25}]
[null,null,null,null,null,"Nombre d'h prévues :",null,null,null,{"$f":"SUMIF(PDC_SEPT[Pose prév. S],PDC_SEPT[[#Headers],[36]],PDC_SEPT[H estimatives])","v":0},{"$f":"SUMIF(PDC_SEPT[Pose prév. S],PDC_SEPT[[#Headers],[37]],PDC_SEPT[H estimatives])","v":0},{"$f":"SUMIF(PDC_SEPT[Pose prév. S],PDC_SEPT[[#Headers],[38]],PDC_SEPT[H estimatives])","v":0},{"$f":"SUMIF(PDC_SEPT[Pose prév. S],PDC_SEPT[[#Headers],[39]],PDC_SEPT[H estimatives])","v":0},{"$f":"SUMIF(PDC_SEPT[Pose prév. S],PDC_SEPT[[#Headers],[40]],PDC_SEPT[H estimatives])","v":0},null,null,"Heures restantes",{"$f":"IF(R10=0,IF(TODAY()<=Q1,R13-(R7+AOUT!S10),R13-R7),0)","v":1217},null,"Poseur 5",{"$f":"INDEX(H_productives[],MATCH(U$6&$T$5,H_productives[N°S]&H_productives[N°Mois],0),MATCH($T11,H_productives[#Headers],0))","v":34.25},{"$f":"INDEX(H_productives[],MATCH(V$6&$T$5,H_productives[N°S]&H_productives[N°Mois],0),MATCH($T11,H_productives[#Headers],0))","v":35},{"$f":"INDEX(H_productives[],MATCH(W$6&$T$5,H_productives[N°S]&H_productives[N°Mois],0),MATCH($T11,H_productives[#Headers],0))","v":43},{"$f":"INDEX(H_productives[],MATCH(X$6&$T$5,H_productives[N°S]&H_productives[N°Mois],0),MATCH($T11,H_productives[#Headers],0))","v":35},{"$f":"INDEX(H_productives[],MATCH(Y$6&$T$5,H_productives[N°S]&H_productives[N°Mois],0),MATCH($T11,H_productives[#Headers],0))","v":26.25}]
[null,null,null,null,null,"Différence d'h (H prévues - H prod.) :",null,null,null,{"$f":"J11-U16","v":-201.875},{"$f":"K11-V16","v":-212.5},{"$f":"L11-W16","v":-253.3},{"$f":"M11-X16","v":-212.5},{"$f":"N11-Y16","v":-154.27500000000001},null,null,null,null,null,"Poseur 6",{"$f":"INDEX(H_productives[],MATCH(U$6&$T$5,H_productives[N°S]&H_productives[N°Mois],0),MATCH($T12,H_productives[#Headers],0))","v":34.25},{"$f":"INDEX(H_productives[],MATCH(V$6&$T$5,H_productives[N°S]&H_productives[N°Mois],0),MATCH($T12,H_productives[#Headers],0))","v":35},{"$f":"INDEX(H_productives[],MATCH(W$6&$T$5,H_productives[N°S]&H_productives[N°Mois],0),MATCH($T12,H_productives[#Headers],0))","v":43},{"$f":"INDEX(H_productives[],MATCH(X$6&$T$5,H_productives[N°S]&H_productives[N°Mois],0),MATCH($T12,H_productives[#Headers],0))","v":35},{"$f":"INDEX(H_productives[],MATCH(Y$6&$T$5,H_productives[N°S]&H_productives[N°Mois],0),MATCH($T12,H_productives[#Headers],0))","v":26.25}]
[null,null,null,null,null,"CA/mois\nTOTAL",{"$f":"SUMIF(PDC_SEPT[Plannifié et validé],\"ü\",PDC_SEPT[CA])","v":0},null,null,null,null,null,null,null,null,null,"Heures prod.",{"$f":"SUM(Tps_travaillées_OCT384386387388389391[[#Totals],[36]:[40]])","v":1217},null,"Poseur 7",{"$f":"INDEX(H_productives[],MATCH(U$6&$T$5,H_productives[N°S]&H_productives[N°Mois],0),MATCH($T13,H_productives[#Headers],0))","v":32},{"$f":"INDEX(H_productives[],MATCH(V$6&$T$5,H_productives[N°S]&H_productives[N°Mois],0),MATCH($T13,H_productives[#Headers],0))","v":40},{"$f":"INDEX(H_productives[],MATCH(W$6&$T$5,H_productives[N°S]&H_productives[N°Mois],0),MATCH($T13,H_productives[#Headers],0))","v":40},{"$f":"INDEX(H_productives[],MATCH(X$6&$T$5,H_productives[N°S]&H_productives[N°Mois],0),MATCH($T13,H_productives[#Headers],0))","v":40},{"$f":"INDEX(H_productives[],MATCH(Y$6&$T$5,H_productives[N°S]&H_productives[N°Mois],0),MATCH($T13,H_productives[#Headers],0))","v":24}]
[null,null,null,null,null,null,null,null,null,null,null,null,null,null,null,null,"Heures prod. cumulées",{"$f":"R13+AOUT!S14","v":12587.85},null,"Total",{"$f":"SUBTOTAL(109,Tps_travaillées_OCT384386387388389391[36])","v":237.5},{"$f":"SUBTOTAL(109,Tps_travaillées_OCT384386387388389391[37])","v":250},{"$f":"SUBTOTAL(109,Tps_travaillées_OCT384386387388389391[38])","v":298},{"$f":"SUBTOTAL(109,Tps_travaillées_OCT384386387388389391[39])","v":250},{"$f":"SUBTOTAL(109,Tps_travaillées_OCT384386387388389391[40])","v":181.5}]
[null,null,null,null,null,null,null,null,null,null,null,null,null,null,null,null,null,null,null,-0.15,{"$f":"Tps_travaillées_OCT384386387388389391[[#Totals],[36]]*$T$15","v":-35.625},{"$f":"Tps_travaillées_OCT384386387388389391[[#Totals],[37]]*$T$15","v":-37.5},{"$f":"Tps_travaillées_OCT384386387388389391[[#Totals],[38]]*$T$15","v":-44.699999999999996},{"$f":"Tps_travaillées_OCT384386387388389391[[#Totals],[39]]*$T$15","v":-37.5},{"$f":"Tps_travaillées_OCT384386387388389391[[#Totals],[40]]*$T$15","v":-27.224999999999998}]
[null,null,null,null,null,null,null,null,null,null,null,null,null,null,null,null,"Heures réelles réalisées",{"$f":"PDC_SEPT[[#Totals],[H réelles réalisées]]","v":0},null,"Heure réelles travaillées",{"$f":"SUM(U14:U15)","v":201.875},{"$f":"SUM(V14:V15)","v":212.5},{"$f":"SUM(W14:W15)","v":253.3},{"$f":"SUM(X14:X15)","v":212.5},{"$f":"SUM(Y14:Y15)","v":154.27500000000001}]
[null,null,null,null,null,null,null,null,null,null,null,null,null,null,null,null,"Heures réelles réalisées cumulées",{"$f":"R16+AOUT!S17","v":0},null,"Soit en JOURS",{"$f":"U16/8.75","v":23.071428571428573},{"$f":"V16/8.75","v":24.285714285714285},{"$f":"W16/8.75","v":28.94857142857143},{"$f":"X16/8.75","v":24.285714285714285},{"$f":"Y16/8.75","v":17.631428571428572}]
[]
[null,null,null,null,null,null,null,null,null,null,null,null,null,null,null,null,"Moyenne CA/h estimatives",{"$f":"SUM(PDC_SEPT[[#Totals],[CA]]/E10)","v":{"$error":"#DIV/0!"}}]
[null,null,null,null,null,null,null,null,null,null,null,null,null,null,null,null,"Moyenne CA/h réalisées",{"$f":"G13/PDC_SEPT[[#Totals],[H réelles réalisées]]","v":{"$error":"#DIV/0!"}}]
[null,null,null,null,null,null,null,null,null,null,null,null,null,null,null,null,"Moyenne CA/h réalisées cumulées",{"$f":"R25/R17","v":{"$error":"#DIV/0!"}}]
[]
[null,null,null,null,null,null,null,null,null,null,null,null,null,null,null,null,"CA prévi. à poser au cours de l'année",{"$f":"PDC_SEPT[[#Totals],[CA]]","v":0}]
[null,null,null,null,null,null,null,null,null,null,null,null,null,null,null,null,"CA prévision cumulé",{"$f":"PDC_SEPT[[#Totals],[CA]]+AOUT!S24","v":0}]
[null,null,null,null,null,null,null,null,null,null,null,null,null,null,null,null,"CA réel cumulé",{"$f":"G13+AOUT!S25","v":0}]

{"sheet":"Fermetures & jours fériés","index":12,"n_rows":370,"n_cols":20,"rows_kept":370,"cut":false,"hidden":true,"merged":[[0,1,0,2],[1,1,1,2]]}
[null,"Année début d'exercice :",null,2019]
[null,"Année fin d'exercice :",null,{"$f":"D1+1","v":2020}]
[]
[null,"Date","N°S","N° mois","Mois","Jour","Etat",null,null,"Fermeture","Date début","Date de reprise","Total jour","S de début","S de reprise",null,"Date","Jours férié ou improductif","Etat","N° S"]
[null,{"$f":"DATE(D1,10,1)","v":"2019-10-01"},{"$f":"_xlfn.ISOWEEKNUM(Tableau1[[#This Row],[Date]])","v":40},{"$f":"MONTH(Tableau1[[#This Row],[Date]])","v":10},{"$f":"TEXT(Tableau1[[#This Row],[Date]],\"mmmm\")","v":"octobre"},{"$f":"CHOOSE(WEEKDAY(Tableau1[[#This Row],[Date]],2),\"lu\",\"ma\",\"me\",\"je\",\"ve\",\"sa\",\"di\")","v":"ma"},{"$f":"IFERROR(VLOOKUP(B5,Tableau30[],3,FALSE),IF(OR(AND($K$5<=B5,$L$5>B5),AND($K$6<=Tableau1[[#This Row],[Date]],$L$6>=Tableau1[[#This Row],[Date]])),\"FERMÉE\",IF(OR(Tableau1[[#This Row],[Jour]]=\"sa\",Tableau1[[#This Row],[Jour]]=\"di\",AND(Tableau1[[#This Row],[Jour]]=\"ve\",MOD(Tableau1[[#This Row],[N°S]],2)=1)),\"REPOS\",IF(Tableau1[[#This Row],[Jour]]=\"ve\",8,8.75))))","v":8.75},null,null,"Noël","2019-12-25","2020-01-06",{"$f":"Tableau29[[#This Row],[Date de reprise]]-Tableau29[[#This Row],[Date début]]-(COUNTIFS(Tableau30[Date],\"<=\"&Tableau29[[#This Row],[Date de reprise]],Tableau30[Date],\">=\"&Tableau29[[#This Row],[Date début]]))","v":10},{"$f":"IF(COUNTA(Tableau29[[#This Row],[Date début]:[Date de reprise]])=2,_xlfn.ISOWEEKNUM(Tableau29[[#This Row],[Date début]]),\"\")","v":52},{"$f":"IF(COUNTA(Tableau29[[#This Row],[Date début]:[Date de reprise]])=2,_xlfn.ISOWEEKNUM(Tableau29[[#This Row],[Date de reprise]]),\"\")","v":2},null,"2019-10-07","INVENTAIRE",{"$f":"IF(COUNTA(Tableau30[[#This Row],[Jours férié ou improductif]])=1,\"FÉRIÉ/INACTIF\",\"\")","v":"FÉRIÉ/INACTIF"},{"$f":"_xlfn.ISOWEEKNUM(Tableau30[[#This Row],[Date]])","v":41}]
[null,{"$f":"B5+1","v":"2019-10-02"},{"$f":"_xlfn.ISOWEEKNUM(Tableau1[[#This Row],[Date]])","v":40},{"$f":"MONTH(Tableau1[[#This Row],[Date]])","v":10},{"$f":"TEXT(Tableau1[[#This Row],[Date]],\"mmmm\")","v":"octobre"},{"$f":"CHOOSE(WEEKDAY(Tableau1[[#This Row],[Date]],2),\"lu\",\"ma\",\"me\",\"je\",\"ve\",\"sa\",\"di\")","v":"me"},{"$f":"IFERROR(VLOOKUP(B6,Tableau30[],3,FALSE),IF(OR(AND($K$5<=B6,$L$5>B6),AND($K$6<=Tableau1[[#This Row],[Date]],$L$6>=Tableau1[[#This Row],[Date]])),\"FERMÉE\",IF(OR(Tableau1[[#This Row],[Jour]]=\"sa\",Tableau1[[#This Row],[Jour]]=\"di\",AND(Tableau1[[#This Row],[Jour]]=\"ve\",MOD(Tableau1[[#This Row],[N°S]],2)=1)),\"REPOS\",IF(Tableau1[[#This Row],[Jour]]=\"ve\",8,8.75))))","v":8.75},null,null,"Été",null,null,{"$f":"Tableau29[[#This Row],[Date de reprise]]-Tableau29[[#This Row],[Date début]]-(COUNTIFS(Tableau30[Date],\"<=\"&Tableau29[[#This Row],[Date de reprise]],Tableau30[Date],\">=\"&Tableau29[[#This Row],[Date début]]))","v":0},{"$f":"IF(COUNTA(Tableau29[[#This Row],[Date début]:[Date de reprise]])=2,_xlfn.ISOWEEKNUM(Tableau29[[#This Row],[Date début]]),\"\")","v":""},{"$f":"IF(COUNTA(Tableau29[[#This Row],[Date début]:[Date de reprise]])=2,_xlfn.ISOWEEKNUM(Tableau29[[#This Row],[Date de reprise]]),\"\")","v":""},null,"2019-11-01","Toussaint",{"$f":"IF(COUNTA(Tableau30[[#This Row],[Jours férié ou improductif]])=1,\"FÉRIÉ/INACTIF\",\"\")","v":"FÉRIÉ/INACTIF"},{"$f":"_xlfn.ISOWEEKNUM(Tableau30[[#This Row],[Date]])","v":44}]
[null,{"$f":"B6+1","v":"2019-10-03"},{"$f":"_xlfn.ISOWEEKNUM(Tableau1[[#This Row],[Date]])","v":40},{"$f":"MONTH(Tableau1[[#This Row],[Date]])","v":10},{"$f":"TEXT(Tableau1[[#This Row],[Date]],\"mmmm\")","v":"octobre"},{"$f":"CHOOSE(WEEKDAY(Tableau1[[#This Row],[Date]],2),\"lu\",\"ma\",\"me\",\"je\",\"ve\",\"sa\",\"di\")","v":"je"},{"$f":"IFERROR(VLOOKUP(B7,Tableau30[],3,FALSE),IF(OR(AND($K$5<=B7,$L$5>B7),AND($K$6<=Tableau1[[#This Row],[Date]],$L$6>=Tableau1[[#This Row],[Date]])),\"FERMÉE\",IF(OR(Tableau1[[#This Row],[Jour]]=\"sa\",Tableau1[[#This Row],[Jour]]=\"di\",AND(Tableau1[[#This Row],[Jour]]=\"ve\",MOD(Tableau1[[#This Row],[N°S]],2)=1)),\"REPOS\",IF(Tableau1[[#This Row],[Jour]]=\"ve\",8,8.75))))","v":8.75},null,null,null,null,null,null,null,null,null,"2019-11-11","Armistice 1918",{"$f":"IF(COUNTA(Tableau30[[#This Row],[Jours férié ou improductif]])=1,\"FÉRIÉ/INACTIF\",\"\")","v":"FÉRIÉ/INACTIF"},{"$f":"_xlfn.ISOWEEKNUM(Tableau30[[#This Row],[Date]])","v":46}]
[null,"2019-10-04",{"$f":"_xlfn.ISOWEEKNUM(Tableau1[[#This Row],[Date]])","v":40},{"$f":"MONTH(Tableau1[[#This Row],[Date]])","v":10},{"$f":"TEXT(Tableau1[[#This Row],[Date]],\"mmmm\")","v":"octobre"},{"$f":"CHOOSE(WEEKDAY(Tableau1[[#This Row],[Date]],2),\"lu\",\"ma\",\"me\",\"je\",\"ve\",\"sa\",\"di\")","v":"ve"},{"$f":"IFERROR(VLOOKUP(B8,Tableau30[],3,FALSE),IF(OR(AND($K$5<=B8,$L$5>B8),AND($K$6<=Tableau1[[#This Row],[Date]],$L$6>=Tableau1[[#This Row],[Date]])),\"FERMÉE\",IF(OR(Tableau1[[#This Row],[Jour]]=\"sa\",Tableau1[[#This Row],[Jour]]=\"di\",AND(Tableau1[[#This Row],[Jour]]=\"ve\",MOD(Tableau1[[#This Row],[N°S]],2)=1)),\"REPOS\",IF(Tableau1[[#This Row],[Jour]]=\"ve\",8,8.75))))","v":8},null,null,"Etat","Nombre",null,null,null,null,null,"2019-12-25","Noël",{"$f":"IF(COUNTA(Tableau30[[#This Row],[Jours férié ou improductif]])=1,\"FÉRIÉ/INACTIF\",\"\")","v":"FÉRIÉ/INACTIF"},{"$f":"_xlfn.ISOWEEKNUM(Tableau30[[#This Row],[Date]])","v":52}]
[null,"2019-10-05",{"$f":"_xlfn.ISOWEEKNUM(Tableau1[[#This Row],[Date]])","v":40},{"$f":"MONTH(Tableau1[[#This Row],[Date]])","v":10},{"$f":"TEXT(Tableau1[[#This Row],[Date]],\"mmmm\")","v":"octobre"},{"$f":"CHOOSE(WEEKDAY(Tableau1[[#This Row],[Date]],2),\"lu\",\"ma\",\"me\",\"je\",\"ve\",\"sa\",\"di\")","v":"sa"},{"$f":"IFERROR(VLOOKUP(B9,Tableau30[],3,FALSE),IF(OR(AND($K$5<=B9,$L$5>B9),AND($K$6<=Tableau1[[#This Row],[Date]],$L$6>=Tableau1[[#This Row],[Date]])),\"FERMÉE\",IF(OR(Tableau1[[#This Row],[Jour]]=\"sa\",Tableau1[[#This Row],[Jour]]=\"di\",AND(Tableau1[[#This Row],[Jour]]=\"ve\",MOD(Tableau1[[#This Row],[N°S]],2)=1)),\"REPOS\",IF(Tableau1[[#This Row],[Jour]]=\"ve\",8,8.75))))","v":"REPOS"},null,null,"FÉRIÉ/INACTIF",{"$f":"COUNTIF(Tableau1[Etat],Tableau31[[#This Row],[Etat]])","v":11},null,null,null,null,null,"2020-01-01","Jour de l'an",{"$f":"IF(COUNTA(Tableau30[[#This Row],[Jours férié ou improductif]])=1,\"FÉRIÉ/INACTIF\",\"\")","v":"FÉRIÉ/INACTIF"},{"$f":"_xlfn.ISOWEEKNUM(Tableau30[[#This Row],[Date]])","v":1}]
[null,"2019-10-06",{"$f":"_xlfn.ISOWEEKNUM(Tableau1[[#This Row],[Date]])","v":40},{"$f":"MONTH(Tableau1[[#This Row],[Date]])","v":10},{"$f":"TEXT(Tableau1[[#This Row],[Date]],\"mmmm\")","v":"octobre"},{"$f":"CHOOSE(WEEKDAY(Tableau1[[#This Row],[Date]],2),\"lu\",\"ma\",\"me\",\"je\",\"ve\",\"sa\",\"di\")","v":"di"},{"$f":"IFERROR(VLOOKUP(B10,Tableau30[],3,FALSE),IF(OR(AND($K$5<=B10,$L$5>B10),AND($K$6<=Tableau1[[#This Row],[Date]],$L$6>=Tableau1[[#This Row],[Date]])),\"FERMÉE\",IF(OR(Tableau1[[#This Row],[Jour]]=\"sa\",Tableau1[[#This Row],[Jour]]=\"di\",AND(Tableau1[[#This Row],[Jour]]=\"ve\",MOD(Tableau1[[#This Row],[N°S]],2)=1)),\"REPOS\",IF(Tableau1[[#This Row],[Jour]]=\"ve\",8,8.75))))","v":"REPOS"},null,null,"FERMÉE",{"$f":"COUNTIF(Tableau1[Etat],Tableau31[[#This Row],[Etat]])","v":10},null,null,null,null,null,"2020-04-13","Lundi de Pâques",{"$f":"IF(COUNTA(Tableau30[[#This Row],[Jours férié ou improductif]])=1,\"FÉRIÉ/INACTIF\",\"\")","v":"FÉRIÉ/INACTIF"},{"$f":"_xlfn.ISOWEEKNUM(Tableau30[[#This Row],[Date]])","v":16}]
[null,"2019-10-07",{"$f":"_xlfn.ISOWEEKNUM(Tableau1[[#This Row],[Date]])","v":41},{"$f":"MONTH(Tableau1[[#This Row],[Date]])","v":10},{"$f":"TEXT(Tableau1[[#This Row],[Date]],\"mmmm\")","v":"octobre"},{"$f":"CHOOSE(WEEKDAY(Tableau1[[#This Row],[Date]],2),\"lu\",\"ma\",\"me\",\"je\",\"ve\",\"sa\",\"di\")","v":"lu"},{"$f":"IFERROR(VLOOKUP(B11,Tableau30[],3,FALSE),IF(OR(AND($K$5<=B11,$L$5>B11),AND($K$6<=Tableau1[[#This Row],[Date]],$L$6>=Tableau1[[#This Row],[Date]])),\"FERMÉE\",IF(OR(Tableau1[[#This Row],[Jour]]=\"sa\",Tableau1[[#This Row],[Jour]]=\"di\",AND(Tableau1[[#This Row],[Jour]]=\"ve\",MOD(Tableau1[[#This Row],[N°S]],2)=1)),\"REPOS\",IF(Tableau1[[#This Row],[Jour]]=\"ve\",8,8.75))))","v":"FÉRIÉ/INACTIF"},null,null,"REPOS",{"$f":"COUNTIF(Tableau1[Etat],Tableau31[[#This Row],[Etat]])","v":124},null,null,null,null,null,"2020-05-01","Fête du Travail",{"$f":"IF(COUNTA(Tableau30[[#This Row],[Jours férié ou improductif]])=1,\"FÉRIÉ/INACTIF\",\"\")","v":"FÉRIÉ/INACTIF"},{"$f":"_xlfn.ISOWEEKNUM(Tableau30[[#This Row],[Date]])","v":18}]
[null,"2019-10-08",{"$f":"_xlfn.ISOWEEKNUM(Tableau1[[#This Row],[Date]])","v":41},{"$f":"MONTH(Tableau1[[#This Row],[Date]])","v":10},{"$f":"TEXT(Tableau1[[#This Row],[Date]],\"mmmm\")","v":"octobre"},{"$f":"CHOOSE(WEEKDAY(Tableau1[[#This Row],[Date]],2),\"lu\",\"ma\",\"me\",\"je\",\"ve\",\"sa\",\"di\")","v":"ma"},{"$f":"IFERROR(VLOOKUP(B12,Tableau30[],3,FALSE),IF(OR(AND($K$5<=B12,$L$5>B12),AND($K$6<=Tableau1[[#This Row],[Date]],$L$6>=Tableau1[[#This Row],[Date]])),\"FERMÉE\",IF(OR(Tableau1[[#This Row],[Jour]]=\"sa\",Tableau1[[#This Row],[Jour]]=\"di\",AND(Tableau1[[#This Row],[Jour]]=\"ve\",MOD(Tableau1[[#This Row],[N°S]],2)=1)),\"REPOS\",IF(Tableau1[[#This Row],[Jour]]=\"ve\",8,8.75))))","v":8.75},null,null,8,{"$f":"COUNTIF(Tableau1[Etat],Tableau31[[#This Row],[Etat]])","v":23},null,null,null,null,null,"2020-05-21","Jeudi de l'Ascension",{"$f":"IF(COUNTA(Tableau30[[#This Row],[Jours férié ou improductif]])=1,\"FÉRIÉ/INACTIF\",\"\")","v":"FÉRIÉ/INACTIF"},{"$f":"_xlfn.ISOWEEKNUM(Tableau30[[#This Row],[Date]])","v":21}]
[null,"2019-10-09",{"$f":"_xlfn.ISOWEEKNUM(Tableau1[[#This Row],[Date]])","v":41},{"$f":"MONTH(Tableau1[[#This Row],[Date]])","v":10},{"$f":"TEXT(Tableau1[[#This Row],[Date]],\"mmmm\")","v":"octobre"},{"$f":"CHOOSE(WEEKDAY(Tableau1[[#This Row],[Date]],2),\"lu\",\"ma\",\"me\",\"je\",\"ve\",\"sa\",\"di\")","v":"me"},{"$f":"IFERROR(VLOOKUP(B13,Tableau30[],3,FALSE),IF(OR(AND($K$5<=B13,$L$5>B13),AND($K$6<=Tableau1[[#This Row],[Date]],$L$6>=Tableau1[[#This Row],[Date]])),\"FERMÉE\",IF(OR(Tableau1[[#This Row],[Jour]]=\"sa\",Tableau1[[#This Row],[Jour]]=\"di\",AND(Tableau1[[#This Row],[Jour]]=\"ve\",MOD(Tableau1[[#This Row],[N°S]],2)=1)),\"REPOS\",IF(Tableau1[[#This Row],[Jour]]=\"ve\",8,8.75))))","v":8.75},null,null,8.75,{"$f":"COUNTIF(Tableau1[Etat],Tableau31[[#This Row],[Etat]])","v":198},null,null,null,null,null,"2020-06-01","Lundi de Pentecote",{"$f":"IF(COUNTA(Tableau30[[#This Row],[Jours férié ou improductif]])=1,\"FÉRIÉ/INACTIF\",\"\")","v":"FÉRIÉ/INACTIF"},{"$f":"_xlfn.ISOWEEKNUM(Tableau30[[#This Row],[Date]])","v":23}]
[null,"2019-10-10",{"$f":"_xlfn.ISOWEEKNUM(Tableau1[[#This Row],[Date]])","v":41},{"$f":"MONTH(Tableau1[[#This Row],[Date]])","v":10},{"$f":"TEXT(Tableau1[[#This Row],[Date]],\"mmmm\")","v":"octobre"},{"$f":"CHOOSE(WEEKDAY(Tableau1[[#This Row],[Date]],2),\"lu\",\"ma\",\"me\",\"je\",\"ve\",\"sa\",\"di\")","v":"je"},{"$f":"IFERROR(VLOOKUP(B14,Tableau30[],3,FALSE),IF(OR(AND($K$5<=B14,$L$5>B14),AND($K$6<=Tableau1[[#This Row],[Date]],$L$6>=Tableau1[[#This Row],[Date]])),\"FERMÉE\",IF(OR(Tableau1[[#This Row],[Jour]]=\"sa\",Tableau1[[#This Row],[Jour]]=\"di\",AND(Tableau1[[#This Row],[Jour]]=\"ve\",MOD(Tableau1[[#This Row],[N°S]],2)=1)),\"REPOS\",IF(Tableau1[[#This Row],[Jour]]=\"ve\",8,8.75))))","v":8.75},null,null,"Total",{"$f":"SUBTOTAL(109,Tableau31[Nombre])","v":366},null,null,null,null,null,"2020-07-14","Fête nationale",{"$f":"IF(COUNTA(Tableau30[[#This Row],[Jours férié ou improductif]])=1,\"FÉRIÉ/INACTIF\",\"\")","v":"FÉRIÉ/INACTIF"},{"$f":"_xlfn.ISOWEEKNUM(Tableau30[[#This Row],[Date]])","v":29}]
[null,"2019-10-11",{"$f":"_xlfn.ISOWEEKNUM(Tableau1[[#This Row],[Date]])","v":41},{"$f":"MONTH(Tableau1[[#This Row],[Date]])","v":10},{"$f":"TEXT(Tableau1[[#This Row],[Date]],\"mmmm\")","v":"octobre"},{"$f":"CHOOSE(WEEKDAY(Tableau1[[#This Row],[Date]],2),\"lu\",\"ma\",\"me\",\"je\",\"ve\",\"sa\",\"di\")","v":"ve"},{"$f":"IFERROR(VLOOKUP(B15,Tableau30[],3,FALSE),IF(OR(AND($K$5<=B15,$L$5>B15),AND($K$6<=Tableau1[[#This Row],[Date]],$L$6>=Tableau1[[#This Row],[Date]])),\"FERMÉE\",IF(OR(Tableau1[[#This Row],[Jour]]=\"sa\",Tableau1[[#This Row],[Jour]]=\"di\",AND(Tableau1[[#This Row],[Jour]]=\"ve\",MOD(Tableau1[[#This Row],[N°S]],2)=1)),\"REPOS\",IF(Tableau1[[#This Row],[Jour]]=\"ve\",8,8.75))))","v":"REPOS"},null,null,null,null,null,null,null,null,null,"2020-08-15","Assomption",{"$f":"IF(COUNTA(Tableau30[[#This Row],[Jours férié ou improductif]])=1,\"FÉRIÉ/INACTIF\",\"\")","v":"FÉRIÉ/INACTIF"},{"$f":"_xlfn.ISOWEEKNUM(Tableau30[[#This Row],[Date]])","v":33}]
[null,"2019-10-12",{"$f":"_xlfn.ISOWEEKNUM(Tableau1[[#This Row],[Date]])","v":41},{"$f":"MONTH(Tableau1[[#This Row],[Date]])","v":10},{"$f":"TEXT(Tableau1[[#This Row],[Date]],\"mmmm\")","v":"octobre"},{"$f":"CHOOSE(WEEKDAY(Tableau1[[#This Row],[Date]],2),\"lu\",\"ma\",\"me\",\"je\",\"ve\",\"sa\",\"di\")","v":"sa"},{"$f":"IFERROR(VLOOKUP(B16,Tableau30[],3,FALSE),IF(OR(AND($K$5<=B16,$L$5>B16),AND($K$6<=Tableau1[[#This Row],[Date]],$L$6>=Tableau1[[#This Row],[Date]])),\"FERMÉE\",IF(OR(Tableau1[[#This Row],[Jour]]=\"sa\",Tableau1[[#This Row],[Jour]]=\"di\",AND(Tableau1[[#This Row],[Jour]]=\"ve\",MOD(Tableau1[[#This Row],[N°S]],2)=1)),\"REPOS\",IF(Tableau1[[#This Row],[Jour]]=\"ve\",8,8.75))))","v":"REPOS"},null,null,null,null,null,null,null,null,null,"Total",null,{"$f":"SUBTOTAL(103,Tableau30[Etat])","v":11}]
[null,"2019-10-13",{"$f":"_xlfn.ISOWEEKNUM(Tableau1[[#This Row],[Date]])","v":41},{"$f":"MONTH(Tableau1[[#This Row],[Date]])","v":10},{"$f":"TEXT(Tableau1[[#This Row],[Date]],\"mmmm\")","v":"octobre"},{"$f":"CHOOSE(WEEKDAY(Tableau1[[#This Row],[Date]],2),\"lu\",\"ma\",\"me\",\"je\",\"ve\",\"sa\",\"di\")","v":"di"},{"$f":"IFERROR(VLOOKUP(B17,Tableau30[],3,FALSE),IF(OR(AND($K$5<=B17,$L$5>B17),AND($K$6<=Tableau1[[#This Row],[Date]],$L$6>=Tableau1[[#This Row],[Date]])),\"FERMÉE\",IF(OR(Tableau1[[#This Row],[Jour]]=\"sa\",Tableau1[[#This Row],[Jour]]=\"di\",AND(Tableau1[[#This Row],[Jour]]=\"ve\",MOD(Tableau1[[#This Row],[N°S]],2)=1)),\"REPOS\",IF(Tableau1[[#This Row],[Jour]]=\"ve\",8,8.75))))","v":"REPOS"}]
[null,"2019-10-14",{"$f":"_xlfn.ISOWEEKNUM(Tableau1[[#This Row],[Date]])","v":42},{"$f":"MONTH(Tableau1[[#This Row],[Date]])","v":10},{"$f":"TEXT(Tableau1[[#This Row],[Date]],\"mmmm\")","v":"octobre"},{"$f":"CHOOSE(WEEKDAY(Tableau1[[#This Row],[Date]],2),\"lu\",\"ma\",\"me\",\"je\",\"ve\",\"sa\",\"di\")","v":"lu"},{"$f":"IFERROR(VLOOKUP(B18,Tableau30[],3,FALSE),IF(OR(AND($K$5<=B18,$L$5>B18),AND($K$6<=Tableau1[[#This Row],[Date]],$L$6>=Tableau1[[#This Row],[Date]])),\"FERMÉE\",IF(OR(Tableau1[[#This Row],[Jour]]=\"sa\",Tableau1[[#This Row],[Jour]]=\"di\",AND(Tableau1[[#This Row],[Jour]]=\"ve\",MOD(Tableau1[[#This Row],[N°S]],2)=1)),\"REPOS\",IF(Tableau1[[#This Row],[Jour]]=\"ve\",8,8.75))))","v":8.75}]
[null,"2019-10-15",{"$f":"_xlfn.ISOWEEKNUM(Tableau1[[#This Row],[Date]])","v":42},{"$f":"MONTH(Tableau1[[#This Row],[Date]])","v":10},{"$f":"TEXT(Tableau1[[#This Row],[Date]],\"mmmm\")","v":"octobre"},{"$f":"CHOOSE(WEEKDAY(Tableau1[[#This Row],[Date]],2),\"lu\",\"ma\",\"me\",\"je\",\"ve\",\"sa\",\"di\")","v":"ma"},{"$f":"IFERROR(VLOOKUP(B19,Tableau30[],3,FALSE),IF(OR(AND($K$5<=B19,$L$5>B19),AND($K$6<=Tableau1[[#This Row],[Date]],$L$6>=Tableau1[[#This Row],[Date]])),\"FERMÉE\",IF(OR(Tableau1[[#This Row],[Jour]]=\"sa\",Tableau1[[#This Row],[Jour]]=\"di\",AND(Tableau1[[#This Row],[Jour]]=\"ve\",MOD(Tableau1[[#This Row],[N°S]],2)=1)),\"REPOS\",IF(Tableau1[[#This Row],[Jour]]=\"ve\",8,8.75))))","v":8.75}]
[null,"2019-10-16",{"$f":"_xlfn.ISOWEEKNUM(Tableau1[[#This Row],[Date]])","v":42},{"$f":"MONTH(Tableau1[[#This Row],[Date]])","v":10},{"$f":"TEXT(Tableau1[[#This Row],[Date]],\"mmmm\")","v":"octobre"},{"$f":"CHOOSE(WEEKDAY(Tableau1[[#This Row],[Date]],2),\"lu\",\"ma\",\"me\",\"je\",\"ve\",\"sa\",\"di\")","v":"me"},{"$f":"IFERROR(VLOOKUP(B20,Tableau30[],3,FALSE),IF(OR(AND($K$5<=B20,$L$5>B20),AND($K$6<=Tableau1[[#This Row],[Date]],$L$6>=Tableau1[[#This Row],[Date]])),\"FERMÉE\",IF(OR(Tableau1[[#This Row],[Jour]]=\"sa\",Tableau1[[#This Row],[Jour]]=\"di\",AND(Tableau1[[#This Row],[Jour]]=\"ve\",MOD(Tableau1[[#This Row],[N°S]],2)=1)),\"REPOS\",IF(Tableau1[[#This Row],[Jour]]=\"ve\",8,8.75))))","v":8.75}]
[null,"2019-10-17",{"$f":"_xlfn.ISOWEEKNUM(Tableau1[[#This Row],[Date]])","v":42},{"$f":"MONTH(Tableau1[[#This Row],[Date]])","v":10},{"$f":"TEXT(Tableau1[[#This Row],[Date]],\"mmmm\")","v":"octobre"},{"$f":"CHOOSE(WEEKDAY(Tableau1[[#This Row],[Date]],2),\"lu\",\"ma\",\"me\",\"je\",\"ve\",\"sa\",\"di\")","v":"je"},{"$f":"IFERROR(VLOOKUP(B21,Tableau30[],3,FALSE),IF(OR(AND($K$5<=B21,$L$5>B21),AND($K$6<=Tableau1[[#This Row],[Date]],$L$6>=Tableau1[[#This Row],[Date]])),\"FERMÉE\",IF(OR(Tableau1[[#This Row],[Jour]]=\"sa\",Tableau1[[#This Row],[Jour]]=\"di\",AND(Tableau1[[#This Row],[Jour]]=\"ve\",MOD(Tableau1[[#This Row],[N°S]],2)=1)),\"REPOS\",IF(Tableau1[[#This Row],[Jour]]=\"ve\",8,8.75))))","v":8.75}]
[null,"2019-10-18",{"$f":"_xlfn.ISOWEEKNUM(Tableau1[[#This Row],[Date]])","v":42},{"$f":"MONTH(Tableau1[[#This Row],[Date]])","v":10},{"$f":"TEXT(Tableau1[[#This Row],[Date]],\"mmmm\")","v":"octobre"},{"$f":"CHOOSE(WEEKDAY(Tableau1[[#This Row],[Date]],2),\"lu\",\"ma\",\"me\",\"je\",\"ve\",\"sa\",\"di\")","v":"ve"},{"$f":"IFERROR(VLOOKUP(B22,Tableau30[],3,FALSE),IF(OR(AND($K$5<=B22,$L$5>B22),AND($K$6<=Tableau1[[#This Row],[Date]],$L$6>=Tableau1[[#This Row],[Date]])),\"FERMÉE\",IF(OR(Tableau1[[#This Row],[Jour]]=\"sa\",Tableau1[[#This Row],[Jour]]=\"di\",AND(Tableau1[[#This Row],[Jour]]=\"ve\",MOD(Tableau1[[#This Row],[N°S]],2)=1)),\"REPOS\",IF(Tableau1[[#This Row],[Jour]]=\"ve\",8,8.75))))","v":8}]
[null,"2019-10-19",{"$f":"_xlfn.ISOWEEKNUM(Tableau1[[#This Row],[Date]])","v":42},{"$f":"MONTH(Tableau1[[#This Row],[Date]])","v":10},{"$f":"TEXT(Tableau1[[#This Row],[Date]],\"mmmm\")","v":"octobre"},{"$f":"CHOOSE(WEEKDAY(Tableau1[[#This Row],[Date]],2),\"lu\",\"ma\",\"me\",\"je\",\"ve\",\"sa\",\"di\")","v":"sa"},{"$f":"IFERROR(VLOOKUP(B23,Tableau30[],3,FALSE),IF(OR(AND($K$5<=B23,$L$5>B23),AND($K$6<=Tableau1[[#This Row],[Date]],$L$6>=Tableau1[[#This Row],[Date]])),\"FERMÉE\",IF(OR(Tableau1[[#This Row],[Jour]]=\"sa\",Tableau1[[#This Row],[Jour]]=\"di\",AND(Tableau1[[#This Row],[Jour]]=\"ve\",MOD(Tableau1[[#This Row],[N°S]],2)=1)),\"REPOS\",IF(Tableau1[[#This Row],[Jour]]=\"ve\",8,8.75))))","v":"REPOS"}]
[null,"2019-10-20",{"$f":"_xlfn.ISOWEEKNUM(Tableau1[[#This Row],[Date]])","v":42},{"$f":"MONTH(Tableau1[[#This Row],[Date]])","v":10},{"$f":"TEXT(Tableau1[[#This Row],[Date]],\"mmmm\")","v":"octobre"},{"$f":"CHOOSE(WEEKDAY(Tableau1[[#This Row],[Date]],2),\"lu\",\"ma\",\"me\",\"je\",\"ve\",\"sa\",\"di\")","v":"di"},{"$f":"IFERROR(VLOOKUP(B24,Tableau30[],3,FALSE),IF(OR(AND($K$5<=B24,$L$5>B24),AND($K$6<=Tableau1[[#This Row],[Date]],$L$6>=Tableau1[[#This Row],[Date]])),\"FERMÉE\",IF(OR(Tableau1[[#This Row],[Jour]]=\"sa\",Tableau1[[#This Row],[Jour]]=\"di\",AND(Tableau1[[#This Row],[Jour]]=\"ve\",MOD(Tableau1[[#This Row],[N°S]],2)=1)),\"REPOS\",IF(Tableau1[[#This Row],[Jour]]=\"ve\",8,8.75))))","v":"REPOS"}]
[null,"2019-10-21",{"$f":"_xlfn.ISOWEEKNUM(Tableau1[[#This Row],[Date]])","v":43},{"$f":"MONTH(Tableau1[[#This Row],[Date]])","v":10},{"$f":"TEXT(Tableau1[[#This Row],[Date]],\"mmmm\")","v":"octobre"},{"$f":"CHOOSE(WEEKDAY(Tableau1[[#This Row],[Date]],2),\"lu\",\"ma\",\"me\",\"je\",\"ve\",\"sa\",\"di\")","v":"lu"},{"$f":"IFERROR(VLOOKUP(B25,Tableau30[],3,FALSE),IF(OR(AND($K$5<=B25,$L$5>B25),AND($K$6<=Tableau1[[#This Row],[Date]],$L$6>=Tableau1[[#This Row],[Date]])),\"FERMÉE\",IF(OR(Tableau1[[#This Row],[Jour]]=\"sa\",Tableau1[[#This Row],[Jour]]=\"di\",AND(Tableau1[[#This Row],[Jour]]=\"ve\",MOD(Tableau1[[#This Row],[N°S]],2)=1)),\"REPOS\",IF(Tableau1[[#This Row],[Jour]]=\"ve\",8,8.75))))","v":8.75}]
[null,"2019-10-22",{"$f":"_xlfn.ISOWEEKNUM(Tableau1[[#This Row],[Date]])","v":43},{"$f":"MONTH(Tableau1[[#This Row],[Date]])","v":10},{"$f":"TEXT(Tableau1[[#This Row],[Date]],\"mmmm\")","v":"octobre"},{"$f":"CHOOSE(WEEKDAY(Tableau1[[#This Row],[Date]],2),\"lu\",\"ma\",\"me\",\"je\",\"ve\",\"sa\",\"di\")","v":"ma"},{"$f":"IFERROR(VLOOKUP(B26,Tableau30[],3,FALSE),IF(OR(AND($K$5<=B26,$L$5>B26),AND($K$6<=Tableau1[[#This Row],[Date]],$L$6>=Tableau1[[#This Row],[Date]])),\"FERMÉE\",IF(OR(Tableau1[[#This Row],[Jour]]=\"sa\",Tableau1[[#This Row],[Jour]]=\"di\",AND(Tableau1[[#This Row],[Jour]]=\"ve\",MOD(Tableau1[[#This Row],[N°S]],2)=1)),\"REPOS\",IF(Tableau1[[#This Row],[Jour]]=\"ve\",8,8.75))))","v":8.75}]
[null,"2019-10-23",{"$f":"_xlfn.ISOWEEKNUM(Tableau1[[#This Row],[Date]])","v":43},{"$f":"MONTH(Tableau1[[#This Row],[Date]])","v":10},{"$f":"TEXT(Tableau1[[#This Row],[Date]],\"mmmm\")","v":"octobre"},{"$f":"CHOOSE(WEEKDAY(Tableau1[[#This Row],[Date]],2),\"lu\",\"ma\",\"me\",\"je\",\"ve\",\"sa\",\"di\")","v":"me"},{"$f":"IFERROR(VLOOKUP(B27,Tableau30[],3,FALSE),IF(OR(AND($K$5<=B27,$L$5>B27),AND($K$6<=Tableau1[[#This Row],[Date]],$L$6>=Tableau1[[#This Row],[Date]])),\"FERMÉE\",IF(OR(Tableau1[[#This Row],[Jour]]=\"sa\",Tableau1[[#This Row],[Jour]]=\"di\",AND(Tableau1[[#This Row],[Jour]]=\"ve\",MOD(Tableau1[[#This Row],[N°S]],2)=1)),\"REPOS\",IF(Tableau1[[#This Row],[Jour]]=\"ve\",8,8.75))))","v":8.75}]
[null,"2019-10-24",{"$f":"_xlfn.ISOWEEKNUM(Tableau1[[#This Row],[Date]])","v":43},{"$f":"MONTH(Tableau1[[#This Row],[Date]])","v":10},{"$f":"TEXT(Tableau1[[#This Row],[Date]],\"mmmm\")","v":"octobre"},{"$f":"CHOOSE(WEEKDAY(Tableau1[[#This Row],[Date]],2),\"lu\",\"ma\",\"me\",\"je\",\"ve\",\"sa\",\"di\")","v":"je"},{"$f":"IFERROR(VLOOKUP(B28,Tableau30[],3,FALSE),IF(OR(AND($K$5<=B28,$L$5>B28),AND($K$6<=Tableau1[[#This Row],[Date]],$L$6>=Tableau1[[#This Row],[Date]])),\"FERMÉE\",IF(OR(Tableau1[[#This Row],[Jour]]=\"sa\",Tableau1[[#This Row],[Jour]]=\"di\",AND(Tableau1[[#This Row],[Jour]]=\"ve\",MOD(Tableau1[[#This Row],[N°S]],2)=1)),\"REPOS\",IF(Tableau1[[#This Row],[Jour]]=\"ve\",8,8.75))))","v":8.75}]
[null,"2019-10-25",{"$f":"_xlfn.ISOWEEKNUM(Tableau1[[#This Row],[Date]])","v":43},{"$f":"MONTH(Tableau1[[#This Row],[Date]])","v":10},{"$f":"TEXT(Tableau1[[#This Row],[Date]],\"mmmm\")","v":"octobre"},{"$f":"CHOOSE(WEEKDAY(Tableau1[[#This Row],[Date]],2),\"lu\",\"ma\",\"me\",\"je\",\"ve\",\"sa\",\"di\")","v":"ve"},{"$f":"IFERROR(VLOOKUP(B29,Tableau30[],3,FALSE),IF(OR(AND($K$5<=B29,$L$5>B29),AND($K$6<=Tableau1[[#This Row],[Date]],$L$6>=Tableau1[[#This Row],[Date]])),\"FERMÉE\",IF(OR(Tableau1[[#This Row],[Jour]]=\"sa\",Tableau1[[#This Row],[Jour]]=\"di\",AND(Tableau1[[#This Row],[Jour]]=\"ve\",MOD(Tableau1[[#This Row],[N°S]],2)=1)),\"REPOS\",IF(Tableau1[[#This Row],[Jour]]=\"ve\",8,8.75))))","v":"REPOS"}]
[null,{"$f":"B29+1","v":"2019-10-26"},{"$f":"_xlfn.ISOWEEKNUM(Tableau1[[#This Row],[Date]])","v":43},{"$f":"MONTH(Tableau1[[#This Row],[Date]])","v":10},{"$f":"TEXT(Tableau1[[#This Row],[Date]],\"mmmm\")","v":"octobre"},{"$f":"CHOOSE(WEEKDAY(Tableau1[[#This Row],[Date]],2),\"lu\",\"ma\",\"me\",\"je\",\"ve\",\"sa\",\"di\")","v":"sa"},{"$f":"IFERROR(VLOOKUP(B30,Tableau30[],3,FALSE),IF(OR(AND($K$5<=B30,$L$5>B30),AND($K$6<=Tableau1[[#This Row],[Date]],$L$6>=Tableau1[[#This Row],[Date]])),\"FERMÉE\",IF(OR(Tableau1[[#This Row],[Jour]]=\"sa\",Tableau1[[#This Row],[Jour]]=\"di\",AND(Tableau1[[#This Row],[Jour]]=\"ve\",MOD(Tableau1[[#This Row],[N°S]],2)=1)),\"REPOS\",IF(Tableau1[[#This Row],[Jour]]=\"ve\",8,8.75))))","v":"REPOS"}]
[null,"2019-10-27",{"$f":"_xlfn.ISOWEEKNUM(Tableau1[[#This Row],[Date]])","v":43},{"$f":"MONTH(Tableau1[[#This Row],[Date]])","v":10},{"$f":"TEXT(Tableau1[[#This Row],[Date]],\"mmmm\")","v":"octobre"},{"$f":"CHOOSE(WEEKDAY(Tableau1[[#This Row],[Date]],2),\"lu\",\"ma\",\"me\",\"je\",\"ve\",\"sa\",\"di\")","v":"di"},{"$f":"IFERROR(VLOOKUP(B31,Tableau30[],3,FALSE),IF(OR(AND($K$5<=B31,$L$5>B31),AND($K$6<=Tableau1[[#This Row],[Date]],$L$6>=Tableau1[[#This Row],[Date]])),\"FERMÉE\",IF(OR(Tableau1[[#This Row],[Jour]]=\"sa\",Tableau1[[#This Row],[Jour]]=\"di\",AND(Tableau1[[#This Row],[Jour]]=\"ve\",MOD(Tableau1[[#This Row],[N°S]],2)=1)),\"REPOS\",IF(Tableau1[[#This Row],[Jour]]=\"ve\",8,8.75))))","v":"REPOS"}]
[null,"2019-10-28",{"$f":"_xlfn.ISOWEEKNUM(Tableau1[[#This Row],[Date]])","v":44},{"$f":"MONTH(Tableau1[[#This Row],[Date]])","v":10},{"$f":"TEXT(Tableau1[[#This Row],[Date]],\"mmmm\")","v":"octobre"},{"$f":"CHOOSE(WEEKDAY(Tableau1[[#This Row],[Date]],2),\"lu\",\"ma\",\"me\",\"je\",\"ve\",\"sa\",\"di\")","v":"lu"},{"$f":"IFERROR(VLOOKUP(B32,Tableau30[],3,FALSE),IF(OR(AND($K$5<=B32,$L$5>B32),AND($K$6<=Tableau1[[#This Row],[Date]],$L$6>=Tableau1[[#This Row],[Date]])),\"FERMÉE\",IF(OR(Tableau1[[#This Row],[Jour]]=\"sa\",Tableau1[[#This Row],[Jour]]=\"di\",AND(Tableau1[[#This Row],[Jour]]=\"ve\",MOD(Tableau1[[#This Row],[N°S]],2)=1)),\"REPOS\",IF(Tableau1[[#This Row],[Jour]]=\"ve\",8,8.75))))","v":8.75}]
[null,{"$f":"B32+1","v":"2019-10-29"},{"$f":"_xlfn.ISOWEEKNUM(Tableau1[[#This Row],[Date]])","v":44},{"$f":"MONTH(Tableau1[[#This Row],[Date]])","v":10},{"$f":"TEXT(Tableau1[[#This Row],[Date]],\"mmmm\")","v":"octobre"},{"$f":"CHOOSE(WEEKDAY(Tableau1[[#This Row],[Date]],2),\"lu\",\"ma\",\"me\",\"je\",\"ve\",\"sa\",\"di\")","v":"ma"},{"$f":"IFERROR(VLOOKUP(B33,Tableau30[],3,FALSE),IF(OR(AND($K$5<=B33,$L$5>B33),AND($K$6<=Tableau1[[#This Row],[Date]],$L$6>=Tableau1[[#This Row],[Date]])),\"FERMÉE\",IF(OR(Tableau1[[#This Row],[Jour]]=\"sa\",Tableau1[[#This Row],[Jour]]=\"di\",AND(Tableau1[[#This Row],[Jour]]=\"ve\",MOD(Tableau1[[#This Row],[N°S]],2)=1)),\"REPOS\",IF(Tableau1[[#This Row],[Jour]]=\"ve\",8,8.75))))","v":8.75}]
[null,"2019-10-30",{"$f":"_xlfn.ISOWEEKNUM(Tableau1[[#This Row],[Date]])","v":44},{"$f":"MONTH(Tableau1[[#This Row],[Date]])","v":10},{"$f":"TEXT(Tableau1[[#This Row],[Date]],\"mmmm\")","v":"octobre"},{"$f":"CHOOSE(WEEKDAY(Tableau1[[#This Row],[Date]],2),\"lu\",\"ma\",\"me\",\"je\",\"ve\",\"sa\",\"di\")","v":"me"},{"$f":"IFERROR(VLOOKUP(B34,Tableau30[],3,FALSE),IF(OR(AND($K$5<=B34,$L$5>B34),AND($K$6<=Tableau1[[#This Row],[Date]],$L$6>=Tableau1[[#This Row],[Date]])),\"FERMÉE\",IF(OR(Tableau1[[#This Row],[Jour]]=\"sa\",Tableau1[[#This Row],[Jour]]=\"di\",AND(Tableau1[[#This Row],[Jour]]=\"ve\",MOD(Tableau1[[#This Row],[N°S]],2)=1)),\"REPOS\",IF(Tableau1[[#This Row],[Jour]]=\"ve\",8,8.75))))","v":8.75}]
[null,{"$f":"B34+1","v":"2019-10-31"},{"$f":"_xlfn.ISOWEEKNUM(Tableau1[[#This Row],[Date]])","v":44},{"$f":"MONTH(Tableau1[[#This Row],[Date]])","v":10},{"$f":"TEXT(Tableau1[[#This Row],[Date]],\"mmmm\")","v":"octobre"},{"$f":"CHOOSE(WEEKDAY(Tableau1[[#This Row],[Date]],2),\"lu\",\"ma\",\"me\",\"je\",\"ve\",\"sa\",\"di\")","v":"je"},{"$f":"IFERROR(VLOOKUP(B35,Tableau30[],3,FALSE),IF(OR(AND($K$5<=B35,$L$5>B35),AND($K$6<=Tableau1[[#This Row],[Date]],$L$6>=Tableau1[[#This Row],[Date]])),\"FERMÉE\",IF(OR(Tableau1[[#This Row],[Jour]]=\"sa\",Tableau1[[#This Row],[Jour]]=\"di\",AND(Tableau1[[#This Row],[Jour]]=\"ve\",MOD(Tableau1[[#This Row],[N°S]],2)=1)),\"REPOS\",IF(Tableau1[[#This Row],[Jour]]=\"ve\",8,8.75))))","v":8.75}]
[null,"2019-11-01",{"$f":"_xlfn.ISOWEEKNUM(Tableau1[[#This Row],[Date]])","v":44},{"$f":"MONTH(Tableau1[[#This Row],[Date]])","v":11},{"$f":"TEXT(Tableau1[[#This Row],[Date]],\"mmmm\")","v":"novembre"},{"$f":"CHOOSE(WEEKDAY(Tableau1[[#This Row],[Date]],2),\"lu\",\"ma\",\"me\",\"je\",\"ve\",\"sa\",\"di\")","v":"ve"},{"$f":"IFERROR(VLOOKUP(B36,Tableau30[],3,FALSE),IF(OR(AND($K$5<=B36,$L$5>B36),AND($K$6<=Tableau1[[#This Row],[Date]],$L$6>=Tableau1[[#This Row],[Date]])),\"FERMÉE\",IF(OR(Tableau1[[#This Row],[Jour]]=\"sa\",Tableau1[[#This Row],[Jour]]=\"di\",AND(Tableau1[[#This Row],[Jour]]=\"ve\",MOD(Tableau1[[#This Row],[N°S]],2)=1)),\"REPOS\",IF(Tableau1[[#This Row],[Jour]]=\"ve\",8,8.75))))","v":"FÉRIÉ/INACTIF"}]
[null,"2019-11-02",{"$f":"_xlfn.ISOWEEKNUM(Tableau1[[#This Row],[Date]])","v":44},{"$f":"MONTH(Tableau1[[#This Row],[Date]])","v":11},{"$f":"TEXT(Tableau1[[#This Row],[Date]],\"mmmm\")","v":"novembre"},{"$f":"CHOOSE(WEEKDAY(Tableau1[[#This Row],[Date]],2),\"lu\",\"ma\",\"me\",\"je\",\"ve\",\"sa\",\"di\")","v":"sa"},{"$f":"IFERROR(VLOOKUP(B37,Tableau30[],3,FALSE),IF(OR(AND($K$5<=B37,$L$5>B37),AND($K$6<=Tableau1[[#This Row],[Date]],$L$6>=Tableau1[[#This Row],[Date]])),\"FERMÉE\",IF(OR(Tableau1[[#This Row],[Jour]]=\"sa\",Tableau1[[#This Row],[Jour]]=\"di\",AND(Tableau1[[#This Row],[Jour]]=\"ve\",MOD(Tableau1[[#This Row],[N°S]],2)=1)),\"REPOS\",IF(Tableau1[[#This Row],[Jour]]=\"ve\",8,8.75))))","v":"REPOS"}]
[null,"2019-11-03",{"$f":"_xlfn.ISOWEEKNUM(Tableau1[[#This Row],[Date]])","v":44},{"$f":"MONTH(Tableau1[[#This Row],[Date]])","v":11},{"$f":"TEXT(Tableau1[[#This Row],[Date]],\"mmmm\")","v":"novembre"},{"$f":"CHOOSE(WEEKDAY(Tableau1[[#This Row],[Date]],2),\"lu\",\"ma\",\"me\",\"je\",\"ve\",\"sa\",\"di\")","v":"di"},{"$f":"IFERROR(VLOOKUP(B38,Tableau30[],3,FALSE),IF(OR(AND($K$5<=B38,$L$5>B38),AND($K$6<=Tableau1[[#This Row],[Date]],$L$6>=Tableau1[[#This Row],[Date]])),\"FERMÉE\",IF(OR(Tableau1[[#This Row],[Jour]]=\"sa\",Tableau1[[#This Row],[Jour]]=\"di\",AND(Tableau1[[#This Row],[Jour]]=\"ve\",MOD(Tableau1[[#This Row],[N°S]],2)=1)),\"REPOS\",IF(Tableau1[[#This Row],[Jour]]=\"ve\",8,8.75))))","v":"REPOS"}]
[null,"2019-11-04",{"$f":"_xlfn.ISOWEEKNUM(Tableau1[[#This Row],[Date]])","v":45},{"$f":"MONTH(Tableau1[[#This Row],[Date]])","v":11},{"$f":"TEXT(Tableau1[[#This Row],[Date]],\"mmmm\")","v":"novembre"},{"$f":"CHOOSE(WEEKDAY(Tableau1[[#This Row],[Date]],2),\"lu\",\"ma\",\"me\",\"je\",\"ve\",\"sa\",\"di\")","v":"lu"},{"$f":"IFERROR(VLOOKUP(B39,Tableau30[],3,FALSE),IF(OR(AND($K$5<=B39,$L$5>B39),AND($K$6<=Tableau1[[#This Row],[Date]],$L$6>=Tableau1[[#This Row],[Date]])),\"FERMÉE\",IF(OR(Tableau1[[#This Row],[Jour]]=\"sa\",Tableau1[[#This Row],[Jour]]=\"di\",AND(Tableau1[[#This Row],[Jour]]=\"ve\",MOD(Tableau1[[#This Row],[N°S]],2)=1)),\"REPOS\",IF(Tableau1[[#This Row],[Jour]]=\"ve\",8,8.75))))","v":8.75}]
[null,"2019-11-05",{"$f":"_xlfn.ISOWEEKNUM(Tableau1[[#This Row],[Date]])","v":45},{"$f":"MONTH(Tableau1[[#This Row],[Date]])","v":11},{"$f":"TEXT(Tableau1[[#This Row],[Date]],\"mmmm\")","v":"novembre"},{"$f":"CHOOSE(WEEKDAY(Tableau1[[#This Row],[Date]],2),\"lu\",\"ma\",\"me\",\"je\",\"ve\",\"sa\",\"di\")","v":"ma"},{"$f":"IFERROR(VLOOKUP(B40,Tableau30[],3,FALSE),IF(OR(AND($K$5<=B40,$L$5>B40),AND($K$6<=Tableau1[[#This Row],[Date]],$L$6>=Tableau1[[#This Row],[Date]])),\"FERMÉE\",IF(OR(Tableau1[[#This Row],[Jour]]=\"sa\",Tableau1[[#This Row],[Jour]]=\"di\",AND(Tableau1[[#This Row],[Jour]]=\"ve\",MOD(Tableau1[[#This Row],[N°S]],2)=1)),\"REPOS\",IF(Tableau1[[#This Row],[Jour]]=\"ve\",8,8.75))))","v":8.75}]
[null,"2019-11-06",{"$f":"_xlfn.ISOWEEKNUM(Tableau1[[#This Row],[Date]])","v":45},{"$f":"MONTH(Tableau1[[#This Row],[Date]])","v":11},{"$f":"TEXT(Tableau1[[#This Row],[Date]],\"mmmm\")","v":"novembre"},{"$f":"CHOOSE(WEEKDAY(Tableau1[[#This Row],[Date]],2),\"lu\",\"ma\",\"me\",\"je\",\"ve\",\"sa\",\"di\")","v":"me"},{"$f":"IFERROR(VLOOKUP(B41,Tableau30[],3,FALSE),IF(OR(AND($K$5<=B41,$L$5>B41),AND($K$6<=Tableau1[[#This Row],[Date]],$L$6>=Tableau1[[#This Row],[Date]])),\"FERMÉE\",IF(OR(Tableau1[[#This Row],[Jour]]=\"sa\",Tableau1[[#This Row],[Jour]]=\"di\",AND(Tableau1[[#This Row],[Jour]]=\"ve\",MOD(Tableau1[[#This Row],[N°S]],2)=1)),\"REPOS\",IF(Tableau1[[#This Row],[Jour]]=\"ve\",8,8.75))))","v":8.75}]
[null,"2019-11-07",{"$f":"_xlfn.ISOWEEKNUM(Tableau1[[#This Row],[Date]])","v":45},{"$f":"MONTH(Tableau1[[#This Row],[Date]])","v":11},{"$f":"TEXT(Tableau1[[#This Row],[Date]],\"mmmm\")","v":"novembre"},{"$f":"CHOOSE(WEEKDAY(Tableau1[[#This Row],[Date]],2),\"lu\",\"ma\",\"me\",\"je\",\"ve\",\"sa\",\"di\")","v":"je"},{"$f":"IFERROR(VLOOKUP(B42,Tableau30[],3,FALSE),IF(OR(AND($K$5<=B42,$L$5>B42),AND($K$6<=Tableau1[[#This Row],[Date]],$L$6>=Tableau1[[#This Row],[Date]])),\"FERMÉE\",IF(OR(Tableau1[[#This Row],[Jour]]=\"sa\",Tableau1[[#This Row],[Jour]]=\"di\",AND(Tableau1[[#This Row],[Jour]]=\"ve\",MOD(Tableau1[[#This Row],[N°S]],2)=1)),\"REPOS\",IF(Tableau1[[#This Row],[Jour]]=\"ve\",8,8.75))))","v":8.75}]
[null,"2019-11-08",{"$f":"_xlfn.ISOWEEKNUM(Tableau1[[#This Row],[Date]])","v":45},{"$f":"MONTH(Tableau1[[#This Row],[Date]])","v":11},{"$f":"TEXT(Tableau1[[#This Row],[Date]],\"mmmm\")","v":"novembre"},{"$f":"CHOOSE(WEEKDAY(Tableau1[[#This Row],[Date]],2),\"lu\",\"ma\",\"me\",\"je\",\"ve\",\"sa\",\"di\")","v":"ve"},{"$f":"IFERROR(VLOOKUP(B43,Tableau30[],3,FALSE),IF(OR(AND($K$5<=B43,$L$5>B43),AND($K$6<=Tableau1[[#This Row],[Date]],$L$6>=Tableau1[[#This Row],[Date]])),\"FERMÉE\",IF(OR(Tableau1[[#This Row],[Jour]]=\"sa\",Tableau1[[#This Row],[Jour]]=\"di\",AND(Tableau1[[#This Row],[Jour]]=\"ve\",MOD(Tableau1[[#This Row],[N°S]],2)=1)),\"REPOS\",IF(Tableau1[[#This Row],[Jour]]=\"ve\",8,8.75))))","v":"REPOS"}]
[null,"2019-11-09",{"$f":"_xlfn.ISOWEEKNUM(Tableau1[[#This Row],[Date]])","v":45},{"$f":"MONTH(Tableau1[[#This Row],[Date]])","v":11},{"$f":"TEXT(Tableau1[[#This Row],[Date]],\"mmmm\")","v":"novembre"},{"$f":"CHOOSE(WEEKDAY(Tableau1[[#This Row],[Date]],2),\"lu\",\"ma\",\"me\",\"je\",\"ve\",\"sa\",\"di\")","v":"sa"},{"$f":"IFERROR(VLOOKUP(B44,Tableau30[],3,FALSE),IF(OR(AND($K$5<=B44,$L$5>B44),AND($K$6<=Tableau1[[#This Row],[Date]],$L$6>=Tableau1[[#This Row],[Date]])),\"FERMÉE\",IF(OR(Tableau1[[#This Row],[Jour]]=\"sa\",Tableau1[[#This Row],[Jour]]=\"di\",AND(Tableau1[[#This Row],[Jour]]=\"ve\",MOD(Tableau1[[#This Row],[N°S]],2)=1)),\"REPOS\",IF(Tableau1[[#This Row],[Jour]]=\"ve\",8,8.75))))","v":"REPOS"}]
[null,"2019-11-10",{"$f":"_xlfn.ISOWEEKNUM(Tableau1[[#This Row],[Date]])","v":45},{"$f":"MONTH(Tableau1[[#This Row],[Date]])","v":11},{"$f":"TEXT(Tableau1[[#This Row],[Date]],\"mmmm\")","v":"novembre"},{"$f":"CHOOSE(WEEKDAY(Tableau1[[#This Row],[Date]],2),\"lu\",\"ma\",\"me\",\"je\",\"ve\",\"sa\",\"di\")","v":"di"},{"$f":"IFERROR(VLOOKUP(B45,Tableau30[],3,FALSE),IF(OR(AND($K$5<=B45,$L$5>B45),AND($K$6<=Tableau1[[#This Row],[Date]],$L$6>=Tableau1[[#This Row],[Date]])),\"FERMÉE\",IF(OR(Tableau1[[#This Row],[Jour]]=\"sa\",Tableau1[[#This Row],[Jour]]=\"di\",AND(Tableau1[[#This Row],[Jour]]=\"ve\",MOD(Tableau1[[#This Row],[N°S]],2)=1)),\"REPOS\",IF(Tableau1[[#This Row],[Jour]]=\"ve\",8,8.75))))","v":"REPOS"}]
[null,"2019-11-11",{"$f":"_xlfn.ISOWEEKNUM(Tableau1[[#This Row],[Date]])","v":46},{"$f":"MONTH(Tableau1[[#This Row],[Date]])","v":11},{"$f":"TEXT(Tableau1[[#This Row],[Date]],\"mmmm\")","v":"novembre"},{"$f":"CHOOSE(WEEKDAY(Tableau1[[#This Row],[Date]],2),\"lu\",\"ma\",\"me\",\"je\",\"ve\",\"sa\",\"di\")","v":"lu"},{"$f":"IFERROR(VLOOKUP(B46,Tableau30[],3,FALSE),IF(OR(AND($K$5<=B46,$L$5>B46),AND($K$6<=Tableau1[[#This Row],[Date]],$L$6>=Tableau1[[#This Row],[Date]])),\"FERMÉE\",IF(OR(Tableau1[[#This Row],[Jour]]=\"sa\",Tableau1[[#This Row],[Jour]]=\"di\",AND(Tableau1[[#This Row],[Jour]]=\"ve\",MOD(Tableau1[[#This Row],[N°S]],2)=1)),\"REPOS\",IF(Tableau1[[#This Row],[Jour]]=\"ve\",8,8.75))))","v":"FÉRIÉ/INACTIF"}]
[null,"2019-11-12",{"$f":"_xlfn.ISOWEEKNUM(Tableau1[[#This Row],[Date]])","v":46},{"$f":"MONTH(Tableau1[[#This Row],[Date]])","v":11},{"$f":"TEXT(Tableau1[[#This Row],[Date]],\"mmmm\")","v":"novembre"},{"$f":"CHOOSE(WEEKDAY(Tableau1[[#This Row],[Date]],2),\"lu\",\"ma\",\"me\",\"je\",\"ve\",\"sa\",\"di\")","v":"ma"},{"$f":"IFERROR(VLOOKUP(B47,Tableau30[],3,FALSE),IF(OR(AND($K$5<=B47,$L$5>B47),AND($K$6<=Tableau1[[#This Row],[Date]],$L$6>=Tableau1[[#This Row],[Date]])),\"FERMÉE\",IF(OR(Tableau1[[#This Row],[Jour]]=\"sa\",Tableau1[[#This Row],[Jour]]=\"di\",AND(Tableau1[[#This Row],[Jour]]=\"ve\",MOD(Tableau1[[#This Row],[N°S]],2)=1)),\"REPOS\",IF(Tableau1[[#This Row],[Jour]]=\"ve\",8,8.75))))","v":8.75}]
[null,"2019-11-13",{"$f":"_xlfn.ISOWEEKNUM(Tableau1[[#This Row],[Date]])","v":46},{"$f":"MONTH(Tableau1[[#This Row],[Date]])","v":11},{"$f":"TEXT(Tableau1[[#This Row],[Date]],\"mmmm\")","v":"novembre"},{"$f":"CHOOSE(WEEKDAY(Tableau1[[#This Row],[Date]],2),\"lu\",\"ma\",\"me\",\"je\",\"ve\",\"sa\",\"di\")","v":"me"},{"$f":"IFERROR(VLOOKUP(B48,Tableau30[],3,FALSE),IF(OR(AND($K$5<=B48,$L$5>B48),AND($K$6<=Tableau1[[#This Row],[Date]],$L$6>=Tableau1[[#This Row],[Date]])),\"FERMÉE\",IF(OR(Tableau1[[#This Row],[Jour]]=\"sa\",Tableau1[[#This Row],[Jour]]=\"di\",AND(Tableau1[[#This Row],[Jour]]=\"ve\",MOD(Tableau1[[#This Row],[N°S]],2)=1)),\"REPOS\",IF(Tableau1[[#This Row],[Jour]]=\"ve\",8,8.75))))","v":8.75}]
[null,"2019-11-14",{"$f":"_xlfn.ISOWEEKNUM(Tableau1[[#This Row],[Date]])","v":46},{"$f":"MONTH(Tableau1[[#This Row],[Date]])","v":11},{"$f":"TEXT(Tableau1[[#This Row],[Date]],\"mmmm\")","v":"novembre"},{"$f":"CHOOSE(WEEKDAY(Tableau1[[#This Row],[Date]],2),\"lu\",\"ma\",\"me\",\"je\",\"ve\",\"sa\",\"di\")","v":"je"},{"$f":"IFERROR(VLOOKUP(B49,Tableau30[],3,FALSE),IF(OR(AND($K$5<=B49,$L$5>B49),AND($K$6<=Tableau1[[#This Row],[Date]],$L$6>=Tableau1[[#This Row],[Date]])),\"FERMÉE\",IF(OR(Tableau1[[#This Row],[Jour]]=\"sa\",Tableau1[[#This Row],[Jour]]=\"di\",AND(Tableau1[[#This Row],[Jour]]=\"ve\",MOD(Tableau1[[#This Row],[N°S]],2)=1)),\"REPOS\",IF(Tableau1[[#This Row],[Jour]]=\"ve\",8,8.75))))","v":8.75}]
[null,"2019-11-15",{"$f":"_xlfn.ISOWEEKNUM(Tableau1[[#This Row],[Date]])","v":46},{"$f":"MONTH(Tableau1[[#This Row],[Date]])","v":11},{"$f":"TEXT(Tableau1[[#This Row],[Date]],\"mmmm\")","v":"novembre"},{"$f":"CHOOSE(WEEKDAY(Tableau1[[#This Row],[Date]],2),\"lu\",\"ma\",\"me\",\"je\",\"ve\",\"sa\",\"di\")","v":"ve"},{"$f":"IFERROR(VLOOKUP(B50,Tableau30[],3,FALSE),IF(OR(AND($K$5<=B50,$L$5>B50),AND($K$6<=Tableau1[[#This Row],[Date]],$L$6>=Tableau1[[#This Row],[Date]])),\"FERMÉE\",IF(OR(Tableau1[[#This Row],[Jour]]=\"sa\",Tableau1[[#This Row],[Jour]]=\"di\",AND(Tableau1[[#This Row],[Jour]]=\"ve\",MOD(Tableau1[[#This Row],[N°S]],2)=1)),\"REPOS\",IF(Tableau1[[#This Row],[Jour]]=\"ve\",8,8.75))))","v":8}]
[null,"2019-11-16",{"$f":"_xlfn.ISOWEEKNUM(Tableau1[[#This Row],[Date]])","v":46},{"$f":"MONTH(Tableau1[[#This Row],[Date]])","v":11},{"$f":"TEXT(Tableau1[[#This Row],[Date]],\"mmmm\")","v":"novembre"},{"$f":"CHOOSE(WEEKDAY(Tableau1[[#This Row],[Date]],2),\"lu\",\"ma\",\"me\",\"je\",\"ve\",\"sa\",\"di\")","v":"sa"},{"$f":"IFERROR(VLOOKUP(B51,Tableau30[],3,FALSE),IF(OR(AND($K$5<=B51,$L$5>B51),AND($K$6<=Tableau1[[#This Row],[Date]],$L$6>=Tableau1[[#This Row],[Date]])),\"FERMÉE\",IF(OR(Tableau1[[#This Row],[Jour]]=\"sa\",Tableau1[[#This Row],[Jour]]=\"di\",AND(Tableau1[[#This Row],[Jour]]=\"ve\",MOD(Tableau1[[#This Row],[N°S]],2)=1)),\"REPOS\",IF(Tableau1[[#This Row],[Jour]]=\"ve\",8,8.75))))","v":"REPOS"}]
[null,"2019-11-17",{"$f":"_xlfn.ISOWEEKNUM(Tableau1[[#This Row],[Date]])","v":46},{"$f":"MONTH(Tableau1[[#This Row],[Date]])","v":11},{"$f":"TEXT(Tableau1[[#This Row],[Date]],\"mmmm\")","v":"novembre"},{"$f":"CHOOSE(WEEKDAY(Tableau1[[#This Row],[Date]],2),\"lu\",\"ma\",\"me\",\"je\",\"ve\",\"sa\",\"di\")","v":"di"},{"$f":"IFERROR(VLOOKUP(B52,Tableau30[],3,FALSE),IF(OR(AND($K$5<=B52,$L$5>B52),AND($K$6<=Tableau1[[#This Row],[Date]],$L$6>=Tableau1[[#This Row],[Date]])),\"FERMÉE\",IF(OR(Tableau1[[#This Row],[Jour]]=\"sa\",Tableau1[[#This Row],[Jour]]=\"di\",AND(Tableau1[[#This Row],[Jour]]=\"ve\",MOD(Tableau1[[#This Row],[N°S]],2)=1)),\"REPOS\",IF(Tableau1[[#This Row],[Jour]]=\"ve\",8,8.75))))","v":"REPOS"}]
[null,"2019-11-18",{"$f":"_xlfn.ISOWEEKNUM(Tableau1[[#This Row],[Date]])","v":47},{"$f":"MONTH(Tableau1[[#This Row],[Date]])","v":11},{"$f":"TEXT(Tableau1[[#This Row],[Date]],\"mmmm\")","v":"novembre"},{"$f":"CHOOSE(WEEKDAY(Tableau1[[#This Row],[Date]],2),\"lu\",\"ma\",\"me\",\"je\",\"ve\",\"sa\",\"di\")","v":"lu"},{"$f":"IFERROR(VLOOKUP(B53,Tableau30[],3,FALSE),IF(OR(AND($K$5<=B53,$L$5>B53),AND($K$6<=Tableau1[[#This Row],[Date]],$L$6>=Tableau1[[#This Row],[Date]])),\"FERMÉE\",IF(OR(Tableau1[[#This Row],[Jour]]=\"sa\",Tableau1[[#This Row],[Jour]]=\"di\",AND(Tableau1[[#This Row],[Jour]]=\"ve\",MOD(Tableau1[[#This Row],[N°S]],2)=1)),\"REPOS\",IF(Tableau1[[#This Row],[Jour]]=\"ve\",8,8.75))))","v":8.75}]
[null,"2019-11-19",{"$f":"_xlfn.ISOWEEKNUM(Tableau1[[#This Row],[Date]])","v":47},{"$f":"MONTH(Tableau1[[#This Row],[Date]])","v":11},{"$f":"TEXT(Tableau1[[#This Row],[Date]],\"mmmm\")","v":"novembre"},{"$f":"CHOOSE(WEEKDAY(Tableau1[[#This Row],[Date]],2),\"lu\",\"ma\",\"me\",\"je\",\"ve\",\"sa\",\"di\")","v":"ma"},{"$f":"IFERROR(VLOOKUP(B54,Tableau30[],3,FALSE),IF(OR(AND($K$5<=B54,$L$5>B54),AND($K$6<=Tableau1[[#This Row],[Date]],$L$6>=Tableau1[[#This Row],[Date]])),\"FERMÉE\",IF(OR(Tableau1[[#This Row],[Jour]]=\"sa\",Tableau1[[#This Row],[Jour]]=\"di\",AND(Tableau1[[#This Row],[Jour]]=\"ve\",MOD(Tableau1[[#This Row],[N°S]],2)=1)),\"REPOS\",IF(Tableau1[[#This Row],[Jour]]=\"ve\",8,8.75))))","v":8.75}]
[null,"2019-11-20",{"$f":"_xlfn.ISOWEEKNUM(Tableau1[[#This Row],[Date]])","v":47},{"$f":"MONTH(Tableau1[[#This Row],[Date]])","v":11},{"$f":"TEXT(Tableau1[[#This Row],[Date]],\"mmmm\")","v":"novembre"},{"$f":"CHOOSE(WEEKDAY(Tableau1[[#This Row],[Date]],2),\"lu\",\"ma\",\"me\",\"je\",\"ve\",\"sa\",\"di\")","v":"me"},{"$f":"IFERROR(VLOOKUP(B55,Tableau30[],3,FALSE),IF(OR(AND($K$5<=B55,$L$5>B55),AND($K$6<=Tableau1[[#This Row],[Date]],$L$6>=Tableau1[[#This Row],[Date]])),\"FERMÉE\",IF(OR(Tableau1[[#This Row],[Jour]]=\"sa\",Tableau1[[#This Row],[Jour]]=\"di\",AND(Tableau1[[#This Row],[Jour]]=\"ve\",MOD(Tableau1[[#This Row],[N°S]],2)=1)),\"REPOS\",IF(Tableau1[[#This Row],[Jour]]=\"ve\",8,8.75))))","v":8.75}]
[null,"2019-11-21",{"$f":"_xlfn.ISOWEEKNUM(Tableau1[[#This Row],[Date]])","v":47},{"$f":"MONTH(Tableau1[[#This Row],[Date]])","v":11},{"$f":"TEXT(Tableau1[[#This Row],[Date]],\"mmmm\")","v":"novembre"},{"$f":"CHOOSE(WEEKDAY(Tableau1[[#This Row],[Date]],2),\"lu\",\"ma\",\"me\",\"je\",\"ve\",\"sa\",\"di\")","v":"je"},{"$f":"IFERROR(VLOOKUP(B56,Tableau30[],3,FALSE),IF(OR(AND($K$5<=B56,$L$5>B56),AND($K$6<=Tableau1[[#This Row],[Date]],$L$6>=Tableau1[[#This Row],[Date]])),\"FERMÉE\",IF(OR(Tableau1[[#This Row],[Jour]]=\"sa\",Tableau1[[#This Row],[Jour]]=\"di\",AND(Tableau1[[#This Row],[Jour]]=\"ve\",MOD(Tableau1[[#This Row],[N°S]],2)=1)),\"REPOS\",IF(Tableau1[[#This Row],[Jour]]=\"ve\",8,8.75))))","v":8.75}]
[null,"2019-11-22",{"$f":"_xlfn.ISOWEEKNUM(Tableau1[[#This Row],[Date]])","v":47},{"$f":"MONTH(Tableau1[[#This Row],[Date]])","v":11},{"$f":"TEXT(Tableau1[[#This Row],[Date]],\"mmmm\")","v":"novembre"},{"$f":"CHOOSE(WEEKDAY(Tableau1[[#This Row],[Date]],2),\"lu\",\"ma\",\"me\",\"je\",\"ve\",\"sa\",\"di\")","v":"ve"},{"$f":"IFERROR(VLOOKUP(B57,Tableau30[],3,FALSE),IF(OR(AND($K$5<=B57,$L$5>B57),AND($K$6<=Tableau1[[#This Row],[Date]],$L$6>=Tableau1[[#This Row],[Date]])),\"FERMÉE\",IF(OR(Tableau1[[#This Row],[Jour]]=\"sa\",Tableau1[[#This Row],[Jour]]=\"di\",AND(Tableau1[[#This Row],[Jour]]=\"ve\",MOD(Tableau1[[#This Row],[N°S]],2)=1)),\"REPOS\",IF(Tableau1[[#This Row],[Jour]]=\"ve\",8,8.75))))","v":"REPOS"}]
[null,"2019-11-23",{"$f":"_xlfn.ISOWEEKNUM(Tableau1[[#This Row],[Date]])","v":47},{"$f":"MONTH(Tableau1[[#This Row],[Date]])","v":11},{"$f":"TEXT(Tableau1[[#This Row],[Date]],\"mmmm\")","v":"novembre"},{"$f":"CHOOSE(WEEKDAY(Tableau1[[#This Row],[Date]],2),\"lu\",\"ma\",\"me\",\"je\",\"ve\",\"sa\",\"di\")","v":"sa"},{"$f":"IFERROR(VLOOKUP(B58,Tableau30[],3,FALSE),IF(OR(AND($K$5<=B58,$L$5>B58),AND($K$6<=Tableau1[[#This Row],[Date]],$L$6>=Tableau1[[#This Row],[Date]])),\"FERMÉE\",IF(OR(Tableau1[[#This Row],[Jour]]=\"sa\",Tableau1[[#This Row],[Jour]]=\"di\",AND(Tableau1[[#This Row],[Jour]]=\"ve\",MOD(Tableau1[[#This Row],[N°S]],2)=1)),\"REPOS\",IF(Tableau1[[#This Row],[Jour]]=\"ve\",8,8.75))))","v":"REPOS"}]
[null,"2019-11-24",{"$f":"_xlfn.ISOWEEKNUM(Tableau1[[#This Row],[Date]])","v":47},{"$f":"MONTH(Tableau1[[#This Row],[Date]])","v":11},{"$f":"TEXT(Tableau1[[#This Row],[Date]],\"mmmm\")","v":"novembre"},{"$f":"CHOOSE(WEEKDAY(Tableau1[[#This Row],[Date]],2),\"lu\",\"ma\",\"me\",\"je\",\"ve\",\"sa\",\"di\")","v":"di"},{"$f":"IFERROR(VLOOKUP(B59,Tableau30[],3,FALSE),IF(OR(AND($K$5<=B59,$L$5>B59),AND($K$6<=Tableau1[[#This Row],[Date]],$L$6>=Tableau1[[#This Row],[Date]])),\"FERMÉE\",IF(OR(Tableau1[[#This Row],[Jour]]=\"sa\",Tableau1[[#This Row],[Jour]]=\"di\",AND(Tableau1[[#This Row],[Jour]]=\"ve\",MOD(Tableau1[[#This Row],[N°S]],2)=1)),\"REPOS\",IF(Tableau1[[#This Row],[Jour]]=\"ve\",8,8.75))))","v":"REPOS"}]
[null,"2019-11-25",{"$f":"_xlfn.ISOWEEKNUM(Tableau1[[#This Row],[Date]])","v":48},{"$f":"MONTH(Tableau1[[#This Row],[Date]])","v":11},{"$f":"TEXT(Tableau1[[#This Row],[Date]],\"mmmm\")","v":"novembre"},{"$f":"CHOOSE(WEEKDAY(Tableau1[[#This Row],[Date]],2),\"lu\",\"ma\",\"me\",\"je\",\"ve\",\"sa\",\"di\")","v":"lu"},{"$f":"IFERROR(VLOOKUP(B60,Tableau30[],3,FALSE),IF(OR(AND($K$5<=B60,$L$5>B60),AND($K$6<=Tableau1[[#This Row],[Date]],$L$6>=Tableau1[[#This Row],[Date]])),\"FERMÉE\",IF(OR(Tableau1[[#This Row],[Jour]]=\"sa\",Tableau1[[#This Row],[Jour]]=\"di\",AND(Tableau1[[#This Row],[Jour]]=\"ve\",MOD(Tableau1[[#This Row],[N°S]],2)=1)),\"REPOS\",IF(Tableau1[[#This Row],[Jour]]=\"ve\",8,8.75))))","v":8.75}]
[null,"2019-11-26",{"$f":"_xlfn.ISOWEEKNUM(Tableau1[[#This Row],[Date]])","v":48},{"$f":"MONTH(Tableau1[[#This Row],[Date]])","v":11},{"$f":"TEXT(Tableau1[[#This Row],[Date]],\"mmmm\")","v":"novembre"},{"$f":"CHOOSE(WEEKDAY(Tableau1[[#This Row],[Date]],2),\"lu\",\"ma\",\"me\",\"je\",\"ve\",\"sa\",\"di\")","v":"ma"},{"$f":"IFERROR(VLOOKUP(B61,Tableau30[],3,FALSE),IF(OR(AND($K$5<=B61,$L$5>B61),AND($K$6<=Tableau1[[#This Row],[Date]],$L$6>=Tableau1[[#This Row],[Date]])),\"FERMÉE\",IF(OR(Tableau1[[#This Row],[Jour]]=\"sa\",Tableau1[[#This Row],[Jour]]=\"di\",AND(Tableau1[[#This Row],[Jour]]=\"ve\",MOD(Tableau1[[#This Row],[N°S]],2)=1)),\"REPOS\",IF(Tableau1[[#This Row],[Jour]]=\"ve\",8,8.75))))","v":8.75}]
[null,"2019-11-27",{"$f":"_xlfn.ISOWEEKNUM(Tableau1[[#This Row],[Date]])","v":48},{"$f":"MONTH(Tableau1[[#This Row],[Date]])","v":11},{"$f":"TEXT(Tableau1[[#This Row],[Date]],\"mmmm\")","v":"novembre"},{"$f":"CHOOSE(WEEKDAY(Tableau1[[#This Row],[Date]],2),\"lu\",\"ma\",\"me\",\"je\",\"ve\",\"sa\",\"di\")","v":"me"},{"$f":"IFERROR(VLOOKUP(B62,Tableau30[],3,FALSE),IF(OR(AND($K$5<=B62,$L$5>B62),AND($K$6<=Tableau1[[#This Row],[Date]],$L$6>=Tableau1[[#This Row],[Date]])),\"FERMÉE\",IF(OR(Tableau1[[#This Row],[Jour]]=\"sa\",Tableau1[[#This Row],[Jour]]=\"di\",AND(Tableau1[[#This Row],[Jour]]=\"ve\",MOD(Tableau1[[#This Row],[N°S]],2)=1)),\"REPOS\",IF(Tableau1[[#This Row],[Jour]]=\"ve\",8,8.75))))","v":8.75}]
[null,"2019-11-28",{"$f":"_xlfn.ISOWEEKNUM(Tableau1[[#This Row],[Date]])","v":48},{"$f":"MONTH(Tableau1[[#This Row],[Date]])","v":11},{"$f":"TEXT(Tableau1[[#This Row],[Date]],\"mmmm\")","v":"novembre"},{"$f":"CHOOSE(WEEKDAY(Tableau1[[#This Row],[Date]],2),\"lu\",\"ma\",\"me\",\"je\",\"ve\",\"sa\",\"di\")","v":"je"},{"$f":"IFERROR(VLOOKUP(B63,Tableau30[],3,FALSE),IF(OR(AND($K$5<=B63,$L$5>B63),AND($K$6<=Tableau1[[#This Row],[Date]],$L$6>=Tableau1[[#This Row],[Date]])),\"FERMÉE\",IF(OR(Tableau1[[#This Row],[Jour]]=\"sa\",Tableau1[[#This Row],[Jour]]=\"di\",AND(Tableau1[[#This Row],[Jour]]=\"ve\",MOD(Tableau1[[#This Row],[N°S]],2)=1)),\"REPOS\",IF(Tableau1[[#This Row],[Jour]]=\"ve\",8,8.75))))","v":8.75}]
[null,"2019-11-29",{"$f":"_xlfn.ISOWEEKNUM(Tableau1[[#This Row],[Date]])","v":48},{"$f":"MONTH(Tableau1[[#This Row],[Date]])","v":11},{"$f":"TEXT(Tableau1[[#This Row],[Date]],\"mmmm\")","v":"novembre"},{"$f":"CHOOSE(WEEKDAY(Tableau1[[#This Row],[Date]],2),\"lu\",\"ma\",\"me\",\"je\",\"ve\",\"sa\",\"di\")","v":"ve"},{"$f":"IFERROR(VLOOKUP(B64,Tableau30[],3,FALSE),IF(OR(AND($K$5<=B64,$L$5>B64),AND($K$6<=Tableau1[[#This Row],[Date]],$L$6>=Tableau1[[#This Row],[Date]])),\"FERMÉE\",IF(OR(Tableau1[[#This Row],[Jour]]=\"sa\",Tableau1[[#This Row],[Jour]]=\"di\",AND(Tableau1[[#This Row],[Jour]]=\"ve\",MOD(Tableau1[[#This Row],[N°S]],2)=1)),\"REPOS\",IF(Tableau1[[#This Row],[Jour]]=\"ve\",8,8.75))))","v":8}]
[null,"2019-11-30",{"$f":"_xlfn.ISOWEEKNUM(Tableau1[[#This Row],[Date]])","v":48},{"$f":"MONTH(Tableau1[[#This Row],[Date]])","v":11},{"$f":"TEXT(Tableau1[[#This Row],[Date]],\"mmmm\")","v":"novembre"},{"$f":"CHOOSE(WEEKDAY(Tableau1[[#This Row],[Date]],2),\"lu\",\"ma\",\"me\",\"je\",\"ve\",\"sa\",\"di\")","v":"sa"},{"$f":"IFERROR(VLOOKUP(B65,Tableau30[],3,FALSE),IF(OR(AND($K$5<=B65,$L$5>B65),AND($K$6<=Tableau1[[#This Row],[Date]],$L$6>=Tableau1[[#This Row],[Date]])),\"FERMÉE\",IF(OR(Tableau1[[#This Row],[Jour]]=\"sa\",Tableau1[[#This Row],[Jour]]=\"di\",AND(Tableau1[[#This Row],[Jour]]=\"ve\",MOD(Tableau1[[#This Row],[N°S]],2)=1)),\"REPOS\",IF(Tableau1[[#This Row],[Jour]]=\"ve\",8,8.75))))","v":"REPOS"}]
[null,"2019-12-01",{"$f":"_xlfn.ISOWEEKNUM(Tableau1[[#This Row],[Date]])","v":48},{"$f":"MONTH(Tableau1[[#This Row],[Date]])","v":12},{"$f":"TEXT(Tableau1[[#This Row],[Date]],\"mmmm\")","v":"décembre"},{"$f":"CHOOSE(WEEKDAY(Tableau1[[#This Row],[Date]],2),\"lu\",\"ma\",\"me\",\"je\",\"ve\",\"sa\",\"di\")","v":"di"},{"$f":"IFERROR(VLOOKUP(B66,Tableau30[],3,FALSE),IF(OR(AND($K$5<=B66,$L$5>B66),AND($K$6<=Tableau1[[#This Row],[Date]],$L$6>=Tableau1[[#This Row],[Date]])),\"FERMÉE\",IF(OR(Tableau1[[#This Row],[Jour]]=\"sa\",Tableau1[[#This Row],[Jour]]=\"di\",AND(Tableau1[[#This Row],[Jour]]=\"ve\",MOD(Tableau1[[#This Row],[N°S]],2)=1)),\"REPOS\",IF(Tableau1[[#This Row],[Jour]]=\"ve\",8,8.75))))","v":"REPOS"}]
[null,"2019-12-02",{"$f":"_xlfn.ISOWEEKNUM(Tableau1[[#This Row],[Date]])","v":49},{"$f":"MONTH(Tableau1[[#This Row],[Date]])","v":12},{"$f":"TEXT(Tableau1[[#This Row],[Date]],\"mmmm\")","v":"décembre"},{"$f":"CHOOSE(WEEKDAY(Tableau1[[#This Row],[Date]],2),\"lu\",\"ma\",\"me\",\"je\",\"ve\",\"sa\",\"di\")","v":"lu"},{"$f":"IFERROR(VLOOKUP(B67,Tableau30[],3,FALSE),IF(OR(AND($K$5<=B67,$L$5>B67),AND($K$6<=Tableau1[[#This Row],[Date]],$L$6>=Tableau1[[#This Row],[Date]])),\"FERMÉE\",IF(OR(Tableau1[[#This Row],[Jour]]=\"sa\",Tableau1[[#This Row],[Jour]]=\"di\",AND(Tableau1[[#This Row],[Jour]]=\"ve\",MOD(Tableau1[[#This Row],[N°S]],2)=1)),\"REPOS\",IF(Tableau1[[#This Row],[Jour]]=\"ve\",8,8.75))))","v":8.75}]
[null,"2019-12-03",{"$f":"_xlfn.ISOWEEKNUM(Tableau1[[#This Row],[Date]])","v":49},{"$f":"MONTH(Tableau1[[#This Row],[Date]])","v":12},{"$f":"TEXT(Tableau1[[#This Row],[Date]],\"mmmm\")","v":"décembre"},{"$f":"CHOOSE(WEEKDAY(Tableau1[[#This Row],[Date]],2),\"lu\",\"ma\",\"me\",\"je\",\"ve\",\"sa\",\"di\")","v":"ma"},{"$f":"IFERROR(VLOOKUP(B68,Tableau30[],3,FALSE),IF(OR(AND($K$5<=B68,$L$5>B68),AND($K$6<=Tableau1[[#This Row],[Date]],$L$6>=Tableau1[[#This Row],[Date]])),\"FERMÉE\",IF(OR(Tableau1[[#This Row],[Jour]]=\"sa\",Tableau1[[#This Row],[Jour]]=\"di\",AND(Tableau1[[#This Row],[Jour]]=\"ve\",MOD(Tableau1[[#This Row],[N°S]],2)=1)),\"REPOS\",IF(Tableau1[[#This Row],[Jour]]=\"ve\",8,8.75))))","v":8.75}]
[null,"2019-12-04",{"$f":"_xlfn.ISOWEEKNUM(Tableau1[[#This Row],[Date]])","v":49},{"$f":"MONTH(Tableau1[[#This Row],[Date]])","v":12},{"$f":"TEXT(Tableau1[[#This Row],[Date]],\"mmmm\")","v":"décembre"},{"$f":"CHOOSE(WEEKDAY(Tableau1[[#This Row],[Date]],2),\"lu\",\"ma\",\"me\",\"je\",\"ve\",\"sa\",\"di\")","v":"me"},{"$f":"IFERROR(VLOOKUP(B69,Tableau30[],3,FALSE),IF(OR(AND($K$5<=B69,$L$5>B69),AND($K$6<=Tableau1[[#This Row],[Date]],$L$6>=Tableau1[[#This Row],[Date]])),\"FERMÉE\",IF(OR(Tableau1[[#This Row],[Jour]]=\"sa\",Tableau1[[#This Row],[Jour]]=\"di\",AND(Tableau1[[#This Row],[Jour]]=\"ve\",MOD(Tableau1[[#This Row],[N°S]],2)=1)),\"REPOS\",IF(Tableau1[[#This Row],[Jour]]=\"ve\",8,8.75))))","v":8.75}]
[null,"2019-12-05",{"$f":"_xlfn.ISOWEEKNUM(Tableau1[[#This Row],[Date]])","v":49},{"$f":"MONTH(Tableau1[[#This Row],[Date]])","v":12},{"$f":"TEXT(Tableau1[[#This Row],[Date]],\"mmmm\")","v":"décembre"},{"$f":"CHOOSE(WEEKDAY(Tableau1[[#This Row],[Date]],2),\"lu\",\"ma\",\"me\",\"je\",\"ve\",\"sa\",\"di\")","v":"je"},{"$f":"IFERROR(VLOOKUP(B70,Tableau30[],3,FALSE),IF(OR(AND($K$5<=B70,$L$5>B70),AND($K$6<=Tableau1[[#This Row],[Date]],$L$6>=Tableau1[[#This Row],[Date]])),\"FERMÉE\",IF(OR(Tableau1[[#This Row],[Jour]]=\"sa\",Tableau1[[#This Row],[Jour]]=\"di\",AND(Tableau1[[#This Row],[Jour]]=\"ve\",MOD(Tableau1[[#This Row],[N°S]],2)=1)),\"REPOS\",IF(Tableau1[[#This Row],[Jour]]=\"ve\",8,8.75))))","v":8.75}]
[null,{"$f":"B70+1","v":"2019-12-06"},{"$f":"_xlfn.ISOWEEKNUM(Tableau1[[#This Row],[Date]])","v":49},{"$f":"MONTH(Tableau1[[#This Row],[Date]])","v":12},{"$f":"TEXT(Tableau1[[#This Row],[Date]],\"mmmm\")","v":"décembre"},{"$f":"CHOOSE(WEEKDAY(Tableau1[[#This Row],[Date]],2),\"lu\",\"ma\",\"me\",\"je\",\"ve\",\"sa\",\"di\")","v":"ve"},{"$f":"IFERROR(VLOOKUP(B71,Tableau30[],3,FALSE),IF(OR(AND($K$5<=B71,$L$5>B71),AND($K$6<=Tableau1[[#This Row],[Date]],$L$6>=Tableau1[[#This Row],[Date]])),\"FERMÉE\",IF(OR(Tableau1[[#This Row],[Jour]]=\"sa\",Tableau1[[#This Row],[Jour]]=\"di\",AND(Tableau1[[#This Row],[Jour]]=\"ve\",MOD(Tableau1[[#This Row],[N°S]],2)=1)),\"REPOS\",IF(Tableau1[[#This Row],[Jour]]=\"ve\",8,8.75))))","v":"REPOS"}]
[null,"2019-12-07",{"$f":"_xlfn.ISOWEEKNUM(Tableau1[[#This Row],[Date]])","v":49},{"$f":"MONTH(Tableau1[[#This Row],[Date]])","v":12},{"$f":"TEXT(Tableau1[[#This Row],[Date]],\"mmmm\")","v":"décembre"},{"$f":"CHOOSE(WEEKDAY(Tableau1[[#This Row],[Date]],2),\"lu\",\"ma\",\"me\",\"je\",\"ve\",\"sa\",\"di\")","v":"sa"},{"$f":"IFERROR(VLOOKUP(B72,Tableau30[],3,FALSE),IF(OR(AND($K$5<=B72,$L$5>B72),AND($K$6<=Tableau1[[#This Row],[Date]],$L$6>=Tableau1[[#This Row],[Date]])),\"FERMÉE\",IF(OR(Tableau1[[#This Row],[Jour]]=\"sa\",Tableau1[[#This Row],[Jour]]=\"di\",AND(Tableau1[[#This Row],[Jour]]=\"ve\",MOD(Tableau1[[#This Row],[N°S]],2)=1)),\"REPOS\",IF(Tableau1[[#This Row],[Jour]]=\"ve\",8,8.75))))","v":"REPOS"}]
[null,"2019-12-08",{"$f":"_xlfn.ISOWEEKNUM(Tableau1[[#This Row],[Date]])","v":49},{"$f":"MONTH(Tableau1[[#This Row],[Date]])","v":12},{"$f":"TEXT(Tableau1[[#This Row],[Date]],\"mmmm\")","v":"décembre"},{"$f":"CHOOSE(WEEKDAY(Tableau1[[#This Row],[Date]],2),\"lu\",\"ma\",\"me\",\"je\",\"ve\",\"sa\",\"di\")","v":"di"},{"$f":"IFERROR(VLOOKUP(B73,Tableau30[],3,FALSE),IF(OR(AND($K$5<=B73,$L$5>B73),AND($K$6<=Tableau1[[#This Row],[Date]],$L$6>=Tableau1[[#This Row],[Date]])),\"FERMÉE\",IF(OR(Tableau1[[#This Row],[Jour]]=\"sa\",Tableau1[[#This Row],[Jour]]=\"di\",AND(Tableau1[[#This Row],[Jour]]=\"ve\",MOD(Tableau1[[#This Row],[N°S]],2)=1)),\"REPOS\",IF(Tableau1[[#This Row],[Jour]]=\"ve\",8,8.75))))","v":"REPOS"}]
[null,"2019-12-09",{"$f":"_xlfn.ISOWEEKNUM(Tableau1[[#This Row],[Date]])","v":50},{"$f":"MONTH(Tableau1[[#This Row],[Date]])","v":12},{"$f":"TEXT(Tableau1[[#This Row],[Date]],\"mmmm\")","v":"décembre"},{"$f":"CHOOSE(WEEKDAY(Tableau1[[#This Row],[Date]],2),\"lu\",\"ma\",\"me\",\"je\",\"ve\",\"sa\",\"di\")","v":"lu"},{"$f":"IFERROR(VLOOKUP(B74,Tableau30[],3,FALSE),IF(OR(AND($K$5<=B74,$L$5>B74),AND($K$6<=Tableau1[[#This Row],[Date]],$L$6>=Tableau1[[#This Row],[Date]])),\"FERMÉE\",IF(OR(Tableau1[[#This Row],[Jour]]=\"sa\",Tableau1[[#This Row],[Jour]]=\"di\",AND(Tableau1[[#This Row],[Jour]]=\"ve\",MOD(Tableau1[[#This Row],[N°S]],2)=1)),\"REPOS\",IF(Tableau1[[#This Row],[Jour]]=\"ve\",8,8.75))))","v":8.75}]
[null,"2019-12-10",{"$f":"_xlfn.ISOWEEKNUM(Tableau1[[#This Row],[Date]])","v":50},{"$f":"MONTH(Tableau1[[#This Row],[Date]])","v":12},{"$f":"TEXT(Tableau1[[#This Row],[Date]],\"mmmm\")","v":"décembre"},{"$f":"CHOOSE(WEEKDAY(Tableau1[[#This Row],[Date]],2),\"lu\",\"ma\",\"me\",\"je\",\"ve\",\"sa\",\"di\")","v":"ma"},{"$f":"IFERROR(VLOOKUP(B75,Tableau30[],3,FALSE),IF(OR(AND($K$5<=B75,$L$5>B75),AND($K$6<=Tableau1[[#This Row],[Date]],$L$6>=Tableau1[[#This Row],[Date]])),\"FERMÉE\",IF(OR(Tableau1[[#This Row],[Jour]]=\"sa\",Tableau1[[#This Row],[Jour]]=\"di\",AND(Tableau1[[#This Row],[Jour]]=\"ve\",MOD(Tableau1[[#This Row],[N°S]],2)=1)),\"REPOS\",IF(Tableau1[[#This Row],[Jour]]=\"ve\",8,8.75))))","v":8.75}]
[null,"2019-12-11",{"$f":"_xlfn.ISOWEEKNUM(Tableau1[[#This Row],[Date]])","v":50},{"$f":"MONTH(Tableau1[[#This Row],[Date]])","v":12},{"$f":"TEXT(Tableau1[[#This Row],[Date]],\"mmmm\")","v":"décembre"},{"$f":"CHOOSE(WEEKDAY(Tableau1[[#This Row],[Date]],2),\"lu\",\"ma\",\"me\",\"je\",\"ve\",\"sa\",\"di\")","v":"me"},{"$f":"IFERROR(VLOOKUP(B76,Tableau30[],3,FALSE),IF(OR(AND($K$5<=B76,$L$5>B76),AND($K$6<=Tableau1[[#This Row],[Date]],$L$6>=Tableau1[[#This Row],[Date]])),\"FERMÉE\",IF(OR(Tableau1[[#This Row],[Jour]]=\"sa\",Tableau1[[#This Row],[Jour]]=\"di\",AND(Tableau1[[#This Row],[Jour]]=\"ve\",MOD(Tableau1[[#This Row],[N°S]],2)=1)),\"REPOS\",IF(Tableau1[[#This Row],[Jour]]=\"ve\",8,8.75))))","v":8.75}]
[null,"2019-12-12",{"$f":"_xlfn.ISOWEEKNUM(Tableau1[[#This Row],[Date]])","v":50},{"$f":"MONTH(Tableau1[[#This Row],[Date]])","v":12},{"$f":"TEXT(Tableau1[[#This Row],[Date]],\"mmmm\")","v":"décembre"},{"$f":"CHOOSE(WEEKDAY(Tableau1[[#This Row],[Date]],2),\"lu\",\"ma\",\"me\",\"je\",\"ve\",\"sa\",\"di\")","v":"je"},{"$f":"IFERROR(VLOOKUP(B77,Tableau30[],3,FALSE),IF(OR(AND($K$5<=B77,$L$5>B77),AND($K$6<=Tableau1[[#This Row],[Date]],$L$6>=Tableau1[[#This Row],[Date]])),\"FERMÉE\",IF(OR(Tableau1[[#This Row],[Jour]]=\"sa\",Tableau1[[#This Row],[Jour]]=\"di\",AND(Tableau1[[#This Row],[Jour]]=\"ve\",MOD(Tableau1[[#This Row],[N°S]],2)=1)),\"REPOS\",IF(Tableau1[[#This Row],[Jour]]=\"ve\",8,8.75))))","v":8.75}]
[null,"2019-12-13",{"$f":"_xlfn.ISOWEEKNUM(Tableau1[[#This Row],[Date]])","v":50},{"$f":"MONTH(Tableau1[[#This Row],[Date]])","v":12},{"$f":"TEXT(Tableau1[[#This Row],[Date]],\"mmmm\")","v":"décembre"},{"$f":"CHOOSE(WEEKDAY(Tableau1[[#This Row],[Date]],2),\"lu\",\"ma\",\"me\",\"je\",\"ve\",\"sa\",\"di\")","v":"ve"},{"$f":"IFERROR(VLOOKUP(B78,Tableau30[],3,FALSE),IF(OR(AND($K$5<=B78,$L$5>B78),AND($K$6<=Tableau1[[#This Row],[Date]],$L$6>=Tableau1[[#This Row],[Date]])),\"FERMÉE\",IF(OR(Tableau1[[#This Row],[Jour]]=\"sa\",Tableau1[[#This Row],[Jour]]=\"di\",AND(Tableau1[[#This Row],[Jour]]=\"ve\",MOD(Tableau1[[#This Row],[N°S]],2)=1)),\"REPOS\",IF(Tableau1[[#This Row],[Jour]]=\"ve\",8,8.75))))","v":8}]
[null,"2019-12-14",{"$f":"_xlfn.ISOWEEKNUM(Tableau1[[#This Row],[Date]])","v":50},{"$f":"MONTH(Tableau1[[#This Row],[Date]])","v":12},{"$f":"TEXT(Tableau1[[#This Row],[Date]],\"mmmm\")","v":"décembre"},{"$f":"CHOOSE(WEEKDAY(Tableau1[[#This Row],[Date]],2),\"lu\",\"ma\",\"me\",\"je\",\"ve\",\"sa\",\"di\")","v":"sa"},{"$f":"IFERROR(VLOOKUP(B79,Tableau30[],3,FALSE),IF(OR(AND($K$5<=B79,$L$5>B79),AND($K$6<=Tableau1[[#This Row],[Date]],$L$6>=Tableau1[[#This Row],[Date]])),\"FERMÉE\",IF(OR(Tableau1[[#This Row],[Jour]]=\"sa\",Tableau1[[#This Row],[Jour]]=\"di\",AND(Tableau1[[#This Row],[Jour]]=\"ve\",MOD(Tableau1[[#This Row],[N°S]],2)=1)),\"REPOS\",IF(Tableau1[[#This Row],[Jour]]=\"ve\",8,8.75))))","v":"REPOS"}]
[null,"2019-12-15",{"$f":"_xlfn.ISOWEEKNUM(Tableau1[[#This Row],[Date]])","v":50},{"$f":"MONTH(Tableau1[[#This Row],[Date]])","v":12},{"$f":"TEXT(Tableau1[[#This Row],[Date]],\"mmmm\")","v":"décembre"},{"$f":"CHOOSE(WEEKDAY(Tableau1[[#This Row],[Date]],2),\"lu\",\"ma\",\"me\",\"je\",\"ve\",\"sa\",\"di\")","v":"di"},{"$f":"IFERROR(VLOOKUP(B80,Tableau30[],3,FALSE),IF(OR(AND($K$5<=B80,$L$5>B80),AND($K$6<=Tableau1[[#This Row],[Date]],$L$6>=Tableau1[[#This Row],[Date]])),\"FERMÉE\",IF(OR(Tableau1[[#This Row],[Jour]]=\"sa\",Tableau1[[#This Row],[Jour]]=\"di\",AND(Tableau1[[#This Row],[Jour]]=\"ve\",MOD(Tableau1[[#This Row],[N°S]],2)=1)),\"REPOS\",IF(Tableau1[[#This Row],[Jour]]=\"ve\",8,8.75))))","v":"REPOS"}]
[null,"2019-12-16",{"$f":"_xlfn.ISOWEEKNUM(Tableau1[[#This Row],[Date]])","v":51},{"$f":"MONTH(Tableau1[[#This Row],[Date]])","v":12},{"$f":"TEXT(Tableau1[[#This Row],[Date]],\"mmmm\")","v":"décembre"},{"$f":"CHOOSE(WEEKDAY(Tableau1[[#This Row],[Date]],2),\"lu\",\"ma\",\"me\",\"je\",\"ve\",\"sa\",\"di\")","v":"lu"},{"$f":"IFERROR(VLOOKUP(B81,Tableau30[],3,FALSE),IF(OR(AND($K$5<=B81,$L$5>B81),AND($K$6<=Tableau1[[#This Row],[Date]],$L$6>=Tableau1[[#This Row],[Date]])),\"FERMÉE\",IF(OR(Tableau1[[#This Row],[Jour]]=\"sa\",Tableau1[[#This Row],[Jour]]=\"di\",AND(Tableau1[[#This Row],[Jour]]=\"ve\",MOD(Tableau1[[#This Row],[N°S]],2)=1)),\"REPOS\",IF(Tableau1[[#This Row],[Jour]]=\"ve\",8,8.75))))","v":8.75}]
[null,"2019-12-17",{"$f":"_xlfn.ISOWEEKNUM(Tableau1[[#This Row],[Date]])","v":51},{"$f":"MONTH(Tableau1[[#This Row],[Date]])","v":12},{"$f":"TEXT(Tableau1[[#This Row],[Date]],\"mmmm\")","v":"décembre"},{"$f":"CHOOSE(WEEKDAY(Tableau1[[#This Row],[Date]],2),\"lu\",\"ma\",\"me\",\"je\",\"ve\",\"sa\",\"di\")","v":"ma"},{"$f":"IFERROR(VLOOKUP(B82,Tableau30[],3,FALSE),IF(OR(AND($K$5<=B82,$L$5>B82),AND($K$6<=Tableau1[[#This Row],[Date]],$L$6>=Tableau1[[#This Row],[Date]])),\"FERMÉE\",IF(OR(Tableau1[[#This Row],[Jour]]=\"sa\",Tableau1[[#This Row],[Jour]]=\"di\",AND(Tableau1[[#This Row],[Jour]]=\"ve\",MOD(Tableau1[[#This Row],[N°S]],2)=1)),\"REPOS\",IF(Tableau1[[#This Row],[Jour]]=\"ve\",8,8.75))))","v":8.75}]
[null,"2019-12-18",{"$f":"_xlfn.ISOWEEKNUM(Tableau1[[#This Row],[Date]])","v":51},{"$f":"MONTH(Tableau1[[#This Row],[Date]])","v":12},{"$f":"TEXT(Tableau1[[#This Row],[Date]],\"mmmm\")","v":"décembre"},{"$f":"CHOOSE(WEEKDAY(Tableau1[[#This Row],[Date]],2),\"lu\",\"ma\",\"me\",\"je\",\"ve\",\"sa\",\"di\")","v":"me"},{"$f":"IFERROR(VLOOKUP(B83,Tableau30[],3,FALSE),IF(OR(AND($K$5<=B83,$L$5>B83),AND($K$6<=Tableau1[[#This Row],[Date]],$L$6>=Tableau1[[#This Row],[Date]])),\"FERMÉE\",IF(OR(Tableau1[[#This Row],[Jour]]=\"sa\",Tableau1[[#This Row],[Jour]]=\"di\",AND(Tableau1[[#This Row],[Jour]]=\"ve\",MOD(Tableau1[[#This Row],[N°S]],2)=1)),\"REPOS\",IF(Tableau1[[#This Row],[Jour]]=\"ve\",8,8.75))))","v":8.75}]
[null,"2019-12-19",{"$f":"_xlfn.ISOWEEKNUM(Tableau1[[#This Row],[Date]])","v":51},{"$f":"MONTH(Tableau1[[#This Row],[Date]])","v":12},{"$f":"TEXT(Tableau1[[#This Row],[Date]],\"mmmm\")","v":"décembre"},{"$f":"CHOOSE(WEEKDAY(Tableau1[[#This Row],[Date]],2),\"lu\",\"ma\",\"me\",\"je\",\"ve\",\"sa\",\"di\")","v":"je"},{"$f":"IFERROR(VLOOKUP(B84,Tableau30[],3,FALSE),IF(OR(AND($K$5<=B84,$L$5>B84),AND($K$6<=Tableau1[[#This Row],[Date]],$L$6>=Tableau1[[#This Row],[Date]])),\"FERMÉE\",IF(OR(Tableau1[[#This Row],[Jour]]=\"sa\",Tableau1[[#This Row],[Jour]]=\"di\",AND(Tableau1[[#This Row],[Jour]]=\"ve\",MOD(Tableau1[[#This Row],[N°S]],2)=1)),\"REPOS\",IF(Tableau1[[#This Row],[Jour]]=\"ve\",8,8.75))))","v":8.75}]
[null,"2019-12-20",{"$f":"_xlfn.ISOWEEKNUM(Tableau1[[#This Row],[Date]])","v":51},{"$f":"MONTH(Tableau1[[#This Row],[Date]])","v":12},{"$f":"TEXT(Tableau1[[#This Row],[Date]],\"mmmm\")","v":"décembre"},{"$f":"CHOOSE(WEEKDAY(Tableau1[[#This Row],[Date]],2),\"lu\",\"ma\",\"me\",\"je\",\"ve\",\"sa\",\"di\")","v":"ve"},{"$f":"IFERROR(VLOOKUP(B85,Tableau30[],3,FALSE),IF(OR(AND($K$5<=B85,$L$5>B85),AND($K$6<=Tableau1[[#This Row],[Date]],$L$6>=Tableau1[[#This Row],[Date]])),\"FERMÉE\",IF(OR(Tableau1[[#This Row],[Jour]]=\"sa\",Tableau1[[#This Row],[Jour]]=\"di\",AND(Tableau1[[#This Row],[Jour]]=\"ve\",MOD(Tableau1[[#This Row],[N°S]],2)=1)),\"REPOS\",IF(Tableau1[[#This Row],[Jour]]=\"ve\",8,8.75))))","v":"REPOS"}]
[null,"2019-12-21",{"$f":"_xlfn.ISOWEEKNUM(Tableau1[[#This Row],[Date]])","v":51},{"$f":"MONTH(Tableau1[[#This Row],[Date]])","v":12},{"$f":"TEXT(Tableau1[[#This Row],[Date]],\"mmmm\")","v":"décembre"},{"$f":"CHOOSE(WEEKDAY(Tableau1[[#This Row],[Date]],2),\"lu\",\"ma\",\"me\",\"je\",\"ve\",\"sa\",\"di\")","v":"sa"},{"$f":"IFERROR(VLOOKUP(B86,Tableau30[],3,FALSE),IF(OR(AND($K$5<=B86,$L$5>B86),AND($K$6<=Tableau1[[#This Row],[Date]],$L$6>=Tableau1[[#This Row],[Date]])),\"FERMÉE\",IF(OR(Tableau1[[#This Row],[Jour]]=\"sa\",Tableau1[[#This Row],[Jour]]=\"di\",AND(Tableau1[[#This Row],[Jour]]=\"ve\",MOD(Tableau1[[#This Row],[N°S]],2)=1)),\"REPOS\",IF(Tableau1[[#This Row],[Jour]]=\"ve\",8,8.75))))","v":"REPOS"}]
[null,"2019-12-22",{"$f":"_xlfn.ISOWEEKNUM(Tableau1[[#This Row],[Date]])","v":51},{"$f":"MONTH(Tableau1[[#This Row],[Date]])","v":12},{"$f":"TEXT(Tableau1[[#This Row],[Date]],\"mmmm\")","v":"décembre"},{"$f":"CHOOSE(WEEKDAY(Tableau1[[#This Row],[Date]],2),\"lu\",\"ma\",\"me\",\"je\",\"ve\",\"sa\",\"di\")","v":"di"},{"$f":"IFERROR(VLOOKUP(B87,Tableau30[],3,FALSE),IF(OR(AND($K$5<=B87,$L$5>B87),AND($K$6<=Tableau1[[#This Row],[Date]],$L$6>=Tableau1[[#This Row],[Date]])),\"FERMÉE\",IF(OR(Tableau1[[#This Row],[Jour]]=\"sa\",Tableau1[[#This Row],[Jour]]=\"di\",AND(Tableau1[[#This Row],[Jour]]=\"ve\",MOD(Tableau1[[#This Row],[N°S]],2)=1)),\"REPOS\",IF(Tableau1[[#This Row],[Jour]]=\"ve\",8,8.75))))","v":"REPOS"}]
[null,"2019-12-23",{"$f":"_xlfn.ISOWEEKNUM(Tableau1[[#This Row],[Date]])","v":52},{"$f":"MONTH(Tableau1[[#This Row],[Date]])","v":12},{"$f":"TEXT(Tableau1[[#This Row],[Date]],\"mmmm\")","v":"décembre"},{"$f":"CHOOSE(WEEKDAY(Tableau1[[#This Row],[Date]],2),\"lu\",\"ma\",\"me\",\"je\",\"ve\",\"sa\",\"di\")","v":"lu"},{"$f":"IFERROR(VLOOKUP(B88,Tableau30[],3,FALSE),IF(OR(AND($K$5<=B88,$L$5>B88),AND($K$6<=Tableau1[[#This Row],[Date]],$L$6>=Tableau1[[#This Row],[Date]])),\"FERMÉE\",IF(OR(Tableau1[[#This Row],[Jour]]=\"sa\",Tableau1[[#This Row],[Jour]]=\"di\",AND(Tableau1[[#This Row],[Jour]]=\"ve\",MOD(Tableau1[[#This Row],[N°S]],2)=1)),\"REPOS\",IF(Tableau1[[#This Row],[Jour]]=\"ve\",8,8.75))))","v":8.75}]
[null,"2019-12-24",{"$f":"_xlfn.ISOWEEKNUM(Tableau1[[#This Row],[Date]])","v":52},{"$f":"MONTH(Tableau1[[#This Row],[Date]])","v":12},{"$f":"TEXT(Tableau1[[#This Row],[Date]],\"mmmm\")","v":"décembre"},{"$f":"CHOOSE(WEEKDAY(Tableau1[[#This Row],[Date]],2),\"lu\",\"ma\",\"me\",\"je\",\"ve\",\"sa\",\"di\")","v":"ma"},{"$f":"IFERROR(VLOOKUP(B89,Tableau30[],3,FALSE),IF(OR(AND($K$5<=B89,$L$5>B89),AND($K$6<=Tableau1[[#This Row],[Date]],$L$6>=Tableau1[[#This Row],[Date]])),\"FERMÉE\",IF(OR(Tableau1[[#This Row],[Jour]]=\"sa\",Tableau1[[#This Row],[Jour]]=\"di\",AND(Tableau1[[#This Row],[Jour]]=\"ve\",MOD(Tableau1[[#This Row],[N°S]],2)=1)),\"REPOS\",IF(Tableau1[[#This Row],[Jour]]=\"ve\",8,8.75))))","v":8.75}]
[null,"2019-12-25",{"$f":"_xlfn.ISOWEEKNUM(Tableau1[[#This Row],[Date]])","v":52},{"$f":"MONTH(Tableau1[[#This Row],[Date]])","v":12},{"$f":"TEXT(Tableau1[[#This Row],[Date]],\"mmmm\")","v":"décembre"},{"$f":"CHOOSE(WEEKDAY(Tableau1[[#This Row],[Date]],2),\"lu\",\"ma\",\"me\",\"je\",\"ve\",\"sa\",\"di\")","v":"me"},{"$f":"IFERROR(VLOOKUP(B90,Tableau30[],3,FALSE),IF(OR(AND($K$5<=B90,$L$5>B90),AND($K$6<=Tableau1[[#This Row],[Date]],$L$6>=Tableau1[[#This Row],[Date]])),\"FERMÉE\",IF(OR(Tableau1[[#This Row],[Jour]]=\"sa\",Tableau1[[#This Row],[Jour]]=\"di\",AND(Tableau1[[#This Row],[Jour]]=\"ve\",MOD(Tableau1[[#This Row],[N°S]],2)=1)),\"REPOS\",IF(Tableau1[[#This Row],[Jour]]=\"ve\",8,8.75))))","v":"FÉRIÉ/INACTIF"}]
[null,"2019-12-26",{"$f":"_xlfn.ISOWEEKNUM(Tableau1[[#This Row],[Date]])","v":52},{"$f":"MONTH(Tableau1[[#This Row],[Date]])","v":12},{"$f":"TEXT(Tableau1[[#This Row],[Date]],\"mmmm\")","v":"décembre"},{"$f":"CHOOSE(WEEKDAY(Tableau1[[#This Row],[Date]],2),\"lu\",\"ma\",\"me\",\"je\",\"ve\",\"sa\",\"di\")","v":"je"},{"$f":"IFERROR(VLOOKUP(B91,Tableau30[],3,FALSE),IF(OR(AND($K$5<=B91,$L$5>B91),AND($K$6<=Tableau1[[#This Row],[Date]],$L$6>=Tableau1[[#This Row],[Date]])),\"FERMÉE\",IF(OR(Tableau1[[#This Row],[Jour]]=\"sa\",Tableau1[[#This Row],[Jour]]=\"di\",AND(Tableau1[[#This Row],[Jour]]=\"ve\",MOD(Tableau1[[#This Row],[N°S]],2)=1)),\"REPOS\",IF(Tableau1[[#This Row],[Jour]]=\"ve\",8,8.75))))","v":"FERMÉE"}]
[null,"2019-12-27",{"$f":"_xlfn.ISOWEEKNUM(Tableau1[[#This Row],[Date]])","v":52},{"$f":"MONTH(Tableau1[[#This Row],[Date]])","v":12},{"$f":"TEXT(Tableau1[[#This Row],[Date]],\"mmmm\")","v":"décembre"},{"$f":"CHOOSE(WEEKDAY(Tableau1[[#This Row],[Date]],2),\"lu\",\"ma\",\"me\",\"je\",\"ve\",\"sa\",\"di\")","v":"ve"},{"$f":"IFERROR(VLOOKUP(B92,Tableau30[],3,FALSE),IF(OR(AND($K$5<=B92,$L$5>B92),AND($K$6<=Tableau1[[#This Row],[Date]],$L$6>=Tableau1[[#This Row],[Date]])),\"FERMÉE\",IF(OR(Tableau1[[#This Row],[Jour]]=\"sa\",Tableau1[[#This Row],[Jour]]=\"di\",AND(Tableau1[[#This Row],[Jour]]=\"ve\",MOD(Tableau1[[#This Row],[N°S]],2)=1)),\"REPOS\",IF(Tableau1[[#This Row],[Jour]]=\"ve\",8,8.75))))","v":"FERMÉE"}]
[null,"2019-12-28",{"$f":"_xlfn.ISOWEEKNUM(Tableau1[[#This Row],[Date]])","v":52},{"$f":"MONTH(Tableau1[[#This Row],[Date]])","v":12},{"$f":"TEXT(Tableau1[[#This Row],[Date]],\"mmmm\")","v":"décembre"},{"$f":"CHOOSE(WEEKDAY(Tableau1[[#This Row],[Date]],2),\"lu\",\"ma\",\"me\",\"je\",\"ve\",\"sa\",\"di\")","v":"sa"},{"$f":"IFERROR(VLOOKUP(B93,Tableau30[],3,FALSE),IF(OR(AND($K$5<=B93,$L$5>B93),AND($K$6<=Tableau1[[#This Row],[Date]],$L$6>=Tableau1[[#This Row],[Date]])),\"FERMÉE\",IF(OR(Tableau1[[#This Row],[Jour]]=\"sa\",Tableau1[[#This Row],[Jour]]=\"di\",AND(Tableau1[[#This Row],[Jour]]=\"ve\",MOD(Tableau1[[#This Row],[N°S]],2)=1)),\"REPOS\",IF(Tableau1[[#This Row],[Jour]]=\"ve\",8,8.75))))","v":"FERMÉE"}]
[null,"2019-12-29",{"$f":"_xlfn.ISOWEEKNUM(Tableau1[[#This Row],[Date]])","v":52},{"$f":"MONTH(Tableau1[[#This Row],[Date]])","v":12},{"$f":"TEXT(Tableau1[[#This Row],[Date]],\"mmmm\")","v":"décembre"},{"$f":"CHOOSE(WEEKDAY(Tableau1[[#This Row],[Date]],2),\"lu\",\"ma\",\"me\",\"je\",\"ve\",\"sa\",\"di\")","v":"di"},{"$f":"IFERROR(VLOOKUP(B94,Tableau30[],3,FALSE),IF(OR(AND($K$5<=B94,$L$5>B94),AND($K$6<=Tableau1[[#This Row],[Date]],$L$6>=Tableau1[[#This Row],[Date]])),\"FERMÉE\",IF(OR(Tableau1[[#This Row],[Jour]]=\"sa\",Tableau1[[#This Row],[Jour]]=\"di\",AND(Tableau1[[#This Row],[Jour]]=\"ve\",MOD(Tableau1[[#This Row],[N°S]],2)=1)),\"REPOS\",IF(Tableau1[[#This Row],[Jour]]=\"ve\",8,8.75))))","v":"FERMÉE"}]
[null,"2019-12-30",{"$f":"_xlfn.ISOWEEKNUM(Tableau1[[#This Row],[Date]])","v":1},{"$f":"MONTH(Tableau1[[#This Row],[Date]])","v":12},{"$f":"TEXT(Tableau1[[#This Row],[Date]],\"mmmm\")","v":"décembre"},{"$f":"CHOOSE(WEEKDAY(Tableau1[[#This Row],[Date]],2),\"lu\",\"ma\",\"me\",\"je\",\"ve\",\"sa\",\"di\")","v":"lu"},{"$f":"IFERROR(VLOOKUP(B95,Tableau30[],3,FALSE),IF(OR(AND($K$5<=B95,$L$5>B95),AND($K$6<=Tableau1[[#This Row],[Date]],$L$6>=Tableau1[[#This Row],[Date]])),\"FERMÉE\",IF(OR(Tableau1[[#This Row],[Jour]]=\"sa\",Tableau1[[#This Row],[Jour]]=\"di\",AND(Tableau1[[#This Row],[Jour]]=\"ve\",MOD(Tableau1[[#This Row],[N°S]],2)=1)),\"REPOS\",IF(Tableau1[[#This Row],[Jour]]=\"ve\",8,8.75))))","v":"FERMÉE"}]
[null,"2019-12-31",{"$f":"_xlfn.ISOWEEKNUM(Tableau1[[#This Row],[Date]])","v":1},{"$f":"MONTH(Tableau1[[#This Row],[Date]])","v":12},{"$f":"TEXT(Tableau1[[#This Row],[Date]],\"mmmm\")","v":"décembre"},{"$f":"CHOOSE(WEEKDAY(Tableau1[[#This Row],[Date]],2),\"lu\",\"ma\",\"me\",\"je\",\"ve\",\"sa\",\"di\")","v":"ma"},{"$f":"IFERROR(VLOOKUP(B96,Tableau30[],3,FALSE),IF(OR(AND($K$5<=B96,$L$5>B96),AND($K$6<=Tableau1[[#This Row],[Date]],$L$6>=Tableau1[[#This Row],[Date]])),\"FERMÉE\",IF(OR(Tableau1[[#This Row],[Jour]]=\"sa\",Tableau1[[#This Row],[Jour]]=\"di\",AND(Tableau1[[#This Row],[Jour]]=\"ve\",MOD(Tableau1[[#This Row],[N°S]],2)=1)),\"REPOS\",IF(Tableau1[[#This Row],[Jour]]=\"ve\",8,8.75))))","v":"FERMÉE"}]
[null,"2020-01-01",{"$f":"_xlfn.ISOWEEKNUM(Tableau1[[#This Row],[Date]])","v":1},{"$f":"MONTH(Tableau1[[#This Row],[Date]])","v":1},{"$f":"TEXT(Tableau1[[#This Row],[Date]],\"mmmm\")","v":"janvier"},{"$f":"CHOOSE(WEEKDAY(Tableau1[[#This Row],[Date]],2),\"lu\",\"ma\",\"me\",\"je\",\"ve\",\"sa\",\"di\")","v":"me"},{"$f":"IFERROR(VLOOKUP(B97,Tableau30[],3,FALSE),IF(OR(AND($K$5<=B97,$L$5>B97),AND($K$6<=Tableau1[[#This Row],[Date]],$L$6>=Tableau1[[#This Row],[Date]])),\"FERMÉE\",IF(OR(Tableau1[[#This Row],[Jour]]=\"sa\",Tableau1[[#This Row],[Jour]]=\"di\",AND(Tableau1[[#This Row],[Jour]]=\"ve\",MOD(Tableau1[[#This Row],[N°S]],2)=1)),\"REPOS\",IF(Tableau1[[#This Row],[Jour]]=\"ve\",8,8.75))))","v":"FÉRIÉ/INACTIF"}]
[null,"2020-01-02",{"$f":"_xlfn.ISOWEEKNUM(Tableau1[[#This Row],[Date]])","v":1},{"$f":"MONTH(Tableau1[[#This Row],[Date]])","v":1},{"$f":"TEXT(Tableau1[[#This Row],[Date]],\"mmmm\")","v":"janvier"},{"$f":"CHOOSE(WEEKDAY(Tableau1[[#This Row],[Date]],2),\"lu\",\"ma\",\"me\",\"je\",\"ve\",\"sa\",\"di\")","v":"je"},{"$f":"IFERROR(VLOOKUP(B98,Tableau30[],3,FALSE),IF(OR(AND($K$5<=B98,$L$5>B98),AND($K$6<=Tableau1[[#This Row],[Date]],$L$6>=Tableau1[[#This Row],[Date]])),\"FERMÉE\",IF(OR(Tableau1[[#This Row],[Jour]]=\"sa\",Tableau1[[#This Row],[Jour]]=\"di\",AND(Tableau1[[#This Row],[Jour]]=\"ve\",MOD(Tableau1[[#This Row],[N°S]],2)=1)),\"REPOS\",IF(Tableau1[[#This Row],[Jour]]=\"ve\",8,8.75))))","v":"FERMÉE"}]
[null,"2020-01-03",{"$f":"_xlfn.ISOWEEKNUM(Tableau1[[#This Row],[Date]])","v":1},{"$f":"MONTH(Tableau1[[#This Row],[Date]])","v":1},{"$f":"TEXT(Tableau1[[#This Row],[Date]],\"mmmm\")","v":"janvier"},{"$f":"CHOOSE(WEEKDAY(Tableau1[[#This Row],[Date]],2),\"lu\",\"ma\",\"me\",\"je\",\"ve\",\"sa\",\"di\")","v":"ve"},{"$f":"IFERROR(VLOOKUP(B99,Tableau30[],3,FALSE),IF(OR(AND($K$5<=B99,$L$5>B99),AND($K$6<=Tableau1[[#This Row],[Date]],$L$6>=Tableau1[[#This Row],[Date]])),\"FERMÉE\",IF(OR(Tableau1[[#This Row],[Jour]]=\"sa\",Tableau1[[#This Row],[Jour]]=\"di\",AND(Tableau1[[#This Row],[Jour]]=\"ve\",MOD(Tableau1[[#This Row],[N°S]],2)=1)),\"REPOS\",IF(Tableau1[[#This Row],[Jour]]=\"ve\",8,8.75))))","v":"FERMÉE"}]
[null,"2020-01-04",{"$f":"_xlfn.ISOWEEKNUM(Tableau1[[#This Row],[Date]])","v":1},{"$f":"MONTH(Tableau1[[#This Row],[Date]])","v":1},{"$f":"TEXT(Tableau1[[#This Row],[Date]],\"mmmm\")","v":"janvier"},{"$f":"CHOOSE(WEEKDAY(Tableau1[[#This Row],[Date]],2),\"lu\",\"ma\",\"me\",\"je\",\"ve\",\"sa\",\"di\")","v":"sa"},{"$f":"IFERROR(VLOOKUP(B100,Tableau30[],3,FALSE),IF(OR(AND($K$5<=B100,$L$5>B100),AND($K$6<=Tableau1[[#This Row],[Date]],$L$6>=Tableau1[[#This Row],[Date]])),\"FERMÉE\",IF(OR(Tableau1[[#This Row],[Jour]]=\"sa\",Tableau1[[#This Row],[Jour]]=\"di\",AND(Tableau1[[#This Row],[Jour]]=\"ve\",MOD(Tableau1[[#This Row],[N°S]],2)=1)),\"REPOS\",IF(Tableau1[[#This Row],[Jour]]=\"ve\",8,8.75))))","v":"FERMÉE"}]
[null,"2020-01-05",{"$f":"_xlfn.ISOWEEKNUM(Tableau1[[#This Row],[Date]])","v":1},{"$f":"MONTH(Tableau1[[#This Row],[Date]])","v":1},{"$f":"TEXT(Tableau1[[#This Row],[Date]],\"mmmm\")","v":"janvier"},{"$f":"CHOOSE(WEEKDAY(Tableau1[[#This Row],[Date]],2),\"lu\",\"ma\",\"me\",\"je\",\"ve\",\"sa\",\"di\")","v":"di"},{"$f":"IFERROR(VLOOKUP(B101,Tableau30[],3,FALSE),IF(OR(AND($K$5<=B101,$L$5>B101),AND($K$6<=Tableau1[[#This Row],[Date]],$L$6>=Tableau1[[#This Row],[Date]])),\"FERMÉE\",IF(OR(Tableau1[[#This Row],[Jour]]=\"sa\",Tableau1[[#This Row],[Jour]]=\"di\",AND(Tableau1[[#This Row],[Jour]]=\"ve\",MOD(Tableau1[[#This Row],[N°S]],2)=1)),\"REPOS\",IF(Tableau1[[#This Row],[Jour]]=\"ve\",8,8.75))))","v":"FERMÉE"}]
[null,"2020-01-06",{"$f":"_xlfn.ISOWEEKNUM(Tableau1[[#This Row],[Date]])","v":2},{"$f":"MONTH(Tableau1[[#This Row],[Date]])","v":1},{"$f":"TEXT(Tableau1[[#This Row],[Date]],\"mmmm\")","v":"janvier"},{"$f":"CHOOSE(WEEKDAY(Tableau1[[#This Row],[Date]],2),\"lu\",\"ma\",\"me\",\"je\",\"ve\",\"sa\",\"di\")","v":"lu"},{"$f":"IFERROR(VLOOKUP(B102,Tableau30[],3,FALSE),IF(OR(AND($K$5<=B102,$L$5>B102),AND($K$6<=Tableau1[[#This Row],[Date]],$L$6>=Tableau1[[#This Row],[Date]])),\"FERMÉE\",IF(OR(Tableau1[[#This Row],[Jour]]=\"sa\",Tableau1[[#This Row],[Jour]]=\"di\",AND(Tableau1[[#This Row],[Jour]]=\"ve\",MOD(Tableau1[[#This Row],[N°S]],2)=1)),\"REPOS\",IF(Tableau1[[#This Row],[Jour]]=\"ve\",8,8.75))))","v":8.75}]
[null,"2020-01-07",{"$f":"_xlfn.ISOWEEKNUM(Tableau1[[#This Row],[Date]])","v":2},{"$f":"MONTH(Tableau1[[#This Row],[Date]])","v":1},{"$f":"TEXT(Tableau1[[#This Row],[Date]],\"mmmm\")","v":"janvier"},{"$f":"CHOOSE(WEEKDAY(Tableau1[[#This Row],[Date]],2),\"lu\",\"ma\",\"me\",\"je\",\"ve\",\"sa\",\"di\")","v":"ma"},{"$f":"IFERROR(VLOOKUP(B103,Tableau30[],3,FALSE),IF(OR(AND($K$5<=B103,$L$5>B103),AND($K$6<=Tableau1[[#This Row],[Date]],$L$6>=Tableau1[[#This Row],[Date]])),\"FERMÉE\",IF(OR(Tableau1[[#This Row],[Jour]]=\"sa\",Tableau1[[#This Row],[Jour]]=\"di\",AND(Tableau1[[#This Row],[Jour]]=\"ve\",MOD(Tableau1[[#This Row],[N°S]],2)=1)),\"REPOS\",IF(Tableau1[[#This Row],[Jour]]=\"ve\",8,8.75))))","v":8.75}]
[null,"2020-01-08",{"$f":"_xlfn.ISOWEEKNUM(Tableau1[[#This Row],[Date]])","v":2},{"$f":"MONTH(Tableau1[[#This Row],[Date]])","v":1},{"$f":"TEXT(Tableau1[[#This Row],[Date]],\"mmmm\")","v":"janvier"},{"$f":"CHOOSE(WEEKDAY(Tableau1[[#This Row],[Date]],2),\"lu\",\"ma\",\"me\",\"je\",\"ve\",\"sa\",\"di\")","v":"me"},{"$f":"IFERROR(VLOOKUP(B104,Tableau30[],3,FALSE),IF(OR(AND($K$5<=B104,$L$5>B104),AND($K$6<=Tableau1[[#This Row],[Date]],$L$6>=Tableau1[[#This Row],[Date]])),\"FERMÉE\",IF(OR(Tableau1[[#This Row],[Jour]]=\"sa\",Tableau1[[#This Row],[Jour]]=\"di\",AND(Tableau1[[#This Row],[Jour]]=\"ve\",MOD(Tableau1[[#This Row],[N°S]],2)=1)),\"REPOS\",IF(Tableau1[[#This Row],[Jour]]=\"ve\",8,8.75))))","v":8.75}]
[null,"2020-01-09",{"$f":"_xlfn.ISOWEEKNUM(Tableau1[[#This Row],[Date]])","v":2},{"$f":"MONTH(Tableau1[[#This Row],[Date]])","v":1},{"$f":"TEXT(Tableau1[[#This Row],[Date]],\"mmmm\")","v":"janvier"},{"$f":"CHOOSE(WEEKDAY(Tableau1[[#This Row],[Date]],2),\"lu\",\"ma\",\"me\",\"je\",\"ve\",\"sa\",\"di\")","v":"je"},{"$f":"IFERROR(VLOOKUP(B105,Tableau30[],3,FALSE),IF(OR(AND($K$5<=B105,$L$5>B105),AND($K$6<=Tableau1[[#This Row],[Date]],$L$6>=Tableau1[[#This Row],[Date]])),\"FERMÉE\",IF(OR(Tableau1[[#This Row],[Jour]]=\"sa\",Tableau1[[#This Row],[Jour]]=\"di\",AND(Tableau1[[#This Row],[Jour]]=\"ve\",MOD(Tableau1[[#This Row],[N°S]],2)=1)),\"REPOS\",IF(Tableau1[[#This Row],[Jour]]=\"ve\",8,8.75))))","v":8.75}]
[null,"2020-01-10",{"$f":"_xlfn.ISOWEEKNUM(Tableau1[[#This Row],[Date]])","v":2},{"$f":"MONTH(Tableau1[[#This Row],[Date]])","v":1},{"$f":"TEXT(Tableau1[[#This Row],[Date]],\"mmmm\")","v":"janvier"},{"$f":"CHOOSE(WEEKDAY(Tableau1[[#This Row],[Date]],2),\"lu\",\"ma\",\"me\",\"je\",\"ve\",\"sa\",\"di\")","v":"ve"},{"$f":"IFERROR(VLOOKUP(B106,Tableau30[],3,FALSE),IF(OR(AND($K$5<=B106,$L$5>B106),AND($K$6<=Tableau1[[#This Row],[Date]],$L$6>=Tableau1[[#This Row],[Date]])),\"FERMÉE\",IF(OR(Tableau1[[#This Row],[Jour]]=\"sa\",Tableau1[[#This Row],[Jour]]=\"di\",AND(Tableau1[[#This Row],[Jour]]=\"ve\",MOD(Tableau1[[#This Row],[N°S]],2)=1)),\"REPOS\",IF(Tableau1[[#This Row],[Jour]]=\"ve\",8,8.75))))","v":8}]
[null,"2020-01-11",{"$f":"_xlfn.ISOWEEKNUM(Tableau1[[#This Row],[Date]])","v":2},{"$f":"MONTH(Tableau1[[#This Row],[Date]])","v":1},{"$f":"TEXT(Tableau1[[#This Row],[Date]],\"mmmm\")","v":"janvier"},{"$f":"CHOOSE(WEEKDAY(Tableau1[[#This Row],[Date]],2),\"lu\",\"ma\",\"me\",\"je\",\"ve\",\"sa\",\"di\")","v":"sa"},{"$f":"IFERROR(VLOOKUP(B107,Tableau30[],3,FALSE),IF(OR(AND($K$5<=B107,$L$5>B107),AND($K$6<=Tableau1[[#This Row],[Date]],$L$6>=Tableau1[[#This Row],[Date]])),\"FERMÉE\",IF(OR(Tableau1[[#This Row],[Jour]]=\"sa\",Tableau1[[#This Row],[Jour]]=\"di\",AND(Tableau1[[#This Row],[Jour]]=\"ve\",MOD(Tableau1[[#This Row],[N°S]],2)=1)),\"REPOS\",IF(Tableau1[[#This Row],[Jour]]=\"ve\",8,8.75))))","v":"REPOS"}]
[null,"2020-01-12",{"$f":"_xlfn.ISOWEEKNUM(Tableau1[[#This Row],[Date]])","v":2},{"$f":"MONTH(Tableau1[[#This Row],[Date]])","v":1},{"$f":"TEXT(Tableau1[[#This Row],[Date]],\"mmmm\")","v":"janvier"},{"$f":"CHOOSE(WEEKDAY(Tableau1[[#This Row],[Date]],2),\"lu\",\"ma\",\"me\",\"je\",\"ve\",\"sa\",\"di\")","v":"di"},{"$f":"IFERROR(VLOOKUP(B108,Tableau30[],3,FALSE),IF(OR(AND($K$5<=B108,$L$5>B108),AND($K$6<=Tableau1[[#This Row],[Date]],$L$6>=Tableau1[[#This Row],[Date]])),\"FERMÉE\",IF(OR(Tableau1[[#This Row],[Jour]]=\"sa\",Tableau1[[#This Row],[Jour]]=\"di\",AND(Tableau1[[#This Row],[Jour]]=\"ve\",MOD(Tableau1[[#This Row],[N°S]],2)=1)),\"REPOS\",IF(Tableau1[[#This Row],[Jour]]=\"ve\",8,8.75))))","v":"REPOS"}]
[null,"2020-01-13",{"$f":"_xlfn.ISOWEEKNUM(Tableau1[[#This Row],[Date]])","v":3},{"$f":"MONTH(Tableau1[[#This Row],[Date]])","v":1},{"$f":"TEXT(Tableau1[[#This Row],[Date]],\"mmmm\")","v":"janvier"},{"$f":"CHOOSE(WEEKDAY(Tableau1[[#This Row],[Date]],2),\"lu\",\"ma\",\"me\",\"je\",\"ve\",\"sa\",\"di\")","v":"lu"},{"$f":"IFERROR(VLOOKUP(B109,Tableau30[],3,FALSE),IF(OR(AND($K$5<=B109,$L$5>B109),AND($K$6<=Tableau1[[#This Row],[Date]],$L$6>=Tableau1[[#This Row],[Date]])),\"FERMÉE\",IF(OR(Tableau1[[#This Row],[Jour]]=\"sa\",Tableau1[[#This Row],[Jour]]=\"di\",AND(Tableau1[[#This Row],[Jour]]=\"ve\",MOD(Tableau1[[#This Row],[N°S]],2)=1)),\"REPOS\",IF(Tableau1[[#This Row],[Jour]]=\"ve\",8,8.75))))","v":8.75}]
[null,"2020-01-14",{"$f":"_xlfn.ISOWEEKNUM(Tableau1[[#This Row],[Date]])","v":3},{"$f":"MONTH(Tableau1[[#This Row],[Date]])","v":1},{"$f":"TEXT(Tableau1[[#This Row],[Date]],\"mmmm\")","v":"janvier"},{"$f":"CHOOSE(WEEKDAY(Tableau1[[#This Row],[Date]],2),\"lu\",\"ma\",\"me\",\"je\",\"ve\",\"sa\",\"di\")","v":"ma"},{"$f":"IFERROR(VLOOKUP(B110,Tableau30[],3,FALSE),IF(OR(AND($K$5<=B110,$L$5>B110),AND($K$6<=Tableau1[[#This Row],[Date]],$L$6>=Tableau1[[#This Row],[Date]])),\"FERMÉE\",IF(OR(Tableau1[[#This Row],[Jour]]=\"sa\",Tableau1[[#This Row],[Jour]]=\"di\",AND(Tableau1[[#This Row],[Jour]]=\"ve\",MOD(Tableau1[[#This Row],[N°S]],2)=1)),\"REPOS\",IF(Tableau1[[#This Row],[Jour]]=\"ve\",8,8.75))))","v":8.75}]
[null,"2020-01-15",{"$f":"_xlfn.ISOWEEKNUM(Tableau1[[#This Row],[Date]])","v":3},{"$f":"MONTH(Tableau1[[#This Row],[Date]])","v":1},{"$f":"TEXT(Tableau1[[#This Row],[Date]],\"mmmm\")","v":"janvier"},{"$f":"CHOOSE(WEEKDAY(Tableau1[[#This Row],[Date]],2),\"lu\",\"ma\",\"me\",\"je\",\"ve\",\"sa\",\"di\")","v":"me"},{"$f":"IFERROR(VLOOKUP(B111,Tableau30[],3,FALSE),IF(OR(AND($K$5<=B111,$L$5>B111),AND($K$6<=Tableau1[[#This Row],[Date]],$L$6>=Tableau1[[#This Row],[Date]])),\"FERMÉE\",IF(OR(Tableau1[[#This Row],[Jour]]=\"sa\",Tableau1[[#This Row],[Jour]]=\"di\",AND(Tableau1[[#This Row],[Jour]]=\"ve\",MOD(Tableau1[[#This Row],[N°S]],2)=1)),\"REPOS\",IF(Tableau1[[#This Row],[Jour]]=\"ve\",8,8.75))))","v":8.75}]
[null,"2020-01-16",{"$f":"_xlfn.ISOWEEKNUM(Tableau1[[#This Row],[Date]])","v":3},{"$f":"MONTH(Tableau1[[#This Row],[Date]])","v":1},{"$f":"TEXT(Tableau1[[#This Row],[Date]],\"mmmm\")","v":"janvier"},{"$f":"CHOOSE(WEEKDAY(Tableau1[[#This Row],[Date]],2),\"lu\",\"ma\",\"me\",\"je\",\"ve\",\"sa\",\"di\")","v":"je"},{"$f":"IFERROR(VLOOKUP(B112,Tableau30[],3,FALSE),IF(OR(AND($K$5<=B112,$L$5>B112),AND($K$6<=Tableau1[[#This Row],[Date]],$L$6>=Tableau1[[#This Row],[Date]])),\"FERMÉE\",IF(OR(Tableau1[[#This Row],[Jour]]=\"sa\",Tableau1[[#This Row],[Jour]]=\"di\",AND(Tableau1[[#This Row],[Jour]]=\"ve\",MOD(Tableau1[[#This Row],[N°S]],2)=1)),\"REPOS\",IF(Tableau1[[#This Row],[Jour]]=\"ve\",8,8.75))))","v":8.75}]
[null,"2020-01-17",{"$f":"_xlfn.ISOWEEKNUM(Tableau1[[#This Row],[Date]])","v":3},{"$f":"MONTH(Tableau1[[#This Row],[Date]])","v":1},{"$f":"TEXT(Tableau1[[#This Row],[Date]],\"mmmm\")","v":"janvier"},{"$f":"CHOOSE(WEEKDAY(Tableau1[[#This Row],[Date]],2),\"lu\",\"ma\",\"me\",\"je\",\"ve\",\"sa\",\"di\")","v":"ve"},{"$f":"IFERROR(VLOOKUP(B113,Tableau30[],3,FALSE),IF(OR(AND($K$5<=B113,$L$5>B113),AND($K$6<=Tableau1[[#This Row],[Date]],$L$6>=Tableau1[[#This Row],[Date]])),\"FERMÉE\",IF(OR(Tableau1[[#This Row],[Jour]]=\"sa\",Tableau1[[#This Row],[Jour]]=\"di\",AND(Tableau1[[#This Row],[Jour]]=\"ve\",MOD(Tableau1[[#This Row],[N°S]],2)=1)),\"REPOS\",IF(Tableau1[[#This Row],[Jour]]=\"ve\",8,8.75))))","v":"REPOS"}]
[null,"2020-01-18",{"$f":"_xlfn.ISOWEEKNUM(Tableau1[[#This Row],[Date]])","v":3},{"$f":"MONTH(Tableau1[[#This Row],[Date]])","v":1},{"$f":"TEXT(Tableau1[[#This Row],[Date]],\"mmmm\")","v":"janvier"},{"$f":"CHOOSE(WEEKDAY(Tableau1[[#This Row],[Date]],2),\"lu\",\"ma\",\"me\",\"je\",\"ve\",\"sa\",\"di\")","v":"sa"},{"$f":"IFERROR(VLOOKUP(B114,Tableau30[],3,FALSE),IF(OR(AND($K$5<=B114,$L$5>B114),AND($K$6<=Tableau1[[#This Row],[Date]],$L$6>=Tableau1[[#This Row],[Date]])),\"FERMÉE\",IF(OR(Tableau1[[#This Row],[Jour]]=\"sa\",Tableau1[[#This Row],[Jour]]=\"di\",AND(Tableau1[[#This Row],[Jour]]=\"ve\",MOD(Tableau1[[#This Row],[N°S]],2)=1)),\"REPOS\",IF(Tableau1[[#This Row],[Jour]]=\"ve\",8,8.75))))","v":"REPOS"}]
[null,"2020-01-19",{"$f":"_xlfn.ISOWEEKNUM(Tableau1[[#This Row],[Date]])","v":3},{"$f":"MONTH(Tableau1[[#This Row],[Date]])","v":1},{"$f":"TEXT(Tableau1[[#This Row],[Date]],\"mmmm\")","v":"janvier"},{"$f":"CHOOSE(WEEKDAY(Tableau1[[#This Row],[Date]],2),\"lu\",\"ma\",\"me\",\"je\",\"ve\",\"sa\",\"di\")","v":"di"},{"$f":"IFERROR(VLOOKUP(B115,Tableau30[],3,FALSE),IF(OR(AND($K$5<=B115,$L$5>B115),AND($K$6<=Tableau1[[#This Row],[Date]],$L$6>=Tableau1[[#This Row],[Date]])),\"FERMÉE\",IF(OR(Tableau1[[#This Row],[Jour]]=\"sa\",Tableau1[[#This Row],[Jour]]=\"di\",AND(Tableau1[[#This Row],[Jour]]=\"ve\",MOD(Tableau1[[#This Row],[N°S]],2)=1)),\"REPOS\",IF(Tableau1[[#This Row],[Jour]]=\"ve\",8,8.75))))","v":"REPOS"}]
[null,"2020-01-20",{"$f":"_xlfn.ISOWEEKNUM(Tableau1[[#This Row],[Date]])","v":4},{"$f":"MONTH(Tableau1[[#This Row],[Date]])","v":1},{"$f":"TEXT(Tableau1[[#This Row],[Date]],\"mmmm\")","v":"janvier"},{"$f":"CHOOSE(WEEKDAY(Tableau1[[#This Row],[Date]],2),\"lu\",\"ma\",\"me\",\"je\",\"ve\",\"sa\",\"di\")","v":"lu"},{"$f":"IFERROR(VLOOKUP(B116,Tableau30[],3,FALSE),IF(OR(AND($K$5<=B116,$L$5>B116),AND($K$6<=Tableau1[[#This Row],[Date]],$L$6>=Tableau1[[#This Row],[Date]])),\"FERMÉE\",IF(OR(Tableau1[[#This Row],[Jour]]=\"sa\",Tableau1[[#This Row],[Jour]]=\"di\",AND(Tableau1[[#This Row],[Jour]]=\"ve\",MOD(Tableau1[[#This Row],[N°S]],2)=1)),\"REPOS\",IF(Tableau1[[#This Row],[Jour]]=\"ve\",8,8.75))))","v":8.75}]
[null,"2020-01-21",{"$f":"_xlfn.ISOWEEKNUM(Tableau1[[#This Row],[Date]])","v":4},{"$f":"MONTH(Tableau1[[#This Row],[Date]])","v":1},{"$f":"TEXT(Tableau1[[#This Row],[Date]],\"mmmm\")","v":"janvier"},{"$f":"CHOOSE(WEEKDAY(Tableau1[[#This Row],[Date]],2),\"lu\",\"ma\",\"me\",\"je\",\"ve\",\"sa\",\"di\")","v":"ma"},{"$f":"IFERROR(VLOOKUP(B117,Tableau30[],3,FALSE),IF(OR(AND($K$5<=B117,$L$5>B117),AND($K$6<=Tableau1[[#This Row],[Date]],$L$6>=Tableau1[[#This Row],[Date]])),\"FERMÉE\",IF(OR(Tableau1[[#This Row],[Jour]]=\"sa\",Tableau1[[#This Row],[Jour]]=\"di\",AND(Tableau1[[#This Row],[Jour]]=\"ve\",MOD(Tableau1[[#This Row],[N°S]],2)=1)),\"REPOS\",IF(Tableau1[[#This Row],[Jour]]=\"ve\",8,8.75))))","v":8.75}]
[null,"2020-01-22",{"$f":"_xlfn.ISOWEEKNUM(Tableau1[[#This Row],[Date]])","v":4},{"$f":"MONTH(Tableau1[[#This Row],[Date]])","v":1},{"$f":"TEXT(Tableau1[[#This Row],[Date]],\"mmmm\")","v":"janvier"},{"$f":"CHOOSE(WEEKDAY(Tableau1[[#This Row],[Date]],2),\"lu\",\"ma\",\"me\",\"je\",\"ve\",\"sa\",\"di\")","v":"me"},{"$f":"IFERROR(VLOOKUP(B118,Tableau30[],3,FALSE),IF(OR(AND($K$5<=B118,$L$5>B118),AND($K$6<=Tableau1[[#This Row],[Date]],$L$6>=Tableau1[[#This Row],[Date]])),\"FERMÉE\",IF(OR(Tableau1[[#This Row],[Jour]]=\"sa\",Tableau1[[#This Row],[Jour]]=\"di\",AND(Tableau1[[#This Row],[Jour]]=\"ve\",MOD(Tableau1[[#This Row],[N°S]],2)=1)),\"REPOS\",IF(Tableau1[[#This Row],[Jour]]=\"ve\",8,8.75))))","v":8.75}]
[null,"2020-01-23",{"$f":"_xlfn.ISOWEEKNUM(Tableau1[[#This Row],[Date]])","v":4},{"$f":"MONTH(Tableau1[[#This Row],[Date]])","v":1},{"$f":"TEXT(Tableau1[[#This Row],[Date]],\"mmmm\")","v":"janvier"},{"$f":"CHOOSE(WEEKDAY(Tableau1[[#This Row],[Date]],2),\"lu\",\"ma\",\"me\",\"je\",\"ve\",\"sa\",\"di\")","v":"je"},{"$f":"IFERROR(VLOOKUP(B119,Tableau30[],3,FALSE),IF(OR(AND($K$5<=B119,$L$5>B119),AND($K$6<=Tableau1[[#This Row],[Date]],$L$6>=Tableau1[[#This Row],[Date]])),\"FERMÉE\",IF(OR(Tableau1[[#This Row],[Jour]]=\"sa\",Tableau1[[#This Row],[Jour]]=\"di\",AND(Tableau1[[#This Row],[Jour]]=\"ve\",MOD(Tableau1[[#This Row],[N°S]],2)=1)),\"REPOS\",IF(Tableau1[[#This Row],[Jour]]=\"ve\",8,8.75))))","v":8.75}]
[null,"2020-01-24",{"$f":"_xlfn.ISOWEEKNUM(Tableau1[[#This Row],[Date]])","v":4},{"$f":"MONTH(Tableau1[[#This Row],[Date]])","v":1},{"$f":"TEXT(Tableau1[[#This Row],[Date]],\"mmmm\")","v":"janvier"},{"$f":"CHOOSE(WEEKDAY(Tableau1[[#This Row],[Date]],2),\"lu\",\"ma\",\"me\",\"je\",\"ve\",\"sa\",\"di\")","v":"ve"},{"$f":"IFERROR(VLOOKUP(B120,Tableau30[],3,FALSE),IF(OR(AND($K$5<=B120,$L$5>B120),AND($K$6<=Tableau1[[#This Row],[Date]],$L$6>=Tableau1[[#This Row],[Date]])),\"FERMÉE\",IF(OR(Tableau1[[#This Row],[Jour]]=\"sa\",Tableau1[[#This Row],[Jour]]=\"di\",AND(Tableau1[[#This Row],[Jour]]=\"ve\",MOD(Tableau1[[#This Row],[N°S]],2)=1)),\"REPOS\",IF(Tableau1[[#This Row],[Jour]]=\"ve\",8,8.75))))","v":8}]
[null,"2020-01-25",{"$f":"_xlfn.ISOWEEKNUM(Tableau1[[#This Row],[Date]])","v":4},{"$f":"MONTH(Tableau1[[#This Row],[Date]])","v":1},{"$f":"TEXT(Tableau1[[#This Row],[Date]],\"mmmm\")","v":"janvier"},{"$f":"CHOOSE(WEEKDAY(Tableau1[[#This Row],[Date]],2),\"lu\",\"ma\",\"me\",\"je\",\"ve\",\"sa\",\"di\")","v":"sa"},{"$f":"IFERROR(VLOOKUP(B121,Tableau30[],3,FALSE),IF(OR(AND($K$5<=B121,$L$5>B121),AND($K$6<=Tableau1[[#This Row],[Date]],$L$6>=Tableau1[[#This Row],[Date]])),\"FERMÉE\",IF(OR(Tableau1[[#This Row],[Jour]]=\"sa\",Tableau1[[#This Row],[Jour]]=\"di\",AND(Tableau1[[#This Row],[Jour]]=\"ve\",MOD(Tableau1[[#This Row],[N°S]],2)=1)),\"REPOS\",IF(Tableau1[[#This Row],[Jour]]=\"ve\",8,8.75))))","v":"REPOS"}]
[null,"2020-01-26",{"$f":"_xlfn.ISOWEEKNUM(Tableau1[[#This Row],[Date]])","v":4},{"$f":"MONTH(Tableau1[[#This Row],[Date]])","v":1},{"$f":"TEXT(Tableau1[[#This Row],[Date]],\"mmmm\")","v":"janvier"},{"$f":"CHOOSE(WEEKDAY(Tableau1[[#This Row],[Date]],2),\"lu\",\"ma\",\"me\",\"je\",\"ve\",\"sa\",\"di\")","v":"di"},{"$f":"IFERROR(VLOOKUP(B122,Tableau30[],3,FALSE),IF(OR(AND($K$5<=B122,$L$5>B122),AND($K$6<=Tableau1[[#This Row],[Date]],$L$6>=Tableau1[[#This Row],[Date]])),\"FERMÉE\",IF(OR(Tableau1[[#This Row],[Jour]]=\"sa\",Tableau1[[#This Row],[Jour]]=\"di\",AND(Tableau1[[#This Row],[Jour]]=\"ve\",MOD(Tableau1[[#This Row],[N°S]],2)=1)),\"REPOS\",IF(Tableau1[[#This Row],[Jour]]=\"ve\",8,8.75))))","v":"REPOS"}]
[null,"2020-01-27",{"$f":"_xlfn.ISOWEEKNUM(Tableau1[[#This Row],[Date]])","v":5},{"$f":"MONTH(Tableau1[[#This Row],[Date]])","v":1},{"$f":"TEXT(Tableau1[[#This Row],[Date]],\"mmmm\")","v":"janvier"},{"$f":"CHOOSE(WEEKDAY(Tableau1[[#This Row],[Date]],2),\"lu\",\"ma\",\"me\",\"je\",\"ve\",\"sa\",\"di\")","v":"lu"},{"$f":"IFERROR(VLOOKUP(B123,Tableau30[],3,FALSE),IF(OR(AND($K$5<=B123,$L$5>B123),AND($K$6<=Tableau1[[#This Row],[Date]],$L$6>=Tableau1[[#This Row],[Date]])),\"FERMÉE\",IF(OR(Tableau1[[#This Row],[Jour]]=\"sa\",Tableau1[[#This Row],[Jour]]=\"di\",AND(Tableau1[[#This Row],[Jour]]=\"ve\",MOD(Tableau1[[#This Row],[N°S]],2)=1)),\"REPOS\",IF(Tableau1[[#This Row],[Jour]]=\"ve\",8,8.75))))","v":8.75}]
[null,"2020-01-28",{"$f":"_xlfn.ISOWEEKNUM(Tableau1[[#This Row],[Date]])","v":5},{"$f":"MONTH(Tableau1[[#This Row],[Date]])","v":1},{"$f":"TEXT(Tableau1[[#This Row],[Date]],\"mmmm\")","v":"janvier"},{"$f":"CHOOSE(WEEKDAY(Tableau1[[#This Row],[Date]],2),\"lu\",\"ma\",\"me\",\"je\",\"ve\",\"sa\",\"di\")","v":"ma"},{"$f":"IFERROR(VLOOKUP(B124,Tableau30[],3,FALSE),IF(OR(AND($K$5<=B124,$L$5>B124),AND($K$6<=Tableau1[[#This Row],[Date]],$L$6>=Tableau1[[#This Row],[Date]])),\"FERMÉE\",IF(OR(Tableau1[[#This Row],[Jour]]=\"sa\",Tableau1[[#This Row],[Jour]]=\"di\",AND(Tableau1[[#This Row],[Jour]]=\"ve\",MOD(Tableau1[[#This Row],[N°S]],2)=1)),\"REPOS\",IF(Tableau1[[#This Row],[Jour]]=\"ve\",8,8.75))))","v":8.75}]
[null,"2020-01-29",{"$f":"_xlfn.ISOWEEKNUM(Tableau1[[#This Row],[Date]])","v":5},{"$f":"MONTH(Tableau1[[#This Row],[Date]])","v":1},{"$f":"TEXT(Tableau1[[#This Row],[Date]],\"mmmm\")","v":"janvier"},{"$f":"CHOOSE(WEEKDAY(Tableau1[[#This Row],[Date]],2),\"lu\",\"ma\",\"me\",\"je\",\"ve\",\"sa\",\"di\")","v":"me"},{"$f":"IFERROR(VLOOKUP(B125,Tableau30[],3,FALSE),IF(OR(AND($K$5<=B125,$L$5>B125),AND($K$6<=Tableau1[[#This Row],[Date]],$L$6>=Tableau1[[#This Row],[Date]])),\"FERMÉE\",IF(OR(Tableau1[[#This Row],[Jour]]=\"sa\",Tableau1[[#This Row],[Jour]]=\"di\",AND(Tableau1[[#This Row],[Jour]]=\"ve\",MOD(Tableau1[[#This Row],[N°S]],2)=1)),\"REPOS\",IF(Tableau1[[#This Row],[Jour]]=\"ve\",8,8.75))))","v":8.75}]
[null,"2020-01-30",{"$f":"_xlfn.ISOWEEKNUM(Tableau1[[#This Row],[Date]])","v":5},{"$f":"MONTH(Tableau1[[#This Row],[Date]])","v":1},{"$f":"TEXT(Tableau1[[#This Row],[Date]],\"mmmm\")","v":"janvier"},{"$f":"CHOOSE(WEEKDAY(Tableau1[[#This Row],[Date]],2),\"lu\",\"ma\",\"me\",\"je\",\"ve\",\"sa\",\"di\")","v":"je"},{"$f":"IFERROR(VLOOKUP(B126,Tableau30[],3,FALSE),IF(OR(AND($K$5<=B126,$L$5>B126),AND($K$6<=Tableau1[[#This Row],[Date]],$L$6>=Tableau1[[#This Row],[Date]])),\"FERMÉE\",IF(OR(Tableau1[[#This Row],[Jour]]=\"sa\",Tableau1[[#This Row],[Jour]]=\"di\",AND(Tableau1[[#This Row],[Jour]]=\"ve\",MOD(Tableau1[[#This Row],[N°S]],2)=1)),\"REPOS\",IF(Tableau1[[#This Row],[Jour]]=\"ve\",8,8.75))))","v":8.75}]
[null,"2020-01-31",{"$f":"_xlfn.ISOWEEKNUM(Tableau1[[#This Row],[Date]])","v":5},{"$f":"MONTH(Tableau1[[#This Row],[Date]])","v":1},{"$f":"TEXT(Tableau1[[#This Row],[Date]],\"mmmm\")","v":"janvier"},{"$f":"CHOOSE(WEEKDAY(Tableau1[[#This Row],[Date]],2),\"lu\",\"ma\",\"me\",\"je\",\"ve\",\"sa\",\"di\")","v":"ve"},{"$f":"IFERROR(VLOOKUP(B127,Tableau30[],3,FALSE),IF(OR(AND($K$5<=B127,$L$5>B127),AND($K$6<=Tableau1[[#This Row],[Date]],$L$6>=Tableau1[[#This Row],[Date]])),\"FERMÉE\",IF(OR(Tableau1[[#This Row],[Jour]]=\"sa\",Tableau1[[#This Row],[Jour]]=\"di\",AND(Tableau1[[#This Row],[Jour]]=\"ve\",MOD(Tableau1[[#This Row],[N°S]],2)=1)),\"REPOS\",IF(Tableau1[[#This Row],[Jour]]=\"ve\",8,8.75))))","v":"REPOS"}]
[null,"2020-02-01",{"$f":"_xlfn.ISOWEEKNUM(Tableau1[[#This Row],[Date]])","v":5},{"$f":"MONTH(Tableau1[[#This Row],[Date]])","v":2},{"$f":"TEXT(Tableau1[[#This Row],[Date]],\"mmmm\")","v":"février"},{"$f":"CHOOSE(WEEKDAY(Tableau1[[#This Row],[Date]],2),\"lu\",\"ma\",\"me\",\"je\",\"ve\",\"sa\",\"di\")","v":"sa"},{"$f":"IFERROR(VLOOKUP(B128,Tableau30[],3,FALSE),IF(OR(AND($K$5<=B128,$L$5>B128),AND($K$6<=Tableau1[[#This Row],[Date]],$L$6>=Tableau1[[#This Row],[Date]])),\"FERMÉE\",IF(OR(Tableau1[[#This Row],[Jour]]=\"sa\",Tableau1[[#This Row],[Jour]]=\"di\",AND(Tableau1[[#This Row],[Jour]]=\"ve\",MOD(Tableau1[[#This Row],[N°S]],2)=1)),\"REPOS\",IF(Tableau1[[#This Row],[Jour]]=\"ve\",8,8.75))))","v":"REPOS"}]
[null,"2020-02-02",{"$f":"_xlfn.ISOWEEKNUM(Tableau1[[#This Row],[Date]])","v":5},{"$f":"MONTH(Tableau1[[#This Row],[Date]])","v":2},{"$f":"TEXT(Tableau1[[#This Row],[Date]],\"mmmm\")","v":"février"},{"$f":"CHOOSE(WEEKDAY(Tableau1[[#This Row],[Date]],2),\"lu\",\"ma\",\"me\",\"je\",\"ve\",\"sa\",\"di\")","v":"di"},{"$f":"IFERROR(VLOOKUP(B129,Tableau30[],3,FALSE),IF(OR(AND($K$5<=B129,$L$5>B129),AND($K$6<=Tableau1[[#This Row],[Date]],$L$6>=Tableau1[[#This Row],[Date]])),\"FERMÉE\",IF(OR(Tableau1[[#This Row],[Jour]]=\"sa\",Tableau1[[#This Row],[Jour]]=\"di\",AND(Tableau1[[#This Row],[Jour]]=\"ve\",MOD(Tableau1[[#This Row],[N°S]],2)=1)),\"REPOS\",IF(Tableau1[[#This Row],[Jour]]=\"ve\",8,8.75))))","v":"REPOS"}]
[null,"2020-02-03",{"$f":"_xlfn.ISOWEEKNUM(Tableau1[[#This Row],[Date]])","v":6},{"$f":"MONTH(Tableau1[[#This Row],[Date]])","v":2},{"$f":"TEXT(Tableau1[[#This Row],[Date]],\"mmmm\")","v":"février"},{"$f":"CHOOSE(WEEKDAY(Tableau1[[#This Row],[Date]],2),\"lu\",\"ma\",\"me\",\"je\",\"ve\",\"sa\",\"di\")","v":"lu"},{"$f":"IFERROR(VLOOKUP(B130,Tableau30[],3,FALSE),IF(OR(AND($K$5<=B130,$L$5>B130),AND($K$6<=Tableau1[[#This Row],[Date]],$L$6>=Tableau1[[#This Row],[Date]])),\"FERMÉE\",IF(OR(Tableau1[[#This Row],[Jour]]=\"sa\",Tableau1[[#This Row],[Jour]]=\"di\",AND(Tableau1[[#This Row],[Jour]]=\"ve\",MOD(Tableau1[[#This Row],[N°S]],2)=1)),\"REPOS\",IF(Tableau1[[#This Row],[Jour]]=\"ve\",8,8.75))))","v":8.75}]
[null,"2020-02-04",{"$f":"_xlfn.ISOWEEKNUM(Tableau1[[#This Row],[Date]])","v":6},{"$f":"MONTH(Tableau1[[#This Row],[Date]])","v":2},{"$f":"TEXT(Tableau1[[#This Row],[Date]],\"mmmm\")","v":"février"},{"$f":"CHOOSE(WEEKDAY(Tableau1[[#This Row],[Date]],2),\"lu\",\"ma\",\"me\",\"je\",\"ve\",\"sa\",\"di\")","v":"ma"},{"$f":"IFERROR(VLOOKUP(B131,Tableau30[],3,FALSE),IF(OR(AND($K$5<=B131,$L$5>B131),AND($K$6<=Tableau1[[#This Row],[Date]],$L$6>=Tableau1[[#This Row],[Date]])),\"FERMÉE\",IF(OR(Tableau1[[#This Row],[Jour]]=\"sa\",Tableau1[[#This Row],[Jour]]=\"di\",AND(Tableau1[[#This Row],[Jour]]=\"ve\",MOD(Tableau1[[#This Row],[N°S]],2)=1)),\"REPOS\",IF(Tableau1[[#This Row],[Jour]]=\"ve\",8,8.75))))","v":8.75}]
[null,"2020-02-05",{"$f":"_xlfn.ISOWEEKNUM(Tableau1[[#This Row],[Date]])","v":6},{"$f":"MONTH(Tableau1[[#This Row],[Date]])","v":2},{"$f":"TEXT(Tableau1[[#This Row],[Date]],\"mmmm\")","v":"février"},{"$f":"CHOOSE(WEEKDAY(Tableau1[[#This Row],[Date]],2),\"lu\",\"ma\",\"me\",\"je\",\"ve\",\"sa\",\"di\")","v":"me"},{"$f":"IFERROR(VLOOKUP(B132,Tableau30[],3,FALSE),IF(OR(AND($K$5<=B132,$L$5>B132),AND($K$6<=Tableau1[[#This Row],[Date]],$L$6>=Tableau1[[#This Row],[Date]])),\"FERMÉE\",IF(OR(Tableau1[[#This Row],[Jour]]=\"sa\",Tableau1[[#This Row],[Jour]]=\"di\",AND(Tableau1[[#This Row],[Jour]]=\"ve\",MOD(Tableau1[[#This Row],[N°S]],2)=1)),\"REPOS\",IF(Tableau1[[#This Row],[Jour]]=\"ve\",8,8.75))))","v":8.75}]
[null,"2020-02-06",{"$f":"_xlfn.ISOWEEKNUM(Tableau1[[#This Row],[Date]])","v":6},{"$f":"MONTH(Tableau1[[#This Row],[Date]])","v":2},{"$f":"TEXT(Tableau1[[#This Row],[Date]],\"mmmm\")","v":"février"},{"$f":"CHOOSE(WEEKDAY(Tableau1[[#This Row],[Date]],2),\"lu\",\"ma\",\"me\",\"je\",\"ve\",\"sa\",\"di\")","v":"je"},{"$f":"IFERROR(VLOOKUP(B133,Tableau30[],3,FALSE),IF(OR(AND($K$5<=B133,$L$5>B133),AND($K$6<=Tableau1[[#This Row],[Date]],$L$6>=Tableau1[[#This Row],[Date]])),\"FERMÉE\",IF(OR(Tableau1[[#This Row],[Jour]]=\"sa\",Tableau1[[#This Row],[Jour]]=\"di\",AND(Tableau1[[#This Row],[Jour]]=\"ve\",MOD(Tableau1[[#This Row],[N°S]],2)=1)),\"REPOS\",IF(Tableau1[[#This Row],[Jour]]=\"ve\",8,8.75))))","v":8.75}]
[null,"2020-02-07",{"$f":"_xlfn.ISOWEEKNUM(Tableau1[[#This Row],[Date]])","v":6},{"$f":"MONTH(Tableau1[[#This Row],[Date]])","v":2},{"$f":"TEXT(Tableau1[[#This Row],[Date]],\"mmmm\")","v":"février"},{"$f":"CHOOSE(WEEKDAY(Tableau1[[#This Row],[Date]],2),\"lu\",\"ma\",\"me\",\"je\",\"ve\",\"sa\",\"di\")","v":"ve"},{"$f":"IFERROR(VLOOKUP(B134,Tableau30[],3,FALSE),IF(OR(AND($K$5<=B134,$L$5>B134),AND($K$6<=Tableau1[[#This Row],[Date]],$L$6>=Tableau1[[#This Row],[Date]])),\"FERMÉE\",IF(OR(Tableau1[[#This Row],[Jour]]=\"sa\",Tableau1[[#This Row],[Jour]]=\"di\",AND(Tableau1[[#This Row],[Jour]]=\"ve\",MOD(Tableau1[[#This Row],[N°S]],2)=1)),\"REPOS\",IF(Tableau1[[#This Row],[Jour]]=\"ve\",8,8.75))))","v":8}]
[null,{"$f":"B134+1","v":"2020-02-08"},{"$f":"_xlfn.ISOWEEKNUM(Tableau1[[#This Row],[Date]])","v":6},{"$f":"MONTH(Tableau1[[#This Row],[Date]])","v":2},{"$f":"TEXT(Tableau1[[#This Row],[Date]],\"mmmm\")","v":"février"},{"$f":"CHOOSE(WEEKDAY(Tableau1[[#This Row],[Date]],2),\"lu\",\"ma\",\"me\",\"je\",\"ve\",\"sa\",\"di\")","v":"sa"},{"$f":"IFERROR(VLOOKUP(B135,Tableau30[],3,FALSE),IF(OR(AND($K$5<=B135,$L$5>B135),AND($K$6<=Tableau1[[#This Row],[Date]],$L$6>=Tableau1[[#This Row],[Date]])),\"FERMÉE\",IF(OR(Tableau1[[#This Row],[Jour]]=\"sa\",Tableau1[[#This Row],[Jour]]=\"di\",AND(Tableau1[[#This Row],[Jour]]=\"ve\",MOD(Tableau1[[#This Row],[N°S]],2)=1)),\"REPOS\",IF(Tableau1[[#This Row],[Jour]]=\"ve\",8,8.75))))","v":"REPOS"}]
[null,"2020-02-09",{"$f":"_xlfn.ISOWEEKNUM(Tableau1[[#This Row],[Date]])","v":6},{"$f":"MONTH(Tableau1[[#This Row],[Date]])","v":2},{"$f":"TEXT(Tableau1[[#This Row],[Date]],\"mmmm\")","v":"février"},{"$f":"CHOOSE(WEEKDAY(Tableau1[[#This Row],[Date]],2),\"lu\",\"ma\",\"me\",\"je\",\"ve\",\"sa\",\"di\")","v":"di"},{"$f":"IFERROR(VLOOKUP(B136,Tableau30[],3,FALSE),IF(OR(AND($K$5<=B136,$L$5>B136),AND($K$6<=Tableau1[[#This Row],[Date]],$L$6>=Tableau1[[#This Row],[Date]])),\"FERMÉE\",IF(OR(Tableau1[[#This Row],[Jour]]=\"sa\",Tableau1[[#This Row],[Jour]]=\"di\",AND(Tableau1[[#This Row],[Jour]]=\"ve\",MOD(Tableau1[[#This Row],[N°S]],2)=1)),\"REPOS\",IF(Tableau1[[#This Row],[Jour]]=\"ve\",8,8.75))))","v":"REPOS"}]
[null,"2020-02-10",{"$f":"_xlfn.ISOWEEKNUM(Tableau1[[#This Row],[Date]])","v":7},{"$f":"MONTH(Tableau1[[#This Row],[Date]])","v":2},{"$f":"TEXT(Tableau1[[#This Row],[Date]],\"mmmm\")","v":"février"},{"$f":"CHOOSE(WEEKDAY(Tableau1[[#This Row],[Date]],2),\"lu\",\"ma\",\"me\",\"je\",\"ve\",\"sa\",\"di\")","v":"lu"},{"$f":"IFERROR(VLOOKUP(B137,Tableau30[],3,FALSE),IF(OR(AND($K$5<=B137,$L$5>B137),AND($K$6<=Tableau1[[#This Row],[Date]],$L$6>=Tableau1[[#This Row],[Date]])),\"FERMÉE\",IF(OR(Tableau1[[#This Row],[Jour]]=\"sa\",Tableau1[[#This Row],[Jour]]=\"di\",AND(Tableau1[[#This Row],[Jour]]=\"ve\",MOD(Tableau1[[#This Row],[N°S]],2)=1)),\"REPOS\",IF(Tableau1[[#This Row],[Jour]]=\"ve\",8,8.75))))","v":8.75}]
[null,"2020-02-11",{"$f":"_xlfn.ISOWEEKNUM(Tableau1[[#This Row],[Date]])","v":7},{"$f":"MONTH(Tableau1[[#This Row],[Date]])","v":2},{"$f":"TEXT(Tableau1[[#This Row],[Date]],\"mmmm\")","v":"février"},{"$f":"CHOOSE(WEEKDAY(Tableau1[[#This Row],[Date]],2),\"lu\",\"ma\",\"me\",\"je\",\"ve\",\"sa\",\"di\")","v":"ma"},{"$f":"IFERROR(VLOOKUP(B138,Tableau30[],3,FALSE),IF(OR(AND($K$5<=B138,$L$5>B138),AND($K$6<=Tableau1[[#This Row],[Date]],$L$6>=Tableau1[[#This Row],[Date]])),\"FERMÉE\",IF(OR(Tableau1[[#This Row],[Jour]]=\"sa\",Tableau1[[#This Row],[Jour]]=\"di\",AND(Tableau1[[#This Row],[Jour]]=\"ve\",MOD(Tableau1[[#This Row],[N°S]],2)=1)),\"REPOS\",IF(Tableau1[[#This Row],[Jour]]=\"ve\",8,8.75))))","v":8.75}]
[null,"2020-02-12",{"$f":"_xlfn.ISOWEEKNUM(Tableau1[[#This Row],[Date]])","v":7},{"$f":"MONTH(Tableau1[[#This Row],[Date]])","v":2},{"$f":"TEXT(Tableau1[[#This Row],[Date]],\"mmmm\")","v":"février"},{"$f":"CHOOSE(WEEKDAY(Tableau1[[#This Row],[Date]],2),\"lu\",\"ma\",\"me\",\"je\",\"ve\",\"sa\",\"di\")","v":"me"},{"$f":"IFERROR(VLOOKUP(B139,Tableau30[],3,FALSE),IF(OR(AND($K$5<=B139,$L$5>B139),AND($K$6<=Tableau1[[#This Row],[Date]],$L$6>=Tableau1[[#This Row],[Date]])),\"FERMÉE\",IF(OR(Tableau1[[#This Row],[Jour]]=\"sa\",Tableau1[[#This Row],[Jour]]=\"di\",AND(Tableau1[[#This Row],[Jour]]=\"ve\",MOD(Tableau1[[#This Row],[N°S]],2)=1)),\"REPOS\",IF(Tableau1[[#This Row],[Jour]]=\"ve\",8,8.75))))","v":8.75}]
[null,"2020-02-13",{"$f":"_xlfn.ISOWEEKNUM(Tableau1[[#This Row],[Date]])","v":7},{"$f":"MONTH(Tableau1[[#This Row],[Date]])","v":2},{"$f":"TEXT(Tableau1[[#This Row],[Date]],\"mmmm\")","v":"février"},{"$f":"CHOOSE(WEEKDAY(Tableau1[[#This Row],[Date]],2),\"lu\",\"ma\",\"me\",\"je\",\"ve\",\"sa\",\"di\")","v":"je"},{"$f":"IFERROR(VLOOKUP(B140,Tableau30[],3,FALSE),IF(OR(AND($K$5<=B140,$L$5>B140),AND($K$6<=Tableau1[[#This Row],[Date]],$L$6>=Tableau1[[#This Row],[Date]])),\"FERMÉE\",IF(OR(Tableau1[[#This Row],[Jour]]=\"sa\",Tableau1[[#This Row],[Jour]]=\"di\",AND(Tableau1[[#This Row],[Jour]]=\"ve\",MOD(Tableau1[[#This Row],[N°S]],2)=1)),\"REPOS\",IF(Tableau1[[#This Row],[Jour]]=\"ve\",8,8.75))))","v":8.75}]
[null,"2020-02-14",{"$f":"_xlfn.ISOWEEKNUM(Tableau1[[#This Row],[Date]])","v":7},{"$f":"MONTH(Tableau1[[#This Row],[Date]])","v":2},{"$f":"TEXT(Tableau1[[#This Row],[Date]],\"mmmm\")","v":"février"},{"$f":"CHOOSE(WEEKDAY(Tableau1[[#This Row],[Date]],2),\"lu\",\"ma\",\"me\",\"je\",\"ve\",\"sa\",\"di\")","v":"ve"},{"$f":"IFERROR(VLOOKUP(B141,Tableau30[],3,FALSE),IF(OR(AND($K$5<=B141,$L$5>B141),AND($K$6<=Tableau1[[#This Row],[Date]],$L$6>=Tableau1[[#This Row],[Date]])),\"FERMÉE\",IF(OR(Tableau1[[#This Row],[Jour]]=\"sa\",Tableau1[[#This Row],[Jour]]=\"di\",AND(Tableau1[[#This Row],[Jour]]=\"ve\",MOD(Tableau1[[#This Row],[N°S]],2)=1)),\"REPOS\",IF(Tableau1[[#This Row],[Jour]]=\"ve\",8,8.75))))","v":"REPOS"}]
[null,"2020-02-15",{"$f":"_xlfn.ISOWEEKNUM(Tableau1[[#This Row],[Date]])","v":7},{"$f":"MONTH(Tableau1[[#This Row],[Date]])","v":2},{"$f":"TEXT(Tableau1[[#This Row],[Date]],\"mmmm\")","v":"février"},{"$f":"CHOOSE(WEEKDAY(Tableau1[[#This Row],[Date]],2),\"lu\",\"ma\",\"me\",\"je\",\"ve\",\"sa\",\"di\")","v":"sa"},{"$f":"IFERROR(VLOOKUP(B142,Tableau30[],3,FALSE),IF(OR(AND($K$5<=B142,$L$5>B142),AND($K$6<=Tableau1[[#This Row],[Date]],$L$6>=Tableau1[[#This Row],[Date]])),\"FERMÉE\",IF(OR(Tableau1[[#This Row],[Jour]]=\"sa\",Tableau1[[#This Row],[Jour]]=\"di\",AND(Tableau1[[#This Row],[Jour]]=\"ve\",MOD(Tableau1[[#This Row],[N°S]],2)=1)),\"REPOS\",IF(Tableau1[[#This Row],[Jour]]=\"ve\",8,8.75))))","v":"REPOS"}]
[null,"2020-02-16",{"$f":"_xlfn.ISOWEEKNUM(Tableau1[[#This Row],[Date]])","v":7},{"$f":"MONTH(Tableau1[[#This Row],[Date]])","v":2},{"$f":"TEXT(Tableau1[[#This Row],[Date]],\"mmmm\")","v":"février"},{"$f":"CHOOSE(WEEKDAY(Tableau1[[#This Row],[Date]],2),\"lu\",\"ma\",\"me\",\"je\",\"ve\",\"sa\",\"di\")","v":"di"},{"$f":"IFERROR(VLOOKUP(B143,Tableau30[],3,FALSE),IF(OR(AND($K$5<=B143,$L$5>B143),AND($K$6<=Tableau1[[#This Row],[Date]],$L$6>=Tableau1[[#This Row],[Date]])),\"FERMÉE\",IF(OR(Tableau1[[#This Row],[Jour]]=\"sa\",Tableau1[[#This Row],[Jour]]=\"di\",AND(Tableau1[[#This Row],[Jour]]=\"ve\",MOD(Tableau1[[#This Row],[N°S]],2)=1)),\"REPOS\",IF(Tableau1[[#This Row],[Jour]]=\"ve\",8,8.75))))","v":"REPOS"}]
[null,"2020-02-17",{"$f":"_xlfn.ISOWEEKNUM(Tableau1[[#This Row],[Date]])","v":8},{"$f":"MONTH(Tableau1[[#This Row],[Date]])","v":2},{"$f":"TEXT(Tableau1[[#This Row],[Date]],\"mmmm\")","v":"février"},{"$f":"CHOOSE(WEEKDAY(Tableau1[[#This Row],[Date]],2),\"lu\",\"ma\",\"me\",\"je\",\"ve\",\"sa\",\"di\")","v":"lu"},{"$f":"IFERROR(VLOOKUP(B144,Tableau30[],3,FALSE),IF(OR(AND($K$5<=B144,$L$5>B144),AND($K$6<=Tableau1[[#This Row],[Date]],$L$6>=Tableau1[[#This Row],[Date]])),\"FERMÉE\",IF(OR(Tableau1[[#This Row],[Jour]]=\"sa\",Tableau1[[#This Row],[Jour]]=\"di\",AND(Tableau1[[#This Row],[Jour]]=\"ve\",MOD(Tableau1[[#This Row],[N°S]],2)=1)),\"REPOS\",IF(Tableau1[[#This Row],[Jour]]=\"ve\",8,8.75))))","v":8.75}]
[null,"2020-02-18",{"$f":"_xlfn.ISOWEEKNUM(Tableau1[[#This Row],[Date]])","v":8},{"$f":"MONTH(Tableau1[[#This Row],[Date]])","v":2},{"$f":"TEXT(Tableau1[[#This Row],[Date]],\"mmmm\")","v":"février"},{"$f":"CHOOSE(WEEKDAY(Tableau1[[#This Row],[Date]],2),\"lu\",\"ma\",\"me\",\"je\",\"ve\",\"sa\",\"di\")","v":"ma"},{"$f":"IFERROR(VLOOKUP(B145,Tableau30[],3,FALSE),IF(OR(AND($K$5<=B145,$L$5>B145),AND($K$6<=Tableau1[[#This Row],[Date]],$L$6>=Tableau1[[#This Row],[Date]])),\"FERMÉE\",IF(OR(Tableau1[[#This Row],[Jour]]=\"sa\",Tableau1[[#This Row],[Jour]]=\"di\",AND(Tableau1[[#This Row],[Jour]]=\"ve\",MOD(Tableau1[[#This Row],[N°S]],2)=1)),\"REPOS\",IF(Tableau1[[#This Row],[Jour]]=\"ve\",8,8.75))))","v":8.75}]
[null,"2020-02-19",{"$f":"_xlfn.ISOWEEKNUM(Tableau1[[#This Row],[Date]])","v":8},{"$f":"MONTH(Tableau1[[#This Row],[Date]])","v":2},{"$f":"TEXT(Tableau1[[#This Row],[Date]],\"mmmm\")","v":"février"},{"$f":"CHOOSE(WEEKDAY(Tableau1[[#This Row],[Date]],2),\"lu\",\"ma\",\"me\",\"je\",\"ve\",\"sa\",\"di\")","v":"me"},{"$f":"IFERROR(VLOOKUP(B146,Tableau30[],3,FALSE),IF(OR(AND($K$5<=B146,$L$5>B146),AND($K$6<=Tableau1[[#This Row],[Date]],$L$6>=Tableau1[[#This Row],[Date]])),\"FERMÉE\",IF(OR(Tableau1[[#This Row],[Jour]]=\"sa\",Tableau1[[#This Row],[Jour]]=\"di\",AND(Tableau1[[#This Row],[Jour]]=\"ve\",MOD(Tableau1[[#This Row],[N°S]],2)=1)),\"REPOS\",IF(Tableau1[[#This Row],[Jour]]=\"ve\",8,8.75))))","v":8.75}]
[null,"2020-02-20",{"$f":"_xlfn.ISOWEEKNUM(Tableau1[[#This Row],[Date]])","v":8},{"$f":"MONTH(Tableau1[[#This Row],[Date]])","v":2},{"$f":"TEXT(Tableau1[[#This Row],[Date]],\"mmmm\")","v":"février"},{"$f":"CHOOSE(WEEKDAY(Tableau1[[#This Row],[Date]],2),\"lu\",\"ma\",\"me\",\"je\",\"ve\",\"sa\",\"di\")","v":"je"},{"$f":"IFERROR(VLOOKUP(B147,Tableau30[],3,FALSE),IF(OR(AND($K$5<=B147,$L$5>B147),AND($K$6<=Tableau1[[#This Row],[Date]],$L$6>=Tableau1[[#This Row],[Date]])),\"FERMÉE\",IF(OR(Tableau1[[#This Row],[Jour]]=\"sa\",Tableau1[[#This Row],[Jour]]=\"di\",AND(Tableau1[[#This Row],[Jour]]=\"ve\",MOD(Tableau1[[#This Row],[N°S]],2)=1)),\"REPOS\",IF(Tableau1[[#This Row],[Jour]]=\"ve\",8,8.75))))","v":8.75}]
[null,"2020-02-21",{"$f":"_xlfn.ISOWEEKNUM(Tableau1[[#This Row],[Date]])","v":8},{"$f":"MONTH(Tableau1[[#This Row],[Date]])","v":2},{"$f":"TEXT(Tableau1[[#This Row],[Date]],\"mmmm\")","v":"février"},{"$f":"CHOOSE(WEEKDAY(Tableau1[[#This Row],[Date]],2),\"lu\",\"ma\",\"me\",\"je\",\"ve\",\"sa\",\"di\")","v":"ve"},{"$f":"IFERROR(VLOOKUP(B148,Tableau30[],3,FALSE),IF(OR(AND($K$5<=B148,$L$5>B148),AND($K$6<=Tableau1[[#This Row],[Date]],$L$6>=Tableau1[[#This Row],[Date]])),\"FERMÉE\",IF(OR(Tableau1[[#This Row],[Jour]]=\"sa\",Tableau1[[#This Row],[Jour]]=\"di\",AND(Tableau1[[#This Row],[Jour]]=\"ve\",MOD(Tableau1[[#This Row],[N°S]],2)=1)),\"REPOS\",IF(Tableau1[[#This Row],[Jour]]=\"ve\",8,8.75))))","v":8}]
[null,"2020-02-22",{"$f":"_xlfn.ISOWEEKNUM(Tableau1[[#This Row],[Date]])","v":8},{"$f":"MONTH(Tableau1[[#This Row],[Date]])","v":2},{"$f":"TEXT(Tableau1[[#This Row],[Date]],\"mmmm\")","v":"février"},{"$f":"CHOOSE(WEEKDAY(Tableau1[[#This Row],[Date]],2),\"lu\",\"ma\",\"me\",\"je\",\"ve\",\"sa\",\"di\")","v":"sa"},{"$f":"IFERROR(VLOOKUP(B149,Tableau30[],3,FALSE),IF(OR(AND($K$5<=B149,$L$5>B149),AND($K$6<=Tableau1[[#This Row],[Date]],$L$6>=Tableau1[[#This Row],[Date]])),\"FERMÉE\",IF(OR(Tableau1[[#This Row],[Jour]]=\"sa\",Tableau1[[#This Row],[Jour]]=\"di\",AND(Tableau1[[#This Row],[Jour]]=\"ve\",MOD(Tableau1[[#This Row],[N°S]],2)=1)),\"REPOS\",IF(Tableau1[[#This Row],[Jour]]=\"ve\",8,8.75))))","v":"REPOS"}]
[null,"2020-02-23",{"$f":"_xlfn.ISOWEEKNUM(Tableau1[[#This Row],[Date]])","v":8},{"$f":"MONTH(Tableau1[[#This Row],[Date]])","v":2},{"$f":"TEXT(Tableau1[[#This Row],[Date]],\"mmmm\")","v":"février"},{"$f":"CHOOSE(WEEKDAY(Tableau1[[#This Row],[Date]],2),\"lu\",\"ma\",\"me\",\"je\",\"ve\",\"sa\",\"di\")","v":"di"},{"$f":"IFERROR(VLOOKUP(B150,Tableau30[],3,FALSE),IF(OR(AND($K$5<=B150,$L$5>B150),AND($K$6<=Tableau1[[#This Row],[Date]],$L$6>=Tableau1[[#This Row],[Date]])),\"FERMÉE\",IF(OR(Tableau1[[#This Row],[Jour]]=\"sa\",Tableau1[[#This Row],[Jour]]=\"di\",AND(Tableau1[[#This Row],[Jour]]=\"ve\",MOD(Tableau1[[#This Row],[N°S]],2)=1)),\"REPOS\",IF(Tableau1[[#This Row],[Jour]]=\"ve\",8,8.75))))","v":"REPOS"}]
[null,"2020-02-24",{"$f":"_xlfn.ISOWEEKNUM(Tableau1[[#This Row],[Date]])","v":9},{"$f":"MONTH(Tableau1[[#This Row],[Date]])","v":2},{"$f":"TEXT(Tableau1[[#This Row],[Date]],\"mmmm\")","v":"février"},{"$f":"CHOOSE(WEEKDAY(Tableau1[[#This Row],[Date]],2),\"lu\",\"ma\",\"me\",\"je\",\"ve\",\"sa\",\"di\")","v":"lu"},{"$f":"IFERROR(VLOOKUP(B151,Tableau30[],3,FALSE),IF(OR(AND($K$5<=B151,$L$5>B151),AND($K$6<=Tableau1[[#This Row],[Date]],$L$6>=Tableau1[[#This Row],[Date]])),\"FERMÉE\",IF(OR(Tableau1[[#This Row],[Jour]]=\"sa\",Tableau1[[#This Row],[Jour]]=\"di\",AND(Tableau1[[#This Row],[Jour]]=\"ve\",MOD(Tableau1[[#This Row],[N°S]],2)=1)),\"REPOS\",IF(Tableau1[[#This Row],[Jour]]=\"ve\",8,8.75))))","v":8.75}]
[null,"2020-02-25",{"$f":"_xlfn.ISOWEEKNUM(Tableau1[[#This Row],[Date]])","v":9},{"$f":"MONTH(Tableau1[[#This Row],[Date]])","v":2},{"$f":"TEXT(Tableau1[[#This Row],[Date]],\"mmmm\")","v":"février"},{"$f":"CHOOSE(WEEKDAY(Tableau1[[#This Row],[Date]],2),\"lu\",\"ma\",\"me\",\"je\",\"ve\",\"sa\",\"di\")","v":"ma"},{"$f":"IFERROR(VLOOKUP(B152,Tableau30[],3,FALSE),IF(OR(AND($K$5<=B152,$L$5>B152),AND($K$6<=Tableau1[[#This Row],[Date]],$L$6>=Tableau1[[#This Row],[Date]])),\"FERMÉE\",IF(OR(Tableau1[[#This Row],[Jour]]=\"sa\",Tableau1[[#This Row],[Jour]]=\"di\",AND(Tableau1[[#This Row],[Jour]]=\"ve\",MOD(Tableau1[[#This Row],[N°S]],2)=1)),\"REPOS\",IF(Tableau1[[#This Row],[Jour]]=\"ve\",8,8.75))))","v":8.75}]
[null,"2020-02-26",{"$f":"_xlfn.ISOWEEKNUM(Tableau1[[#This Row],[Date]])","v":9},{"$f":"MONTH(Tableau1[[#This Row],[Date]])","v":2},{"$f":"TEXT(Tableau1[[#This Row],[Date]],\"mmmm\")","v":"février"},{"$f":"CHOOSE(WEEKDAY(Tableau1[[#This Row],[Date]],2),\"lu\",\"ma\",\"me\",\"je\",\"ve\",\"sa\",\"di\")","v":"me"},{"$f":"IFERROR(VLOOKUP(B153,Tableau30[],3,FALSE),IF(OR(AND($K$5<=B153,$L$5>B153),AND($K$6<=Tableau1[[#This Row],[Date]],$L$6>=Tableau1[[#This Row],[Date]])),\"FERMÉE\",IF(OR(Tableau1[[#This Row],[Jour]]=\"sa\",Tableau1[[#This Row],[Jour]]=\"di\",AND(Tableau1[[#This Row],[Jour]]=\"ve\",MOD(Tableau1[[#This Row],[N°S]],2)=1)),\"REPOS\",IF(Tableau1[[#This Row],[Jour]]=\"ve\",8,8.75))))","v":8.75}]
[null,"2020-02-27",{"$f":"_xlfn.ISOWEEKNUM(Tableau1[[#This Row],[Date]])","v":9},{"$f":"MONTH(Tableau1[[#This Row],[Date]])","v":2},{"$f":"TEXT(Tableau1[[#This Row],[Date]],\"mmmm\")","v":"février"},{"$f":"CHOOSE(WEEKDAY(Tableau1[[#This Row],[Date]],2),\"lu\",\"ma\",\"me\",\"je\",\"ve\",\"sa\",\"di\")","v":"je"},{"$f":"IFERROR(VLOOKUP(B154,Tableau30[],3,FALSE),IF(OR(AND($K$5<=B154,$L$5>B154),AND($K$6<=Tableau1[[#This Row],[Date]],$L$6>=Tableau1[[#This Row],[Date]])),\"FERMÉE\",IF(OR(Tableau1[[#This Row],[Jour]]=\"sa\",Tableau1[[#This Row],[Jour]]=\"di\",AND(Tableau1[[#This Row],[Jour]]=\"ve\",MOD(Tableau1[[#This Row],[N°S]],2)=1)),\"REPOS\",IF(Tableau1[[#This Row],[Jour]]=\"ve\",8,8.75))))","v":8.75}]
[null,"2020-02-28",{"$f":"_xlfn.ISOWEEKNUM(Tableau1[[#This Row],[Date]])","v":9},{"$f":"MONTH(Tableau1[[#This Row],[Date]])","v":2},{"$f":"TEXT(Tableau1[[#This Row],[Date]],\"mmmm\")","v":"février"},{"$f":"CHOOSE(WEEKDAY(Tableau1[[#This Row],[Date]],2),\"lu\",\"ma\",\"me\",\"je\",\"ve\",\"sa\",\"di\")","v":"ve"},{"$f":"IFERROR(VLOOKUP(B155,Tableau30[],3,FALSE),IF(OR(AND($K$5<=B155,$L$5>B155),AND($K$6<=Tableau1[[#This Row],[Date]],$L$6>=Tableau1[[#This Row],[Date]])),\"FERMÉE\",IF(OR(Tableau1[[#This Row],[Jour]]=\"sa\",Tableau1[[#This Row],[Jour]]=\"di\",AND(Tableau1[[#This Row],[Jour]]=\"ve\",MOD(Tableau1[[#This Row],[N°S]],2)=1)),\"REPOS\",IF(Tableau1[[#This Row],[Jour]]=\"ve\",8,8.75))))","v":"REPOS"}]
[null,"2020-02-29",{"$f":"_xlfn.ISOWEEKNUM(Tableau1[[#This Row],[Date]])","v":9},{"$f":"MONTH(Tableau1[[#This Row],[Date]])","v":2},{"$f":"TEXT(Tableau1[[#This Row],[Date]],\"mmmm\")","v":"février"},{"$f":"CHOOSE(WEEKDAY(Tableau1[[#This Row],[Date]],2),\"lu\",\"ma\",\"me\",\"je\",\"ve\",\"sa\",\"di\")","v":"sa"},{"$f":"IFERROR(VLOOKUP(B156,Tableau30[],3,FALSE),IF(OR(AND($K$5<=B156,$L$5>B156),AND($K$6<=Tableau1[[#This Row],[Date]],$L$6>=Tableau1[[#This Row],[Date]])),\"FERMÉE\",IF(OR(Tableau1[[#This Row],[Jour]]=\"sa\",Tableau1[[#This Row],[Jour]]=\"di\",AND(Tableau1[[#This Row],[Jour]]=\"ve\",MOD(Tableau1[[#This Row],[N°S]],2)=1)),\"REPOS\",IF(Tableau1[[#This Row],[Jour]]=\"ve\",8,8.75))))","v":"REPOS"}]
[null,"2020-03-01",{"$f":"_xlfn.ISOWEEKNUM(Tableau1[[#This Row],[Date]])","v":9},{"$f":"MONTH(Tableau1[[#This Row],[Date]])","v":3},{"$f":"TEXT(Tableau1[[#This Row],[Date]],\"mmmm\")","v":"mars"},{"$f":"CHOOSE(WEEKDAY(Tableau1[[#This Row],[Date]],2),\"lu\",\"ma\",\"me\",\"je\",\"ve\",\"sa\",\"di\")","v":"di"},{"$f":"IFERROR(VLOOKUP(B157,Tableau30[],3,FALSE),IF(OR(AND($K$5<=B157,$L$5>B157),AND($K$6<=Tableau1[[#This Row],[Date]],$L$6>=Tableau1[[#This Row],[Date]])),\"FERMÉE\",IF(OR(Tableau1[[#This Row],[Jour]]=\"sa\",Tableau1[[#This Row],[Jour]]=\"di\",AND(Tableau1[[#This Row],[Jour]]=\"ve\",MOD(Tableau1[[#This Row],[N°S]],2)=1)),\"REPOS\",IF(Tableau1[[#This Row],[Jour]]=\"ve\",8,8.75))))","v":"REPOS"}]
[null,"2020-03-02",{"$f":"_xlfn.ISOWEEKNUM(Tableau1[[#This Row],[Date]])","v":10},{"$f":"MONTH(Tableau1[[#This Row],[Date]])","v":3},{"$f":"TEXT(Tableau1[[#This Row],[Date]],\"mmmm\")","v":"mars"},{"$f":"CHOOSE(WEEKDAY(Tableau1[[#This Row],[Date]],2),\"lu\",\"ma\",\"me\",\"je\",\"ve\",\"sa\",\"di\")","v":"lu"},{"$f":"IFERROR(VLOOKUP(B158,Tableau30[],3,FALSE),IF(OR(AND($K$5<=B158,$L$5>B158),AND($K$6<=Tableau1[[#This Row],[Date]],$L$6>=Tableau1[[#This Row],[Date]])),\"FERMÉE\",IF(OR(Tableau1[[#This Row],[Jour]]=\"sa\",Tableau1[[#This Row],[Jour]]=\"di\",AND(Tableau1[[#This Row],[Jour]]=\"ve\",MOD(Tableau1[[#This Row],[N°S]],2)=1)),\"REPOS\",IF(Tableau1[[#This Row],[Jour]]=\"ve\",8,8.75))))","v":8.75}]
[null,"2020-03-03",{"$f":"_xlfn.ISOWEEKNUM(Tableau1[[#This Row],[Date]])","v":10},{"$f":"MONTH(Tableau1[[#This Row],[Date]])","v":3},{"$f":"TEXT(Tableau1[[#This Row],[Date]],\"mmmm\")","v":"mars"},{"$f":"CHOOSE(WEEKDAY(Tableau1[[#This Row],[Date]],2),\"lu\",\"ma\",\"me\",\"je\",\"ve\",\"sa\",\"di\")","v":"ma"},{"$f":"IFERROR(VLOOKUP(B159,Tableau30[],3,FALSE),IF(OR(AND($K$5<=B159,$L$5>B159),AND($K$6<=Tableau1[[#This Row],[Date]],$L$6>=Tableau1[[#This Row],[Date]])),\"FERMÉE\",IF(OR(Tableau1[[#This Row],[Jour]]=\"sa\",Tableau1[[#This Row],[Jour]]=\"di\",AND(Tableau1[[#This Row],[Jour]]=\"ve\",MOD(Tableau1[[#This Row],[N°S]],2)=1)),\"REPOS\",IF(Tableau1[[#This Row],[Jour]]=\"ve\",8,8.75))))","v":8.75}]
[null,"2020-03-04",{"$f":"_xlfn.ISOWEEKNUM(Tableau1[[#This Row],[Date]])","v":10},{"$f":"MONTH(Tableau1[[#This Row],[Date]])","v":3},{"$f":"TEXT(Tableau1[[#This Row],[Date]],\"mmmm\")","v":"mars"},{"$f":"CHOOSE(WEEKDAY(Tableau1[[#This Row],[Date]],2),\"lu\",\"ma\",\"me\",\"je\",\"ve\",\"sa\",\"di\")","v":"me"},{"$f":"IFERROR(VLOOKUP(B160,Tableau30[],3,FALSE),IF(OR(AND($K$5<=B160,$L$5>B160),AND($K$6<=Tableau1[[#This Row],[Date]],$L$6>=Tableau1[[#This Row],[Date]])),\"FERMÉE\",IF(OR(Tableau1[[#This Row],[Jour]]=\"sa\",Tableau1[[#This Row],[Jour]]=\"di\",AND(Tableau1[[#This Row],[Jour]]=\"ve\",MOD(Tableau1[[#This Row],[N°S]],2)=1)),\"REPOS\",IF(Tableau1[[#This Row],[Jour]]=\"ve\",8,8.75))))","v":8.75}]
[null,"2020-03-05",{"$f":"_xlfn.ISOWEEKNUM(Tableau1[[#This Row],[Date]])","v":10},{"$f":"MONTH(Tableau1[[#This Row],[Date]])","v":3},{"$f":"TEXT(Tableau1[[#This Row],[Date]],\"mmmm\")","v":"mars"},{"$f":"CHOOSE(WEEKDAY(Tableau1[[#This Row],[Date]],2),\"lu\",\"ma\",\"me\",\"je\",\"ve\",\"sa\",\"di\")","v":"je"},{"$f":"IFERROR(VLOOKUP(B161,Tableau30[],3,FALSE),IF(OR(AND($K$5<=B161,$L$5>B161),AND($K$6<=Tableau1[[#This Row],[Date]],$L$6>=Tableau1[[#This Row],[Date]])),\"FERMÉE\",IF(OR(Tableau1[[#This Row],[Jour]]=\"sa\",Tableau1[[#This Row],[Jour]]=\"di\",AND(Tableau1[[#This Row],[Jour]]=\"ve\",MOD(Tableau1[[#This Row],[N°S]],2)=1)),\"REPOS\",IF(Tableau1[[#This Row],[Jour]]=\"ve\",8,8.75))))","v":8.75}]
[null,"2020-03-06",{"$f":"_xlfn.ISOWEEKNUM(Tableau1[[#This Row],[Date]])","v":10},{"$f":"MONTH(Tableau1[[#This Row],[Date]])","v":3},{"$f":"TEXT(Tableau1[[#This Row],[Date]],\"mmmm\")","v":"mars"},{"$f":"CHOOSE(WEEKDAY(Tableau1[[#This Row],[Date]],2),\"lu\",\"ma\",\"me\",\"je\",\"ve\",\"sa\",\"di\")","v":"ve"},{"$f":"IFERROR(VLOOKUP(B162,Tableau30[],3,FALSE),IF(OR(AND($K$5<=B162,$L$5>B162),AND($K$6<=Tableau1[[#This Row],[Date]],$L$6>=Tableau1[[#This Row],[Date]])),\"FERMÉE\",IF(OR(Tableau1[[#This Row],[Jour]]=\"sa\",Tableau1[[#This Row],[Jour]]=\"di\",AND(Tableau1[[#This Row],[Jour]]=\"ve\",MOD(Tableau1[[#This Row],[N°S]],2)=1)),\"REPOS\",IF(Tableau1[[#This Row],[Jour]]=\"ve\",8,8.75))))","v":8}]
[null,"2020-03-07",{"$f":"_xlfn.ISOWEEKNUM(Tableau1[[#This Row],[Date]])","v":10},{"$f":"MONTH(Tableau1[[#This Row],[Date]])","v":3},{"$f":"TEXT(Tableau1[[#This Row],[Date]],\"mmmm\")","v":"mars"},{"$f":"CHOOSE(WEEKDAY(Tableau1[[#This Row],[Date]],2),\"lu\",\"ma\",\"me\",\"je\",\"ve\",\"sa\",\"di\")","v":"sa"},{"$f":"IFERROR(VLOOKUP(B163,Tableau30[],3,FALSE),IF(OR(AND($K$5<=B163,$L$5>B163),AND($K$6<=Tableau1[[#This Row],[Date]],$L$6>=Tableau1[[#This Row],[Date]])),\"FERMÉE\",IF(OR(Tableau1[[#This Row],[Jour]]=\"sa\",Tableau1[[#This Row],[Jour]]=\"di\",AND(Tableau1[[#This Row],[Jour]]=\"ve\",MOD(Tableau1[[#This Row],[N°S]],2)=1)),\"REPOS\",IF(Tableau1[[#This Row],[Jour]]=\"ve\",8,8.75))))","v":"REPOS"}]
[null,"2020-03-08",{"$f":"_xlfn.ISOWEEKNUM(Tableau1[[#This Row],[Date]])","v":10},{"$f":"MONTH(Tableau1[[#This Row],[Date]])","v":3},{"$f":"TEXT(Tableau1[[#This Row],[Date]],\"mmmm\")","v":"mars"},{"$f":"CHOOSE(WEEKDAY(Tableau1[[#This Row],[Date]],2),\"lu\",\"ma\",\"me\",\"je\",\"ve\",\"sa\",\"di\")","v":"di"},{"$f":"IFERROR(VLOOKUP(B164,Tableau30[],3,FALSE),IF(OR(AND($K$5<=B164,$L$5>B164),AND($K$6<=Tableau1[[#This Row],[Date]],$L$6>=Tableau1[[#This Row],[Date]])),\"FERMÉE\",IF(OR(Tableau1[[#This Row],[Jour]]=\"sa\",Tableau1[[#This Row],[Jour]]=\"di\",AND(Tableau1[[#This Row],[Jour]]=\"ve\",MOD(Tableau1[[#This Row],[N°S]],2)=1)),\"REPOS\",IF(Tableau1[[#This Row],[Jour]]=\"ve\",8,8.75))))","v":"REPOS"}]
[null,"2020-03-09",{"$f":"_xlfn.ISOWEEKNUM(Tableau1[[#This Row],[Date]])","v":11},{"$f":"MONTH(Tableau1[[#This Row],[Date]])","v":3},{"$f":"TEXT(Tableau1[[#This Row],[Date]],\"mmmm\")","v":"mars"},{"$f":"CHOOSE(WEEKDAY(Tableau1[[#This Row],[Date]],2),\"lu\",\"ma\",\"me\",\"je\",\"ve\",\"sa\",\"di\")","v":"lu"},{"$f":"IFERROR(VLOOKUP(B165,Tableau30[],3,FALSE),IF(OR(AND($K$5<=B165,$L$5>B165),AND($K$6<=Tableau1[[#This Row],[Date]],$L$6>=Tableau1[[#This Row],[Date]])),\"FERMÉE\",IF(OR(Tableau1[[#This Row],[Jour]]=\"sa\",Tableau1[[#This Row],[Jour]]=\"di\",AND(Tableau1[[#This Row],[Jour]]=\"ve\",MOD(Tableau1[[#This Row],[N°S]],2)=1)),\"REPOS\",IF(Tableau1[[#This Row],[Jour]]=\"ve\",8,8.75))))","v":8.75}]
[null,"2020-03-10",{"$f":"_xlfn.ISOWEEKNUM(Tableau1[[#This Row],[Date]])","v":11},{"$f":"MONTH(Tableau1[[#This Row],[Date]])","v":3},{"$f":"TEXT(Tableau1[[#This Row],[Date]],\"mmmm\")","v":"mars"},{"$f":"CHOOSE(WEEKDAY(Tableau1[[#This Row],[Date]],2),\"lu\",\"ma\",\"me\",\"je\",\"ve\",\"sa\",\"di\")","v":"ma"},{"$f":"IFERROR(VLOOKUP(B166,Tableau30[],3,FALSE),IF(OR(AND($K$5<=B166,$L$5>B166),AND($K$6<=Tableau1[[#This Row],[Date]],$L$6>=Tableau1[[#This Row],[Date]])),\"FERMÉE\",IF(OR(Tableau1[[#This Row],[Jour]]=\"sa\",Tableau1[[#This Row],[Jour]]=\"di\",AND(Tableau1[[#This Row],[Jour]]=\"ve\",MOD(Tableau1[[#This Row],[N°S]],2)=1)),\"REPOS\",IF(Tableau1[[#This Row],[Jour]]=\"ve\",8,8.75))))","v":8.75}]
[null,"2020-03-11",{"$f":"_xlfn.ISOWEEKNUM(Tableau1[[#This Row],[Date]])","v":11},{"$f":"MONTH(Tableau1[[#This Row],[Date]])","v":3},{"$f":"TEXT(Tableau1[[#This Row],[Date]],\"mmmm\")","v":"mars"},{"$f":"CHOOSE(WEEKDAY(Tableau1[[#This Row],[Date]],2),\"lu\",\"ma\",\"me\",\"je\",\"ve\",\"sa\",\"di\")","v":"me"},{"$f":"IFERROR(VLOOKUP(B167,Tableau30[],3,FALSE),IF(OR(AND($K$5<=B167,$L$5>B167),AND($K$6<=Tableau1[[#This Row],[Date]],$L$6>=Tableau1[[#This Row],[Date]])),\"FERMÉE\",IF(OR(Tableau1[[#This Row],[Jour]]=\"sa\",Tableau1[[#This Row],[Jour]]=\"di\",AND(Tableau1[[#This Row],[Jour]]=\"ve\",MOD(Tableau1[[#This Row],[N°S]],2)=1)),\"REPOS\",IF(Tableau1[[#This Row],[Jour]]=\"ve\",8,8.75))))","v":8.75}]
[null,"2020-03-12",{"$f":"_xlfn.ISOWEEKNUM(Tableau1[[#This Row],[Date]])","v":11},{"$f":"MONTH(Tableau1[[#This Row],[Date]])","v":3},{"$f":"TEXT(Tableau1[[#This Row],[Date]],\"mmmm\")","v":"mars"},{"$f":"CHOOSE(WEEKDAY(Tableau1[[#This Row],[Date]],2),\"lu\",\"ma\",\"me\",\"je\",\"ve\",\"sa\",\"di\")","v":"je"},{"$f":"IFERROR(VLOOKUP(B168,Tableau30[],3,FALSE),IF(OR(AND($K$5<=B168,$L$5>B168),AND($K$6<=Tableau1[[#This Row],[Date]],$L$6>=Tableau1[[#This Row],[Date]])),\"FERMÉE\",IF(OR(Tableau1[[#This Row],[Jour]]=\"sa\",Tableau1[[#This Row],[Jour]]=\"di\",AND(Tableau1[[#This Row],[Jour]]=\"ve\",MOD(Tableau1[[#This Row],[N°S]],2)=1)),\"REPOS\",IF(Tableau1[[#This Row],[Jour]]=\"ve\",8,8.75))))","v":8.75}]
[null,"2020-03-13",{"$f":"_xlfn.ISOWEEKNUM(Tableau1[[#This Row],[Date]])","v":11},{"$f":"MONTH(Tableau1[[#This Row],[Date]])","v":3},{"$f":"TEXT(Tableau1[[#This Row],[Date]],\"mmmm\")","v":"mars"},{"$f":"CHOOSE(WEEKDAY(Tableau1[[#This Row],[Date]],2),\"lu\",\"ma\",\"me\",\"je\",\"ve\",\"sa\",\"di\")","v":"ve"},{"$f":"IFERROR(VLOOKUP(B169,Tableau30[],3,FALSE),IF(OR(AND($K$5<=B169,$L$5>B169),AND($K$6<=Tableau1[[#This Row],[Date]],$L$6>=Tableau1[[#This Row],[Date]])),\"FERMÉE\",IF(OR(Tableau1[[#This Row],[Jour]]=\"sa\",Tableau1[[#This Row],[Jour]]=\"di\",AND(Tableau1[[#This Row],[Jour]]=\"ve\",MOD(Tableau1[[#This Row],[N°S]],2)=1)),\"REPOS\",IF(Tableau1[[#This Row],[Jour]]=\"ve\",8,8.75))))","v":"REPOS"}]
[null,"2020-03-14",{"$f":"_xlfn.ISOWEEKNUM(Tableau1[[#This Row],[Date]])","v":11},{"$f":"MONTH(Tableau1[[#This Row],[Date]])","v":3},{"$f":"TEXT(Tableau1[[#This Row],[Date]],\"mmmm\")","v":"mars"},{"$f":"CHOOSE(WEEKDAY(Tableau1[[#This Row],[Date]],2),\"lu\",\"ma\",\"me\",\"je\",\"ve\",\"sa\",\"di\")","v":"sa"},{"$f":"IFERROR(VLOOKUP(B170,Tableau30[],3,FALSE),IF(OR(AND($K$5<=B170,$L$5>B170),AND($K$6<=Tableau1[[#This Row],[Date]],$L$6>=Tableau1[[#This Row],[Date]])),\"FERMÉE\",IF(OR(Tableau1[[#This Row],[Jour]]=\"sa\",Tableau1[[#This Row],[Jour]]=\"di\",AND(Tableau1[[#This Row],[Jour]]=\"ve\",MOD(Tableau1[[#This Row],[N°S]],2)=1)),\"REPOS\",IF(Tableau1[[#This Row],[Jour]]=\"ve\",8,8.75))))","v":"REPOS"}]
[null,"2020-03-15",{"$f":"_xlfn.ISOWEEKNUM(Tableau1[[#This Row],[Date]])","v":11},{"$f":"MONTH(Tableau1[[#This Row],[Date]])","v":3},{"$f":"TEXT(Tableau1[[#This Row],[Date]],\"mmmm\")","v":"mars"},{"$f":"CHOOSE(WEEKDAY(Tableau1[[#This Row],[Date]],2),\"lu\",\"ma\",\"me\",\"je\",\"ve\",\"sa\",\"di\")","v":"di"},{"$f":"IFERROR(VLOOKUP(B171,Tableau30[],3,FALSE),IF(OR(AND($K$5<=B171,$L$5>B171),AND($K$6<=Tableau1[[#This Row],[Date]],$L$6>=Tableau1[[#This Row],[Date]])),\"FERMÉE\",IF(OR(Tableau1[[#This Row],[Jour]]=\"sa\",Tableau1[[#This Row],[Jour]]=\"di\",AND(Tableau1[[#This Row],[Jour]]=\"ve\",MOD(Tableau1[[#This Row],[N°S]],2)=1)),\"REPOS\",IF(Tableau1[[#This Row],[Jour]]=\"ve\",8,8.75))))","v":"REPOS"}]
[null,"2020-03-16",{"$f":"_xlfn.ISOWEEKNUM(Tableau1[[#This Row],[Date]])","v":12},{"$f":"MONTH(Tableau1[[#This Row],[Date]])","v":3},{"$f":"TEXT(Tableau1[[#This Row],[Date]],\"mmmm\")","v":"mars"},{"$f":"CHOOSE(WEEKDAY(Tableau1[[#This Row],[Date]],2),\"lu\",\"ma\",\"me\",\"je\",\"ve\",\"sa\",\"di\")","v":"lu"},{"$f":"IFERROR(VLOOKUP(B172,Tableau30[],3,FALSE),IF(OR(AND($K$5<=B172,$L$5>B172),AND($K$6<=Tableau1[[#This Row],[Date]],$L$6>=Tableau1[[#This Row],[Date]])),\"FERMÉE\",IF(OR(Tableau1[[#This Row],[Jour]]=\"sa\",Tableau1[[#This Row],[Jour]]=\"di\",AND(Tableau1[[#This Row],[Jour]]=\"ve\",MOD(Tableau1[[#This Row],[N°S]],2)=1)),\"REPOS\",IF(Tableau1[[#This Row],[Jour]]=\"ve\",8,8.75))))","v":8.75}]
[null,"2020-03-17",{"$f":"_xlfn.ISOWEEKNUM(Tableau1[[#This Row],[Date]])","v":12},{"$f":"MONTH(Tableau1[[#This Row],[Date]])","v":3},{"$f":"TEXT(Tableau1[[#This Row],[Date]],\"mmmm\")","v":"mars"},{"$f":"CHOOSE(WEEKDAY(Tableau1[[#This Row],[Date]],2),\"lu\",\"ma\",\"me\",\"je\",\"ve\",\"sa\",\"di\")","v":"ma"},{"$f":"IFERROR(VLOOKUP(B173,Tableau30[],3,FALSE),IF(OR(AND($K$5<=B173,$L$5>B173),AND($K$6<=Tableau1[[#This Row],[Date]],$L$6>=Tableau1[[#This Row],[Date]])),\"FERMÉE\",IF(OR(Tableau1[[#This Row],[Jour]]=\"sa\",Tableau1[[#This Row],[Jour]]=\"di\",AND(Tableau1[[#This Row],[Jour]]=\"ve\",MOD(Tableau1[[#This Row],[N°S]],2)=1)),\"REPOS\",IF(Tableau1[[#This Row],[Jour]]=\"ve\",8,8.75))))","v":8.75}]
[null,"2020-03-18",{"$f":"_xlfn.ISOWEEKNUM(Tableau1[[#This Row],[Date]])","v":12},{"$f":"MONTH(Tableau1[[#This Row],[Date]])","v":3},{"$f":"TEXT(Tableau1[[#This Row],[Date]],\"mmmm\")","v":"mars"},{"$f":"CHOOSE(WEEKDAY(Tableau1[[#This Row],[Date]],2),\"lu\",\"ma\",\"me\",\"je\",\"ve\",\"sa\",\"di\")","v":"me"},{"$f":"IFERROR(VLOOKUP(B174,Tableau30[],3,FALSE),IF(OR(AND($K$5<=B174,$L$5>B174),AND($K$6<=Tableau1[[#This Row],[Date]],$L$6>=Tableau1[[#This Row],[Date]])),\"FERMÉE\",IF(OR(Tableau1[[#This Row],[Jour]]=\"sa\",Tableau1[[#This Row],[Jour]]=\"di\",AND(Tableau1[[#This Row],[Jour]]=\"ve\",MOD(Tableau1[[#This Row],[N°S]],2)=1)),\"REPOS\",IF(Tableau1[[#This Row],[Jour]]=\"ve\",8,8.75))))","v":8.75}]
[null,"2020-03-19",{"$f":"_xlfn.ISOWEEKNUM(Tableau1[[#This Row],[Date]])","v":12},{"$f":"MONTH(Tableau1[[#This Row],[Date]])","v":3},{"$f":"TEXT(Tableau1[[#This Row],[Date]],\"mmmm\")","v":"mars"},{"$f":"CHOOSE(WEEKDAY(Tableau1[[#This Row],[Date]],2),\"lu\",\"ma\",\"me\",\"je\",\"ve\",\"sa\",\"di\")","v":"je"},{"$f":"IFERROR(VLOOKUP(B175,Tableau30[],3,FALSE),IF(OR(AND($K$5<=B175,$L$5>B175),AND($K$6<=Tableau1[[#This Row],[Date]],$L$6>=Tableau1[[#This Row],[Date]])),\"FERMÉE\",IF(OR(Tableau1[[#This Row],[Jour]]=\"sa\",Tableau1[[#This Row],[Jour]]=\"di\",AND(Tableau1[[#This Row],[Jour]]=\"ve\",MOD(Tableau1[[#This Row],[N°S]],2)=1)),\"REPOS\",IF(Tableau1[[#This Row],[Jour]]=\"ve\",8,8.75))))","v":8.75}]
[null,"2020-03-20",{"$f":"_xlfn.ISOWEEKNUM(Tableau1[[#This Row],[Date]])","v":12},{"$f":"MONTH(Tableau1[[#This Row],[Date]])","v":3},{"$f":"TEXT(Tableau1[[#This Row],[Date]],\"mmmm\")","v":"mars"},{"$f":"CHOOSE(WEEKDAY(Tableau1[[#This Row],[Date]],2),\"lu\",\"ma\",\"me\",\"je\",\"ve\",\"sa\",\"di\")","v":"ve"},{"$f":"IFERROR(VLOOKUP(B176,Tableau30[],3,FALSE),IF(OR(AND($K$5<=B176,$L$5>B176),AND($K$6<=Tableau1[[#This Row],[Date]],$L$6>=Tableau1[[#This Row],[Date]])),\"FERMÉE\",IF(OR(Tableau1[[#This Row],[Jour]]=\"sa\",Tableau1[[#This Row],[Jour]]=\"di\",AND(Tableau1[[#This Row],[Jour]]=\"ve\",MOD(Tableau1[[#This Row],[N°S]],2)=1)),\"REPOS\",IF(Tableau1[[#This Row],[Jour]]=\"ve\",8,8.75))))","v":8}]
[null,"2020-03-21",{"$f":"_xlfn.ISOWEEKNUM(Tableau1[[#This Row],[Date]])","v":12},{"$f":"MONTH(Tableau1[[#This Row],[Date]])","v":3},{"$f":"TEXT(Tableau1[[#This Row],[Date]],\"mmmm\")","v":"mars"},{"$f":"CHOOSE(WEEKDAY(Tableau1[[#This Row],[Date]],2),\"lu\",\"ma\",\"me\",\"je\",\"ve\",\"sa\",\"di\")","v":"sa"},{"$f":"IFERROR(VLOOKUP(B177,Tableau30[],3,FALSE),IF(OR(AND($K$5<=B177,$L$5>B177),AND($K$6<=Tableau1[[#This Row],[Date]],$L$6>=Tableau1[[#This Row],[Date]])),\"FERMÉE\",IF(OR(Tableau1[[#This Row],[Jour]]=\"sa\",Tableau1[[#This Row],[Jour]]=\"di\",AND(Tableau1[[#This Row],[Jour]]=\"ve\",MOD(Tableau1[[#This Row],[N°S]],2)=1)),\"REPOS\",IF(Tableau1[[#This Row],[Jour]]=\"ve\",8,8.75))))","v":"REPOS"}]
[null,"2020-03-22",{"$f":"_xlfn.ISOWEEKNUM(Tableau1[[#This Row],[Date]])","v":12},{"$f":"MONTH(Tableau1[[#This Row],[Date]])","v":3},{"$f":"TEXT(Tableau1[[#This Row],[Date]],\"mmmm\")","v":"mars"},{"$f":"CHOOSE(WEEKDAY(Tableau1[[#This Row],[Date]],2),\"lu\",\"ma\",\"me\",\"je\",\"ve\",\"sa\",\"di\")","v":"di"},{"$f":"IFERROR(VLOOKUP(B178,Tableau30[],3,FALSE),IF(OR(AND($K$5<=B178,$L$5>B178),AND($K$6<=Tableau1[[#This Row],[Date]],$L$6>=Tableau1[[#This Row],[Date]])),\"FERMÉE\",IF(OR(Tableau1[[#This Row],[Jour]]=\"sa\",Tableau1[[#This Row],[Jour]]=\"di\",AND(Tableau1[[#This Row],[Jour]]=\"ve\",MOD(Tableau1[[#This Row],[N°S]],2)=1)),\"REPOS\",IF(Tableau1[[#This Row],[Jour]]=\"ve\",8,8.75))))","v":"REPOS"}]
[null,"2020-03-23",{"$f":"_xlfn.ISOWEEKNUM(Tableau1[[#This Row],[Date]])","v":13},{"$f":"MONTH(Tableau1[[#This Row],[Date]])","v":3},{"$f":"TEXT(Tableau1[[#This Row],[Date]],\"mmmm\")","v":"mars"},{"$f":"CHOOSE(WEEKDAY(Tableau1[[#This Row],[Date]],2),\"lu\",\"ma\",\"me\",\"je\",\"ve\",\"sa\",\"di\")","v":"lu"},{"$f":"IFERROR(VLOOKUP(B179,Tableau30[],3,FALSE),IF(OR(AND($K$5<=B179,$L$5>B179),AND($K$6<=Tableau1[[#This Row],[Date]],$L$6>=Tableau1[[#This Row],[Date]])),\"FERMÉE\",IF(OR(Tableau1[[#This Row],[Jour]]=\"sa\",Tableau1[[#This Row],[Jour]]=\"di\",AND(Tableau1[[#This Row],[Jour]]=\"ve\",MOD(Tableau1[[#This Row],[N°S]],2)=1)),\"REPOS\",IF(Tableau1[[#This Row],[Jour]]=\"ve\",8,8.75))))","v":8.75}]
[null,"2020-03-24",{"$f":"_xlfn.ISOWEEKNUM(Tableau1[[#This Row],[Date]])","v":13},{"$f":"MONTH(Tableau1[[#This Row],[Date]])","v":3},{"$f":"TEXT(Tableau1[[#This Row],[Date]],\"mmmm\")","v":"mars"},{"$f":"CHOOSE(WEEKDAY(Tableau1[[#This Row],[Date]],2),\"lu\",\"ma\",\"me\",\"je\",\"ve\",\"sa\",\"di\")","v":"ma"},{"$f":"IFERROR(VLOOKUP(B180,Tableau30[],3,FALSE),IF(OR(AND($K$5<=B180,$L$5>B180),AND($K$6<=Tableau1[[#This Row],[Date]],$L$6>=Tableau1[[#This Row],[Date]])),\"FERMÉE\",IF(OR(Tableau1[[#This Row],[Jour]]=\"sa\",Tableau1[[#This Row],[Jour]]=\"di\",AND(Tableau1[[#This Row],[Jour]]=\"ve\",MOD(Tableau1[[#This Row],[N°S]],2)=1)),\"REPOS\",IF(Tableau1[[#This Row],[Jour]]=\"ve\",8,8.75))))","v":8.75}]
[null,"2020-03-25",{"$f":"_xlfn.ISOWEEKNUM(Tableau1[[#This Row],[Date]])","v":13},{"$f":"MONTH(Tableau1[[#This Row],[Date]])","v":3},{"$f":"TEXT(Tableau1[[#This Row],[Date]],\"mmmm\")","v":"mars"},{"$f":"CHOOSE(WEEKDAY(Tableau1[[#This Row],[Date]],2),\"lu\",\"ma\",\"me\",\"je\",\"ve\",\"sa\",\"di\")","v":"me"},{"$f":"IFERROR(VLOOKUP(B181,Tableau30[],3,FALSE),IF(OR(AND($K$5<=B181,$L$5>B181),AND($K$6<=Tableau1[[#This Row],[Date]],$L$6>=Tableau1[[#This Row],[Date]])),\"FERMÉE\",IF(OR(Tableau1[[#This Row],[Jour]]=\"sa\",Tableau1[[#This Row],[Jour]]=\"di\",AND(Tableau1[[#This Row],[Jour]]=\"ve\",MOD(Tableau1[[#This Row],[N°S]],2)=1)),\"REPOS\",IF(Tableau1[[#This Row],[Jour]]=\"ve\",8,8.75))))","v":8.75}]
[null,"2020-03-26",{"$f":"_xlfn.ISOWEEKNUM(Tableau1[[#This Row],[Date]])","v":13},{"$f":"MONTH(Tableau1[[#This Row],[Date]])","v":3},{"$f":"TEXT(Tableau1[[#This Row],[Date]],\"mmmm\")","v":"mars"},{"$f":"CHOOSE(WEEKDAY(Tableau1[[#This Row],[Date]],2),\"lu\",\"ma\",\"me\",\"je\",\"ve\",\"sa\",\"di\")","v":"je"},{"$f":"IFERROR(VLOOKUP(B182,Tableau30[],3,FALSE),IF(OR(AND($K$5<=B182,$L$5>B182),AND($K$6<=Tableau1[[#This Row],[Date]],$L$6>=Tableau1[[#This Row],[Date]])),\"FERMÉE\",IF(OR(Tableau1[[#This Row],[Jour]]=\"sa\",Tableau1[[#This Row],[Jour]]=\"di\",AND(Tableau1[[#This Row],[Jour]]=\"ve\",MOD(Tableau1[[#This Row],[N°S]],2)=1)),\"REPOS\",IF(Tableau1[[#This Row],[Jour]]=\"ve\",8,8.75))))","v":8.75}]
[null,"2020-03-27",{"$f":"_xlfn.ISOWEEKNUM(Tableau1[[#This Row],[Date]])","v":13},{"$f":"MONTH(Tableau1[[#This Row],[Date]])","v":3},{"$f":"TEXT(Tableau1[[#This Row],[Date]],\"mmmm\")","v":"mars"},{"$f":"CHOOSE(WEEKDAY(Tableau1[[#This Row],[Date]],2),\"lu\",\"ma\",\"me\",\"je\",\"ve\",\"sa\",\"di\")","v":"ve"},{"$f":"IFERROR(VLOOKUP(B183,Tableau30[],3,FALSE),IF(OR(AND($K$5<=B183,$L$5>B183),AND($K$6<=Tableau1[[#This Row],[Date]],$L$6>=Tableau1[[#This Row],[Date]])),\"FERMÉE\",IF(OR(Tableau1[[#This Row],[Jour]]=\"sa\",Tableau1[[#This Row],[Jour]]=\"di\",AND(Tableau1[[#This Row],[Jour]]=\"ve\",MOD(Tableau1[[#This Row],[N°S]],2)=1)),\"REPOS\",IF(Tableau1[[#This Row],[Jour]]=\"ve\",8,8.75))))","v":"REPOS"}]
[null,"2020-03-28",{"$f":"_xlfn.ISOWEEKNUM(Tableau1[[#This Row],[Date]])","v":13},{"$f":"MONTH(Tableau1[[#This Row],[Date]])","v":3},{"$f":"TEXT(Tableau1[[#This Row],[Date]],\"mmmm\")","v":"mars"},{"$f":"CHOOSE(WEEKDAY(Tableau1[[#This Row],[Date]],2),\"lu\",\"ma\",\"me\",\"je\",\"ve\",\"sa\",\"di\")","v":"sa"},{"$f":"IFERROR(VLOOKUP(B184,Tableau30[],3,FALSE),IF(OR(AND($K$5<=B184,$L$5>B184),AND($K$6<=Tableau1[[#This Row],[Date]],$L$6>=Tableau1[[#This Row],[Date]])),\"FERMÉE\",IF(OR(Tableau1[[#This Row],[Jour]]=\"sa\",Tableau1[[#This Row],[Jour]]=\"di\",AND(Tableau1[[#This Row],[Jour]]=\"ve\",MOD(Tableau1[[#This Row],[N°S]],2)=1)),\"REPOS\",IF(Tableau1[[#This Row],[Jour]]=\"ve\",8,8.75))))","v":"REPOS"}]
[null,"2020-03-29",{"$f":"_xlfn.ISOWEEKNUM(Tableau1[[#This Row],[Date]])","v":13},{"$f":"MONTH(Tableau1[[#This Row],[Date]])","v":3},{"$f":"TEXT(Tableau1[[#This Row],[Date]],\"mmmm\")","v":"mars"},{"$f":"CHOOSE(WEEKDAY(Tableau1[[#This Row],[Date]],2),\"lu\",\"ma\",\"me\",\"je\",\"ve\",\"sa\",\"di\")","v":"di"},{"$f":"IFERROR(VLOOKUP(B185,Tableau30[],3,FALSE),IF(OR(AND($K$5<=B185,$L$5>B185),AND($K$6<=Tableau1[[#This Row],[Date]],$L$6>=Tableau1[[#This Row],[Date]])),\"FERMÉE\",IF(OR(Tableau1[[#This Row],[Jour]]=\"sa\",Tableau1[[#This Row],[Jour]]=\"di\",AND(Tableau1[[#This Row],[Jour]]=\"ve\",MOD(Tableau1[[#This Row],[N°S]],2)=1)),\"REPOS\",IF(Tableau1[[#This Row],[Jour]]=\"ve\",8,8.75))))","v":"REPOS"}]
[null,"2020-03-30",{"$f":"_xlfn.ISOWEEKNUM(Tableau1[[#This Row],[Date]])","v":14},{"$f":"MONTH(Tableau1[[#This Row],[Date]])","v":3},{"$f":"TEXT(Tableau1[[#This Row],[Date]],\"mmmm\")","v":"mars"},{"$f":"CHOOSE(WEEKDAY(Tableau1[[#This Row],[Date]],2),\"lu\",\"ma\",\"me\",\"je\",\"ve\",\"sa\",\"di\")","v":"lu"},{"$f":"IFERROR(VLOOKUP(B186,Tableau30[],3,FALSE),IF(OR(AND($K$5<=B186,$L$5>B186),AND($K$6<=Tableau1[[#This Row],[Date]],$L$6>=Tableau1[[#This Row],[Date]])),\"FERMÉE\",IF(OR(Tableau1[[#This Row],[Jour]]=\"sa\",Tableau1[[#This Row],[Jour]]=\"di\",AND(Tableau1[[#This Row],[Jour]]=\"ve\",MOD(Tableau1[[#This Row],[N°S]],2)=1)),\"REPOS\",IF(Tableau1[[#This Row],[Jour]]=\"ve\",8,8.75))))","v":8.75}]
[null,"2020-03-31",{"$f":"_xlfn.ISOWEEKNUM(Tableau1[[#This Row],[Date]])","v":14},{"$f":"MONTH(Tableau1[[#This Row],[Date]])","v":3},{"$f":"TEXT(Tableau1[[#This Row],[Date]],\"mmmm\")","v":"mars"},{"$f":"CHOOSE(WEEKDAY(Tableau1[[#This Row],[Date]],2),\"lu\",\"ma\",\"me\",\"je\",\"ve\",\"sa\",\"di\")","v":"ma"},{"$f":"IFERROR(VLOOKUP(B187,Tableau30[],3,FALSE),IF(OR(AND($K$5<=B187,$L$5>B187),AND($K$6<=Tableau1[[#This Row],[Date]],$L$6>=Tableau1[[#This Row],[Date]])),\"FERMÉE\",IF(OR(Tableau1[[#This Row],[Jour]]=\"sa\",Tableau1[[#This Row],[Jour]]=\"di\",AND(Tableau1[[#This Row],[Jour]]=\"ve\",MOD(Tableau1[[#This Row],[N°S]],2)=1)),\"REPOS\",IF(Tableau1[[#This Row],[Jour]]=\"ve\",8,8.75))))","v":8.75}]
[null,"2020-04-01",{"$f":"_xlfn.ISOWEEKNUM(Tableau1[[#This Row],[Date]])","v":14},{"$f":"MONTH(Tableau1[[#This Row],[Date]])","v":4},{"$f":"TEXT(Tableau1[[#This Row],[Date]],\"mmmm\")","v":"avril"},{"$f":"CHOOSE(WEEKDAY(Tableau1[[#This Row],[Date]],2),\"lu\",\"ma\",\"me\",\"je\",\"ve\",\"sa\",\"di\")","v":"me"},{"$f":"IFERROR(VLOOKUP(B188,Tableau30[],3,FALSE),IF(OR(AND($K$5<=B188,$L$5>B188),AND($K$6<=Tableau1[[#This Row],[Date]],$L$6>=Tableau1[[#This Row],[Date]])),\"FERMÉE\",IF(OR(Tableau1[[#This Row],[Jour]]=\"sa\",Tableau1[[#This Row],[Jour]]=\"di\",AND(Tableau1[[#This Row],[Jour]]=\"ve\",MOD(Tableau1[[#This Row],[N°S]],2)=1)),\"REPOS\",IF(Tableau1[[#This Row],[Jour]]=\"ve\",8,8.75))))","v":8.75}]
[null,"2020-04-02",{"$f":"_xlfn.ISOWEEKNUM(Tableau1[[#This Row],[Date]])","v":14},{"$f":"MONTH(Tableau1[[#This Row],[Date]])","v":4},{"$f":"TEXT(Tableau1[[#This Row],[Date]],\"mmmm\")","v":"avril"},{"$f":"CHOOSE(WEEKDAY(Tableau1[[#This Row],[Date]],2),\"lu\",\"ma\",\"me\",\"je\",\"ve\",\"sa\",\"di\")","v":"je"},{"$f":"IFERROR(VLOOKUP(B189,Tableau30[],3,FALSE),IF(OR(AND($K$5<=B189,$L$5>B189),AND($K$6<=Tableau1[[#This Row],[Date]],$L$6>=Tableau1[[#This Row],[Date]])),\"FERMÉE\",IF(OR(Tableau1[[#This Row],[Jour]]=\"sa\",Tableau1[[#This Row],[Jour]]=\"di\",AND(Tableau1[[#This Row],[Jour]]=\"ve\",MOD(Tableau1[[#This Row],[N°S]],2)=1)),\"REPOS\",IF(Tableau1[[#This Row],[Jour]]=\"ve\",8,8.75))))","v":8.75}]
[null,"2020-04-03",{"$f":"_xlfn.ISOWEEKNUM(Tableau1[[#This Row],[Date]])","v":14},{"$f":"MONTH(Tableau1[[#This Row],[Date]])","v":4},{"$f":"TEXT(Tableau1[[#This Row],[Date]],\"mmmm\")","v":"avril"},{"$f":"CHOOSE(WEEKDAY(Tableau1[[#This Row],[Date]],2),\"lu\",\"ma\",\"me\",\"je\",\"ve\",\"sa\",\"di\")","v":"ve"},{"$f":"IFERROR(VLOOKUP(B190,Tableau30[],3,FALSE),IF(OR(AND($K$5<=B190,$L$5>B190),AND($K$6<=Tableau1[[#This Row],[Date]],$L$6>=Tableau1[[#This Row],[Date]])),\"FERMÉE\",IF(OR(Tableau1[[#This Row],[Jour]]=\"sa\",Tableau1[[#This Row],[Jour]]=\"di\",AND(Tableau1[[#This Row],[Jour]]=\"ve\",MOD(Tableau1[[#This Row],[N°S]],2)=1)),\"REPOS\",IF(Tableau1[[#This Row],[Jour]]=\"ve\",8,8.75))))","v":8}]
[null,"2020-04-04",{"$f":"_xlfn.ISOWEEKNUM(Tableau1[[#This Row],[Date]])","v":14},{"$f":"MONTH(Tableau1[[#This Row],[Date]])","v":4},{"$f":"TEXT(Tableau1[[#This Row],[Date]],\"mmmm\")","v":"avril"},{"$f":"CHOOSE(WEEKDAY(Tableau1[[#This Row],[Date]],2),\"lu\",\"ma\",\"me\",\"je\",\"ve\",\"sa\",\"di\")","v":"sa"},{"$f":"IFERROR(VLOOKUP(B191,Tableau30[],3,FALSE),IF(OR(AND($K$5<=B191,$L$5>B191),AND($K$6<=Tableau1[[#This Row],[Date]],$L$6>=Tableau1[[#This Row],[Date]])),\"FERMÉE\",IF(OR(Tableau1[[#This Row],[Jour]]=\"sa\",Tableau1[[#This Row],[Jour]]=\"di\",AND(Tableau1[[#This Row],[Jour]]=\"ve\",MOD(Tableau1[[#This Row],[N°S]],2)=1)),\"REPOS\",IF(Tableau1[[#This Row],[Jour]]=\"ve\",8,8.75))))","v":"REPOS"}]
[null,"2020-04-05",{"$f":"_xlfn.ISOWEEKNUM(Tableau1[[#This Row],[Date]])","v":14},{"$f":"MONTH(Tableau1[[#This Row],[Date]])","v":4},{"$f":"TEXT(Tableau1[[#This Row],[Date]],\"mmmm\")","v":"avril"},{"$f":"CHOOSE(WEEKDAY(Tableau1[[#This Row],[Date]],2),\"lu\",\"ma\",\"me\",\"je\",\"ve\",\"sa\",\"di\")","v":"di"},{"$f":"IFERROR(VLOOKUP(B192,Tableau30[],3,FALSE),IF(OR(AND($K$5<=B192,$L$5>B192),AND($K$6<=Tableau1[[#This Row],[Date]],$L$6>=Tableau1[[#This Row],[Date]])),\"FERMÉE\",IF(OR(Tableau1[[#This Row],[Jour]]=\"sa\",Tableau1[[#This Row],[Jour]]=\"di\",AND(Tableau1[[#This Row],[Jour]]=\"ve\",MOD(Tableau1[[#This Row],[N°S]],2)=1)),\"REPOS\",IF(Tableau1[[#This Row],[Jour]]=\"ve\",8,8.75))))","v":"REPOS"}]
[null,"2020-04-06",{"$f":"_xlfn.ISOWEEKNUM(Tableau1[[#This Row],[Date]])","v":15},{"$f":"MONTH(Tableau1[[#This Row],[Date]])","v":4},{"$f":"TEXT(Tableau1[[#This Row],[Date]],\"mmmm\")","v":"avril"},{"$f":"CHOOSE(WEEKDAY(Tableau1[[#This Row],[Date]],2),\"lu\",\"ma\",\"me\",\"je\",\"ve\",\"sa\",\"di\")","v":"lu"},{"$f":"IFERROR(VLOOKUP(B193,Tableau30[],3,FALSE),IF(OR(AND($K$5<=B193,$L$5>B193),AND($K$6<=Tableau1[[#This Row],[Date]],$L$6>=Tableau1[[#This Row],[Date]])),\"FERMÉE\",IF(OR(Tableau1[[#This Row],[Jour]]=\"sa\",Tableau1[[#This Row],[Jour]]=\"di\",AND(Tableau1[[#This Row],[Jour]]=\"ve\",MOD(Tableau1[[#This Row],[N°S]],2)=1)),\"REPOS\",IF(Tableau1[[#This Row],[Jour]]=\"ve\",8,8.75))))","v":8.75}]
[null,"2020-04-07",{"$f":"_xlfn.ISOWEEKNUM(Tableau1[[#This Row],[Date]])","v":15},{"$f":"MONTH(Tableau1[[#This Row],[Date]])","v":4},{"$f":"TEXT(Tableau1[[#This Row],[Date]],\"mmmm\")","v":"avril"},{"$f":"CHOOSE(WEEKDAY(Tableau1[[#This Row],[Date]],2),\"lu\",\"ma\",\"me\",\"je\",\"ve\",\"sa\",\"di\")","v":"ma"},{"$f":"IFERROR(VLOOKUP(B194,Tableau30[],3,FALSE),IF(OR(AND($K$5<=B194,$L$5>B194),AND($K$6<=Tableau1[[#This Row],[Date]],$L$6>=Tableau1[[#This Row],[Date]])),\"FERMÉE\",IF(OR(Tableau1[[#This Row],[Jour]]=\"sa\",Tableau1[[#This Row],[Jour]]=\"di\",AND(Tableau1[[#This Row],[Jour]]=\"ve\",MOD(Tableau1[[#This Row],[N°S]],2)=1)),\"REPOS\",IF(Tableau1[[#This Row],[Jour]]=\"ve\",8,8.75))))","v":8.75}]
[null,"2020-04-08",{"$f":"_xlfn.ISOWEEKNUM(Tableau1[[#This Row],[Date]])","v":15},{"$f":"MONTH(Tableau1[[#This Row],[Date]])","v":4},{"$f":"TEXT(Tableau1[[#This Row],[Date]],\"mmmm\")","v":"avril"},{"$f":"CHOOSE(WEEKDAY(Tableau1[[#This Row],[Date]],2),\"lu\",\"ma\",\"me\",\"je\",\"ve\",\"sa\",\"di\")","v":"me"},{"$f":"IFERROR(VLOOKUP(B195,Tableau30[],3,FALSE),IF(OR(AND($K$5<=B195,$L$5>B195),AND($K$6<=Tableau1[[#This Row],[Date]],$L$6>=Tableau1[[#This Row],[Date]])),\"FERMÉE\",IF(OR(Tableau1[[#This Row],[Jour]]=\"sa\",Tableau1[[#This Row],[Jour]]=\"di\",AND(Tableau1[[#This Row],[Jour]]=\"ve\",MOD(Tableau1[[#This Row],[N°S]],2)=1)),\"REPOS\",IF(Tableau1[[#This Row],[Jour]]=\"ve\",8,8.75))))","v":8.75}]
[null,"2020-04-09",{"$f":"_xlfn.ISOWEEKNUM(Tableau1[[#This Row],[Date]])","v":15},{"$f":"MONTH(Tableau1[[#This Row],[Date]])","v":4},{"$f":"TEXT(Tableau1[[#This Row],[Date]],\"mmmm\")","v":"avril"},{"$f":"CHOOSE(WEEKDAY(Tableau1[[#This Row],[Date]],2),\"lu\",\"ma\",\"me\",\"je\",\"ve\",\"sa\",\"di\")","v":"je"},{"$f":"IFERROR(VLOOKUP(B196,Tableau30[],3,FALSE),IF(OR(AND($K$5<=B196,$L$5>B196),AND($K$6<=Tableau1[[#This Row],[Date]],$L$6>=Tableau1[[#This Row],[Date]])),\"FERMÉE\",IF(OR(Tableau1[[#This Row],[Jour]]=\"sa\",Tableau1[[#This Row],[Jour]]=\"di\",AND(Tableau1[[#This Row],[Jour]]=\"ve\",MOD(Tableau1[[#This Row],[N°S]],2)=1)),\"REPOS\",IF(Tableau1[[#This Row],[Jour]]=\"ve\",8,8.75))))","v":8.75}]
[null,"2020-04-10",{"$f":"_xlfn.ISOWEEKNUM(Tableau1[[#This Row],[Date]])","v":15},{"$f":"MONTH(Tableau1[[#This Row],[Date]])","v":4},{"$f":"TEXT(Tableau1[[#This Row],[Date]],\"mmmm\")","v":"avril"},{"$f":"CHOOSE(WEEKDAY(Tableau1[[#This Row],[Date]],2),\"lu\",\"ma\",\"me\",\"je\",\"ve\",\"sa\",\"di\")","v":"ve"},{"$f":"IFERROR(VLOOKUP(B197,Tableau30[],3,FALSE),IF(OR(AND($K$5<=B197,$L$5>B197),AND($K$6<=Tableau1[[#This Row],[Date]],$L$6>=Tableau1[[#This Row],[Date]])),\"FERMÉE\",IF(OR(Tableau1[[#This Row],[Jour]]=\"sa\",Tableau1[[#This Row],[Jour]]=\"di\",AND(Tableau1[[#This Row],[Jour]]=\"ve\",MOD(Tableau1[[#This Row],[N°S]],2)=1)),\"REPOS\",IF(Tableau1[[#This Row],[Jour]]=\"ve\",8,8.75))))","v":"REPOS"}]
[null,"2020-04-11",{"$f":"_xlfn.ISOWEEKNUM(Tableau1[[#This Row],[Date]])","v":15},{"$f":"MONTH(Tableau1[[#This Row],[Date]])","v":4},{"$f":"TEXT(Tableau1[[#This Row],[Date]],\"mmmm\")","v":"avril"},{"$f":"CHOOSE(WEEKDAY(Tableau1[[#This Row],[Date]],2),\"lu\",\"ma\",\"me\",\"je\",\"ve\",\"sa\",\"di\")","v":"sa"},{"$f":"IFERROR(VLOOKUP(B198,Tableau30[],3,FALSE),IF(OR(AND($K$5<=B198,$L$5>B198),AND($K$6<=Tableau1[[#This Row],[Date]],$L$6>=Tableau1[[#This Row],[Date]])),\"FERMÉE\",IF(OR(Tableau1[[#This Row],[Jour]]=\"sa\",Tableau1[[#This Row],[Jour]]=\"di\",AND(Tableau1[[#This Row],[Jour]]=\"ve\",MOD(Tableau1[[#This Row],[N°S]],2)=1)),\"REPOS\",IF(Tableau1[[#This Row],[Jour]]=\"ve\",8,8.75))))","v":"REPOS"}]
[null,{"$f":"B198+1","v":"2020-04-12"},{"$f":"_xlfn.ISOWEEKNUM(Tableau1[[#This Row],[Date]])","v":15},{"$f":"MONTH(Tableau1[[#This Row],[Date]])","v":4},{"$f":"TEXT(Tableau1[[#This Row],[Date]],\"mmmm\")","v":"avril"},{"$f":"CHOOSE(WEEKDAY(Tableau1[[#This Row],[Date]],2),\"lu\",\"ma\",\"me\",\"je\",\"ve\",\"sa\",\"di\")","v":"di"},{"$f":"IFERROR(VLOOKUP(B199,Tableau30[],3,FALSE),IF(OR(AND($K$5<=B199,$L$5>B199),AND($K$6<=Tableau1[[#This Row],[Date]],$L$6>=Tableau1[[#This Row],[Date]])),\"FERMÉE\",IF(OR(Tableau1[[#This Row],[Jour]]=\"sa\",Tableau1[[#This Row],[Jour]]=\"di\",AND(Tableau1[[#This Row],[Jour]]=\"ve\",MOD(Tableau1[[#This Row],[N°S]],2)=1)),\"REPOS\",IF(Tableau1[[#This Row],[Jour]]=\"ve\",8,8.75))))","v":"REPOS"}]
[null,"2020-04-13",{"$f":"_xlfn.ISOWEEKNUM(Tableau1[[#This Row],[Date]])","v":16},{"$f":"MONTH(Tableau1[[#This Row],[Date]])","v":4},{"$f":"TEXT(Tableau1[[#This Row],[Date]],\"mmmm\")","v":"avril"},{"$f":"CHOOSE(WEEKDAY(Tableau1[[#This Row],[Date]],2),\"lu\",\"ma\",\"me\",\"je\",\"ve\",\"sa\",\"di\")","v":"lu"},{"$f":"IFERROR(VLOOKUP(B200,Tableau30[],3,FALSE),IF(OR(AND($K$5<=B200,$L$5>B200),AND($K$6<=Tableau1[[#This Row],[Date]],$L$6>=Tableau1[[#This Row],[Date]])),\"FERMÉE\",IF(OR(Tableau1[[#This Row],[Jour]]=\"sa\",Tableau1[[#This Row],[Jour]]=\"di\",AND(Tableau1[[#This Row],[Jour]]=\"ve\",MOD(Tableau1[[#This Row],[N°S]],2)=1)),\"REPOS\",IF(Tableau1[[#This Row],[Jour]]=\"ve\",8,8.75))))","v":"FÉRIÉ/INACTIF"}]
[null,"2020-04-14",{"$f":"_xlfn.ISOWEEKNUM(Tableau1[[#This Row],[Date]])","v":16},{"$f":"MONTH(Tableau1[[#This Row],[Date]])","v":4},{"$f":"TEXT(Tableau1[[#This Row],[Date]],\"mmmm\")","v":"avril"},{"$f":"CHOOSE(WEEKDAY(Tableau1[[#This Row],[Date]],2),\"lu\",\"ma\",\"me\",\"je\",\"ve\",\"sa\",\"di\")","v":"ma"},{"$f":"IFERROR(VLOOKUP(B201,Tableau30[],3,FALSE),IF(OR(AND($K$5<=B201,$L$5>B201),AND($K$6<=Tableau1[[#This Row],[Date]],$L$6>=Tableau1[[#This Row],[Date]])),\"FERMÉE\",IF(OR(Tableau1[[#This Row],[Jour]]=\"sa\",Tableau1[[#This Row],[Jour]]=\"di\",AND(Tableau1[[#This Row],[Jour]]=\"ve\",MOD(Tableau1[[#This Row],[N°S]],2)=1)),\"REPOS\",IF(Tableau1[[#This Row],[Jour]]=\"ve\",8,8.75))))","v":8.75}]
[null,"2020-04-15",{"$f":"_xlfn.ISOWEEKNUM(Tableau1[[#This Row],[Date]])","v":16},{"$f":"MONTH(Tableau1[[#This Row],[Date]])","v":4},{"$f":"TEXT(Tableau1[[#This Row],[Date]],\"mmmm\")","v":"avril"},{"$f":"CHOOSE(WEEKDAY(Tableau1[[#This Row],[Date]],2),\"lu\",\"ma\",\"me\",\"je\",\"ve\",\"sa\",\"di\")","v":"me"},{"$f":"IFERROR(VLOOKUP(B202,Tableau30[],3,FALSE),IF(OR(AND($K$5<=B202,$L$5>B202),AND($K$6<=Tableau1[[#This Row],[Date]],$L$6>=Tableau1[[#This Row],[Date]])),\"FERMÉE\",IF(OR(Tableau1[[#This Row],[Jour]]=\"sa\",Tableau1[[#This Row],[Jour]]=\"di\",AND(Tableau1[[#This Row],[Jour]]=\"ve\",MOD(Tableau1[[#This Row],[N°S]],2)=1)),\"REPOS\",IF(Tableau1[[#This Row],[Jour]]=\"ve\",8,8.75))))","v":8.75}]
[null,"2020-04-16",{"$f":"_xlfn.ISOWEEKNUM(Tableau1[[#This Row],[Date]])","v":16},{"$f":"MONTH(Tableau1[[#This Row],[Date]])","v":4},{"$f":"TEXT(Tableau1[[#This Row],[Date]],\"mmmm\")","v":"avril"},{"$f":"CHOOSE(WEEKDAY(Tableau1[[#This Row],[Date]],2),\"lu\",\"ma\",\"me\",\"je\",\"ve\",\"sa\",\"di\")","v":"je"},{"$f":"IFERROR(VLOOKUP(B203,Tableau30[],3,FALSE),IF(OR(AND($K$5<=B203,$L$5>B203),AND($K$6<=Tableau1[[#This Row],[Date]],$L$6>=Tableau1[[#This Row],[Date]])),\"FERMÉE\",IF(OR(Tableau1[[#This Row],[Jour]]=\"sa\",Tableau1[[#This Row],[Jour]]=\"di\",AND(Tableau1[[#This Row],[Jour]]=\"ve\",MOD(Tableau1[[#This Row],[N°S]],2)=1)),\"REPOS\",IF(Tableau1[[#This Row],[Jour]]=\"ve\",8,8.75))))","v":8.75}]
[null,"2020-04-17",{"$f":"_xlfn.ISOWEEKNUM(Tableau1[[#This Row],[Date]])","v":16},{"$f":"MONTH(Tableau1[[#This Row],[Date]])","v":4},{"$f":"TEXT(Tableau1[[#This Row],[Date]],\"mmmm\")","v":"avril"},{"$f":"CHOOSE(WEEKDAY(Tableau1[[#This Row],[Date]],2),\"lu\",\"ma\",\"me\",\"je\",\"ve\",\"sa\",\"di\")","v":"ve"},{"$f":"IFERROR(VLOOKUP(B204,Tableau30[],3,FALSE),IF(OR(AND($K$5<=B204,$L$5>B204),AND($K$6<=Tableau1[[#This Row],[Date]],$L$6>=Tableau1[[#This Row],[Date]])),\"FERMÉE\",IF(OR(Tableau1[[#This Row],[Jour]]=\"sa\",Tableau1[[#This Row],[Jour]]=\"di\",AND(Tableau1[[#This Row],[Jour]]=\"ve\",MOD(Tableau1[[#This Row],[N°S]],2)=1)),\"REPOS\",IF(Tableau1[[#This Row],[Jour]]=\"ve\",8,8.75))))","v":8}]
[null,"2020-04-18",{"$f":"_xlfn.ISOWEEKNUM(Tableau1[[#This Row],[Date]])","v":16},{"$f":"MONTH(Tableau1[[#This Row],[Date]])","v":4},{"$f":"TEXT(Tableau1[[#This Row],[Date]],\"mmmm\")","v":"avril"},{"$f":"CHOOSE(WEEKDAY(Tableau1[[#This Row],[Date]],2),\"lu\",\"ma\",\"me\",\"je\",\"ve\",\"sa\",\"di\")","v":"sa"},{"$f":"IFERROR(VLOOKUP(B205,Tableau30[],3,FALSE),IF(OR(AND($K$5<=B205,$L$5>B205),AND($K$6<=Tableau1[[#This Row],[Date]],$L$6>=Tableau1[[#This Row],[Date]])),\"FERMÉE\",IF(OR(Tableau1[[#This Row],[Jour]]=\"sa\",Tableau1[[#This Row],[Jour]]=\"di\",AND(Tableau1[[#This Row],[Jour]]=\"ve\",MOD(Tableau1[[#This Row],[N°S]],2)=1)),\"REPOS\",IF(Tableau1[[#This Row],[Jour]]=\"ve\",8,8.75))))","v":"REPOS"}]
[null,"2020-04-19",{"$f":"_xlfn.ISOWEEKNUM(Tableau1[[#This Row],[Date]])","v":16},{"$f":"MONTH(Tableau1[[#This Row],[Date]])","v":4},{"$f":"TEXT(Tableau1[[#This Row],[Date]],\"mmmm\")","v":"avril"},{"$f":"CHOOSE(WEEKDAY(Tableau1[[#This Row],[Date]],2),\"lu\",\"ma\",\"me\",\"je\",\"ve\",\"sa\",\"di\")","v":"di"},{"$f":"IFERROR(VLOOKUP(B206,Tableau30[],3,FALSE),IF(OR(AND($K$5<=B206,$L$5>B206),AND($K$6<=Tableau1[[#This Row],[Date]],$L$6>=Tableau1[[#This Row],[Date]])),\"FERMÉE\",IF(OR(Tableau1[[#This Row],[Jour]]=\"sa\",Tableau1[[#This Row],[Jour]]=\"di\",AND(Tableau1[[#This Row],[Jour]]=\"ve\",MOD(Tableau1[[#This Row],[N°S]],2)=1)),\"REPOS\",IF(Tableau1[[#This Row],[Jour]]=\"ve\",8,8.75))))","v":"REPOS"}]
[null,"2020-04-20",{"$f":"_xlfn.ISOWEEKNUM(Tableau1[[#This Row],[Date]])","v":17},{"$f":"MONTH(Tableau1[[#This Row],[Date]])","v":4},{"$f":"TEXT(Tableau1[[#This Row],[Date]],\"mmmm\")","v":"avril"},{"$f":"CHOOSE(WEEKDAY(Tableau1[[#This Row],[Date]],2),\"lu\",\"ma\",\"me\",\"je\",\"ve\",\"sa\",\"di\")","v":"lu"},{"$f":"IFERROR(VLOOKUP(B207,Tableau30[],3,FALSE),IF(OR(AND($K$5<=B207,$L$5>B207),AND($K$6<=Tableau1[[#This Row],[Date]],$L$6>=Tableau1[[#This Row],[Date]])),\"FERMÉE\",IF(OR(Tableau1[[#This Row],[Jour]]=\"sa\",Tableau1[[#This Row],[Jour]]=\"di\",AND(Tableau1[[#This Row],[Jour]]=\"ve\",MOD(Tableau1[[#This Row],[N°S]],2)=1)),\"REPOS\",IF(Tableau1[[#This Row],[Jour]]=\"ve\",8,8.75))))","v":8.75}]
[null,"2020-04-21",{"$f":"_xlfn.ISOWEEKNUM(Tableau1[[#This Row],[Date]])","v":17},{"$f":"MONTH(Tableau1[[#This Row],[Date]])","v":4},{"$f":"TEXT(Tableau1[[#This Row],[Date]],\"mmmm\")","v":"avril"},{"$f":"CHOOSE(WEEKDAY(Tableau1[[#This Row],[Date]],2),\"lu\",\"ma\",\"me\",\"je\",\"ve\",\"sa\",\"di\")","v":"ma"},{"$f":"IFERROR(VLOOKUP(B208,Tableau30[],3,FALSE),IF(OR(AND($K$5<=B208,$L$5>B208),AND($K$6<=Tableau1[[#This Row],[Date]],$L$6>=Tableau1[[#This Row],[Date]])),\"FERMÉE\",IF(OR(Tableau1[[#This Row],[Jour]]=\"sa\",Tableau1[[#This Row],[Jour]]=\"di\",AND(Tableau1[[#This Row],[Jour]]=\"ve\",MOD(Tableau1[[#This Row],[N°S]],2)=1)),\"REPOS\",IF(Tableau1[[#This Row],[Jour]]=\"ve\",8,8.75))))","v":8.75}]
[null,"2020-04-22",{"$f":"_xlfn.ISOWEEKNUM(Tableau1[[#This Row],[Date]])","v":17},{"$f":"MONTH(Tableau1[[#This Row],[Date]])","v":4},{"$f":"TEXT(Tableau1[[#This Row],[Date]],\"mmmm\")","v":"avril"},{"$f":"CHOOSE(WEEKDAY(Tableau1[[#This Row],[Date]],2),\"lu\",\"ma\",\"me\",\"je\",\"ve\",\"sa\",\"di\")","v":"me"},{"$f":"IFERROR(VLOOKUP(B209,Tableau30[],3,FALSE),IF(OR(AND($K$5<=B209,$L$5>B209),AND($K$6<=Tableau1[[#This Row],[Date]],$L$6>=Tableau1[[#This Row],[Date]])),\"FERMÉE\",IF(OR(Tableau1[[#This Row],[Jour]]=\"sa\",Tableau1[[#This Row],[Jour]]=\"di\",AND(Tableau1[[#This Row],[Jour]]=\"ve\",MOD(Tableau1[[#This Row],[N°S]],2)=1)),\"REPOS\",IF(Tableau1[[#This Row],[Jour]]=\"ve\",8,8.75))))","v":8.75}]
[null,"2020-04-23",{"$f":"_xlfn.ISOWEEKNUM(Tableau1[[#This Row],[Date]])","v":17},{"$f":"MONTH(Tableau1[[#This Row],[Date]])","v":4},{"$f":"TEXT(Tableau1[[#This Row],[Date]],\"mmmm\")","v":"avril"},{"$f":"CHOOSE(WEEKDAY(Tableau1[[#This Row],[Date]],2),\"lu\",\"ma\",\"me\",\"je\",\"ve\",\"sa\",\"di\")","v":"je"},{"$f":"IFERROR(VLOOKUP(B210,Tableau30[],3,FALSE),IF(OR(AND($K$5<=B210,$L$5>B210),AND($K$6<=Tableau1[[#This Row],[Date]],$L$6>=Tableau1[[#This Row],[Date]])),\"FERMÉE\",IF(OR(Tableau1[[#This Row],[Jour]]=\"sa\",Tableau1[[#This Row],[Jour]]=\"di\",AND(Tableau1[[#This Row],[Jour]]=\"ve\",MOD(Tableau1[[#This Row],[N°S]],2)=1)),\"REPOS\",IF(Tableau1[[#This Row],[Jour]]=\"ve\",8,8.75))))","v":8.75}]
[null,"2020-04-24",{"$f":"_xlfn.ISOWEEKNUM(Tableau1[[#This Row],[Date]])","v":17},{"$f":"MONTH(Tableau1[[#This Row],[Date]])","v":4},{"$f":"TEXT(Tableau1[[#This Row],[Date]],\"mmmm\")","v":"avril"},{"$f":"CHOOSE(WEEKDAY(Tableau1[[#This Row],[Date]],2),\"lu\",\"ma\",\"me\",\"je\",\"ve\",\"sa\",\"di\")","v":"ve"},{"$f":"IFERROR(VLOOKUP(B211,Tableau30[],3,FALSE),IF(OR(AND($K$5<=B211,$L$5>B211),AND($K$6<=Tableau1[[#This Row],[Date]],$L$6>=Tableau1[[#This Row],[Date]])),\"FERMÉE\",IF(OR(Tableau1[[#This Row],[Jour]]=\"sa\",Tableau1[[#This Row],[Jour]]=\"di\",AND(Tableau1[[#This Row],[Jour]]=\"ve\",MOD(Tableau1[[#This Row],[N°S]],2)=1)),\"REPOS\",IF(Tableau1[[#This Row],[Jour]]=\"ve\",8,8.75))))","v":"REPOS"}]
[null,"2020-04-25",{"$f":"_xlfn.ISOWEEKNUM(Tableau1[[#This Row],[Date]])","v":17},{"$f":"MONTH(Tableau1[[#This Row],[Date]])","v":4},{"$f":"TEXT(Tableau1[[#This Row],[Date]],\"mmmm\")","v":"avril"},{"$f":"CHOOSE(WEEKDAY(Tableau1[[#This Row],[Date]],2),\"lu\",\"ma\",\"me\",\"je\",\"ve\",\"sa\",\"di\")","v":"sa"},{"$f":"IFERROR(VLOOKUP(B212,Tableau30[],3,FALSE),IF(OR(AND($K$5<=B212,$L$5>B212),AND($K$6<=Tableau1[[#This Row],[Date]],$L$6>=Tableau1[[#This Row],[Date]])),\"FERMÉE\",IF(OR(Tableau1[[#This Row],[Jour]]=\"sa\",Tableau1[[#This Row],[Jour]]=\"di\",AND(Tableau1[[#This Row],[Jour]]=\"ve\",MOD(Tableau1[[#This Row],[N°S]],2)=1)),\"REPOS\",IF(Tableau1[[#This Row],[Jour]]=\"ve\",8,8.75))))","v":"REPOS"}]
[null,"2020-04-26",{"$f":"_xlfn.ISOWEEKNUM(Tableau1[[#This Row],[Date]])","v":17},{"$f":"MONTH(Tableau1[[#This Row],[Date]])","v":4},{"$f":"TEXT(Tableau1[[#This Row],[Date]],\"mmmm\")","v":"avril"},{"$f":"CHOOSE(WEEKDAY(Tableau1[[#This Row],[Date]],2),\"lu\",\"ma\",\"me\",\"je\",\"ve\",\"sa\",\"di\")","v":"di"},{"$f":"IFERROR(VLOOKUP(B213,Tableau30[],3,FALSE),IF(OR(AND($K$5<=B213,$L$5>B213),AND($K$6<=Tableau1[[#This Row],[Date]],$L$6>=Tableau1[[#This Row],[Date]])),\"FERMÉE\",IF(OR(Tableau1[[#This Row],[Jour]]=\"sa\",Tableau1[[#This Row],[Jour]]=\"di\",AND(Tableau1[[#This Row],[Jour]]=\"ve\",MOD(Tableau1[[#This Row],[N°S]],2)=1)),\"REPOS\",IF(Tableau1[[#This Row],[Jour]]=\"ve\",8,8.75))))","v":"REPOS"}]
[null,"2020-04-27",{"$f":"_xlfn.ISOWEEKNUM(Tableau1[[#This Row],[Date]])","v":18},{"$f":"MONTH(Tableau1[[#This Row],[Date]])","v":4},{"$f":"TEXT(Tableau1[[#This Row],[Date]],\"mmmm\")","v":"avril"},{"$f":"CHOOSE(WEEKDAY(Tableau1[[#This Row],[Date]],2),\"lu\",\"ma\",\"me\",\"je\",\"ve\",\"sa\",\"di\")","v":"lu"},{"$f":"IFERROR(VLOOKUP(B214,Tableau30[],3,FALSE),IF(OR(AND($K$5<=B214,$L$5>B214),AND($K$6<=Tableau1[[#This Row],[Date]],$L$6>=Tableau1[[#This Row],[Date]])),\"FERMÉE\",IF(OR(Tableau1[[#This Row],[Jour]]=\"sa\",Tableau1[[#This Row],[Jour]]=\"di\",AND(Tableau1[[#This Row],[Jour]]=\"ve\",MOD(Tableau1[[#This Row],[N°S]],2)=1)),\"REPOS\",IF(Tableau1[[#This Row],[Jour]]=\"ve\",8,8.75))))","v":8.75}]
[null,"2020-04-28",{"$f":"_xlfn.ISOWEEKNUM(Tableau1[[#This Row],[Date]])","v":18},{"$f":"MONTH(Tableau1[[#This Row],[Date]])","v":4},{"$f":"TEXT(Tableau1[[#This Row],[Date]],\"mmmm\")","v":"avril"},{"$f":"CHOOSE(WEEKDAY(Tableau1[[#This Row],[Date]],2),\"lu\",\"ma\",\"me\",\"je\",\"ve\",\"sa\",\"di\")","v":"ma"},{"$f":"IFERROR(VLOOKUP(B215,Tableau30[],3,FALSE),IF(OR(AND($K$5<=B215,$L$5>B215),AND($K$6<=Tableau1[[#This Row],[Date]],$L$6>=Tableau1[[#This Row],[Date]])),\"FERMÉE\",IF(OR(Tableau1[[#This Row],[Jour]]=\"sa\",Tableau1[[#This Row],[Jour]]=\"di\",AND(Tableau1[[#This Row],[Jour]]=\"ve\",MOD(Tableau1[[#This Row],[N°S]],2)=1)),\"REPOS\",IF(Tableau1[[#This Row],[Jour]]=\"ve\",8,8.75))))","v":8.75}]
[null,"2020-04-29",{"$f":"_xlfn.ISOWEEKNUM(Tableau1[[#This Row],[Date]])","v":18},{"$f":"MONTH(Tableau1[[#This Row],[Date]])","v":4},{"$f":"TEXT(Tableau1[[#This Row],[Date]],\"mmmm\")","v":"avril"},{"$f":"CHOOSE(WEEKDAY(Tableau1[[#This Row],[Date]],2),\"lu\",\"ma\",\"me\",\"je\",\"ve\",\"sa\",\"di\")","v":"me"},{"$f":"IFERROR(VLOOKUP(B216,Tableau30[],3,FALSE),IF(OR(AND($K$5<=B216,$L$5>B216),AND($K$6<=Tableau1[[#This Row],[Date]],$L$6>=Tableau1[[#This Row],[Date]])),\"FERMÉE\",IF(OR(Tableau1[[#This Row],[Jour]]=\"sa\",Tableau1[[#This Row],[Jour]]=\"di\",AND(Tableau1[[#This Row],[Jour]]=\"ve\",MOD(Tableau1[[#This Row],[N°S]],2)=1)),\"REPOS\",IF(Tableau1[[#This Row],[Jour]]=\"ve\",8,8.75))))","v":8.75}]
[null,"2020-04-30",{"$f":"_xlfn.ISOWEEKNUM(Tableau1[[#This Row],[Date]])","v":18},{"$f":"MONTH(Tableau1[[#This Row],[Date]])","v":4},{"$f":"TEXT(Tableau1[[#This Row],[Date]],\"mmmm\")","v":"avril"},{"$f":"CHOOSE(WEEKDAY(Tableau1[[#This Row],[Date]],2),\"lu\",\"ma\",\"me\",\"je\",\"ve\",\"sa\",\"di\")","v":"je"},{"$f":"IFERROR(VLOOKUP(B217,Tableau30[],3,FALSE),IF(OR(AND($K$5<=B217,$L$5>B217),AND($K$6<=Tableau1[[#This Row],[Date]],$L$6>=Tableau1[[#This Row],[Date]])),\"FERMÉE\",IF(OR(Tableau1[[#This Row],[Jour]]=\"sa\",Tableau1[[#This Row],[Jour]]=\"di\",AND(Tableau1[[#This Row],[Jour]]=\"ve\",MOD(Tableau1[[#This Row],[N°S]],2)=1)),\"REPOS\",IF(Tableau1[[#This Row],[Jour]]=\"ve\",8,8.75))))","v":8.75}]
[null,"2020-05-01",{"$f":"_xlfn.ISOWEEKNUM(Tableau1[[#This Row],[Date]])","v":18},{"$f":"MONTH(Tableau1[[#This Row],[Date]])","v":5},{"$f":"TEXT(Tableau1[[#This Row],[Date]],\"mmmm\")","v":"mai"},{"$f":"CHOOSE(WEEKDAY(Tableau1[[#This Row],[Date]],2),\"lu\",\"ma\",\"me\",\"je\",\"ve\",\"sa\",\"di\")","v":"ve"},{"$f":"IFERROR(VLOOKUP(B218,Tableau30[],3,FALSE),IF(OR(AND($K$5<=B218,$L$5>B218),AND($K$6<=Tableau1[[#This Row],[Date]],$L$6>=Tableau1[[#This Row],[Date]])),\"FERMÉE\",IF(OR(Tableau1[[#This Row],[Jour]]=\"sa\",Tableau1[[#This Row],[Jour]]=\"di\",AND(Tableau1[[#This Row],[Jour]]=\"ve\",MOD(Tableau1[[#This Row],[N°S]],2)=1)),\"REPOS\",IF(Tableau1[[#This Row],[Jour]]=\"ve\",8,8.75))))","v":"FÉRIÉ/INACTIF"}]
[null,"2020-05-02",{"$f":"_xlfn.ISOWEEKNUM(Tableau1[[#This Row],[Date]])","v":18},{"$f":"MONTH(Tableau1[[#This Row],[Date]])","v":5},{"$f":"TEXT(Tableau1[[#This Row],[Date]],\"mmmm\")","v":"mai"},{"$f":"CHOOSE(WEEKDAY(Tableau1[[#This Row],[Date]],2),\"lu\",\"ma\",\"me\",\"je\",\"ve\",\"sa\",\"di\")","v":"sa"},{"$f":"IFERROR(VLOOKUP(B219,Tableau30[],3,FALSE),IF(OR(AND($K$5<=B219,$L$5>B219),AND($K$6<=Tableau1[[#This Row],[Date]],$L$6>=Tableau1[[#This Row],[Date]])),\"FERMÉE\",IF(OR(Tableau1[[#This Row],[Jour]]=\"sa\",Tableau1[[#This Row],[Jour]]=\"di\",AND(Tableau1[[#This Row],[Jour]]=\"ve\",MOD(Tableau1[[#This Row],[N°S]],2)=1)),\"REPOS\",IF(Tableau1[[#This Row],[Jour]]=\"ve\",8,8.75))))","v":"REPOS"}]
[null,"2020-05-03",{"$f":"_xlfn.ISOWEEKNUM(Tableau1[[#This Row],[Date]])","v":18},{"$f":"MONTH(Tableau1[[#This Row],[Date]])","v":5},{"$f":"TEXT(Tableau1[[#This Row],[Date]],\"mmmm\")","v":"mai"},{"$f":"CHOOSE(WEEKDAY(Tableau1[[#This Row],[Date]],2),\"lu\",\"ma\",\"me\",\"je\",\"ve\",\"sa\",\"di\")","v":"di"},{"$f":"IFERROR(VLOOKUP(B220,Tableau30[],3,FALSE),IF(OR(AND($K$5<=B220,$L$5>B220),AND($K$6<=Tableau1[[#This Row],[Date]],$L$6>=Tableau1[[#This Row],[Date]])),\"FERMÉE\",IF(OR(Tableau1[[#This Row],[Jour]]=\"sa\",Tableau1[[#This Row],[Jour]]=\"di\",AND(Tableau1[[#This Row],[Jour]]=\"ve\",MOD(Tableau1[[#This Row],[N°S]],2)=1)),\"REPOS\",IF(Tableau1[[#This Row],[Jour]]=\"ve\",8,8.75))))","v":"REPOS"}]
[null,"2020-05-04",{"$f":"_xlfn.ISOWEEKNUM(Tableau1[[#This Row],[Date]])","v":19},{"$f":"MONTH(Tableau1[[#This Row],[Date]])","v":5},{"$f":"TEXT(Tableau1[[#This Row],[Date]],\"mmmm\")","v":"mai"},{"$f":"CHOOSE(WEEKDAY(Tableau1[[#This Row],[Date]],2),\"lu\",\"ma\",\"me\",\"je\",\"ve\",\"sa\",\"di\")","v":"lu"},{"$f":"IFERROR(VLOOKUP(B221,Tableau30[],3,FALSE),IF(OR(AND($K$5<=B221,$L$5>B221),AND($K$6<=Tableau1[[#This Row],[Date]],$L$6>=Tableau1[[#This Row],[Date]])),\"FERMÉE\",IF(OR(Tableau1[[#This Row],[Jour]]=\"sa\",Tableau1[[#This Row],[Jour]]=\"di\",AND(Tableau1[[#This Row],[Jour]]=\"ve\",MOD(Tableau1[[#This Row],[N°S]],2)=1)),\"REPOS\",IF(Tableau1[[#This Row],[Jour]]=\"ve\",8,8.75))))","v":8.75}]
[null,"2020-05-05",{"$f":"_xlfn.ISOWEEKNUM(Tableau1[[#This Row],[Date]])","v":19},{"$f":"MONTH(Tableau1[[#This Row],[Date]])","v":5},{"$f":"TEXT(Tableau1[[#This Row],[Date]],\"mmmm\")","v":"mai"},{"$f":"CHOOSE(WEEKDAY(Tableau1[[#This Row],[Date]],2),\"lu\",\"ma\",\"me\",\"je\",\"ve\",\"sa\",\"di\")","v":"ma"},{"$f":"IFERROR(VLOOKUP(B222,Tableau30[],3,FALSE),IF(OR(AND($K$5<=B222,$L$5>B222),AND($K$6<=Tableau1[[#This Row],[Date]],$L$6>=Tableau1[[#This Row],[Date]])),\"FERMÉE\",IF(OR(Tableau1[[#This Row],[Jour]]=\"sa\",Tableau1[[#This Row],[Jour]]=\"di\",AND(Tableau1[[#This Row],[Jour]]=\"ve\",MOD(Tableau1[[#This Row],[N°S]],2)=1)),\"REPOS\",IF(Tableau1[[#This Row],[Jour]]=\"ve\",8,8.75))))","v":8.75}]
[null,"2020-05-06",{"$f":"_xlfn.ISOWEEKNUM(Tableau1[[#This Row],[Date]])","v":19},{"$f":"MONTH(Tableau1[[#This Row],[Date]])","v":5},{"$f":"TEXT(Tableau1[[#This Row],[Date]],\"mmmm\")","v":"mai"},{"$f":"CHOOSE(WEEKDAY(Tableau1[[#This Row],[Date]],2),\"lu\",\"ma\",\"me\",\"je\",\"ve\",\"sa\",\"di\")","v":"me"},{"$f":"IFERROR(VLOOKUP(B223,Tableau30[],3,FALSE),IF(OR(AND($K$5<=B223,$L$5>B223),AND($K$6<=Tableau1[[#This Row],[Date]],$L$6>=Tableau1[[#This Row],[Date]])),\"FERMÉE\",IF(OR(Tableau1[[#This Row],[Jour]]=\"sa\",Tableau1[[#This Row],[Jour]]=\"di\",AND(Tableau1[[#This Row],[Jour]]=\"ve\",MOD(Tableau1[[#This Row],[N°S]],2)=1)),\"REPOS\",IF(Tableau1[[#This Row],[Jour]]=\"ve\",8,8.75))))","v":8.75}]
[null,"2020-05-07",{"$f":"_xlfn.ISOWEEKNUM(Tableau1[[#This Row],[Date]])","v":19},{"$f":"MONTH(Tableau1[[#This Row],[Date]])","v":5},{"$f":"TEXT(Tableau1[[#This Row],[Date]],\"mmmm\")","v":"mai"},{"$f":"CHOOSE(WEEKDAY(Tableau1[[#This Row],[Date]],2),\"lu\",\"ma\",\"me\",\"je\",\"ve\",\"sa\",\"di\")","v":"je"},{"$f":"IFERROR(VLOOKUP(B224,Tableau30[],3,FALSE),IF(OR(AND($K$5<=B224,$L$5>B224),AND($K$6<=Tableau1[[#This Row],[Date]],$L$6>=Tableau1[[#This Row],[Date]])),\"FERMÉE\",IF(OR(Tableau1[[#This Row],[Jour]]=\"sa\",Tableau1[[#This Row],[Jour]]=\"di\",AND(Tableau1[[#This Row],[Jour]]=\"ve\",MOD(Tableau1[[#This Row],[N°S]],2)=1)),\"REPOS\",IF(Tableau1[[#This Row],[Jour]]=\"ve\",8,8.75))))","v":8.75}]
[null,"2020-05-08",{"$f":"_xlfn.ISOWEEKNUM(Tableau1[[#This Row],[Date]])","v":19},{"$f":"MONTH(Tableau1[[#This Row],[Date]])","v":5},{"$f":"TEXT(Tableau1[[#This Row],[Date]],\"mmmm\")","v":"mai"},{"$f":"CHOOSE(WEEKDAY(Tableau1[[#This Row],[Date]],2),\"lu\",\"ma\",\"me\",\"je\",\"ve\",\"sa\",\"di\")","v":"ve"},{"$f":"IFERROR(VLOOKUP(B225,Tableau30[],3,FALSE),IF(OR(AND($K$5<=B225,$L$5>B225),AND($K$6<=Tableau1[[#This Row],[Date]],$L$6>=Tableau1[[#This Row],[Date]])),\"FERMÉE\",IF(OR(Tableau1[[#This Row],[Jour]]=\"sa\",Tableau1[[#This Row],[Jour]]=\"di\",AND(Tableau1[[#This Row],[Jour]]=\"ve\",MOD(Tableau1[[#This Row],[N°S]],2)=1)),\"REPOS\",IF(Tableau1[[#This Row],[Jour]]=\"ve\",8,8.75))))","v":"REPOS"}]
[null,"2020-05-09",{"$f":"_xlfn.ISOWEEKNUM(Tableau1[[#This Row],[Date]])","v":19},{"$f":"MONTH(Tableau1[[#This Row],[Date]])","v":5},{"$f":"TEXT(Tableau1[[#This Row],[Date]],\"mmmm\")","v":"mai"},{"$f":"CHOOSE(WEEKDAY(Tableau1[[#This Row],[Date]],2),\"lu\",\"ma\",\"me\",\"je\",\"ve\",\"sa\",\"di\")","v":"sa"},{"$f":"IFERROR(VLOOKUP(B226,Tableau30[],3,FALSE),IF(OR(AND($K$5<=B226,$L$5>B226),AND($K$6<=Tableau1[[#This Row],[Date]],$L$6>=Tableau1[[#This Row],[Date]])),\"FERMÉE\",IF(OR(Tableau1[[#This Row],[Jour]]=\"sa\",Tableau1[[#This Row],[Jour]]=\"di\",AND(Tableau1[[#This Row],[Jour]]=\"ve\",MOD(Tableau1[[#This Row],[N°S]],2)=1)),\"REPOS\",IF(Tableau1[[#This Row],[Jour]]=\"ve\",8,8.75))))","v":"REPOS"}]
[null,"2020-05-10",{"$f":"_xlfn.ISOWEEKNUM(Tableau1[[#This Row],[Date]])","v":19},{"$f":"MONTH(Tableau1[[#This Row],[Date]])","v":5},{"$f":"TEXT(Tableau1[[#This Row],[Date]],\"mmmm\")","v":"mai"},{"$f":"CHOOSE(WEEKDAY(Tableau1[[#This Row],[Date]],2),\"lu\",\"ma\",\"me\",\"je\",\"ve\",\"sa\",\"di\")","v":"di"},{"$f":"IFERROR(VLOOKUP(B227,Tableau30[],3,FALSE),IF(OR(AND($K$5<=B227,$L$5>B227),AND($K$6<=Tableau1[[#This Row],[Date]],$L$6>=Tableau1[[#This Row],[Date]])),\"FERMÉE\",IF(OR(Tableau1[[#This Row],[Jour]]=\"sa\",Tableau1[[#This Row],[Jour]]=\"di\",AND(Tableau1[[#This Row],[Jour]]=\"ve\",MOD(Tableau1[[#This Row],[N°S]],2)=1)),\"REPOS\",IF(Tableau1[[#This Row],[Jour]]=\"ve\",8,8.75))))","v":"REPOS"}]
[null,"2020-05-11",{"$f":"_xlfn.ISOWEEKNUM(Tableau1[[#This Row],[Date]])","v":20},{"$f":"MONTH(Tableau1[[#This Row],[Date]])","v":5},{"$f":"TEXT(Tableau1[[#This Row],[Date]],\"mmmm\")","v":"mai"},{"$f":"CHOOSE(WEEKDAY(Tableau1[[#This Row],[Date]],2),\"lu\",\"ma\",\"me\",\"je\",\"ve\",\"sa\",\"di\")","v":"lu"},{"$f":"IFERROR(VLOOKUP(B228,Tableau30[],3,FALSE),IF(OR(AND($K$5<=B228,$L$5>B228),AND($K$6<=Tableau1[[#This Row],[Date]],$L$6>=Tableau1[[#This Row],[Date]])),\"FERMÉE\",IF(OR(Tableau1[[#This Row],[Jour]]=\"sa\",Tableau1[[#This Row],[Jour]]=\"di\",AND(Tableau1[[#This Row],[Jour]]=\"ve\",MOD(Tableau1[[#This Row],[N°S]],2)=1)),\"REPOS\",IF(Tableau1[[#This Row],[Jour]]=\"ve\",8,8.75))))","v":8.75}]
[null,"2020-05-12",{"$f":"_xlfn.ISOWEEKNUM(Tableau1[[#This Row],[Date]])","v":20},{"$f":"MONTH(Tableau1[[#This Row],[Date]])","v":5},{"$f":"TEXT(Tableau1[[#This Row],[Date]],\"mmmm\")","v":"mai"},{"$f":"CHOOSE(WEEKDAY(Tableau1[[#This Row],[Date]],2),\"lu\",\"ma\",\"me\",\"je\",\"ve\",\"sa\",\"di\")","v":"ma"},{"$f":"IFERROR(VLOOKUP(B229,Tableau30[],3,FALSE),IF(OR(AND($K$5<=B229,$L$5>B229),AND($K$6<=Tableau1[[#This Row],[Date]],$L$6>=Tableau1[[#This Row],[Date]])),\"FERMÉE\",IF(OR(Tableau1[[#This Row],[Jour]]=\"sa\",Tableau1[[#This Row],[Jour]]=\"di\",AND(Tableau1[[#This Row],[Jour]]=\"ve\",MOD(Tableau1[[#This Row],[N°S]],2)=1)),\"REPOS\",IF(Tableau1[[#This Row],[Jour]]=\"ve\",8,8.75))))","v":8.75}]
[null,"2020-05-13",{"$f":"_xlfn.ISOWEEKNUM(Tableau1[[#This Row],[Date]])","v":20},{"$f":"MONTH(Tableau1[[#This Row],[Date]])","v":5},{"$f":"TEXT(Tableau1[[#This Row],[Date]],\"mmmm\")","v":"mai"},{"$f":"CHOOSE(WEEKDAY(Tableau1[[#This Row],[Date]],2),\"lu\",\"ma\",\"me\",\"je\",\"ve\",\"sa\",\"di\")","v":"me"},{"$f":"IFERROR(VLOOKUP(B230,Tableau30[],3,FALSE),IF(OR(AND($K$5<=B230,$L$5>B230),AND($K$6<=Tableau1[[#This Row],[Date]],$L$6>=Tableau1[[#This Row],[Date]])),\"FERMÉE\",IF(OR(Tableau1[[#This Row],[Jour]]=\"sa\",Tableau1[[#This Row],[Jour]]=\"di\",AND(Tableau1[[#This Row],[Jour]]=\"ve\",MOD(Tableau1[[#This Row],[N°S]],2)=1)),\"REPOS\",IF(Tableau1[[#This Row],[Jour]]=\"ve\",8,8.75))))","v":8.75}]
[null,"2020-05-14",{"$f":"_xlfn.ISOWEEKNUM(Tableau1[[#This Row],[Date]])","v":20},{"$f":"MONTH(Tableau1[[#This Row],[Date]])","v":5},{"$f":"TEXT(Tableau1[[#This Row],[Date]],\"mmmm\")","v":"mai"},{"$f":"CHOOSE(WEEKDAY(Tableau1[[#This Row],[Date]],2),\"lu\",\"ma\",\"me\",\"je\",\"ve\",\"sa\",\"di\")","v":"je"},{"$f":"IFERROR(VLOOKUP(B231,Tableau30[],3,FALSE),IF(OR(AND($K$5<=B231,$L$5>B231),AND($K$6<=Tableau1[[#This Row],[Date]],$L$6>=Tableau1[[#This Row],[Date]])),\"FERMÉE\",IF(OR(Tableau1[[#This Row],[Jour]]=\"sa\",Tableau1[[#This Row],[Jour]]=\"di\",AND(Tableau1[[#This Row],[Jour]]=\"ve\",MOD(Tableau1[[#This Row],[N°S]],2)=1)),\"REPOS\",IF(Tableau1[[#This Row],[Jour]]=\"ve\",8,8.75))))","v":8.75}]
[null,"2020-05-15",{"$f":"_xlfn.ISOWEEKNUM(Tableau1[[#This Row],[Date]])","v":20},{"$f":"MONTH(Tableau1[[#This Row],[Date]])","v":5},{"$f":"TEXT(Tableau1[[#This Row],[Date]],\"mmmm\")","v":"mai"},{"$f":"CHOOSE(WEEKDAY(Tableau1[[#This Row],[Date]],2),\"lu\",\"ma\",\"me\",\"je\",\"ve\",\"sa\",\"di\")","v":"ve"},{"$f":"IFERROR(VLOOKUP(B232,Tableau30[],3,FALSE),IF(OR(AND($K$5<=B232,$L$5>B232),AND($K$6<=Tableau1[[#This Row],[Date]],$L$6>=Tableau1[[#This Row],[Date]])),\"FERMÉE\",IF(OR(Tableau1[[#This Row],[Jour]]=\"sa\",Tableau1[[#This Row],[Jour]]=\"di\",AND(Tableau1[[#This Row],[Jour]]=\"ve\",MOD(Tableau1[[#This Row],[N°S]],2)=1)),\"REPOS\",IF(Tableau1[[#This Row],[Jour]]=\"ve\",8,8.75))))","v":8}]
[null,"2020-05-16",{"$f":"_xlfn.ISOWEEKNUM(Tableau1[[#This Row],[Date]])","v":20},{"$f":"MONTH(Tableau1[[#This Row],[Date]])","v":5},{"$f":"TEXT(Tableau1[[#This Row],[Date]],\"mmmm\")","v":"mai"},{"$f":"CHOOSE(WEEKDAY(Tableau1[[#This Row],[Date]],2),\"lu\",\"ma\",\"me\",\"je\",\"ve\",\"sa\",\"di\")","v":"sa"},{"$f":"IFERROR(VLOOKUP(B233,Tableau30[],3,FALSE),IF(OR(AND($K$5<=B233,$L$5>B233),AND($K$6<=Tableau1[[#This Row],[Date]],$L$6>=Tableau1[[#This Row],[Date]])),\"FERMÉE\",IF(OR(Tableau1[[#This Row],[Jour]]=\"sa\",Tableau1[[#This Row],[Jour]]=\"di\",AND(Tableau1[[#This Row],[Jour]]=\"ve\",MOD(Tableau1[[#This Row],[N°S]],2)=1)),\"REPOS\",IF(Tableau1[[#This Row],[Jour]]=\"ve\",8,8.75))))","v":"REPOS"}]
[null,"2020-05-17",{"$f":"_xlfn.ISOWEEKNUM(Tableau1[[#This Row],[Date]])","v":20},{"$f":"MONTH(Tableau1[[#This Row],[Date]])","v":5},{"$f":"TEXT(Tableau1[[#This Row],[Date]],\"mmmm\")","v":"mai"},{"$f":"CHOOSE(WEEKDAY(Tableau1[[#This Row],[Date]],2),\"lu\",\"ma\",\"me\",\"je\",\"ve\",\"sa\",\"di\")","v":"di"},{"$f":"IFERROR(VLOOKUP(B234,Tableau30[],3,FALSE),IF(OR(AND($K$5<=B234,$L$5>B234),AND($K$6<=Tableau1[[#This Row],[Date]],$L$6>=Tableau1[[#This Row],[Date]])),\"FERMÉE\",IF(OR(Tableau1[[#This Row],[Jour]]=\"sa\",Tableau1[[#This Row],[Jour]]=\"di\",AND(Tableau1[[#This Row],[Jour]]=\"ve\",MOD(Tableau1[[#This Row],[N°S]],2)=1)),\"REPOS\",IF(Tableau1[[#This Row],[Jour]]=\"ve\",8,8.75))))","v":"REPOS"}]
[null,"2020-05-18",{"$f":"_xlfn.ISOWEEKNUM(Tableau1[[#This Row],[Date]])","v":21},{"$f":"MONTH(Tableau1[[#This Row],[Date]])","v":5},{"$f":"TEXT(Tableau1[[#This Row],[Date]],\"mmmm\")","v":"mai"},{"$f":"CHOOSE(WEEKDAY(Tableau1[[#This Row],[Date]],2),\"lu\",\"ma\",\"me\",\"je\",\"ve\",\"sa\",\"di\")","v":"lu"},{"$f":"IFERROR(VLOOKUP(B235,Tableau30[],3,FALSE),IF(OR(AND($K$5<=B235,$L$5>B235),AND($K$6<=Tableau1[[#This Row],[Date]],$L$6>=Tableau1[[#This Row],[Date]])),\"FERMÉE\",IF(OR(Tableau1[[#This Row],[Jour]]=\"sa\",Tableau1[[#This Row],[Jour]]=\"di\",AND(Tableau1[[#This Row],[Jour]]=\"ve\",MOD(Tableau1[[#This Row],[N°S]],2)=1)),\"REPOS\",IF(Tableau1[[#This Row],[Jour]]=\"ve\",8,8.75))))","v":8.75}]
[null,"2020-05-19",{"$f":"_xlfn.ISOWEEKNUM(Tableau1[[#This Row],[Date]])","v":21},{"$f":"MONTH(Tableau1[[#This Row],[Date]])","v":5},{"$f":"TEXT(Tableau1[[#This Row],[Date]],\"mmmm\")","v":"mai"},{"$f":"CHOOSE(WEEKDAY(Tableau1[[#This Row],[Date]],2),\"lu\",\"ma\",\"me\",\"je\",\"ve\",\"sa\",\"di\")","v":"ma"},{"$f":"IFERROR(VLOOKUP(B236,Tableau30[],3,FALSE),IF(OR(AND($K$5<=B236,$L$5>B236),AND($K$6<=Tableau1[[#This Row],[Date]],$L$6>=Tableau1[[#This Row],[Date]])),\"FERMÉE\",IF(OR(Tableau1[[#This Row],[Jour]]=\"sa\",Tableau1[[#This Row],[Jour]]=\"di\",AND(Tableau1[[#This Row],[Jour]]=\"ve\",MOD(Tableau1[[#This Row],[N°S]],2)=1)),\"REPOS\",IF(Tableau1[[#This Row],[Jour]]=\"ve\",8,8.75))))","v":8.75}]
[null,"2020-05-20",{"$f":"_xlfn.ISOWEEKNUM(Tableau1[[#This Row],[Date]])","v":21},{"$f":"MONTH(Tableau1[[#This Row],[Date]])","v":5},{"$f":"TEXT(Tableau1[[#This Row],[Date]],\"mmmm\")","v":"mai"},{"$f":"CHOOSE(WEEKDAY(Tableau1[[#This Row],[Date]],2),\"lu\",\"ma\",\"me\",\"je\",\"ve\",\"sa\",\"di\")","v":"me"},{"$f":"IFERROR(VLOOKUP(B237,Tableau30[],3,FALSE),IF(OR(AND($K$5<=B237,$L$5>B237),AND($K$6<=Tableau1[[#This Row],[Date]],$L$6>=Tableau1[[#This Row],[Date]])),\"FERMÉE\",IF(OR(Tableau1[[#This Row],[Jour]]=\"sa\",Tableau1[[#This Row],[Jour]]=\"di\",AND(Tableau1[[#This Row],[Jour]]=\"ve\",MOD(Tableau1[[#This Row],[N°S]],2)=1)),\"REPOS\",IF(Tableau1[[#This Row],[Jour]]=\"ve\",8,8.75))))","v":8.75}]
[null,"2020-05-21",{"$f":"_xlfn.ISOWEEKNUM(Tableau1[[#This Row],[Date]])","v":21},{"$f":"MONTH(Tableau1[[#This Row],[Date]])","v":5},{"$f":"TEXT(Tableau1[[#This Row],[Date]],\"mmmm\")","v":"mai"},{"$f":"CHOOSE(WEEKDAY(Tableau1[[#This Row],[Date]],2),\"lu\",\"ma\",\"me\",\"je\",\"ve\",\"sa\",\"di\")","v":"je"},{"$f":"IFERROR(VLOOKUP(B238,Tableau30[],3,FALSE),IF(OR(AND($K$5<=B238,$L$5>B238),AND($K$6<=Tableau1[[#This Row],[Date]],$L$6>=Tableau1[[#This Row],[Date]])),\"FERMÉE\",IF(OR(Tableau1[[#This Row],[Jour]]=\"sa\",Tableau1[[#This Row],[Jour]]=\"di\",AND(Tableau1[[#This Row],[Jour]]=\"ve\",MOD(Tableau1[[#This Row],[N°S]],2)=1)),\"REPOS\",IF(Tableau1[[#This Row],[Jour]]=\"ve\",8,8.75))))","v":"FÉRIÉ/INACTIF"}]
[null,"2020-05-22",{"$f":"_xlfn.ISOWEEKNUM(Tableau1[[#This Row],[Date]])","v":21},{"$f":"MONTH(Tableau1[[#This Row],[Date]])","v":5},{"$f":"TEXT(Tableau1[[#This Row],[Date]],\"mmmm\")","v":"mai"},{"$f":"CHOOSE(WEEKDAY(Tableau1[[#This Row],[Date]],2),\"lu\",\"ma\",\"me\",\"je\",\"ve\",\"sa\",\"di\")","v":"ve"},{"$f":"IFERROR(VLOOKUP(B239,Tableau30[],3,FALSE),IF(OR(AND($K$5<=B239,$L$5>B239),AND($K$6<=Tableau1[[#This Row],[Date]],$L$6>=Tableau1[[#This Row],[Date]])),\"FERMÉE\",IF(OR(Tableau1[[#This Row],[Jour]]=\"sa\",Tableau1[[#This Row],[Jour]]=\"di\",AND(Tableau1[[#This Row],[Jour]]=\"ve\",MOD(Tableau1[[#This Row],[N°S]],2)=1)),\"REPOS\",IF(Tableau1[[#This Row],[Jour]]=\"ve\",8,8.75))))","v":"REPOS"}]
[null,"2020-05-23",{"$f":"_xlfn.ISOWEEKNUM(Tableau1[[#This Row],[Date]])","v":21},{"$f":"MONTH(Tableau1[[#This Row],[Date]])","v":5},{"$f":"TEXT(Tableau1[[#This Row],[Date]],\"mmmm\")","v":"mai"},{"$f":"CHOOSE(WEEKDAY(Tableau1[[#This Row],[Date]],2),\"lu\",\"ma\",\"me\",\"je\",\"ve\",\"sa\",\"di\")","v":"sa"},{"$f":"IFERROR(VLOOKUP(B240,Tableau30[],3,FALSE),IF(OR(AND($K$5<=B240,$L$5>B240),AND($K$6<=Tableau1[[#This Row],[Date]],$L$6>=Tableau1[[#This Row],[Date]])),\"FERMÉE\",IF(OR(Tableau1[[#This Row],[Jour]]=\"sa\",Tableau1[[#This Row],[Jour]]=\"di\",AND(Tableau1[[#This Row],[Jour]]=\"ve\",MOD(Tableau1[[#This Row],[N°S]],2)=1)),\"REPOS\",IF(Tableau1[[#This Row],[Jour]]=\"ve\",8,8.75))))","v":"REPOS"}]
[null,"2020-05-24",{"$f":"_xlfn.ISOWEEKNUM(Tableau1[[#This Row],[Date]])","v":21},{"$f":"MONTH(Tableau1[[#This Row],[Date]])","v":5},{"$f":"TEXT(Tableau1[[#This Row],[Date]],\"mmmm\")","v":"mai"},{"$f":"CHOOSE(WEEKDAY(Tableau1[[#This Row],[Date]],2),\"lu\",\"ma\",\"me\",\"je\",\"ve\",\"sa\",\"di\")","v":"di"},{"$f":"IFERROR(VLOOKUP(B241,Tableau30[],3,FALSE),IF(OR(AND($K$5<=B241,$L$5>B241),AND($K$6<=Tableau1[[#This Row],[Date]],$L$6>=Tableau1[[#This Row],[Date]])),\"FERMÉE\",IF(OR(Tableau1[[#This Row],[Jour]]=\"sa\",Tableau1[[#This Row],[Jour]]=\"di\",AND(Tableau1[[#This Row],[Jour]]=\"ve\",MOD(Tableau1[[#This Row],[N°S]],2)=1)),\"REPOS\",IF(Tableau1[[#This Row],[Jour]]=\"ve\",8,8.75))))","v":"REPOS"}]
[null,"2020-05-25",{"$f":"_xlfn.ISOWEEKNUM(Tableau1[[#This Row],[Date]])","v":22},{"$f":"MONTH(Tableau1[[#This Row],[Date]])","v":5},{"$f":"TEXT(Tableau1[[#This Row],[Date]],\"mmmm\")","v":"mai"},{"$f":"CHOOSE(WEEKDAY(Tableau1[[#This Row],[Date]],2),\"lu\",\"ma\",\"me\",\"je\",\"ve\",\"sa\",\"di\")","v":"lu"},{"$f":"IFERROR(VLOOKUP(B242,Tableau30[],3,FALSE),IF(OR(AND($K$5<=B242,$L$5>B242),AND($K$6<=Tableau1[[#This Row],[Date]],$L$6>=Tableau1[[#This Row],[Date]])),\"FERMÉE\",IF(OR(Tableau1[[#This Row],[Jour]]=\"sa\",Tableau1[[#This Row],[Jour]]=\"di\",AND(Tableau1[[#This Row],[Jour]]=\"ve\",MOD(Tableau1[[#This Row],[N°S]],2)=1)),\"REPOS\",IF(Tableau1[[#This Row],[Jour]]=\"ve\",8,8.75))))","v":8.75}]
[null,"2020-05-26",{"$f":"_xlfn.ISOWEEKNUM(Tableau1[[#This Row],[Date]])","v":22},{"$f":"MONTH(Tableau1[[#This Row],[Date]])","v":5},{"$f":"TEXT(Tableau1[[#This Row],[Date]],\"mmmm\")","v":"mai"},{"$f":"CHOOSE(WEEKDAY(Tableau1[[#This Row],[Date]],2),\"lu\",\"ma\",\"me\",\"je\",\"ve\",\"sa\",\"di\")","v":"ma"},{"$f":"IFERROR(VLOOKUP(B243,Tableau30[],3,FALSE),IF(OR(AND($K$5<=B243,$L$5>B243),AND($K$6<=Tableau1[[#This Row],[Date]],$L$6>=Tableau1[[#This Row],[Date]])),\"FERMÉE\",IF(OR(Tableau1[[#This Row],[Jour]]=\"sa\",Tableau1[[#This Row],[Jour]]=\"di\",AND(Tableau1[[#This Row],[Jour]]=\"ve\",MOD(Tableau1[[#This Row],[N°S]],2)=1)),\"REPOS\",IF(Tableau1[[#This Row],[Jour]]=\"ve\",8,8.75))))","v":8.75}]
[null,"2020-05-27",{"$f":"_xlfn.ISOWEEKNUM(Tableau1[[#This Row],[Date]])","v":22},{"$f":"MONTH(Tableau1[[#This Row],[Date]])","v":5},{"$f":"TEXT(Tableau1[[#This Row],[Date]],\"mmmm\")","v":"mai"},{"$f":"CHOOSE(WEEKDAY(Tableau1[[#This Row],[Date]],2),\"lu\",\"ma\",\"me\",\"je\",\"ve\",\"sa\",\"di\")","v":"me"},{"$f":"IFERROR(VLOOKUP(B244,Tableau30[],3,FALSE),IF(OR(AND($K$5<=B244,$L$5>B244),AND($K$6<=Tableau1[[#This Row],[Date]],$L$6>=Tableau1[[#This Row],[Date]])),\"FERMÉE\",IF(OR(Tableau1[[#This Row],[Jour]]=\"sa\",Tableau1[[#This Row],[Jour]]=\"di\",AND(Tableau1[[#This Row],[Jour]]=\"ve\",MOD(Tableau1[[#This Row],[N°S]],2)=1)),\"REPOS\",IF(Tableau1[[#This Row],[Jour]]=\"ve\",8,8.75))))","v":8.75}]
[null,"2020-05-28",{"$f":"_xlfn.ISOWEEKNUM(Tableau1[[#This Row],[Date]])","v":22},{"$f":"MONTH(Tableau1[[#This Row],[Date]])","v":5},{"$f":"TEXT(Tableau1[[#This Row],[Date]],\"mmmm\")","v":"mai"},{"$f":"CHOOSE(WEEKDAY(Tableau1[[#This Row],[Date]],2),\"lu\",\"ma\",\"me\",\"je\",\"ve\",\"sa\",\"di\")","v":"je"},{"$f":"IFERROR(VLOOKUP(B245,Tableau30[],3,FALSE),IF(OR(AND($K$5<=B245,$L$5>B245),AND($K$6<=Tableau1[[#This Row],[Date]],$L$6>=Tableau1[[#This Row],[Date]])),\"FERMÉE\",IF(OR(Tableau1[[#This Row],[Jour]]=\"sa\",Tableau1[[#This Row],[Jour]]=\"di\",AND(Tableau1[[#This Row],[Jour]]=\"ve\",MOD(Tableau1[[#This Row],[N°S]],2)=1)),\"REPOS\",IF(Tableau1[[#This Row],[Jour]]=\"ve\",8,8.75))))","v":8.75}]
[null,"2020-05-29",{"$f":"_xlfn.ISOWEEKNUM(Tableau1[[#This Row],[Date]])","v":22},{"$f":"MONTH(Tableau1[[#This Row],[Date]])","v":5},{"$f":"TEXT(Tableau1[[#This Row],[Date]],\"mmmm\")","v":"mai"},{"$f":"CHOOSE(WEEKDAY(Tableau1[[#This Row],[Date]],2),\"lu\",\"ma\",\"me\",\"je\",\"ve\",\"sa\",\"di\")","v":"ve"},{"$f":"IFERROR(VLOOKUP(B246,Tableau30[],3,FALSE),IF(OR(AND($K$5<=B246,$L$5>B246),AND($K$6<=Tableau1[[#This Row],[Date]],$L$6>=Tableau1[[#This Row],[Date]])),\"FERMÉE\",IF(OR(Tableau1[[#This Row],[Jour]]=\"sa\",Tableau1[[#This Row],[Jour]]=\"di\",AND(Tableau1[[#This Row],[Jour]]=\"ve\",MOD(Tableau1[[#This Row],[N°S]],2)=1)),\"REPOS\",IF(Tableau1[[#This Row],[Jour]]=\"ve\",8,8.75))))","v":8}]
[null,"2020-05-30",{"$f":"_xlfn.ISOWEEKNUM(Tableau1[[#This Row],[Date]])","v":22},{"$f":"MONTH(Tableau1[[#This Row],[Date]])","v":5},{"$f":"TEXT(Tableau1[[#This Row],[Date]],\"mmmm\")","v":"mai"},{"$f":"CHOOSE(WEEKDAY(Tableau1[[#This Row],[Date]],2),\"lu\",\"ma\",\"me\",\"je\",\"ve\",\"sa\",\"di\")","v":"sa"},{"$f":"IFERROR(VLOOKUP(B247,Tableau30[],3,FALSE),IF(OR(AND($K$5<=B247,$L$5>B247),AND($K$6<=Tableau1[[#This Row],[Date]],$L$6>=Tableau1[[#This Row],[Date]])),\"FERMÉE\",IF(OR(Tableau1[[#This Row],[Jour]]=\"sa\",Tableau1[[#This Row],[Jour]]=\"di\",AND(Tableau1[[#This Row],[Jour]]=\"ve\",MOD(Tableau1[[#This Row],[N°S]],2)=1)),\"REPOS\",IF(Tableau1[[#This Row],[Jour]]=\"ve\",8,8.75))))","v":"REPOS"}]
[null,"2020-05-31",{"$f":"_xlfn.ISOWEEKNUM(Tableau1[[#This Row],[Date]])","v":22},{"$f":"MONTH(Tableau1[[#This Row],[Date]])","v":5},{"$f":"TEXT(Tableau1[[#This Row],[Date]],\"mmmm\")","v":"mai"},{"$f":"CHOOSE(WEEKDAY(Tableau1[[#This Row],[Date]],2),\"lu\",\"ma\",\"me\",\"je\",\"ve\",\"sa\",\"di\")","v":"di"},{"$f":"IFERROR(VLOOKUP(B248,Tableau30[],3,FALSE),IF(OR(AND($K$5<=B248,$L$5>B248),AND($K$6<=Tableau1[[#This Row],[Date]],$L$6>=Tableau1[[#This Row],[Date]])),\"FERMÉE\",IF(OR(Tableau1[[#This Row],[Jour]]=\"sa\",Tableau1[[#This Row],[Jour]]=\"di\",AND(Tableau1[[#This Row],[Jour]]=\"ve\",MOD(Tableau1[[#This Row],[N°S]],2)=1)),\"REPOS\",IF(Tableau1[[#This Row],[Jour]]=\"ve\",8,8.75))))","v":"REPOS"}]
[null,"2020-06-01",{"$f":"_xlfn.ISOWEEKNUM(Tableau1[[#This Row],[Date]])","v":23},{"$f":"MONTH(Tableau1[[#This Row],[Date]])","v":6},{"$f":"TEXT(Tableau1[[#This Row],[Date]],\"mmmm\")","v":"juin"},{"$f":"CHOOSE(WEEKDAY(Tableau1[[#This Row],[Date]],2),\"lu\",\"ma\",\"me\",\"je\",\"ve\",\"sa\",\"di\")","v":"lu"},{"$f":"IFERROR(VLOOKUP(B249,Tableau30[],3,FALSE),IF(OR(AND($K$5<=B249,$L$5>B249),AND($K$6<=Tableau1[[#This Row],[Date]],$L$6>=Tableau1[[#This Row],[Date]])),\"FERMÉE\",IF(OR(Tableau1[[#This Row],[Jour]]=\"sa\",Tableau1[[#This Row],[Jour]]=\"di\",AND(Tableau1[[#This Row],[Jour]]=\"ve\",MOD(Tableau1[[#This Row],[N°S]],2)=1)),\"REPOS\",IF(Tableau1[[#This Row],[Jour]]=\"ve\",8,8.75))))","v":"FÉRIÉ/INACTIF"}]
[null,"2020-06-02",{"$f":"_xlfn.ISOWEEKNUM(Tableau1[[#This Row],[Date]])","v":23},{"$f":"MONTH(Tableau1[[#This Row],[Date]])","v":6},{"$f":"TEXT(Tableau1[[#This Row],[Date]],\"mmmm\")","v":"juin"},{"$f":"CHOOSE(WEEKDAY(Tableau1[[#This Row],[Date]],2),\"lu\",\"ma\",\"me\",\"je\",\"ve\",\"sa\",\"di\")","v":"ma"},{"$f":"IFERROR(VLOOKUP(B250,Tableau30[],3,FALSE),IF(OR(AND($K$5<=B250,$L$5>B250),AND($K$6<=Tableau1[[#This Row],[Date]],$L$6>=Tableau1[[#This Row],[Date]])),\"FERMÉE\",IF(OR(Tableau1[[#This Row],[Jour]]=\"sa\",Tableau1[[#This Row],[Jour]]=\"di\",AND(Tableau1[[#This Row],[Jour]]=\"ve\",MOD(Tableau1[[#This Row],[N°S]],2)=1)),\"REPOS\",IF(Tableau1[[#This Row],[Jour]]=\"ve\",8,8.75))))","v":8.75}]
[null,"2020-06-03",{"$f":"_xlfn.ISOWEEKNUM(Tableau1[[#This Row],[Date]])","v":23},{"$f":"MONTH(Tableau1[[#This Row],[Date]])","v":6},{"$f":"TEXT(Tableau1[[#This Row],[Date]],\"mmmm\")","v":"juin"},{"$f":"CHOOSE(WEEKDAY(Tableau1[[#This Row],[Date]],2),\"lu\",\"ma\",\"me\",\"je\",\"ve\",\"sa\",\"di\")","v":"me"},{"$f":"IFERROR(VLOOKUP(B251,Tableau30[],3,FALSE),IF(OR(AND($K$5<=B251,$L$5>B251),AND($K$6<=Tableau1[[#This Row],[Date]],$L$6>=Tableau1[[#This Row],[Date]])),\"FERMÉE\",IF(OR(Tableau1[[#This Row],[Jour]]=\"sa\",Tableau1[[#This Row],[Jour]]=\"di\",AND(Tableau1[[#This Row],[Jour]]=\"ve\",MOD(Tableau1[[#This Row],[N°S]],2)=1)),\"REPOS\",IF(Tableau1[[#This Row],[Jour]]=\"ve\",8,8.75))))","v":8.75}]
[null,"2020-06-04",{"$f":"_xlfn.ISOWEEKNUM(Tableau1[[#This Row],[Date]])","v":23},{"$f":"MONTH(Tableau1[[#This Row],[Date]])","v":6},{"$f":"TEXT(Tableau1[[#This Row],[Date]],\"mmmm\")","v":"juin"},{"$f":"CHOOSE(WEEKDAY(Tableau1[[#This Row],[Date]],2),\"lu\",\"ma\",\"me\",\"je\",\"ve\",\"sa\",\"di\")","v":"je"},{"$f":"IFERROR(VLOOKUP(B252,Tableau30[],3,FALSE),IF(OR(AND($K$5<=B252,$L$5>B252),AND($K$6<=Tableau1[[#This Row],[Date]],$L$6>=Tableau1[[#This Row],[Date]])),\"FERMÉE\",IF(OR(Tableau1[[#This Row],[Jour]]=\"sa\",Tableau1[[#This Row],[Jour]]=\"di\",AND(Tableau1[[#This Row],[Jour]]=\"ve\",MOD(Tableau1[[#This Row],[N°S]],2)=1)),\"REPOS\",IF(Tableau1[[#This Row],[Jour]]=\"ve\",8,8.75))))","v":8.75}]
[null,"2020-06-05",{"$f":"_xlfn.ISOWEEKNUM(Tableau1[[#This Row],[Date]])","v":23},{"$f":"MONTH(Tableau1[[#This Row],[Date]])","v":6},{"$f":"TEXT(Tableau1[[#This Row],[Date]],\"mmmm\")","v":"juin"},{"$f":"CHOOSE(WEEKDAY(Tableau1[[#This Row],[Date]],2),\"lu\",\"ma\",\"me\",\"je\",\"ve\",\"sa\",\"di\")","v":"ve"},{"$f":"IFERROR(VLOOKUP(B253,Tableau30[],3,FALSE),IF(OR(AND($K$5<=B253,$L$5>B253),AND($K$6<=Tableau1[[#This Row],[Date]],$L$6>=Tableau1[[#This Row],[Date]])),\"FERMÉE\",IF(OR(Tableau1[[#This Row],[Jour]]=\"sa\",Tableau1[[#This Row],[Jour]]=\"di\",AND(Tableau1[[#This Row],[Jour]]=\"ve\",MOD(Tableau1[[#This Row],[N°S]],2)=1)),\"REPOS\",IF(Tableau1[[#This Row],[Jour]]=\"ve\",8,8.75))))","v":"REPOS"}]
[null,"2020-06-06",{"$f":"_xlfn.ISOWEEKNUM(Tableau1[[#This Row],[Date]])","v":23},{"$f":"MONTH(Tableau1[[#This Row],[Date]])","v":6},{"$f":"TEXT(Tableau1[[#This Row],[Date]],\"mmmm\")","v":"juin"},{"$f":"CHOOSE(WEEKDAY(Tableau1[[#This Row],[Date]],2),\"lu\",\"ma\",\"me\",\"je\",\"ve\",\"sa\",\"di\")","v":"sa"},{"$f":"IFERROR(VLOOKUP(B254,Tableau30[],3,FALSE),IF(OR(AND($K$5<=B254,$L$5>B254),AND($K$6<=Tableau1[[#This Row],[Date]],$L$6>=Tableau1[[#This Row],[Date]])),\"FERMÉE\",IF(OR(Tableau1[[#This Row],[Jour]]=\"sa\",Tableau1[[#This Row],[Jour]]=\"di\",AND(Tableau1[[#This Row],[Jour]]=\"ve\",MOD(Tableau1[[#This Row],[N°S]],2)=1)),\"REPOS\",IF(Tableau1[[#This Row],[Jour]]=\"ve\",8,8.75))))","v":"REPOS"}]
[null,"2020-06-07",{"$f":"_xlfn.ISOWEEKNUM(Tableau1[[#This Row],[Date]])","v":23},{"$f":"MONTH(Tableau1[[#This Row],[Date]])","v":6},{"$f":"TEXT(Tableau1[[#This Row],[Date]],\"mmmm\")","v":"juin"},{"$f":"CHOOSE(WEEKDAY(Tableau1[[#This Row],[Date]],2),\"lu\",\"ma\",\"me\",\"je\",\"ve\",\"sa\",\"di\")","v":"di"},{"$f":"IFERROR(VLOOKUP(B255,Tableau30[],3,FALSE),IF(OR(AND($K$5<=B255,$L$5>B255),AND($K$6<=Tableau1[[#This Row],[Date]],$L$6>=Tableau1[[#This Row],[Date]])),\"FERMÉE\",IF(OR(Tableau1[[#This Row],[Jour]]=\"sa\",Tableau1[[#This Row],[Jour]]=\"di\",AND(Tableau1[[#This Row],[Jour]]=\"ve\",MOD(Tableau1[[#This Row],[N°S]],2)=1)),\"REPOS\",IF(Tableau1[[#This Row],[Jour]]=\"ve\",8,8.75))))","v":"REPOS"}]
[null,"2020-06-08",{"$f":"_xlfn.ISOWEEKNUM(Tableau1[[#This Row],[Date]])","v":24},{"$f":"MONTH(Tableau1[[#This Row],[Date]])","v":6},{"$f":"TEXT(Tableau1[[#This Row],[Date]],\"mmmm\")","v":"juin"},{"$f":"CHOOSE(WEEKDAY(Tableau1[[#This Row],[Date]],2),\"lu\",\"ma\",\"me\",\"je\",\"ve\",\"sa\",\"di\")","v":"lu"},{"$f":"IFERROR(VLOOKUP(B256,Tableau30[],3,FALSE),IF(OR(AND($K$5<=B256,$L$5>B256),AND($K$6<=Tableau1[[#This Row],[Date]],$L$6>=Tableau1[[#This Row],[Date]])),\"FERMÉE\",IF(OR(Tableau1[[#This Row],[Jour]]=\"sa\",Tableau1[[#This Row],[Jour]]=\"di\",AND(Tableau1[[#This Row],[Jour]]=\"ve\",MOD(Tableau1[[#This Row],[N°S]],2)=1)),\"REPOS\",IF(Tableau1[[#This Row],[Jour]]=\"ve\",8,8.75))))","v":8.75}]
[null,"2020-06-09",{"$f":"_xlfn.ISOWEEKNUM(Tableau1[[#This Row],[Date]])","v":24},{"$f":"MONTH(Tableau1[[#This Row],[Date]])","v":6},{"$f":"TEXT(Tableau1[[#This Row],[Date]],\"mmmm\")","v":"juin"},{"$f":"CHOOSE(WEEKDAY(Tableau1[[#This Row],[Date]],2),\"lu\",\"ma\",\"me\",\"je\",\"ve\",\"sa\",\"di\")","v":"ma"},{"$f":"IFERROR(VLOOKUP(B257,Tableau30[],3,FALSE),IF(OR(AND($K$5<=B257,$L$5>B257),AND($K$6<=Tableau1[[#This Row],[Date]],$L$6>=Tableau1[[#This Row],[Date]])),\"FERMÉE\",IF(OR(Tableau1[[#This Row],[Jour]]=\"sa\",Tableau1[[#This Row],[Jour]]=\"di\",AND(Tableau1[[#This Row],[Jour]]=\"ve\",MOD(Tableau1[[#This Row],[N°S]],2)=1)),\"REPOS\",IF(Tableau1[[#This Row],[Jour]]=\"ve\",8,8.75))))","v":8.75}]
[null,"2020-06-10",{"$f":"_xlfn.ISOWEEKNUM(Tableau1[[#This Row],[Date]])","v":24},{"$f":"MONTH(Tableau1[[#This Row],[Date]])","v":6},{"$f":"TEXT(Tableau1[[#This Row],[Date]],\"mmmm\")","v":"juin"},{"$f":"CHOOSE(WEEKDAY(Tableau1[[#This Row],[Date]],2),\"lu\",\"ma\",\"me\",\"je\",\"ve\",\"sa\",\"di\")","v":"me"},{"$f":"IFERROR(VLOOKUP(B258,Tableau30[],3,FALSE),IF(OR(AND($K$5<=B258,$L$5>B258),AND($K$6<=Tableau1[[#This Row],[Date]],$L$6>=Tableau1[[#This Row],[Date]])),\"FERMÉE\",IF(OR(Tableau1[[#This Row],[Jour]]=\"sa\",Tableau1[[#This Row],[Jour]]=\"di\",AND(Tableau1[[#This Row],[Jour]]=\"ve\",MOD(Tableau1[[#This Row],[N°S]],2)=1)),\"REPOS\",IF(Tableau1[[#This Row],[Jour]]=\"ve\",8,8.75))))","v":8.75}]
[null,"2020-06-11",{"$f":"_xlfn.ISOWEEKNUM(Tableau1[[#This Row],[Date]])","v":24},{"$f":"MONTH(Tableau1[[#This Row],[Date]])","v":6},{"$f":"TEXT(Tableau1[[#This Row],[Date]],\"mmmm\")","v":"juin"},{"$f":"CHOOSE(WEEKDAY(Tableau1[[#This Row],[Date]],2),\"lu\",\"ma\",\"me\",\"je\",\"ve\",\"sa\",\"di\")","v":"je"},{"$f":"IFERROR(VLOOKUP(B259,Tableau30[],3,FALSE),IF(OR(AND($K$5<=B259,$L$5>B259),AND($K$6<=Tableau1[[#This Row],[Date]],$L$6>=Tableau1[[#This Row],[Date]])),\"FERMÉE\",IF(OR(Tableau1[[#This Row],[Jour]]=\"sa\",Tableau1[[#This Row],[Jour]]=\"di\",AND(Tableau1[[#This Row],[Jour]]=\"ve\",MOD(Tableau1[[#This Row],[N°S]],2)=1)),\"REPOS\",IF(Tableau1[[#This Row],[Jour]]=\"ve\",8,8.75))))","v":8.75}]
[null,"2020-06-12",{"$f":"_xlfn.ISOWEEKNUM(Tableau1[[#This Row],[Date]])","v":24},{"$f":"MONTH(Tableau1[[#This Row],[Date]])","v":6},{"$f":"TEXT(Tableau1[[#This Row],[Date]],\"mmmm\")","v":"juin"},{"$f":"CHOOSE(WEEKDAY(Tableau1[[#This Row],[Date]],2),\"lu\",\"ma\",\"me\",\"je\",\"ve\",\"sa\",\"di\")","v":"ve"},{"$f":"IFERROR(VLOOKUP(B260,Tableau30[],3,FALSE),IF(OR(AND($K$5<=B260,$L$5>B260),AND($K$6<=Tableau1[[#This Row],[Date]],$L$6>=Tableau1[[#This Row],[Date]])),\"FERMÉE\",IF(OR(Tableau1[[#This Row],[Jour]]=\"sa\",Tableau1[[#This Row],[Jour]]=\"di\",AND(Tableau1[[#This Row],[Jour]]=\"ve\",MOD(Tableau1[[#This Row],[N°S]],2)=1)),\"REPOS\",IF(Tableau1[[#This Row],[Jour]]=\"ve\",8,8.75))))","v":8}]
[null,"2020-06-13",{"$f":"_xlfn.ISOWEEKNUM(Tableau1[[#This Row],[Date]])","v":24},{"$f":"MONTH(Tableau1[[#This Row],[Date]])","v":6},{"$f":"TEXT(Tableau1[[#This Row],[Date]],\"mmmm\")","v":"juin"},{"$f":"CHOOSE(WEEKDAY(Tableau1[[#This Row],[Date]],2),\"lu\",\"ma\",\"me\",\"je\",\"ve\",\"sa\",\"di\")","v":"sa"},{"$f":"IFERROR(VLOOKUP(B261,Tableau30[],3,FALSE),IF(OR(AND($K$5<=B261,$L$5>B261),AND($K$6<=Tableau1[[#This Row],[Date]],$L$6>=Tableau1[[#This Row],[Date]])),\"FERMÉE\",IF(OR(Tableau1[[#This Row],[Jour]]=\"sa\",Tableau1[[#This Row],[Jour]]=\"di\",AND(Tableau1[[#This Row],[Jour]]=\"ve\",MOD(Tableau1[[#This Row],[N°S]],2)=1)),\"REPOS\",IF(Tableau1[[#This Row],[Jour]]=\"ve\",8,8.75))))","v":"REPOS"}]
[null,"2020-06-14",{"$f":"_xlfn.ISOWEEKNUM(Tableau1[[#This Row],[Date]])","v":24},{"$f":"MONTH(Tableau1[[#This Row],[Date]])","v":6},{"$f":"TEXT(Tableau1[[#This Row],[Date]],\"mmmm\")","v":"juin"},{"$f":"CHOOSE(WEEKDAY(Tableau1[[#This Row],[Date]],2),\"lu\",\"ma\",\"me\",\"je\",\"ve\",\"sa\",\"di\")","v":"di"},{"$f":"IFERROR(VLOOKUP(B262,Tableau30[],3,FALSE),IF(OR(AND($K$5<=B262,$L$5>B262),AND($K$6<=Tableau1[[#This Row],[Date]],$L$6>=Tableau1[[#This Row],[Date]])),\"FERMÉE\",IF(OR(Tableau1[[#This Row],[Jour]]=\"sa\",Tableau1[[#This Row],[Jour]]=\"di\",AND(Tableau1[[#This Row],[Jour]]=\"ve\",MOD(Tableau1[[#This Row],[N°S]],2)=1)),\"REPOS\",IF(Tableau1[[#This Row],[Jour]]=\"ve\",8,8.75))))","v":"REPOS"}]
[null,{"$f":"B262+1","v":"2020-06-15"},{"$f":"_xlfn.ISOWEEKNUM(Tableau1[[#This Row],[Date]])","v":25},{"$f":"MONTH(Tableau1[[#This Row],[Date]])","v":6},{"$f":"TEXT(Tableau1[[#This Row],[Date]],\"mmmm\")","v":"juin"},{"$f":"CHOOSE(WEEKDAY(Tableau1[[#This Row],[Date]],2),\"lu\",\"ma\",\"me\",\"je\",\"ve\",\"sa\",\"di\")","v":"lu"},{"$f":"IFERROR(VLOOKUP(B263,Tableau30[],3,FALSE),IF(OR(AND($K$5<=B263,$L$5>B263),AND($K$6<=Tableau1[[#This Row],[Date]],$L$6>=Tableau1[[#This Row],[Date]])),\"FERMÉE\",IF(OR(Tableau1[[#This Row],[Jour]]=\"sa\",Tableau1[[#This Row],[Jour]]=\"di\",AND(Tableau1[[#This Row],[Jour]]=\"ve\",MOD(Tableau1[[#This Row],[N°S]],2)=1)),\"REPOS\",IF(Tableau1[[#This Row],[Jour]]=\"ve\",8,8.75))))","v":8.75}]
[null,"2020-06-16",{"$f":"_xlfn.ISOWEEKNUM(Tableau1[[#This Row],[Date]])","v":25},{"$f":"MONTH(Tableau1[[#This Row],[Date]])","v":6},{"$f":"TEXT(Tableau1[[#This Row],[Date]],\"mmmm\")","v":"juin"},{"$f":"CHOOSE(WEEKDAY(Tableau1[[#This Row],[Date]],2),\"lu\",\"ma\",\"me\",\"je\",\"ve\",\"sa\",\"di\")","v":"ma"},{"$f":"IFERROR(VLOOKUP(B264,Tableau30[],3,FALSE),IF(OR(AND($K$5<=B264,$L$5>B264),AND($K$6<=Tableau1[[#This Row],[Date]],$L$6>=Tableau1[[#This Row],[Date]])),\"FERMÉE\",IF(OR(Tableau1[[#This Row],[Jour]]=\"sa\",Tableau1[[#This Row],[Jour]]=\"di\",AND(Tableau1[[#This Row],[Jour]]=\"ve\",MOD(Tableau1[[#This Row],[N°S]],2)=1)),\"REPOS\",IF(Tableau1[[#This Row],[Jour]]=\"ve\",8,8.75))))","v":8.75}]
[null,"2020-06-17",{"$f":"_xlfn.ISOWEEKNUM(Tableau1[[#This Row],[Date]])","v":25},{"$f":"MONTH(Tableau1[[#This Row],[Date]])","v":6},{"$f":"TEXT(Tableau1[[#This Row],[Date]],\"mmmm\")","v":"juin"},{"$f":"CHOOSE(WEEKDAY(Tableau1[[#This Row],[Date]],2),\"lu\",\"ma\",\"me\",\"je\",\"ve\",\"sa\",\"di\")","v":"me"},{"$f":"IFERROR(VLOOKUP(B265,Tableau30[],3,FALSE),IF(OR(AND($K$5<=B265,$L$5>B265),AND($K$6<=Tableau1[[#This Row],[Date]],$L$6>=Tableau1[[#This Row],[Date]])),\"FERMÉE\",IF(OR(Tableau1[[#This Row],[Jour]]=\"sa\",Tableau1[[#This Row],[Jour]]=\"di\",AND(Tableau1[[#This Row],[Jour]]=\"ve\",MOD(Tableau1[[#This Row],[N°S]],2)=1)),\"REPOS\",IF(Tableau1[[#This Row],[Jour]]=\"ve\",8,8.75))))","v":8.75}]
[null,"2020-06-18",{"$f":"_xlfn.ISOWEEKNUM(Tableau1[[#This Row],[Date]])","v":25},{"$f":"MONTH(Tableau1[[#This Row],[Date]])","v":6},{"$f":"TEXT(Tableau1[[#This Row],[Date]],\"mmmm\")","v":"juin"},{"$f":"CHOOSE(WEEKDAY(Tableau1[[#This Row],[Date]],2),\"lu\",\"ma\",\"me\",\"je\",\"ve\",\"sa\",\"di\")","v":"je"},{"$f":"IFERROR(VLOOKUP(B266,Tableau30[],3,FALSE),IF(OR(AND($K$5<=B266,$L$5>B266),AND($K$6<=Tableau1[[#This Row],[Date]],$L$6>=Tableau1[[#This Row],[Date]])),\"FERMÉE\",IF(OR(Tableau1[[#This Row],[Jour]]=\"sa\",Tableau1[[#This Row],[Jour]]=\"di\",AND(Tableau1[[#This Row],[Jour]]=\"ve\",MOD(Tableau1[[#This Row],[N°S]],2)=1)),\"REPOS\",IF(Tableau1[[#This Row],[Jour]]=\"ve\",8,8.75))))","v":8.75}]
[null,"2020-06-19",{"$f":"_xlfn.ISOWEEKNUM(Tableau1[[#This Row],[Date]])","v":25},{"$f":"MONTH(Tableau1[[#This Row],[Date]])","v":6},{"$f":"TEXT(Tableau1[[#This Row],[Date]],\"mmmm\")","v":"juin"},{"$f":"CHOOSE(WEEKDAY(Tableau1[[#This Row],[Date]],2),\"lu\",\"ma\",\"me\",\"je\",\"ve\",\"sa\",\"di\")","v":"ve"},{"$f":"IFERROR(VLOOKUP(B267,Tableau30[],3,FALSE),IF(OR(AND($K$5<=B267,$L$5>B267),AND($K$6<=Tableau1[[#This Row],[Date]],$L$6>=Tableau1[[#This Row],[Date]])),\"FERMÉE\",IF(OR(Tableau1[[#This Row],[Jour]]=\"sa\",Tableau1[[#This Row],[Jour]]=\"di\",AND(Tableau1[[#This Row],[Jour]]=\"ve\",MOD(Tableau1[[#This Row],[N°S]],2)=1)),\"REPOS\",IF(Tableau1[[#This Row],[Jour]]=\"ve\",8,8.75))))","v":"REPOS"}]
[null,"2020-06-20",{"$f":"_xlfn.ISOWEEKNUM(Tableau1[[#This Row],[Date]])","v":25},{"$f":"MONTH(Tableau1[[#This Row],[Date]])","v":6},{"$f":"TEXT(Tableau1[[#This Row],[Date]],\"mmmm\")","v":"juin"},{"$f":"CHOOSE(WEEKDAY(Tableau1[[#This Row],[Date]],2),\"lu\",\"ma\",\"me\",\"je\",\"ve\",\"sa\",\"di\")","v":"sa"},{"$f":"IFERROR(VLOOKUP(B268,Tableau30[],3,FALSE),IF(OR(AND($K$5<=B268,$L$5>B268),AND($K$6<=Tableau1[[#This Row],[Date]],$L$6>=Tableau1[[#This Row],[Date]])),\"FERMÉE\",IF(OR(Tableau1[[#This Row],[Jour]]=\"sa\",Tableau1[[#This Row],[Jour]]=\"di\",AND(Tableau1[[#This Row],[Jour]]=\"ve\",MOD(Tableau1[[#This Row],[N°S]],2)=1)),\"REPOS\",IF(Tableau1[[#This Row],[Jour]]=\"ve\",8,8.75))))","v":"REPOS"}]
[null,"2020-06-21",{"$f":"_xlfn.ISOWEEKNUM(Tableau1[[#This Row],[Date]])","v":25},{"$f":"MONTH(Tableau1[[#This Row],[Date]])","v":6},{"$f":"TEXT(Tableau1[[#This Row],[Date]],\"mmmm\")","v":"juin"},{"$f":"CHOOSE(WEEKDAY(Tableau1[[#This Row],[Date]],2),\"lu\",\"ma\",\"me\",\"je\",\"ve\",\"sa\",\"di\")","v":"di"},{"$f":"IFERROR(VLOOKUP(B269,Tableau30[],3,FALSE),IF(OR(AND($K$5<=B269,$L$5>B269),AND($K$6<=Tableau1[[#This Row],[Date]],$L$6>=Tableau1[[#This Row],[Date]])),\"FERMÉE\",IF(OR(Tableau1[[#This Row],[Jour]]=\"sa\",Tableau1[[#This Row],[Jour]]=\"di\",AND(Tableau1[[#This Row],[Jour]]=\"ve\",MOD(Tableau1[[#This Row],[N°S]],2)=1)),\"REPOS\",IF(Tableau1[[#This Row],[Jour]]=\"ve\",8,8.75))))","v":"REPOS"}]
[null,"2020-06-22",{"$f":"_xlfn.ISOWEEKNUM(Tableau1[[#This Row],[Date]])","v":26},{"$f":"MONTH(Tableau1[[#This Row],[Date]])","v":6},{"$f":"TEXT(Tableau1[[#This Row],[Date]],\"mmmm\")","v":"juin"},{"$f":"CHOOSE(WEEKDAY(Tableau1[[#This Row],[Date]],2),\"lu\",\"ma\",\"me\",\"je\",\"ve\",\"sa\",\"di\")","v":"lu"},{"$f":"IFERROR(VLOOKUP(B270,Tableau30[],3,FALSE),IF(OR(AND($K$5<=B270,$L$5>B270),AND($K$6<=Tableau1[[#This Row],[Date]],$L$6>=Tableau1[[#This Row],[Date]])),\"FERMÉE\",IF(OR(Tableau1[[#This Row],[Jour]]=\"sa\",Tableau1[[#This Row],[Jour]]=\"di\",AND(Tableau1[[#This Row],[Jour]]=\"ve\",MOD(Tableau1[[#This Row],[N°S]],2)=1)),\"REPOS\",IF(Tableau1[[#This Row],[Jour]]=\"ve\",8,8.75))))","v":8.75}]
[null,"2020-06-23",{"$f":"_xlfn.ISOWEEKNUM(Tableau1[[#This Row],[Date]])","v":26},{"$f":"MONTH(Tableau1[[#This Row],[Date]])","v":6},{"$f":"TEXT(Tableau1[[#This Row],[Date]],\"mmmm\")","v":"juin"},{"$f":"CHOOSE(WEEKDAY(Tableau1[[#This Row],[Date]],2),\"lu\",\"ma\",\"me\",\"je\",\"ve\",\"sa\",\"di\")","v":"ma"},{"$f":"IFERROR(VLOOKUP(B271,Tableau30[],3,FALSE),IF(OR(AND($K$5<=B271,$L$5>B271),AND($K$6<=Tableau1[[#This Row],[Date]],$L$6>=Tableau1[[#This Row],[Date]])),\"FERMÉE\",IF(OR(Tableau1[[#This Row],[Jour]]=\"sa\",Tableau1[[#This Row],[Jour]]=\"di\",AND(Tableau1[[#This Row],[Jour]]=\"ve\",MOD(Tableau1[[#This Row],[N°S]],2)=1)),\"REPOS\",IF(Tableau1[[#This Row],[Jour]]=\"ve\",8,8.75))))","v":8.75}]
[null,"2020-06-24",{"$f":"_xlfn.ISOWEEKNUM(Tableau1[[#This Row],[Date]])","v":26},{"$f":"MONTH(Tableau1[[#This Row],[Date]])","v":6},{"$f":"TEXT(Tableau1[[#This Row],[Date]],\"mmmm\")","v":"juin"},{"$f":"CHOOSE(WEEKDAY(Tableau1[[#This Row],[Date]],2),\"lu\",\"ma\",\"me\",\"je\",\"ve\",\"sa\",\"di\")","v":"me"},{"$f":"IFERROR(VLOOKUP(B272,Tableau30[],3,FALSE),IF(OR(AND($K$5<=B272,$L$5>B272),AND($K$6<=Tableau1[[#This Row],[Date]],$L$6>=Tableau1[[#This Row],[Date]])),\"FERMÉE\",IF(OR(Tableau1[[#This Row],[Jour]]=\"sa\",Tableau1[[#This Row],[Jour]]=\"di\",AND(Tableau1[[#This Row],[Jour]]=\"ve\",MOD(Tableau1[[#This Row],[N°S]],2)=1)),\"REPOS\",IF(Tableau1[[#This Row],[Jour]]=\"ve\",8,8.75))))","v":8.75}]
[null,"2020-06-25",{"$f":"_xlfn.ISOWEEKNUM(Tableau1[[#This Row],[Date]])","v":26},{"$f":"MONTH(Tableau1[[#This Row],[Date]])","v":6},{"$f":"TEXT(Tableau1[[#This Row],[Date]],\"mmmm\")","v":"juin"},{"$f":"CHOOSE(WEEKDAY(Tableau1[[#This Row],[Date]],2),\"lu\",\"ma\",\"me\",\"je\",\"ve\",\"sa\",\"di\")","v":"je"},{"$f":"IFERROR(VLOOKUP(B273,Tableau30[],3,FALSE),IF(OR(AND($K$5<=B273,$L$5>B273),AND($K$6<=Tableau1[[#This Row],[Date]],$L$6>=Tableau1[[#This Row],[Date]])),\"FERMÉE\",IF(OR(Tableau1[[#This Row],[Jour]]=\"sa\",Tableau1[[#This Row],[Jour]]=\"di\",AND(Tableau1[[#This Row],[Jour]]=\"ve\",MOD(Tableau1[[#This Row],[N°S]],2)=1)),\"REPOS\",IF(Tableau1[[#This Row],[Jour]]=\"ve\",8,8.75))))","v":8.75}]
[null,"2020-06-26",{"$f":"_xlfn.ISOWEEKNUM(Tableau1[[#This Row],[Date]])","v":26},{"$f":"MONTH(Tableau1[[#This Row],[Date]])","v":6},{"$f":"TEXT(Tableau1[[#This Row],[Date]],\"mmmm\")","v":"juin"},{"$f":"CHOOSE(WEEKDAY(Tableau1[[#This Row],[Date]],2),\"lu\",\"ma\",\"me\",\"je\",\"ve\",\"sa\",\"di\")","v":"ve"},{"$f":"IFERROR(VLOOKUP(B274,Tableau30[],3,FALSE),IF(OR(AND($K$5<=B274,$L$5>B274),AND($K$6<=Tableau1[[#This Row],[Date]],$L$6>=Tableau1[[#This Row],[Date]])),\"FERMÉE\",IF(OR(Tableau1[[#This Row],[Jour]]=\"sa\",Tableau1[[#This Row],[Jour]]=\"di\",AND(Tableau1[[#This Row],[Jour]]=\"ve\",MOD(Tableau1[[#This Row],[N°S]],2)=1)),\"REPOS\",IF(Tableau1[[#This Row],[Jour]]=\"ve\",8,8.75))))","v":8}]
[null,"2020-06-27",{"$f":"_xlfn.ISOWEEKNUM(Tableau1[[#This Row],[Date]])","v":26},{"$f":"MONTH(Tableau1[[#This Row],[Date]])","v":6},{"$f":"TEXT(Tableau1[[#This Row],[Date]],\"mmmm\")","v":"juin"},{"$f":"CHOOSE(WEEKDAY(Tableau1[[#This Row],[Date]],2),\"lu\",\"ma\",\"me\",\"je\",\"ve\",\"sa\",\"di\")","v":"sa"},{"$f":"IFERROR(VLOOKUP(B275,Tableau30[],3,FALSE),IF(OR(AND($K$5<=B275,$L$5>B275),AND($K$6<=Tableau1[[#This Row],[Date]],$L$6>=Tableau1[[#This Row],[Date]])),\"FERMÉE\",IF(OR(Tableau1[[#This Row],[Jour]]=\"sa\",Tableau1[[#This Row],[Jour]]=\"di\",AND(Tableau1[[#This Row],[Jour]]=\"ve\",MOD(Tableau1[[#This Row],[N°S]],2)=1)),\"REPOS\",IF(Tableau1[[#This Row],[Jour]]=\"ve\",8,8.75))))","v":"REPOS"}]
[null,"2020-06-28",{"$f":"_xlfn.ISOWEEKNUM(Tableau1[[#This Row],[Date]])","v":26},{"$f":"MONTH(Tableau1[[#This Row],[Date]])","v":6},{"$f":"TEXT(Tableau1[[#This Row],[Date]],\"mmmm\")","v":"juin"},{"$f":"CHOOSE(WEEKDAY(Tableau1[[#This Row],[Date]],2),\"lu\",\"ma\",\"me\",\"je\",\"ve\",\"sa\",\"di\")","v":"di"},{"$f":"IFERROR(VLOOKUP(B276,Tableau30[],3,FALSE),IF(OR(AND($K$5<=B276,$L$5>B276),AND($K$6<=Tableau1[[#This Row],[Date]],$L$6>=Tableau1[[#This Row],[Date]])),\"FERMÉE\",IF(OR(Tableau1[[#This Row],[Jour]]=\"sa\",Tableau1[[#This Row],[Jour]]=\"di\",AND(Tableau1[[#This Row],[Jour]]=\"ve\",MOD(Tableau1[[#This Row],[N°S]],2)=1)),\"REPOS\",IF(Tableau1[[#This Row],[Jour]]=\"ve\",8,8.75))))","v":"REPOS"}]
[null,"2020-06-29",{"$f":"_xlfn.ISOWEEKNUM(Tableau1[[#This Row],[Date]])","v":27},{"$f":"MONTH(Tableau1[[#This Row],[Date]])","v":6},{"$f":"TEXT(Tableau1[[#This Row],[Date]],\"mmmm\")","v":"juin"},{"$f":"CHOOSE(WEEKDAY(Tableau1[[#This Row],[Date]],2),\"lu\",\"ma\",\"me\",\"je\",\"ve\",\"sa\",\"di\")","v":"lu"},{"$f":"IFERROR(VLOOKUP(B277,Tableau30[],3,FALSE),IF(OR(AND($K$5<=B277,$L$5>B277),AND($K$6<=Tableau1[[#This Row],[Date]],$L$6>=Tableau1[[#This Row],[Date]])),\"FERMÉE\",IF(OR(Tableau1[[#This Row],[Jour]]=\"sa\",Tableau1[[#This Row],[Jour]]=\"di\",AND(Tableau1[[#This Row],[Jour]]=\"ve\",MOD(Tableau1[[#This Row],[N°S]],2)=1)),\"REPOS\",IF(Tableau1[[#This Row],[Jour]]=\"ve\",8,8.75))))","v":8.75}]
[null,"2020-06-30",{"$f":"_xlfn.ISOWEEKNUM(Tableau1[[#This Row],[Date]])","v":27},{"$f":"MONTH(Tableau1[[#This Row],[Date]])","v":6},{"$f":"TEXT(Tableau1[[#This Row],[Date]],\"mmmm\")","v":"juin"},{"$f":"CHOOSE(WEEKDAY(Tableau1[[#This Row],[Date]],2),\"lu\",\"ma\",\"me\",\"je\",\"ve\",\"sa\",\"di\")","v":"ma"},{"$f":"IFERROR(VLOOKUP(B278,Tableau30[],3,FALSE),IF(OR(AND($K$5<=B278,$L$5>B278),AND($K$6<=Tableau1[[#This Row],[Date]],$L$6>=Tableau1[[#This Row],[Date]])),\"FERMÉE\",IF(OR(Tableau1[[#This Row],[Jour]]=\"sa\",Tableau1[[#This Row],[Jour]]=\"di\",AND(Tableau1[[#This Row],[Jour]]=\"ve\",MOD(Tableau1[[#This Row],[N°S]],2)=1)),\"REPOS\",IF(Tableau1[[#This Row],[Jour]]=\"ve\",8,8.75))))","v":8.75}]
[null,"2020-07-01",{"$f":"_xlfn.ISOWEEKNUM(Tableau1[[#This Row],[Date]])","v":27},{"$f":"MONTH(Tableau1[[#This Row],[Date]])","v":7},{"$f":"TEXT(Tableau1[[#This Row],[Date]],\"mmmm\")","v":"juillet"},{"$f":"CHOOSE(WEEKDAY(Tableau1[[#This Row],[Date]],2),\"lu\",\"ma\",\"me\",\"je\",\"ve\",\"sa\",\"di\")","v":"me"},{"$f":"IFERROR(VLOOKUP(B279,Tableau30[],3,FALSE),IF(OR(AND($K$5<=B279,$L$5>B279),AND($K$6<=Tableau1[[#This Row],[Date]],$L$6>=Tableau1[[#This Row],[Date]])),\"FERMÉE\",IF(OR(Tableau1[[#This Row],[Jour]]=\"sa\",Tableau1[[#This Row],[Jour]]=\"di\",AND(Tableau1[[#This Row],[Jour]]=\"ve\",MOD(Tableau1[[#This Row],[N°S]],2)=1)),\"REPOS\",IF(Tableau1[[#This Row],[Jour]]=\"ve\",8,8.75))))","v":8.75}]
[null,"2020-07-02",{"$f":"_xlfn.ISOWEEKNUM(Tableau1[[#This Row],[Date]])","v":27},{"$f":"MONTH(Tableau1[[#This Row],[Date]])","v":7},{"$f":"TEXT(Tableau1[[#This Row],[Date]],\"mmmm\")","v":"juillet"},{"$f":"CHOOSE(WEEKDAY(Tableau1[[#This Row],[Date]],2),\"lu\",\"ma\",\"me\",\"je\",\"ve\",\"sa\",\"di\")","v":"je"},{"$f":"IFERROR(VLOOKUP(B280,Tableau30[],3,FALSE),IF(OR(AND($K$5<=B280,$L$5>B280),AND($K$6<=Tableau1[[#This Row],[Date]],$L$6>=Tableau1[[#This Row],[Date]])),\"FERMÉE\",IF(OR(Tableau1[[#This Row],[Jour]]=\"sa\",Tableau1[[#This Row],[Jour]]=\"di\",AND(Tableau1[[#This Row],[Jour]]=\"ve\",MOD(Tableau1[[#This Row],[N°S]],2)=1)),\"REPOS\",IF(Tableau1[[#This Row],[Jour]]=\"ve\",8,8.75))))","v":8.75}]
[null,"2020-07-03",{"$f":"_xlfn.ISOWEEKNUM(Tableau1[[#This Row],[Date]])","v":27},{"$f":"MONTH(Tableau1[[#This Row],[Date]])","v":7},{"$f":"TEXT(Tableau1[[#This Row],[Date]],\"mmmm\")","v":"juillet"},{"$f":"CHOOSE(WEEKDAY(Tableau1[[#This Row],[Date]],2),\"lu\",\"ma\",\"me\",\"je\",\"ve\",\"sa\",\"di\")","v":"ve"},{"$f":"IFERROR(VLOOKUP(B281,Tableau30[],3,FALSE),IF(OR(AND($K$5<=B281,$L$5>B281),AND($K$6<=Tableau1[[#This Row],[Date]],$L$6>=Tableau1[[#This Row],[Date]])),\"FERMÉE\",IF(OR(Tableau1[[#This Row],[Jour]]=\"sa\",Tableau1[[#This Row],[Jour]]=\"di\",AND(Tableau1[[#This Row],[Jour]]=\"ve\",MOD(Tableau1[[#This Row],[N°S]],2)=1)),\"REPOS\",IF(Tableau1[[#This Row],[Jour]]=\"ve\",8,8.75))))","v":"REPOS"}]
[null,"2020-07-04",{"$f":"_xlfn.ISOWEEKNUM(Tableau1[[#This Row],[Date]])","v":27},{"$f":"MONTH(Tableau1[[#This Row],[Date]])","v":7},{"$f":"TEXT(Tableau1[[#This Row],[Date]],\"mmmm\")","v":"juillet"},{"$f":"CHOOSE(WEEKDAY(Tableau1[[#This Row],[Date]],2),\"lu\",\"ma\",\"me\",\"je\",\"ve\",\"sa\",\"di\")","v":"sa"},{"$f":"IFERROR(VLOOKUP(B282,Tableau30[],3,FALSE),IF(OR(AND($K$5<=B282,$L$5>B282),AND($K$6<=Tableau1[[#This Row],[Date]],$L$6>=Tableau1[[#This Row],[Date]])),\"FERMÉE\",IF(OR(Tableau1[[#This Row],[Jour]]=\"sa\",Tableau1[[#This Row],[Jour]]=\"di\",AND(Tableau1[[#This Row],[Jour]]=\"ve\",MOD(Tableau1[[#This Row],[N°S]],2)=1)),\"REPOS\",IF(Tableau1[[#This Row],[Jour]]=\"ve\",8,8.75))))","v":"REPOS"}]
[null,"2020-07-05",{"$f":"_xlfn.ISOWEEKNUM(Tableau1[[#This Row],[Date]])","v":27},{"$f":"MONTH(Tableau1[[#This Row],[Date]])","v":7},{"$f":"TEXT(Tableau1[[#This Row],[Date]],\"mmmm\")","v":"juillet"},{"$f":"CHOOSE(WEEKDAY(Tableau1[[#This Row],[Date]],2),\"lu\",\"ma\",\"me\",\"je\",\"ve\",\"sa\",\"di\")","v":"di"},{"$f":"IFERROR(VLOOKUP(B283,Tableau30[],3,FALSE),IF(OR(AND($K$5<=B283,$L$5>B283),AND($K$6<=Tableau1[[#This Row],[Date]],$L$6>=Tableau1[[#This Row],[Date]])),\"FERMÉE\",IF(OR(Tableau1[[#This Row],[Jour]]=\"sa\",Tableau1[[#This Row],[Jour]]=\"di\",AND(Tableau1[[#This Row],[Jour]]=\"ve\",MOD(Tableau1[[#This Row],[N°S]],2)=1)),\"REPOS\",IF(Tableau1[[#This Row],[Jour]]=\"ve\",8,8.75))))","v":"REPOS"}]
[null,"2020-07-06",{"$f":"_xlfn.ISOWEEKNUM(Tableau1[[#This Row],[Date]])","v":28},{"$f":"MONTH(Tableau1[[#This Row],[Date]])","v":7},{"$f":"TEXT(Tableau1[[#This Row],[Date]],\"mmmm\")","v":"juillet"},{"$f":"CHOOSE(WEEKDAY(Tableau1[[#This Row],[Date]],2),\"lu\",\"ma\",\"me\",\"je\",\"ve\",\"sa\",\"di\")","v":"lu"},{"$f":"IFERROR(VLOOKUP(B284,Tableau30[],3,FALSE),IF(OR(AND($K$5<=B284,$L$5>B284),AND($K$6<=Tableau1[[#This Row],[Date]],$L$6>=Tableau1[[#This Row],[Date]])),\"FERMÉE\",IF(OR(Tableau1[[#This Row],[Jour]]=\"sa\",Tableau1[[#This Row],[Jour]]=\"di\",AND(Tableau1[[#This Row],[Jour]]=\"ve\",MOD(Tableau1[[#This Row],[N°S]],2)=1)),\"REPOS\",IF(Tableau1[[#This Row],[Jour]]=\"ve\",8,8.75))))","v":8.75}]
[null,"2020-07-07",{"$f":"_xlfn.ISOWEEKNUM(Tableau1[[#This Row],[Date]])","v":28},{"$f":"MONTH(Tableau1[[#This Row],[Date]])","v":7},{"$f":"TEXT(Tableau1[[#This Row],[Date]],\"mmmm\")","v":"juillet"},{"$f":"CHOOSE(WEEKDAY(Tableau1[[#This Row],[Date]],2),\"lu\",\"ma\",\"me\",\"je\",\"ve\",\"sa\",\"di\")","v":"ma"},{"$f":"IFERROR(VLOOKUP(B285,Tableau30[],3,FALSE),IF(OR(AND($K$5<=B285,$L$5>B285),AND($K$6<=Tableau1[[#This Row],[Date]],$L$6>=Tableau1[[#This Row],[Date]])),\"FERMÉE\",IF(OR(Tableau1[[#This Row],[Jour]]=\"sa\",Tableau1[[#This Row],[Jour]]=\"di\",AND(Tableau1[[#This Row],[Jour]]=\"ve\",MOD(Tableau1[[#This Row],[N°S]],2)=1)),\"REPOS\",IF(Tableau1[[#This Row],[Jour]]=\"ve\",8,8.75))))","v":8.75}]
[null,"2020-07-08",{"$f":"_xlfn.ISOWEEKNUM(Tableau1[[#This Row],[Date]])","v":28},{"$f":"MONTH(Tableau1[[#This Row],[Date]])","v":7},{"$f":"TEXT(Tableau1[[#This Row],[Date]],\"mmmm\")","v":"juillet"},{"$f":"CHOOSE(WEEKDAY(Tableau1[[#This Row],[Date]],2),\"lu\",\"ma\",\"me\",\"je\",\"ve\",\"sa\",\"di\")","v":"me"},{"$f":"IFERROR(VLOOKUP(B286,Tableau30[],3,FALSE),IF(OR(AND($K$5<=B286,$L$5>B286),AND($K$6<=Tableau1[[#This Row],[Date]],$L$6>=Tableau1[[#This Row],[Date]])),\"FERMÉE\",IF(OR(Tableau1[[#This Row],[Jour]]=\"sa\",Tableau1[[#This Row],[Jour]]=\"di\",AND(Tableau1[[#This Row],[Jour]]=\"ve\",MOD(Tableau1[[#This Row],[N°S]],2)=1)),\"REPOS\",IF(Tableau1[[#This Row],[Jour]]=\"ve\",8,8.75))))","v":8.75}]
[null,"2020-07-09",{"$f":"_xlfn.ISOWEEKNUM(Tableau1[[#This Row],[Date]])","v":28},{"$f":"MONTH(Tableau1[[#This Row],[Date]])","v":7},{"$f":"TEXT(Tableau1[[#This Row],[Date]],\"mmmm\")","v":"juillet"},{"$f":"CHOOSE(WEEKDAY(Tableau1[[#This Row],[Date]],2),\"lu\",\"ma\",\"me\",\"je\",\"ve\",\"sa\",\"di\")","v":"je"},{"$f":"IFERROR(VLOOKUP(B287,Tableau30[],3,FALSE),IF(OR(AND($K$5<=B287,$L$5>B287),AND($K$6<=Tableau1[[#This Row],[Date]],$L$6>=Tableau1[[#This Row],[Date]])),\"FERMÉE\",IF(OR(Tableau1[[#This Row],[Jour]]=\"sa\",Tableau1[[#This Row],[Jour]]=\"di\",AND(Tableau1[[#This Row],[Jour]]=\"ve\",MOD(Tableau1[[#This Row],[N°S]],2)=1)),\"REPOS\",IF(Tableau1[[#This Row],[Jour]]=\"ve\",8,8.75))))","v":8.75}]
[null,"2020-07-10",{"$f":"_xlfn.ISOWEEKNUM(Tableau1[[#This Row],[Date]])","v":28},{"$f":"MONTH(Tableau1[[#This Row],[Date]])","v":7},{"$f":"TEXT(Tableau1[[#This Row],[Date]],\"mmmm\")","v":"juillet"},{"$f":"CHOOSE(WEEKDAY(Tableau1[[#This Row],[Date]],2),\"lu\",\"ma\",\"me\",\"je\",\"ve\",\"sa\",\"di\")","v":"ve"},{"$f":"IFERROR(VLOOKUP(B288,Tableau30[],3,FALSE),IF(OR(AND($K$5<=B288,$L$5>B288),AND($K$6<=Tableau1[[#This Row],[Date]],$L$6>=Tableau1[[#This Row],[Date]])),\"FERMÉE\",IF(OR(Tableau1[[#This Row],[Jour]]=\"sa\",Tableau1[[#This Row],[Jour]]=\"di\",AND(Tableau1[[#This Row],[Jour]]=\"ve\",MOD(Tableau1[[#This Row],[N°S]],2)=1)),\"REPOS\",IF(Tableau1[[#This Row],[Jour]]=\"ve\",8,8.75))))","v":8}]
[null,"2020-07-11",{"$f":"_xlfn.ISOWEEKNUM(Tableau1[[#This Row],[Date]])","v":28},{"$f":"MONTH(Tableau1[[#This Row],[Date]])","v":7},{"$f":"TEXT(Tableau1[[#This Row],[Date]],\"mmmm\")","v":"juillet"},{"$f":"CHOOSE(WEEKDAY(Tableau1[[#This Row],[Date]],2),\"lu\",\"ma\",\"me\",\"je\",\"ve\",\"sa\",\"di\")","v":"sa"},{"$f":"IFERROR(VLOOKUP(B289,Tableau30[],3,FALSE),IF(OR(AND($K$5<=B289,$L$5>B289),AND($K$6<=Tableau1[[#This Row],[Date]],$L$6>=Tableau1[[#This Row],[Date]])),\"FERMÉE\",IF(OR(Tableau1[[#This Row],[Jour]]=\"sa\",Tableau1[[#This Row],[Jour]]=\"di\",AND(Tableau1[[#This Row],[Jour]]=\"ve\",MOD(Tableau1[[#This Row],[N°S]],2)=1)),\"REPOS\",IF(Tableau1[[#This Row],[Jour]]=\"ve\",8,8.75))))","v":"REPOS"}]
[null,"2020-07-12",{"$f":"_xlfn.ISOWEEKNUM(Tableau1[[#This Row],[Date]])","v":28},{"$f":"MONTH(Tableau1[[#This Row],[Date]])","v":7},{"$f":"TEXT(Tableau1[[#This Row],[Date]],\"mmmm\")","v":"juillet"},{"$f":"CHOOSE(WEEKDAY(Tableau1[[#This Row],[Date]],2),\"lu\",\"ma\",\"me\",\"je\",\"ve\",\"sa\",\"di\")","v":"di"},{"$f":"IFERROR(VLOOKUP(B290,Tableau30[],3,FALSE),IF(OR(AND($K$5<=B290,$L$5>B290),AND($K$6<=Tableau1[[#This Row],[Date]],$L$6>=Tableau1[[#This Row],[Date]])),\"FERMÉE\",IF(OR(Tableau1[[#This Row],[Jour]]=\"sa\",Tableau1[[#This Row],[Jour]]=\"di\",AND(Tableau1[[#This Row],[Jour]]=\"ve\",MOD(Tableau1[[#This Row],[N°S]],2)=1)),\"REPOS\",IF(Tableau1[[#This Row],[Jour]]=\"ve\",8,8.75))))","v":"REPOS"}]
[null,"2020-07-13",{"$f":"_xlfn.ISOWEEKNUM(Tableau1[[#This Row],[Date]])","v":29},{"$f":"MONTH(Tableau1[[#This Row],[Date]])","v":7},{"$f":"TEXT(Tableau1[[#This Row],[Date]],\"mmmm\")","v":"juillet"},{"$f":"CHOOSE(WEEKDAY(Tableau1[[#This Row],[Date]],2),\"lu\",\"ma\",\"me\",\"je\",\"ve\",\"sa\",\"di\")","v":"lu"},{"$f":"IFERROR(VLOOKUP(B291,Tableau30[],3,FALSE),IF(OR(AND($K$5<=B291,$L$5>B291),AND($K$6<=Tableau1[[#This Row],[Date]],$L$6>=Tableau1[[#This Row],[Date]])),\"FERMÉE\",IF(OR(Tableau1[[#This Row],[Jour]]=\"sa\",Tableau1[[#This Row],[Jour]]=\"di\",AND(Tableau1[[#This Row],[Jour]]=\"ve\",MOD(Tableau1[[#This Row],[N°S]],2)=1)),\"REPOS\",IF(Tableau1[[#This Row],[Jour]]=\"ve\",8,8.75))))","v":8.75}]
[null,"2020-07-14",{"$f":"_xlfn.ISOWEEKNUM(Tableau1[[#This Row],[Date]])","v":29},{"$f":"MONTH(Tableau1[[#This Row],[Date]])","v":7},{"$f":"TEXT(Tableau1[[#This Row],[Date]],\"mmmm\")","v":"juillet"},{"$f":"CHOOSE(WEEKDAY(Tableau1[[#This Row],[Date]],2),\"lu\",\"ma\",\"me\",\"je\",\"ve\",\"sa\",\"di\")","v":"ma"},{"$f":"IFERROR(VLOOKUP(B292,Tableau30[],3,FALSE),IF(OR(AND($K$5<=B292,$L$5>B292),AND($K$6<=Tableau1[[#This Row],[Date]],$L$6>=Tableau1[[#This Row],[Date]])),\"FERMÉE\",IF(OR(Tableau1[[#This Row],[Jour]]=\"sa\",Tableau1[[#This Row],[Jour]]=\"di\",AND(Tableau1[[#This Row],[Jour]]=\"ve\",MOD(Tableau1[[#This Row],[N°S]],2)=1)),\"REPOS\",IF(Tableau1[[#This Row],[Jour]]=\"ve\",8,8.75))))","v":"FÉRIÉ/INACTIF"}]
[null,"2020-07-15",{"$f":"_xlfn.ISOWEEKNUM(Tableau1[[#This Row],[Date]])","v":29},{"$f":"MONTH(Tableau1[[#This Row],[Date]])","v":7},{"$f":"TEXT(Tableau1[[#This Row],[Date]],\"mmmm\")","v":"juillet"},{"$f":"CHOOSE(WEEKDAY(Tableau1[[#This Row],[Date]],2),\"lu\",\"ma\",\"me\",\"je\",\"ve\",\"sa\",\"di\")","v":"me"},{"$f":"IFERROR(VLOOKUP(B293,Tableau30[],3,FALSE),IF(OR(AND($K$5<=B293,$L$5>B293),AND($K$6<=Tableau1[[#This Row],[Date]],$L$6>=Tableau1[[#This Row],[Date]])),\"FERMÉE\",IF(OR(Tableau1[[#This Row],[Jour]]=\"sa\",Tableau1[[#This Row],[Jour]]=\"di\",AND(Tableau1[[#This Row],[Jour]]=\"ve\",MOD(Tableau1[[#This Row],[N°S]],2)=1)),\"REPOS\",IF(Tableau1[[#This Row],[Jour]]=\"ve\",8,8.75))))","v":8.75}]
[null,"2020-07-16",{"$f":"_xlfn.ISOWEEKNUM(Tableau1[[#This Row],[Date]])","v":29},{"$f":"MONTH(Tableau1[[#This Row],[Date]])","v":7},{"$f":"TEXT(Tableau1[[#This Row],[Date]],\"mmmm\")","v":"juillet"},{"$f":"CHOOSE(WEEKDAY(Tableau1[[#This Row],[Date]],2),\"lu\",\"ma\",\"me\",\"je\",\"ve\",\"sa\",\"di\")","v":"je"},{"$f":"IFERROR(VLOOKUP(B294,Tableau30[],3,FALSE),IF(OR(AND($K$5<=B294,$L$5>B294),AND($K$6<=Tableau1[[#This Row],[Date]],$L$6>=Tableau1[[#This Row],[Date]])),\"FERMÉE\",IF(OR(Tableau1[[#This Row],[Jour]]=\"sa\",Tableau1[[#This Row],[Jour]]=\"di\",AND(Tableau1[[#This Row],[Jour]]=\"ve\",MOD(Tableau1[[#This Row],[N°S]],2)=1)),\"REPOS\",IF(Tableau1[[#This Row],[Jour]]=\"ve\",8,8.75))))","v":8.75}]
[null,"2020-07-17",{"$f":"_xlfn.ISOWEEKNUM(Tableau1[[#This Row],[Date]])","v":29},{"$f":"MONTH(Tableau1[[#This Row],[Date]])","v":7},{"$f":"TEXT(Tableau1[[#This Row],[Date]],\"mmmm\")","v":"juillet"},{"$f":"CHOOSE(WEEKDAY(Tableau1[[#This Row],[Date]],2),\"lu\",\"ma\",\"me\",\"je\",\"ve\",\"sa\",\"di\")","v":"ve"},{"$f":"IFERROR(VLOOKUP(B295,Tableau30[],3,FALSE),IF(OR(AND($K$5<=B295,$L$5>B295),AND($K$6<=Tableau1[[#This Row],[Date]],$L$6>=Tableau1[[#This Row],[Date]])),\"FERMÉE\",IF(OR(Tableau1[[#This Row],[Jour]]=\"sa\",Tableau1[[#This Row],[Jour]]=\"di\",AND(Tableau1[[#This Row],[Jour]]=\"ve\",MOD(Tableau1[[#This Row],[N°S]],2)=1)),\"REPOS\",IF(Tableau1[[#This Row],[Jour]]=\"ve\",8,8.75))))","v":"REPOS"}]
[null,"2020-07-18",{"$f":"_xlfn.ISOWEEKNUM(Tableau1[[#This Row],[Date]])","v":29},{"$f":"MONTH(Tableau1[[#This Row],[Date]])","v":7},{"$f":"TEXT(Tableau1[[#This Row],[Date]],\"mmmm\")","v":"juillet"},{"$f":"CHOOSE(WEEKDAY(Tableau1[[#This Row],[Date]],2),\"lu\",\"ma\",\"me\",\"je\",\"ve\",\"sa\",\"di\")","v":"sa"},{"$f":"IFERROR(VLOOKUP(B296,Tableau30[],3,FALSE),IF(OR(AND($K$5<=B296,$L$5>B296),AND($K$6<=Tableau1[[#This Row],[Date]],$L$6>=Tableau1[[#This Row],[Date]])),\"FERMÉE\",IF(OR(Tableau1[[#This Row],[Jour]]=\"sa\",Tableau1[[#This Row],[Jour]]=\"di\",AND(Tableau1[[#This Row],[Jour]]=\"ve\",MOD(Tableau1[[#This Row],[N°S]],2)=1)),\"REPOS\",IF(Tableau1[[#This Row],[Jour]]=\"ve\",8,8.75))))","v":"REPOS"}]
[null,"2020-07-19",{"$f":"_xlfn.ISOWEEKNUM(Tableau1[[#This Row],[Date]])","v":29},{"$f":"MONTH(Tableau1[[#This Row],[Date]])","v":7},{"$f":"TEXT(Tableau1[[#This Row],[Date]],\"mmmm\")","v":"juillet"},{"$f":"CHOOSE(WEEKDAY(Tableau1[[#This Row],[Date]],2),\"lu\",\"ma\",\"me\",\"je\",\"ve\",\"sa\",\"di\")","v":"di"},{"$f":"IFERROR(VLOOKUP(B297,Tableau30[],3,FALSE),IF(OR(AND($K$5<=B297,$L$5>B297),AND($K$6<=Tableau1[[#This Row],[Date]],$L$6>=Tableau1[[#This Row],[Date]])),\"FERMÉE\",IF(OR(Tableau1[[#This Row],[Jour]]=\"sa\",Tableau1[[#This Row],[Jour]]=\"di\",AND(Tableau1[[#This Row],[Jour]]=\"ve\",MOD(Tableau1[[#This Row],[N°S]],2)=1)),\"REPOS\",IF(Tableau1[[#This Row],[Jour]]=\"ve\",8,8.75))))","v":"REPOS"}]
[null,"2020-07-20",{"$f":"_xlfn.ISOWEEKNUM(Tableau1[[#This Row],[Date]])","v":30},{"$f":"MONTH(Tableau1[[#This Row],[Date]])","v":7},{"$f":"TEXT(Tableau1[[#This Row],[Date]],\"mmmm\")","v":"juillet"},{"$f":"CHOOSE(WEEKDAY(Tableau1[[#This Row],[Date]],2),\"lu\",\"ma\",\"me\",\"je\",\"ve\",\"sa\",\"di\")","v":"lu"},{"$f":"IFERROR(VLOOKUP(B298,Tableau30[],3,FALSE),IF(OR(AND($K$5<=B298,$L$5>B298),AND($K$6<=Tableau1[[#This Row],[Date]],$L$6>=Tableau1[[#This Row],[Date]])),\"FERMÉE\",IF(OR(Tableau1[[#This Row],[Jour]]=\"sa\",Tableau1[[#This Row],[Jour]]=\"di\",AND(Tableau1[[#This Row],[Jour]]=\"ve\",MOD(Tableau1[[#This Row],[N°S]],2)=1)),\"REPOS\",IF(Tableau1[[#This Row],[Jour]]=\"ve\",8,8.75))))","v":8.75}]
[null,"2020-07-21",{"$f":"_xlfn.ISOWEEKNUM(Tableau1[[#This Row],[Date]])","v":30},{"$f":"MONTH(Tableau1[[#This Row],[Date]])","v":7},{"$f":"TEXT(Tableau1[[#This Row],[Date]],\"mmmm\")","v":"juillet"},{"$f":"CHOOSE(WEEKDAY(Tableau1[[#This Row],[Date]],2),\"lu\",\"ma\",\"me\",\"je\",\"ve\",\"sa\",\"di\")","v":"ma"},{"$f":"IFERROR(VLOOKUP(B299,Tableau30[],3,FALSE),IF(OR(AND($K$5<=B299,$L$5>B299),AND($K$6<=Tableau1[[#This Row],[Date]],$L$6>=Tableau1[[#This Row],[Date]])),\"FERMÉE\",IF(OR(Tableau1[[#This Row],[Jour]]=\"sa\",Tableau1[[#This Row],[Jour]]=\"di\",AND(Tableau1[[#This Row],[Jour]]=\"ve\",MOD(Tableau1[[#This Row],[N°S]],2)=1)),\"REPOS\",IF(Tableau1[[#This Row],[Jour]]=\"ve\",8,8.75))))","v":8.75}]
[null,"2020-07-22",{"$f":"_xlfn.ISOWEEKNUM(Tableau1[[#This Row],[Date]])","v":30},{"$f":"MONTH(Tableau1[[#This Row],[Date]])","v":7},{"$f":"TEXT(Tableau1[[#This Row],[Date]],\"mmmm\")","v":"juillet"},{"$f":"CHOOSE(WEEKDAY(Tableau1[[#This Row],[Date]],2),\"lu\",\"ma\",\"me\",\"je\",\"ve\",\"sa\",\"di\")","v":"me"},{"$f":"IFERROR(VLOOKUP(B300,Tableau30[],3,FALSE),IF(OR(AND($K$5<=B300,$L$5>B300),AND($K$6<=Tableau1[[#This Row],[Date]],$L$6>=Tableau1[[#This Row],[Date]])),\"FERMÉE\",IF(OR(Tableau1[[#This Row],[Jour]]=\"sa\",Tableau1[[#This Row],[Jour]]=\"di\",AND(Tableau1[[#This Row],[Jour]]=\"ve\",MOD(Tableau1[[#This Row],[N°S]],2)=1)),\"REPOS\",IF(Tableau1[[#This Row],[Jour]]=\"ve\",8,8.75))))","v":8.75}]
[null,"2020-07-23",{"$f":"_xlfn.ISOWEEKNUM(Tableau1[[#This Row],[Date]])","v":30},{"$f":"MONTH(Tableau1[[#This Row],[Date]])","v":7},{"$f":"TEXT(Tableau1[[#This Row],[Date]],\"mmmm\")","v":"juillet"},{"$f":"CHOOSE(WEEKDAY(Tableau1[[#This Row],[Date]],2),\"lu\",\"ma\",\"me\",\"je\",\"ve\",\"sa\",\"di\")","v":"je"},{"$f":"IFERROR(VLOOKUP(B301,Tableau30[],3,FALSE),IF(OR(AND($K$5<=B301,$L$5>B301),AND($K$6<=Tableau1[[#This Row],[Date]],$L$6>=Tableau1[[#This Row],[Date]])),\"FERMÉE\",IF(OR(Tableau1[[#This Row],[Jour]]=\"sa\",Tableau1[[#This Row],[Jour]]=\"di\",AND(Tableau1[[#This Row],[Jour]]=\"ve\",MOD(Tableau1[[#This Row],[N°S]],2)=1)),\"REPOS\",IF(Tableau1[[#This Row],[Jour]]=\"ve\",8,8.75))))","v":8.75}]
[null,"2020-07-24",{"$f":"_xlfn.ISOWEEKNUM(Tableau1[[#This Row],[Date]])","v":30},{"$f":"MONTH(Tableau1[[#This Row],[Date]])","v":7},{"$f":"TEXT(Tableau1[[#This Row],[Date]],\"mmmm\")","v":"juillet"},{"$f":"CHOOSE(WEEKDAY(Tableau1[[#This Row],[Date]],2),\"lu\",\"ma\",\"me\",\"je\",\"ve\",\"sa\",\"di\")","v":"ve"},{"$f":"IFERROR(VLOOKUP(B302,Tableau30[],3,FALSE),IF(OR(AND($K$5<=B302,$L$5>B302),AND($K$6<=Tableau1[[#This Row],[Date]],$L$6>=Tableau1[[#This Row],[Date]])),\"FERMÉE\",IF(OR(Tableau1[[#This Row],[Jour]]=\"sa\",Tableau1[[#This Row],[Jour]]=\"di\",AND(Tableau1[[#This Row],[Jour]]=\"ve\",MOD(Tableau1[[#This Row],[N°S]],2)=1)),\"REPOS\",IF(Tableau1[[#This Row],[Jour]]=\"ve\",8,8.75))))","v":8}]
[null,"2020-07-25",{"$f":"_xlfn.ISOWEEKNUM(Tableau1[[#This Row],[Date]])","v":30},{"$f":"MONTH(Tableau1[[#This Row],[Date]])","v":7},{"$f":"TEXT(Tableau1[[#This Row],[Date]],\"mmmm\")","v":"juillet"},{"$f":"CHOOSE(WEEKDAY(Tableau1[[#This Row],[Date]],2),\"lu\",\"ma\",\"me\",\"je\",\"ve\",\"sa\",\"di\")","v":"sa"},{"$f":"IFERROR(VLOOKUP(B303,Tableau30[],3,FALSE),IF(OR(AND($K$5<=B303,$L$5>B303),AND($K$6<=Tableau1[[#This Row],[Date]],$L$6>=Tableau1[[#This Row],[Date]])),\"FERMÉE\",IF(OR(Tableau1[[#This Row],[Jour]]=\"sa\",Tableau1[[#This Row],[Jour]]=\"di\",AND(Tableau1[[#This Row],[Jour]]=\"ve\",MOD(Tableau1[[#This Row],[N°S]],2)=1)),\"REPOS\",IF(Tableau1[[#This Row],[Jour]]=\"ve\",8,8.75))))","v":"REPOS"}]
[null,"2020-07-26",{"$f":"_xlfn.ISOWEEKNUM(Tableau1[[#This Row],[Date]])","v":30},{"$f":"MONTH(Tableau1[[#This Row],[Date]])","v":7},{"$f":"TEXT(Tableau1[[#This Row],[Date]],\"mmmm\")","v":"juillet"},{"$f":"CHOOSE(WEEKDAY(Tableau1[[#This Row],[Date]],2),\"lu\",\"ma\",\"me\",\"je\",\"ve\",\"sa\",\"di\")","v":"di"},{"$f":"IFERROR(VLOOKUP(B304,Tableau30[],3,FALSE),IF(OR(AND($K$5<=B304,$L$5>B304),AND($K$6<=Tableau1[[#This Row],[Date]],$L$6>=Tableau1[[#This Row],[Date]])),\"FERMÉE\",IF(OR(Tableau1[[#This Row],[Jour]]=\"sa\",Tableau1[[#This Row],[Jour]]=\"di\",AND(Tableau1[[#This Row],[Jour]]=\"ve\",MOD(Tableau1[[#This Row],[N°S]],2)=1)),\"REPOS\",IF(Tableau1[[#This Row],[Jour]]=\"ve\",8,8.75))))","v":"REPOS"}]
[null,"2020-07-27",{"$f":"_xlfn.ISOWEEKNUM(Tableau1[[#This Row],[Date]])","v":31},{"$f":"MONTH(Tableau1[[#This Row],[Date]])","v":7},{"$f":"TEXT(Tableau1[[#This Row],[Date]],\"mmmm\")","v":"juillet"},{"$f":"CHOOSE(WEEKDAY(Tableau1[[#This Row],[Date]],2),\"lu\",\"ma\",\"me\",\"je\",\"ve\",\"sa\",\"di\")","v":"lu"},{"$f":"IFERROR(VLOOKUP(B305,Tableau30[],3,FALSE),IF(OR(AND($K$5<=B305,$L$5>B305),AND($K$6<=Tableau1[[#This Row],[Date]],$L$6>=Tableau1[[#This Row],[Date]])),\"FERMÉE\",IF(OR(Tableau1[[#This Row],[Jour]]=\"sa\",Tableau1[[#This Row],[Jour]]=\"di\",AND(Tableau1[[#This Row],[Jour]]=\"ve\",MOD(Tableau1[[#This Row],[N°S]],2)=1)),\"REPOS\",IF(Tableau1[[#This Row],[Jour]]=\"ve\",8,8.75))))","v":8.75}]
[null,"2020-07-28",{"$f":"_xlfn.ISOWEEKNUM(Tableau1[[#This Row],[Date]])","v":31},{"$f":"MONTH(Tableau1[[#This Row],[Date]])","v":7},{"$f":"TEXT(Tableau1[[#This Row],[Date]],\"mmmm\")","v":"juillet"},{"$f":"CHOOSE(WEEKDAY(Tableau1[[#This Row],[Date]],2),\"lu\",\"ma\",\"me\",\"je\",\"ve\",\"sa\",\"di\")","v":"ma"},{"$f":"IFERROR(VLOOKUP(B306,Tableau30[],3,FALSE),IF(OR(AND($K$5<=B306,$L$5>B306),AND($K$6<=Tableau1[[#This Row],[Date]],$L$6>=Tableau1[[#This Row],[Date]])),\"FERMÉE\",IF(OR(Tableau1[[#This Row],[Jour]]=\"sa\",Tableau1[[#This Row],[Jour]]=\"di\",AND(Tableau1[[#This Row],[Jour]]=\"ve\",MOD(Tableau1[[#This Row],[N°S]],2)=1)),\"REPOS\",IF(Tableau1[[#This Row],[Jour]]=\"ve\",8,8.75))))","v":8.75}]
[null,"2020-07-29",{"$f":"_xlfn.ISOWEEKNUM(Tableau1[[#This Row],[Date]])","v":31},{"$f":"MONTH(Tableau1[[#This Row],[Date]])","v":7},{"$f":"TEXT(Tableau1[[#This Row],[Date]],\"mmmm\")","v":"juillet"},{"$f":"CHOOSE(WEEKDAY(Tableau1[[#This Row],[Date]],2),\"lu\",\"ma\",\"me\",\"je\",\"ve\",\"sa\",\"di\")","v":"me"},{"$f":"IFERROR(VLOOKUP(B307,Tableau30[],3,FALSE),IF(OR(AND($K$5<=B307,$L$5>B307),AND($K$6<=Tableau1[[#This Row],[Date]],$L$6>=Tableau1[[#This Row],[Date]])),\"FERMÉE\",IF(OR(Tableau1[[#This Row],[Jour]]=\"sa\",Tableau1[[#This Row],[Jour]]=\"di\",AND(Tableau1[[#This Row],[Jour]]=\"ve\",MOD(Tableau1[[#This Row],[N°S]],2)=1)),\"REPOS\",IF(Tableau1[[#This Row],[Jour]]=\"ve\",8,8.75))))","v":8.75}]
[null,"2020-07-30",{"$f":"_xlfn.ISOWEEKNUM(Tableau1[[#This Row],[Date]])","v":31},{"$f":"MONTH(Tableau1[[#This Row],[Date]])","v":7},{"$f":"TEXT(Tableau1[[#This Row],[Date]],\"mmmm\")","v":"juillet"},{"$f":"CHOOSE(WEEKDAY(Tableau1[[#This Row],[Date]],2),\"lu\",\"ma\",\"me\",\"je\",\"ve\",\"sa\",\"di\")","v":"je"},{"$f":"IFERROR(VLOOKUP(B308,Tableau30[],3,FALSE),IF(OR(AND($K$5<=B308,$L$5>B308),AND($K$6<=Tableau1[[#This Row],[Date]],$L$6>=Tableau1[[#This Row],[Date]])),\"FERMÉE\",IF(OR(Tableau1[[#This Row],[Jour]]=\"sa\",Tableau1[[#This Row],[Jour]]=\"di\",AND(Tableau1[[#This Row],[Jour]]=\"ve\",MOD(Tableau1[[#This Row],[N°S]],2)=1)),\"REPOS\",IF(Tableau1[[#This Row],[Jour]]=\"ve\",8,8.75))))","v":8.75}]
[null,"2020-07-31",{"$f":"_xlfn.ISOWEEKNUM(Tableau1[[#This Row],[Date]])","v":31},{"$f":"MONTH(Tableau1[[#This Row],[Date]])","v":7},{"$f":"TEXT(Tableau1[[#This Row],[Date]],\"mmmm\")","v":"juillet"},{"$f":"CHOOSE(WEEKDAY(Tableau1[[#This Row],[Date]],2),\"lu\",\"ma\",\"me\",\"je\",\"ve\",\"sa\",\"di\")","v":"ve"},{"$f":"IFERROR(VLOOKUP(B309,Tableau30[],3,FALSE),IF(OR(AND($K$5<=B309,$L$5>B309),AND($K$6<=Tableau1[[#This Row],[Date]],$L$6>=Tableau1[[#This Row],[Date]])),\"FERMÉE\",IF(OR(Tableau1[[#This Row],[Jour]]=\"sa\",Tableau1[[#This Row],[Jour]]=\"di\",AND(Tableau1[[#This Row],[Jour]]=\"ve\",MOD(Tableau1[[#This Row],[N°S]],2)=1)),\"REPOS\",IF(Tableau1[[#This Row],[Jour]]=\"ve\",8,8.75))))","v":"REPOS"}]
[null,"2020-08-01",{"$f":"_xlfn.ISOWEEKNUM(Tableau1[[#This Row],[Date]])","v":31},{"$f":"MONTH(Tableau1[[#This Row],[Date]])","v":8},{"$f":"TEXT(Tableau1[[#This Row],[Date]],\"mmmm\")","v":"août"},{"$f":"CHOOSE(WEEKDAY(Tableau1[[#This Row],[Date]],2),\"lu\",\"ma\",\"me\",\"je\",\"ve\",\"sa\",\"di\")","v":"sa"},{"$f":"IFERROR(VLOOKUP(B310,Tableau30[],3,FALSE),IF(OR(AND($K$5<=B310,$L$5>B310),AND($K$6<=Tableau1[[#This Row],[Date]],$L$6>=Tableau1[[#This Row],[Date]])),\"FERMÉE\",IF(OR(Tableau1[[#This Row],[Jour]]=\"sa\",Tableau1[[#This Row],[Jour]]=\"di\",AND(Tableau1[[#This Row],[Jour]]=\"ve\",MOD(Tableau1[[#This Row],[N°S]],2)=1)),\"REPOS\",IF(Tableau1[[#This Row],[Jour]]=\"ve\",8,8.75))))","v":"REPOS"}]
[null,"2020-08-02",{"$f":"_xlfn.ISOWEEKNUM(Tableau1[[#This Row],[Date]])","v":31},{"$f":"MONTH(Tableau1[[#This Row],[Date]])","v":8},{"$f":"TEXT(Tableau1[[#This Row],[Date]],\"mmmm\")","v":"août"},{"$f":"CHOOSE(WEEKDAY(Tableau1[[#This Row],[Date]],2),\"lu\",\"ma\",\"me\",\"je\",\"ve\",\"sa\",\"di\")","v":"di"},{"$f":"IFERROR(VLOOKUP(B311,Tableau30[],3,FALSE),IF(OR(AND($K$5<=B311,$L$5>B311),AND($K$6<=Tableau1[[#This Row],[Date]],$L$6>=Tableau1[[#This Row],[Date]])),\"FERMÉE\",IF(OR(Tableau1[[#This Row],[Jour]]=\"sa\",Tableau1[[#This Row],[Jour]]=\"di\",AND(Tableau1[[#This Row],[Jour]]=\"ve\",MOD(Tableau1[[#This Row],[N°S]],2)=1)),\"REPOS\",IF(Tableau1[[#This Row],[Jour]]=\"ve\",8,8.75))))","v":"REPOS"}]
[null,"2020-08-03",{"$f":"_xlfn.ISOWEEKNUM(Tableau1[[#This Row],[Date]])","v":32},{"$f":"MONTH(Tableau1[[#This Row],[Date]])","v":8},{"$f":"TEXT(Tableau1[[#This Row],[Date]],\"mmmm\")","v":"août"},{"$f":"CHOOSE(WEEKDAY(Tableau1[[#This Row],[Date]],2),\"lu\",\"ma\",\"me\",\"je\",\"ve\",\"sa\",\"di\")","v":"lu"},{"$f":"IFERROR(VLOOKUP(B312,Tableau30[],3,FALSE),IF(OR(AND($K$5<=B312,$L$5>B312),AND($K$6<=Tableau1[[#This Row],[Date]],$L$6>=Tableau1[[#This Row],[Date]])),\"FERMÉE\",IF(OR(Tableau1[[#This Row],[Jour]]=\"sa\",Tableau1[[#This Row],[Jour]]=\"di\",AND(Tableau1[[#This Row],[Jour]]=\"ve\",MOD(Tableau1[[#This Row],[N°S]],2)=1)),\"REPOS\",IF(Tableau1[[#This Row],[Jour]]=\"ve\",8,8.75))))","v":8.75}]
[null,"2020-08-04",{"$f":"_xlfn.ISOWEEKNUM(Tableau1[[#This Row],[Date]])","v":32},{"$f":"MONTH(Tableau1[[#This Row],[Date]])","v":8},{"$f":"TEXT(Tableau1[[#This Row],[Date]],\"mmmm\")","v":"août"},{"$f":"CHOOSE(WEEKDAY(Tableau1[[#This Row],[Date]],2),\"lu\",\"ma\",\"me\",\"je\",\"ve\",\"sa\",\"di\")","v":"ma"},{"$f":"IFERROR(VLOOKUP(B313,Tableau30[],3,FALSE),IF(OR(AND($K$5<=B313,$L$5>B313),AND($K$6<=Tableau1[[#This Row],[Date]],$L$6>=Tableau1[[#This Row],[Date]])),\"FERMÉE\",IF(OR(Tableau1[[#This Row],[Jour]]=\"sa\",Tableau1[[#This Row],[Jour]]=\"di\",AND(Tableau1[[#This Row],[Jour]]=\"ve\",MOD(Tableau1[[#This Row],[N°S]],2)=1)),\"REPOS\",IF(Tableau1[[#This Row],[Jour]]=\"ve\",8,8.75))))","v":8.75}]
[null,"2020-08-05",{"$f":"_xlfn.ISOWEEKNUM(Tableau1[[#This Row],[Date]])","v":32},{"$f":"MONTH(Tableau1[[#This Row],[Date]])","v":8},{"$f":"TEXT(Tableau1[[#This Row],[Date]],\"mmmm\")","v":"août"},{"$f":"CHOOSE(WEEKDAY(Tableau1[[#This Row],[Date]],2),\"lu\",\"ma\",\"me\",\"je\",\"ve\",\"sa\",\"di\")","v":"me"},{"$f":"IFERROR(VLOOKUP(B314,Tableau30[],3,FALSE),IF(OR(AND($K$5<=B314,$L$5>B314),AND($K$6<=Tableau1[[#This Row],[Date]],$L$6>=Tableau1[[#This Row],[Date]])),\"FERMÉE\",IF(OR(Tableau1[[#This Row],[Jour]]=\"sa\",Tableau1[[#This Row],[Jour]]=\"di\",AND(Tableau1[[#This Row],[Jour]]=\"ve\",MOD(Tableau1[[#This Row],[N°S]],2)=1)),\"REPOS\",IF(Tableau1[[#This Row],[Jour]]=\"ve\",8,8.75))))","v":8.75}]
[null,"2020-08-06",{"$f":"_xlfn.ISOWEEKNUM(Tableau1[[#This Row],[Date]])","v":32},{"$f":"MONTH(Tableau1[[#This Row],[Date]])","v":8},{"$f":"TEXT(Tableau1[[#This Row],[Date]],\"mmmm\")","v":"août"},{"$f":"CHOOSE(WEEKDAY(Tableau1[[#This Row],[Date]],2),\"lu\",\"ma\",\"me\",\"je\",\"ve\",\"sa\",\"di\")","v":"je"},{"$f":"IFERROR(VLOOKUP(B315,Tableau30[],3,FALSE),IF(OR(AND($K$5<=B315,$L$5>B315),AND($K$6<=Tableau1[[#This Row],[Date]],$L$6>=Tableau1[[#This Row],[Date]])),\"FERMÉE\",IF(OR(Tableau1[[#This Row],[Jour]]=\"sa\",Tableau1[[#This Row],[Jour]]=\"di\",AND(Tableau1[[#This Row],[Jour]]=\"ve\",MOD(Tableau1[[#This Row],[N°S]],2)=1)),\"REPOS\",IF(Tableau1[[#This Row],[Jour]]=\"ve\",8,8.75))))","v":8.75}]
[null,"2020-08-07",{"$f":"_xlfn.ISOWEEKNUM(Tableau1[[#This Row],[Date]])","v":32},{"$f":"MONTH(Tableau1[[#This Row],[Date]])","v":8},{"$f":"TEXT(Tableau1[[#This Row],[Date]],\"mmmm\")","v":"août"},{"$f":"CHOOSE(WEEKDAY(Tableau1[[#This Row],[Date]],2),\"lu\",\"ma\",\"me\",\"je\",\"ve\",\"sa\",\"di\")","v":"ve"},{"$f":"IFERROR(VLOOKUP(B316,Tableau30[],3,FALSE),IF(OR(AND($K$5<=B316,$L$5>B316),AND($K$6<=Tableau1[[#This Row],[Date]],$L$6>=Tableau1[[#This Row],[Date]])),\"FERMÉE\",IF(OR(Tableau1[[#This Row],[Jour]]=\"sa\",Tableau1[[#This Row],[Jour]]=\"di\",AND(Tableau1[[#This Row],[Jour]]=\"ve\",MOD(Tableau1[[#This Row],[N°S]],2)=1)),\"REPOS\",IF(Tableau1[[#This Row],[Jour]]=\"ve\",8,8.75))))","v":8}]
[null,"2020-08-08",{"$f":"_xlfn.ISOWEEKNUM(Tableau1[[#This Row],[Date]])","v":32},{"$f":"MONTH(Tableau1[[#This Row],[Date]])","v":8},{"$f":"TEXT(Tableau1[[#This Row],[Date]],\"mmmm\")","v":"août"},{"$f":"CHOOSE(WEEKDAY(Tableau1[[#This Row],[Date]],2),\"lu\",\"ma\",\"me\",\"je\",\"ve\",\"sa\",\"di\")","v":"sa"},{"$f":"IFERROR(VLOOKUP(B317,Tableau30[],3,FALSE),IF(OR(AND($K$5<=B317,$L$5>B317),AND($K$6<=Tableau1[[#This Row],[Date]],$L$6>=Tableau1[[#This Row],[Date]])),\"FERMÉE\",IF(OR(Tableau1[[#This Row],[Jour]]=\"sa\",Tableau1[[#This Row],[Jour]]=\"di\",AND(Tableau1[[#This Row],[Jour]]=\"ve\",MOD(Tableau1[[#This Row],[N°S]],2)=1)),\"REPOS\",IF(Tableau1[[#This Row],[Jour]]=\"ve\",8,8.75))))","v":"REPOS"}]
[null,"2020-08-09",{"$f":"_xlfn.ISOWEEKNUM(Tableau1[[#This Row],[Date]])","v":32},{"$f":"MONTH(Tableau1[[#This Row],[Date]])","v":8},{"$f":"TEXT(Tableau1[[#This Row],[Date]],\"mmmm\")","v":"août"},{"$f":"CHOOSE(WEEKDAY(Tableau1[[#This Row],[Date]],2),\"lu\",\"ma\",\"me\",\"je\",\"ve\",\"sa\",\"di\")","v":"di"},{"$f":"IFERROR(VLOOKUP(B318,Tableau30[],3,FALSE),IF(OR(AND($K$5<=B318,$L$5>B318),AND($K$6<=Tableau1[[#This Row],[Date]],$L$6>=Tableau1[[#This Row],[Date]])),\"FERMÉE\",IF(OR(Tableau1[[#This Row],[Jour]]=\"sa\",Tableau1[[#This Row],[Jour]]=\"di\",AND(Tableau1[[#This Row],[Jour]]=\"ve\",MOD(Tableau1[[#This Row],[N°S]],2)=1)),\"REPOS\",IF(Tableau1[[#This Row],[Jour]]=\"ve\",8,8.75))))","v":"REPOS"}]
[null,"2020-08-10",{"$f":"_xlfn.ISOWEEKNUM(Tableau1[[#This Row],[Date]])","v":33},{"$f":"MONTH(Tableau1[[#This Row],[Date]])","v":8},{"$f":"TEXT(Tableau1[[#This Row],[Date]],\"mmmm\")","v":"août"},{"$f":"CHOOSE(WEEKDAY(Tableau1[[#This Row],[Date]],2),\"lu\",\"ma\",\"me\",\"je\",\"ve\",\"sa\",\"di\")","v":"lu"},{"$f":"IFERROR(VLOOKUP(B319,Tableau30[],3,FALSE),IF(OR(AND($K$5<=B319,$L$5>B319),AND($K$6<=Tableau1[[#This Row],[Date]],$L$6>=Tableau1[[#This Row],[Date]])),\"FERMÉE\",IF(OR(Tableau1[[#This Row],[Jour]]=\"sa\",Tableau1[[#This Row],[Jour]]=\"di\",AND(Tableau1[[#This Row],[Jour]]=\"ve\",MOD(Tableau1[[#This Row],[N°S]],2)=1)),\"REPOS\",IF(Tableau1[[#This Row],[Jour]]=\"ve\",8,8.75))))","v":8.75}]
[null,"2020-08-11",{"$f":"_xlfn.ISOWEEKNUM(Tableau1[[#This Row],[Date]])","v":33},{"$f":"MONTH(Tableau1[[#This Row],[Date]])","v":8},{"$f":"TEXT(Tableau1[[#This Row],[Date]],\"mmmm\")","v":"août"},{"$f":"CHOOSE(WEEKDAY(Tableau1[[#This Row],[Date]],2),\"lu\",\"ma\",\"me\",\"je\",\"ve\",\"sa\",\"di\")","v":"ma"},{"$f":"IFERROR(VLOOKUP(B320,Tableau30[],3,FALSE),IF(OR(AND($K$5<=B320,$L$5>B320),AND($K$6<=Tableau1[[#This Row],[Date]],$L$6>=Tableau1[[#This Row],[Date]])),\"FERMÉE\",IF(OR(Tableau1[[#This Row],[Jour]]=\"sa\",Tableau1[[#This Row],[Jour]]=\"di\",AND(Tableau1[[#This Row],[Jour]]=\"ve\",MOD(Tableau1[[#This Row],[N°S]],2)=1)),\"REPOS\",IF(Tableau1[[#This Row],[Jour]]=\"ve\",8,8.75))))","v":8.75}]
[null,"2020-08-12",{"$f":"_xlfn.ISOWEEKNUM(Tableau1[[#This Row],[Date]])","v":33},{"$f":"MONTH(Tableau1[[#This Row],[Date]])","v":8},{"$f":"TEXT(Tableau1[[#This Row],[Date]],\"mmmm\")","v":"août"},{"$f":"CHOOSE(WEEKDAY(Tableau1[[#This Row],[Date]],2),\"lu\",\"ma\",\"me\",\"je\",\"ve\",\"sa\",\"di\")","v":"me"},{"$f":"IFERROR(VLOOKUP(B321,Tableau30[],3,FALSE),IF(OR(AND($K$5<=B321,$L$5>B321),AND($K$6<=Tableau1[[#This Row],[Date]],$L$6>=Tableau1[[#This Row],[Date]])),\"FERMÉE\",IF(OR(Tableau1[[#This Row],[Jour]]=\"sa\",Tableau1[[#This Row],[Jour]]=\"di\",AND(Tableau1[[#This Row],[Jour]]=\"ve\",MOD(Tableau1[[#This Row],[N°S]],2)=1)),\"REPOS\",IF(Tableau1[[#This Row],[Jour]]=\"ve\",8,8.75))))","v":8.75}]
[null,"2020-08-13",{"$f":"_xlfn.ISOWEEKNUM(Tableau1[[#This Row],[Date]])","v":33},{"$f":"MONTH(Tableau1[[#This Row],[Date]])","v":8},{"$f":"TEXT(Tableau1[[#This Row],[Date]],\"mmmm\")","v":"août"},{"$f":"CHOOSE(WEEKDAY(Tableau1[[#This Row],[Date]],2),\"lu\",\"ma\",\"me\",\"je\",\"ve\",\"sa\",\"di\")","v":"je"},{"$f":"IFERROR(VLOOKUP(B322,Tableau30[],3,FALSE),IF(OR(AND($K$5<=B322,$L$5>B322),AND($K$6<=Tableau1[[#This Row],[Date]],$L$6>=Tableau1[[#This Row],[Date]])),\"FERMÉE\",IF(OR(Tableau1[[#This Row],[Jour]]=\"sa\",Tableau1[[#This Row],[Jour]]=\"di\",AND(Tableau1[[#This Row],[Jour]]=\"ve\",MOD(Tableau1[[#This Row],[N°S]],2)=1)),\"REPOS\",IF(Tableau1[[#This Row],[Jour]]=\"ve\",8,8.75))))","v":8.75}]
[null,"2020-08-14",{"$f":"_xlfn.ISOWEEKNUM(Tableau1[[#This Row],[Date]])","v":33},{"$f":"MONTH(Tableau1[[#This Row],[Date]])","v":8},{"$f":"TEXT(Tableau1[[#This Row],[Date]],\"mmmm\")","v":"août"},{"$f":"CHOOSE(WEEKDAY(Tableau1[[#This Row],[Date]],2),\"lu\",\"ma\",\"me\",\"je\",\"ve\",\"sa\",\"di\")","v":"ve"},{"$f":"IFERROR(VLOOKUP(B323,Tableau30[],3,FALSE),IF(OR(AND($K$5<=B323,$L$5>B323),AND($K$6<=Tableau1[[#This Row],[Date]],$L$6>=Tableau1[[#This Row],[Date]])),\"FERMÉE\",IF(OR(Tableau1[[#This Row],[Jour]]=\"sa\",Tableau1[[#This Row],[Jour]]=\"di\",AND(Tableau1[[#This Row],[Jour]]=\"ve\",MOD(Tableau1[[#This Row],[N°S]],2)=1)),\"REPOS\",IF(Tableau1[[#This Row],[Jour]]=\"ve\",8,8.75))))","v":"REPOS"}]
[null,"2020-08-15",{"$f":"_xlfn.ISOWEEKNUM(Tableau1[[#This Row],[Date]])","v":33},{"$f":"MONTH(Tableau1[[#This Row],[Date]])","v":8},{"$f":"TEXT(Tableau1[[#This Row],[Date]],\"mmmm\")","v":"août"},{"$f":"CHOOSE(WEEKDAY(Tableau1[[#This Row],[Date]],2),\"lu\",\"ma\",\"me\",\"je\",\"ve\",\"sa\",\"di\")","v":"sa"},{"$f":"IFERROR(VLOOKUP(B324,Tableau30[],3,FALSE),IF(OR(AND($K$5<=B324,$L$5>B324),AND($K$6<=Tableau1[[#This Row],[Date]],$L$6>=Tableau1[[#This Row],[Date]])),\"FERMÉE\",IF(OR(Tableau1[[#This Row],[Jour]]=\"sa\",Tableau1[[#This Row],[Jour]]=\"di\",AND(Tableau1[[#This Row],[Jour]]=\"ve\",MOD(Tableau1[[#This Row],[N°S]],2)=1)),\"REPOS\",IF(Tableau1[[#This Row],[Jour]]=\"ve\",8,8.75))))","v":"FÉRIÉ/INACTIF"}]
[null,"2020-08-16",{"$f":"_xlfn.ISOWEEKNUM(Tableau1[[#This Row],[Date]])","v":33},{"$f":"MONTH(Tableau1[[#This Row],[Date]])","v":8},{"$f":"TEXT(Tableau1[[#This Row],[Date]],\"mmmm\")","v":"août"},{"$f":"CHOOSE(WEEKDAY(Tableau1[[#This Row],[Date]],2),\"lu\",\"ma\",\"me\",\"je\",\"ve\",\"sa\",\"di\")","v":"di"},{"$f":"IFERROR(VLOOKUP(B325,Tableau30[],3,FALSE),IF(OR(AND($K$5<=B325,$L$5>B325),AND($K$6<=Tableau1[[#This Row],[Date]],$L$6>=Tableau1[[#This Row],[Date]])),\"FERMÉE\",IF(OR(Tableau1[[#This Row],[Jour]]=\"sa\",Tableau1[[#This Row],[Jour]]=\"di\",AND(Tableau1[[#This Row],[Jour]]=\"ve\",MOD(Tableau1[[#This Row],[N°S]],2)=1)),\"REPOS\",IF(Tableau1[[#This Row],[Jour]]=\"ve\",8,8.75))))","v":"REPOS"}]
[null,"2020-08-17",{"$f":"_xlfn.ISOWEEKNUM(Tableau1[[#This Row],[Date]])","v":34},{"$f":"MONTH(Tableau1[[#This Row],[Date]])","v":8},{"$f":"TEXT(Tableau1[[#This Row],[Date]],\"mmmm\")","v":"août"},{"$f":"CHOOSE(WEEKDAY(Tableau1[[#This Row],[Date]],2),\"lu\",\"ma\",\"me\",\"je\",\"ve\",\"sa\",\"di\")","v":"lu"},{"$f":"IFERROR(VLOOKUP(B326,Tableau30[],3,FALSE),IF(OR(AND($K$5<=B326,$L$5>B326),AND($K$6<=Tableau1[[#This Row],[Date]],$L$6>=Tableau1[[#This Row],[Date]])),\"FERMÉE\",IF(OR(Tableau1[[#This Row],[Jour]]=\"sa\",Tableau1[[#This Row],[Jour]]=\"di\",AND(Tableau1[[#This Row],[Jour]]=\"ve\",MOD(Tableau1[[#This Row],[N°S]],2)=1)),\"REPOS\",IF(Tableau1[[#This Row],[Jour]]=\"ve\",8,8.75))))","v":8.75}]
[null,{"$f":"B326+1","v":"2020-08-18"},{"$f":"_xlfn.ISOWEEKNUM(Tableau1[[#This Row],[Date]])","v":34},{"$f":"MONTH(Tableau1[[#This Row],[Date]])","v":8},{"$f":"TEXT(Tableau1[[#This Row],[Date]],\"mmmm\")","v":"août"},{"$f":"CHOOSE(WEEKDAY(Tableau1[[#This Row],[Date]],2),\"lu\",\"ma\",\"me\",\"je\",\"ve\",\"sa\",\"di\")","v":"ma"},{"$f":"IFERROR(VLOOKUP(B327,Tableau30[],3,FALSE),IF(OR(AND($K$5<=B327,$L$5>B327),AND($K$6<=Tableau1[[#This Row],[Date]],$L$6>=Tableau1[[#This Row],[Date]])),\"FERMÉE\",IF(OR(Tableau1[[#This Row],[Jour]]=\"sa\",Tableau1[[#This Row],[Jour]]=\"di\",AND(Tableau1[[#This Row],[Jour]]=\"ve\",MOD(Tableau1[[#This Row],[N°S]],2)=1)),\"REPOS\",IF(Tableau1[[#This Row],[Jour]]=\"ve\",8,8.75))))","v":8.75}]
[null,"2020-08-19",{"$f":"_xlfn.ISOWEEKNUM(Tableau1[[#This Row],[Date]])","v":34},{"$f":"MONTH(Tableau1[[#This Row],[Date]])","v":8},{"$f":"TEXT(Tableau1[[#This Row],[Date]],\"mmmm\")","v":"août"},{"$f":"CHOOSE(WEEKDAY(Tableau1[[#This Row],[Date]],2),\"lu\",\"ma\",\"me\",\"je\",\"ve\",\"sa\",\"di\")","v":"me"},{"$f":"IFERROR(VLOOKUP(B328,Tableau30[],3,FALSE),IF(OR(AND($K$5<=B328,$L$5>B328),AND($K$6<=Tableau1[[#This Row],[Date]],$L$6>=Tableau1[[#This Row],[Date]])),\"FERMÉE\",IF(OR(Tableau1[[#This Row],[Jour]]=\"sa\",Tableau1[[#This Row],[Jour]]=\"di\",AND(Tableau1[[#This Row],[Jour]]=\"ve\",MOD(Tableau1[[#This Row],[N°S]],2)=1)),\"REPOS\",IF(Tableau1[[#This Row],[Jour]]=\"ve\",8,8.75))))","v":8.75}]
[null,"2020-08-20",{"$f":"_xlfn.ISOWEEKNUM(Tableau1[[#This Row],[Date]])","v":34},{"$f":"MONTH(Tableau1[[#This Row],[Date]])","v":8},{"$f":"TEXT(Tableau1[[#This Row],[Date]],\"mmmm\")","v":"août"},{"$f":"CHOOSE(WEEKDAY(Tableau1[[#This Row],[Date]],2),\"lu\",\"ma\",\"me\",\"je\",\"ve\",\"sa\",\"di\")","v":"je"},{"$f":"IFERROR(VLOOKUP(B329,Tableau30[],3,FALSE),IF(OR(AND($K$5<=B329,$L$5>B329),AND($K$6<=Tableau1[[#This Row],[Date]],$L$6>=Tableau1[[#This Row],[Date]])),\"FERMÉE\",IF(OR(Tableau1[[#This Row],[Jour]]=\"sa\",Tableau1[[#This Row],[Jour]]=\"di\",AND(Tableau1[[#This Row],[Jour]]=\"ve\",MOD(Tableau1[[#This Row],[N°S]],2)=1)),\"REPOS\",IF(Tableau1[[#This Row],[Jour]]=\"ve\",8,8.75))))","v":8.75}]
[null,"2020-08-21",{"$f":"_xlfn.ISOWEEKNUM(Tableau1[[#This Row],[Date]])","v":34},{"$f":"MONTH(Tableau1[[#This Row],[Date]])","v":8},{"$f":"TEXT(Tableau1[[#This Row],[Date]],\"mmmm\")","v":"août"},{"$f":"CHOOSE(WEEKDAY(Tableau1[[#This Row],[Date]],2),\"lu\",\"ma\",\"me\",\"je\",\"ve\",\"sa\",\"di\")","v":"ve"},{"$f":"IFERROR(VLOOKUP(B330,Tableau30[],3,FALSE),IF(OR(AND($K$5<=B330,$L$5>B330),AND($K$6<=Tableau1[[#This Row],[Date]],$L$6>=Tableau1[[#This Row],[Date]])),\"FERMÉE\",IF(OR(Tableau1[[#This Row],[Jour]]=\"sa\",Tableau1[[#This Row],[Jour]]=\"di\",AND(Tableau1[[#This Row],[Jour]]=\"ve\",MOD(Tableau1[[#This Row],[N°S]],2)=1)),\"REPOS\",IF(Tableau1[[#This Row],[Jour]]=\"ve\",8,8.75))))","v":8}]
[null,"2020-08-22",{"$f":"_xlfn.ISOWEEKNUM(Tableau1[[#This Row],[Date]])","v":34},{"$f":"MONTH(Tableau1[[#This Row],[Date]])","v":8},{"$f":"TEXT(Tableau1[[#This Row],[Date]],\"mmmm\")","v":"août"},{"$f":"CHOOSE(WEEKDAY(Tableau1[[#This Row],[Date]],2),\"lu\",\"ma\",\"me\",\"je\",\"ve\",\"sa\",\"di\")","v":"sa"},{"$f":"IFERROR(VLOOKUP(B331,Tableau30[],3,FALSE),IF(OR(AND($K$5<=B331,$L$5>B331),AND($K$6<=Tableau1[[#This Row],[Date]],$L$6>=Tableau1[[#This Row],[Date]])),\"FERMÉE\",IF(OR(Tableau1[[#This Row],[Jour]]=\"sa\",Tableau1[[#This Row],[Jour]]=\"di\",AND(Tableau1[[#This Row],[Jour]]=\"ve\",MOD(Tableau1[[#This Row],[N°S]],2)=1)),\"REPOS\",IF(Tableau1[[#This Row],[Jour]]=\"ve\",8,8.75))))","v":"REPOS"}]
[null,"2020-08-23",{"$f":"_xlfn.ISOWEEKNUM(Tableau1[[#This Row],[Date]])","v":34},{"$f":"MONTH(Tableau1[[#This Row],[Date]])","v":8},{"$f":"TEXT(Tableau1[[#This Row],[Date]],\"mmmm\")","v":"août"},{"$f":"CHOOSE(WEEKDAY(Tableau1[[#This Row],[Date]],2),\"lu\",\"ma\",\"me\",\"je\",\"ve\",\"sa\",\"di\")","v":"di"},{"$f":"IFERROR(VLOOKUP(B332,Tableau30[],3,FALSE),IF(OR(AND($K$5<=B332,$L$5>B332),AND($K$6<=Tableau1[[#This Row],[Date]],$L$6>=Tableau1[[#This Row],[Date]])),\"FERMÉE\",IF(OR(Tableau1[[#This Row],[Jour]]=\"sa\",Tableau1[[#This Row],[Jour]]=\"di\",AND(Tableau1[[#This Row],[Jour]]=\"ve\",MOD(Tableau1[[#This Row],[N°S]],2)=1)),\"REPOS\",IF(Tableau1[[#This Row],[Jour]]=\"ve\",8,8.75))))","v":"REPOS"}]
[null,"2020-08-24",{"$f":"_xlfn.ISOWEEKNUM(Tableau1[[#This Row],[Date]])","v":35},{"$f":"MONTH(Tableau1[[#This Row],[Date]])","v":8},{"$f":"TEXT(Tableau1[[#This Row],[Date]],\"mmmm\")","v":"août"},{"$f":"CHOOSE(WEEKDAY(Tableau1[[#This Row],[Date]],2),\"lu\",\"ma\",\"me\",\"je\",\"ve\",\"sa\",\"di\")","v":"lu"},{"$f":"IFERROR(VLOOKUP(B333,Tableau30[],3,FALSE),IF(OR(AND($K$5<=B333,$L$5>B333),AND($K$6<=Tableau1[[#This Row],[Date]],$L$6>=Tableau1[[#This Row],[Date]])),\"FERMÉE\",IF(OR(Tableau1[[#This Row],[Jour]]=\"sa\",Tableau1[[#This Row],[Jour]]=\"di\",AND(Tableau1[[#This Row],[Jour]]=\"ve\",MOD(Tableau1[[#This Row],[N°S]],2)=1)),\"REPOS\",IF(Tableau1[[#This Row],[Jour]]=\"ve\",8,8.75))))","v":8.75}]
[null,"2020-08-25",{"$f":"_xlfn.ISOWEEKNUM(Tableau1[[#This Row],[Date]])","v":35},{"$f":"MONTH(Tableau1[[#This Row],[Date]])","v":8},{"$f":"TEXT(Tableau1[[#This Row],[Date]],\"mmmm\")","v":"août"},{"$f":"CHOOSE(WEEKDAY(Tableau1[[#This Row],[Date]],2),\"lu\",\"ma\",\"me\",\"je\",\"ve\",\"sa\",\"di\")","v":"ma"},{"$f":"IFERROR(VLOOKUP(B334,Tableau30[],3,FALSE),IF(OR(AND($K$5<=B334,$L$5>B334),AND($K$6<=Tableau1[[#This Row],[Date]],$L$6>=Tableau1[[#This Row],[Date]])),\"FERMÉE\",IF(OR(Tableau1[[#This Row],[Jour]]=\"sa\",Tableau1[[#This Row],[Jour]]=\"di\",AND(Tableau1[[#This Row],[Jour]]=\"ve\",MOD(Tableau1[[#This Row],[N°S]],2)=1)),\"REPOS\",IF(Tableau1[[#This Row],[Jour]]=\"ve\",8,8.75))))","v":8.75}]
[null,"2020-08-26",{"$f":"_xlfn.ISOWEEKNUM(Tableau1[[#This Row],[Date]])","v":35},{"$f":"MONTH(Tableau1[[#This Row],[Date]])","v":8},{"$f":"TEXT(Tableau1[[#This Row],[Date]],\"mmmm\")","v":"août"},{"$f":"CHOOSE(WEEKDAY(Tableau1[[#This Row],[Date]],2),\"lu\",\"ma\",\"me\",\"je\",\"ve\",\"sa\",\"di\")","v":"me"},{"$f":"IFERROR(VLOOKUP(B335,Tableau30[],3,FALSE),IF(OR(AND($K$5<=B335,$L$5>B335),AND($K$6<=Tableau1[[#This Row],[Date]],$L$6>=Tableau1[[#This Row],[Date]])),\"FERMÉE\",IF(OR(Tableau1[[#This Row],[Jour]]=\"sa\",Tableau1[[#This Row],[Jour]]=\"di\",AND(Tableau1[[#This Row],[Jour]]=\"ve\",MOD(Tableau1[[#This Row],[N°S]],2)=1)),\"REPOS\",IF(Tableau1[[#This Row],[Jour]]=\"ve\",8,8.75))))","v":8.75}]
[null,"2020-08-27",{"$f":"_xlfn.ISOWEEKNUM(Tableau1[[#This Row],[Date]])","v":35},{"$f":"MONTH(Tableau1[[#This Row],[Date]])","v":8},{"$f":"TEXT(Tableau1[[#This Row],[Date]],\"mmmm\")","v":"août"},{"$f":"CHOOSE(WEEKDAY(Tableau1[[#This Row],[Date]],2),\"lu\",\"ma\",\"me\",\"je\",\"ve\",\"sa\",\"di\")","v":"je"},{"$f":"IFERROR(VLOOKUP(B336,Tableau30[],3,FALSE),IF(OR(AND($K$5<=B336,$L$5>B336),AND($K$6<=Tableau1[[#This Row],[Date]],$L$6>=Tableau1[[#This Row],[Date]])),\"FERMÉE\",IF(OR(Tableau1[[#This Row],[Jour]]=\"sa\",Tableau1[[#This Row],[Jour]]=\"di\",AND(Tableau1[[#This Row],[Jour]]=\"ve\",MOD(Tableau1[[#This Row],[N°S]],2)=1)),\"REPOS\",IF(Tableau1[[#This Row],[Jour]]=\"ve\",8,8.75))))","v":8.75}]
[null,"2020-08-28",{"$f":"_xlfn.ISOWEEKNUM(Tableau1[[#This Row],[Date]])","v":35},{"$f":"MONTH(Tableau1[[#This Row],[Date]])","v":8},{"$f":"TEXT(Tableau1[[#This Row],[Date]],\"mmmm\")","v":"août"},{"$f":"CHOOSE(WEEKDAY(Tableau1[[#This Row],[Date]],2),\"lu\",\"ma\",\"me\",\"je\",\"ve\",\"sa\",\"di\")","v":"ve"},{"$f":"IFERROR(VLOOKUP(B337,Tableau30[],3,FALSE),IF(OR(AND($K$5<=B337,$L$5>B337),AND($K$6<=Tableau1[[#This Row],[Date]],$L$6>=Tableau1[[#This Row],[Date]])),\"FERMÉE\",IF(OR(Tableau1[[#This Row],[Jour]]=\"sa\",Tableau1[[#This Row],[Jour]]=\"di\",AND(Tableau1[[#This Row],[Jour]]=\"ve\",MOD(Tableau1[[#This Row],[N°S]],2)=1)),\"REPOS\",IF(Tableau1[[#This Row],[Jour]]=\"ve\",8,8.75))))","v":"REPOS"}]
[null,"2020-08-29",{"$f":"_xlfn.ISOWEEKNUM(Tableau1[[#This Row],[Date]])","v":35},{"$f":"MONTH(Tableau1[[#This Row],[Date]])","v":8},{"$f":"TEXT(Tableau1[[#This Row],[Date]],\"mmmm\")","v":"août"},{"$f":"CHOOSE(WEEKDAY(Tableau1[[#This Row],[Date]],2),\"lu\",\"ma\",\"me\",\"je\",\"ve\",\"sa\",\"di\")","v":"sa"},{"$f":"IFERROR(VLOOKUP(B338,Tableau30[],3,FALSE),IF(OR(AND($K$5<=B338,$L$5>B338),AND($K$6<=Tableau1[[#This Row],[Date]],$L$6>=Tableau1[[#This Row],[Date]])),\"FERMÉE\",IF(OR(Tableau1[[#This Row],[Jour]]=\"sa\",Tableau1[[#This Row],[Jour]]=\"di\",AND(Tableau1[[#This Row],[Jour]]=\"ve\",MOD(Tableau1[[#This Row],[N°S]],2)=1)),\"REPOS\",IF(Tableau1[[#This Row],[Jour]]=\"ve\",8,8.75))))","v":"REPOS"}]
[null,"2020-08-30",{"$f":"_xlfn.ISOWEEKNUM(Tableau1[[#This Row],[Date]])","v":35},{"$f":"MONTH(Tableau1[[#This Row],[Date]])","v":8},{"$f":"TEXT(Tableau1[[#This Row],[Date]],\"mmmm\")","v":"août"},{"$f":"CHOOSE(WEEKDAY(Tableau1[[#This Row],[Date]],2),\"lu\",\"ma\",\"me\",\"je\",\"ve\",\"sa\",\"di\")","v":"di"},{"$f":"IFERROR(VLOOKUP(B339,Tableau30[],3,FALSE),IF(OR(AND($K$5<=B339,$L$5>B339),AND($K$6<=Tableau1[[#This Row],[Date]],$L$6>=Tableau1[[#This Row],[Date]])),\"FERMÉE\",IF(OR(Tableau1[[#This Row],[Jour]]=\"sa\",Tableau1[[#This Row],[Jour]]=\"di\",AND(Tableau1[[#This Row],[Jour]]=\"ve\",MOD(Tableau1[[#This Row],[N°S]],2)=1)),\"REPOS\",IF(Tableau1[[#This Row],[Jour]]=\"ve\",8,8.75))))","v":"REPOS"}]
[null,"2020-08-31",{"$f":"_xlfn.ISOWEEKNUM(Tableau1[[#This Row],[Date]])","v":36},{"$f":"MONTH(Tableau1[[#This Row],[Date]])","v":8},{"$f":"TEXT(Tableau1[[#This Row],[Date]],\"mmmm\")","v":"août"},{"$f":"CHOOSE(WEEKDAY(Tableau1[[#This Row],[Date]],2),\"lu\",\"ma\",\"me\",\"je\",\"ve\",\"sa\",\"di\")","v":"lu"},{"$f":"IFERROR(VLOOKUP(B340,Tableau30[],3,FALSE),IF(OR(AND($K$5<=B340,$L$5>B340),AND($K$6<=Tableau1[[#This Row],[Date]],$L$6>=Tableau1[[#This Row],[Date]])),\"FERMÉE\",IF(OR(Tableau1[[#This Row],[Jour]]=\"sa\",Tableau1[[#This Row],[Jour]]=\"di\",AND(Tableau1[[#This Row],[Jour]]=\"ve\",MOD(Tableau1[[#This Row],[N°S]],2)=1)),\"REPOS\",IF(Tableau1[[#This Row],[Jour]]=\"ve\",8,8.75))))","v":8.75}]
[null,"2020-09-01",{"$f":"_xlfn.ISOWEEKNUM(Tableau1[[#This Row],[Date]])","v":36},{"$f":"MONTH(Tableau1[[#This Row],[Date]])","v":9},{"$f":"TEXT(Tableau1[[#This Row],[Date]],\"mmmm\")","v":"septembre"},{"$f":"CHOOSE(WEEKDAY(Tableau1[[#This Row],[Date]],2),\"lu\",\"ma\",\"me\",\"je\",\"ve\",\"sa\",\"di\")","v":"ma"},{"$f":"IFERROR(VLOOKUP(B341,Tableau30[],3,FALSE),IF(OR(AND($K$5<=B341,$L$5>B341),AND($K$6<=Tableau1[[#This Row],[Date]],$L$6>=Tableau1[[#This Row],[Date]])),\"FERMÉE\",IF(OR(Tableau1[[#This Row],[Jour]]=\"sa\",Tableau1[[#This Row],[Jour]]=\"di\",AND(Tableau1[[#This Row],[Jour]]=\"ve\",MOD(Tableau1[[#This Row],[N°S]],2)=1)),\"REPOS\",IF(Tableau1[[#This Row],[Jour]]=\"ve\",8,8.75))))","v":8.75}]
[null,"2020-09-02",{"$f":"_xlfn.ISOWEEKNUM(Tableau1[[#This Row],[Date]])","v":36},{"$f":"MONTH(Tableau1[[#This Row],[Date]])","v":9},{"$f":"TEXT(Tableau1[[#This Row],[Date]],\"mmmm\")","v":"septembre"},{"$f":"CHOOSE(WEEKDAY(Tableau1[[#This Row],[Date]],2),\"lu\",\"ma\",\"me\",\"je\",\"ve\",\"sa\",\"di\")","v":"me"},{"$f":"IFERROR(VLOOKUP(B342,Tableau30[],3,FALSE),IF(OR(AND($K$5<=B342,$L$5>B342),AND($K$6<=Tableau1[[#This Row],[Date]],$L$6>=Tableau1[[#This Row],[Date]])),\"FERMÉE\",IF(OR(Tableau1[[#This Row],[Jour]]=\"sa\",Tableau1[[#This Row],[Jour]]=\"di\",AND(Tableau1[[#This Row],[Jour]]=\"ve\",MOD(Tableau1[[#This Row],[N°S]],2)=1)),\"REPOS\",IF(Tableau1[[#This Row],[Jour]]=\"ve\",8,8.75))))","v":8.75}]
[null,"2020-09-03",{"$f":"_xlfn.ISOWEEKNUM(Tableau1[[#This Row],[Date]])","v":36},{"$f":"MONTH(Tableau1[[#This Row],[Date]])","v":9},{"$f":"TEXT(Tableau1[[#This Row],[Date]],\"mmmm\")","v":"septembre"},{"$f":"CHOOSE(WEEKDAY(Tableau1[[#This Row],[Date]],2),\"lu\",\"ma\",\"me\",\"je\",\"ve\",\"sa\",\"di\")","v":"je"},{"$f":"IFERROR(VLOOKUP(B343,Tableau30[],3,FALSE),IF(OR(AND($K$5<=B343,$L$5>B343),AND($K$6<=Tableau1[[#This Row],[Date]],$L$6>=Tableau1[[#This Row],[Date]])),\"FERMÉE\",IF(OR(Tableau1[[#This Row],[Jour]]=\"sa\",Tableau1[[#This Row],[Jour]]=\"di\",AND(Tableau1[[#This Row],[Jour]]=\"ve\",MOD(Tableau1[[#This Row],[N°S]],2)=1)),\"REPOS\",IF(Tableau1[[#This Row],[Jour]]=\"ve\",8,8.75))))","v":8.75}]
[null,"2020-09-04",{"$f":"_xlfn.ISOWEEKNUM(Tableau1[[#This Row],[Date]])","v":36},{"$f":"MONTH(Tableau1[[#This Row],[Date]])","v":9},{"$f":"TEXT(Tableau1[[#This Row],[Date]],\"mmmm\")","v":"septembre"},{"$f":"CHOOSE(WEEKDAY(Tableau1[[#This Row],[Date]],2),\"lu\",\"ma\",\"me\",\"je\",\"ve\",\"sa\",\"di\")","v":"ve"},{"$f":"IFERROR(VLOOKUP(B344,Tableau30[],3,FALSE),IF(OR(AND($K$5<=B344,$L$5>B344),AND($K$6<=Tableau1[[#This Row],[Date]],$L$6>=Tableau1[[#This Row],[Date]])),\"FERMÉE\",IF(OR(Tableau1[[#This Row],[Jour]]=\"sa\",Tableau1[[#This Row],[Jour]]=\"di\",AND(Tableau1[[#This Row],[Jour]]=\"ve\",MOD(Tableau1[[#This Row],[N°S]],2)=1)),\"REPOS\",IF(Tableau1[[#This Row],[Jour]]=\"ve\",8,8.75))))","v":8}]
[null,"2020-09-05",{"$f":"_xlfn.ISOWEEKNUM(Tableau1[[#This Row],[Date]])","v":36},{"$f":"MONTH(Tableau1[[#This Row],[Date]])","v":9},{"$f":"TEXT(Tableau1[[#This Row],[Date]],\"mmmm\")","v":"septembre"},{"$f":"CHOOSE(WEEKDAY(Tableau1[[#This Row],[Date]],2),\"lu\",\"ma\",\"me\",\"je\",\"ve\",\"sa\",\"di\")","v":"sa"},{"$f":"IFERROR(VLOOKUP(B345,Tableau30[],3,FALSE),IF(OR(AND($K$5<=B345,$L$5>B345),AND($K$6<=Tableau1[[#This Row],[Date]],$L$6>=Tableau1[[#This Row],[Date]])),\"FERMÉE\",IF(OR(Tableau1[[#This Row],[Jour]]=\"sa\",Tableau1[[#This Row],[Jour]]=\"di\",AND(Tableau1[[#This Row],[Jour]]=\"ve\",MOD(Tableau1[[#This Row],[N°S]],2)=1)),\"REPOS\",IF(Tableau1[[#This Row],[Jour]]=\"ve\",8,8.75))))","v":"REPOS"}]
[null,"2020-09-06",{"$f":"_xlfn.ISOWEEKNUM(Tableau1[[#This Row],[Date]])","v":36},{"$f":"MONTH(Tableau1[[#This Row],[Date]])","v":9},{"$f":"TEXT(Tableau1[[#This Row],[Date]],\"mmmm\")","v":"septembre"},{"$f":"CHOOSE(WEEKDAY(Tableau1[[#This Row],[Date]],2),\"lu\",\"ma\",\"me\",\"je\",\"ve\",\"sa\",\"di\")","v":"di"},{"$f":"IFERROR(VLOOKUP(B346,Tableau30[],3,FALSE),IF(OR(AND($K$5<=B346,$L$5>B346),AND($K$6<=Tableau1[[#This Row],[Date]],$L$6>=Tableau1[[#This Row],[Date]])),\"FERMÉE\",IF(OR(Tableau1[[#This Row],[Jour]]=\"sa\",Tableau1[[#This Row],[Jour]]=\"di\",AND(Tableau1[[#This Row],[Jour]]=\"ve\",MOD(Tableau1[[#This Row],[N°S]],2)=1)),\"REPOS\",IF(Tableau1[[#This Row],[Jour]]=\"ve\",8,8.75))))","v":"REPOS"}]
[null,"2020-09-07",{"$f":"_xlfn.ISOWEEKNUM(Tableau1[[#This Row],[Date]])","v":37},{"$f":"MONTH(Tableau1[[#This Row],[Date]])","v":9},{"$f":"TEXT(Tableau1[[#This Row],[Date]],\"mmmm\")","v":"septembre"},{"$f":"CHOOSE(WEEKDAY(Tableau1[[#This Row],[Date]],2),\"lu\",\"ma\",\"me\",\"je\",\"ve\",\"sa\",\"di\")","v":"lu"},{"$f":"IFERROR(VLOOKUP(B347,Tableau30[],3,FALSE),IF(OR(AND($K$5<=B347,$L$5>B347),AND($K$6<=Tableau1[[#This Row],[Date]],$L$6>=Tableau1[[#This Row],[Date]])),\"FERMÉE\",IF(OR(Tableau1[[#This Row],[Jour]]=\"sa\",Tableau1[[#This Row],[Jour]]=\"di\",AND(Tableau1[[#This Row],[Jour]]=\"ve\",MOD(Tableau1[[#This Row],[N°S]],2)=1)),\"REPOS\",IF(Tableau1[[#This Row],[Jour]]=\"ve\",8,8.75))))","v":8.75}]
[null,"2020-09-08",{"$f":"_xlfn.ISOWEEKNUM(Tableau1[[#This Row],[Date]])","v":37},{"$f":"MONTH(Tableau1[[#This Row],[Date]])","v":9},{"$f":"TEXT(Tableau1[[#This Row],[Date]],\"mmmm\")","v":"septembre"},{"$f":"CHOOSE(WEEKDAY(Tableau1[[#This Row],[Date]],2),\"lu\",\"ma\",\"me\",\"je\",\"ve\",\"sa\",\"di\")","v":"ma"},{"$f":"IFERROR(VLOOKUP(B348,Tableau30[],3,FALSE),IF(OR(AND($K$5<=B348,$L$5>B348),AND($K$6<=Tableau1[[#This Row],[Date]],$L$6>=Tableau1[[#This Row],[Date]])),\"FERMÉE\",IF(OR(Tableau1[[#This Row],[Jour]]=\"sa\",Tableau1[[#This Row],[Jour]]=\"di\",AND(Tableau1[[#This Row],[Jour]]=\"ve\",MOD(Tableau1[[#This Row],[N°S]],2)=1)),\"REPOS\",IF(Tableau1[[#This Row],[Jour]]=\"ve\",8,8.75))))","v":8.75}]
[null,"2020-09-09",{"$f":"_xlfn.ISOWEEKNUM(Tableau1[[#This Row],[Date]])","v":37},{"$f":"MONTH(Tableau1[[#This Row],[Date]])","v":9},{"$f":"TEXT(Tableau1[[#This Row],[Date]],\"mmmm\")","v":"septembre"},{"$f":"CHOOSE(WEEKDAY(Tableau1[[#This Row],[Date]],2),\"lu\",\"ma\",\"me\",\"je\",\"ve\",\"sa\",\"di\")","v":"me"},{"$f":"IFERROR(VLOOKUP(B349,Tableau30[],3,FALSE),IF(OR(AND($K$5<=B349,$L$5>B349),AND($K$6<=Tableau1[[#This Row],[Date]],$L$6>=Tableau1[[#This Row],[Date]])),\"FERMÉE\",IF(OR(Tableau1[[#This Row],[Jour]]=\"sa\",Tableau1[[#This Row],[Jour]]=\"di\",AND(Tableau1[[#This Row],[Jour]]=\"ve\",MOD(Tableau1[[#This Row],[N°S]],2)=1)),\"REPOS\",IF(Tableau1[[#This Row],[Jour]]=\"ve\",8,8.75))))","v":8.75}]
[null,"2020-09-10",{"$f":"_xlfn.ISOWEEKNUM(Tableau1[[#This Row],[Date]])","v":37},{"$f":"MONTH(Tableau1[[#This Row],[Date]])","v":9},{"$f":"TEXT(Tableau1[[#This Row],[Date]],\"mmmm\")","v":"septembre"},{"$f":"CHOOSE(WEEKDAY(Tableau1[[#This Row],[Date]],2),\"lu\",\"ma\",\"me\",\"je\",\"ve\",\"sa\",\"di\")","v":"je"},{"$f":"IFERROR(VLOOKUP(B350,Tableau30[],3,FALSE),IF(OR(AND($K$5<=B350,$L$5>B350),AND($K$6<=Tableau1[[#This Row],[Date]],$L$6>=Tableau1[[#This Row],[Date]])),\"FERMÉE\",IF(OR(Tableau1[[#This Row],[Jour]]=\"sa\",Tableau1[[#This Row],[Jour]]=\"di\",AND(Tableau1[[#This Row],[Jour]]=\"ve\",MOD(Tableau1[[#This Row],[N°S]],2)=1)),\"REPOS\",IF(Tableau1[[#This Row],[Jour]]=\"ve\",8,8.75))))","v":8.75}]
[null,"2020-09-11",{"$f":"_xlfn.ISOWEEKNUM(Tableau1[[#This Row],[Date]])","v":37},{"$f":"MONTH(Tableau1[[#This Row],[Date]])","v":9},{"$f":"TEXT(Tableau1[[#This Row],[Date]],\"mmmm\")","v":"septembre"},{"$f":"CHOOSE(WEEKDAY(Tableau1[[#This Row],[Date]],2),\"lu\",\"ma\",\"me\",\"je\",\"ve\",\"sa\",\"di\")","v":"ve"},{"$f":"IFERROR(VLOOKUP(B351,Tableau30[],3,FALSE),IF(OR(AND($K$5<=B351,$L$5>B351),AND($K$6<=Tableau1[[#This Row],[Date]],$L$6>=Tableau1[[#This Row],[Date]])),\"FERMÉE\",IF(OR(Tableau1[[#This Row],[Jour]]=\"sa\",Tableau1[[#This Row],[Jour]]=\"di\",AND(Tableau1[[#This Row],[Jour]]=\"ve\",MOD(Tableau1[[#This Row],[N°S]],2)=1)),\"REPOS\",IF(Tableau1[[#This Row],[Jour]]=\"ve\",8,8.75))))","v":"REPOS"}]
[null,"2020-09-12",{"$f":"_xlfn.ISOWEEKNUM(Tableau1[[#This Row],[Date]])","v":37},{"$f":"MONTH(Tableau1[[#This Row],[Date]])","v":9},{"$f":"TEXT(Tableau1[[#This Row],[Date]],\"mmmm\")","v":"septembre"},{"$f":"CHOOSE(WEEKDAY(Tableau1[[#This Row],[Date]],2),\"lu\",\"ma\",\"me\",\"je\",\"ve\",\"sa\",\"di\")","v":"sa"},{"$f":"IFERROR(VLOOKUP(B352,Tableau30[],3,FALSE),IF(OR(AND($K$5<=B352,$L$5>B352),AND($K$6<=Tableau1[[#This Row],[Date]],$L$6>=Tableau1[[#This Row],[Date]])),\"FERMÉE\",IF(OR(Tableau1[[#This Row],[Jour]]=\"sa\",Tableau1[[#This Row],[Jour]]=\"di\",AND(Tableau1[[#This Row],[Jour]]=\"ve\",MOD(Tableau1[[#This Row],[N°S]],2)=1)),\"REPOS\",IF(Tableau1[[#This Row],[Jour]]=\"ve\",8,8.75))))","v":"REPOS"}]
[null,"2020-09-13",{"$f":"_xlfn.ISOWEEKNUM(Tableau1[[#This Row],[Date]])","v":37},{"$f":"MONTH(Tableau1[[#This Row],[Date]])","v":9},{"$f":"TEXT(Tableau1[[#This Row],[Date]],\"mmmm\")","v":"septembre"},{"$f":"CHOOSE(WEEKDAY(Tableau1[[#This Row],[Date]],2),\"lu\",\"ma\",\"me\",\"je\",\"ve\",\"sa\",\"di\")","v":"di"},{"$f":"IFERROR(VLOOKUP(B353,Tableau30[],3,FALSE),IF(OR(AND($K$5<=B353,$L$5>B353),AND($K$6<=Tableau1[[#This Row],[Date]],$L$6>=Tableau1[[#This Row],[Date]])),\"FERMÉE\",IF(OR(Tableau1[[#This Row],[Jour]]=\"sa\",Tableau1[[#This Row],[Jour]]=\"di\",AND(Tableau1[[#This Row],[Jour]]=\"ve\",MOD(Tableau1[[#This Row],[N°S]],2)=1)),\"REPOS\",IF(Tableau1[[#This Row],[Jour]]=\"ve\",8,8.75))))","v":"REPOS"}]
[null,"2020-09-14",{"$f":"_xlfn.ISOWEEKNUM(Tableau1[[#This Row],[Date]])","v":38},{"$f":"MONTH(Tableau1[[#This Row],[Date]])","v":9},{"$f":"TEXT(Tableau1[[#This Row],[Date]],\"mmmm\")","v":"septembre"},{"$f":"CHOOSE(WEEKDAY(Tableau1[[#This Row],[Date]],2),\"lu\",\"ma\",\"me\",\"je\",\"ve\",\"sa\",\"di\")","v":"lu"},{"$f":"IFERROR(VLOOKUP(B354,Tableau30[],3,FALSE),IF(OR(AND($K$5<=B354,$L$5>B354),AND($K$6<=Tableau1[[#This Row],[Date]],$L$6>=Tableau1[[#This Row],[Date]])),\"FERMÉE\",IF(OR(Tableau1[[#This Row],[Jour]]=\"sa\",Tableau1[[#This Row],[Jour]]=\"di\",AND(Tableau1[[#This Row],[Jour]]=\"ve\",MOD(Tableau1[[#This Row],[N°S]],2)=1)),\"REPOS\",IF(Tableau1[[#This Row],[Jour]]=\"ve\",8,8.75))))","v":8.75}]
[null,"2020-09-15",{"$f":"_xlfn.ISOWEEKNUM(Tableau1[[#This Row],[Date]])","v":38},{"$f":"MONTH(Tableau1[[#This Row],[Date]])","v":9},{"$f":"TEXT(Tableau1[[#This Row],[Date]],\"mmmm\")","v":"septembre"},{"$f":"CHOOSE(WEEKDAY(Tableau1[[#This Row],[Date]],2),\"lu\",\"ma\",\"me\",\"je\",\"ve\",\"sa\",\"di\")","v":"ma"},{"$f":"IFERROR(VLOOKUP(B355,Tableau30[],3,FALSE),IF(OR(AND($K$5<=B355,$L$5>B355),AND($K$6<=Tableau1[[#This Row],[Date]],$L$6>=Tableau1[[#This Row],[Date]])),\"FERMÉE\",IF(OR(Tableau1[[#This Row],[Jour]]=\"sa\",Tableau1[[#This Row],[Jour]]=\"di\",AND(Tableau1[[#This Row],[Jour]]=\"ve\",MOD(Tableau1[[#This Row],[N°S]],2)=1)),\"REPOS\",IF(Tableau1[[#This Row],[Jour]]=\"ve\",8,8.75))))","v":8.75}]
[null,"2020-09-16",{"$f":"_xlfn.ISOWEEKNUM(Tableau1[[#This Row],[Date]])","v":38},{"$f":"MONTH(Tableau1[[#This Row],[Date]])","v":9},{"$f":"TEXT(Tableau1[[#This Row],[Date]],\"mmmm\")","v":"septembre"},{"$f":"CHOOSE(WEEKDAY(Tableau1[[#This Row],[Date]],2),\"lu\",\"ma\",\"me\",\"je\",\"ve\",\"sa\",\"di\")","v":"me"},{"$f":"IFERROR(VLOOKUP(B356,Tableau30[],3,FALSE),IF(OR(AND($K$5<=B356,$L$5>B356),AND($K$6<=Tableau1[[#This Row],[Date]],$L$6>=Tableau1[[#This Row],[Date]])),\"FERMÉE\",IF(OR(Tableau1[[#This Row],[Jour]]=\"sa\",Tableau1[[#This Row],[Jour]]=\"di\",AND(Tableau1[[#This Row],[Jour]]=\"ve\",MOD(Tableau1[[#This Row],[N°S]],2)=1)),\"REPOS\",IF(Tableau1[[#This Row],[Jour]]=\"ve\",8,8.75))))","v":8.75}]
[null,"2020-09-17",{"$f":"_xlfn.ISOWEEKNUM(Tableau1[[#This Row],[Date]])","v":38},{"$f":"MONTH(Tableau1[[#This Row],[Date]])","v":9},{"$f":"TEXT(Tableau1[[#This Row],[Date]],\"mmmm\")","v":"septembre"},{"$f":"CHOOSE(WEEKDAY(Tableau1[[#This Row],[Date]],2),\"lu\",\"ma\",\"me\",\"je\",\"ve\",\"sa\",\"di\")","v":"je"},{"$f":"IFERROR(VLOOKUP(B357,Tableau30[],3,FALSE),IF(OR(AND($K$5<=B357,$L$5>B357),AND($K$6<=Tableau1[[#This Row],[Date]],$L$6>=Tableau1[[#This Row],[Date]])),\"FERMÉE\",IF(OR(Tableau1[[#This Row],[Jour]]=\"sa\",Tableau1[[#This Row],[Jour]]=\"di\",AND(Tableau1[[#This Row],[Jour]]=\"ve\",MOD(Tableau1[[#This Row],[N°S]],2)=1)),\"REPOS\",IF(Tableau1[[#This Row],[Jour]]=\"ve\",8,8.75))))","v":8.75}]
[null,"2020-09-18",{"$f":"_xlfn.ISOWEEKNUM(Tableau1[[#This Row],[Date]])","v":38},{"$f":"MONTH(Tableau1[[#This Row],[Date]])","v":9},{"$f":"TEXT(Tableau1[[#This Row],[Date]],\"mmmm\")","v":"septembre"},{"$f":"CHOOSE(WEEKDAY(Tableau1[[#This Row],[Date]],2),\"lu\",\"ma\",\"me\",\"je\",\"ve\",\"sa\",\"di\")","v":"ve"},{"$f":"IFERROR(VLOOKUP(B358,Tableau30[],3,FALSE),IF(OR(AND($K$5<=B358,$L$5>B358),AND($K$6<=Tableau1[[#This Row],[Date]],$L$6>=Tableau1[[#This Row],[Date]])),\"FERMÉE\",IF(OR(Tableau1[[#This Row],[Jour]]=\"sa\",Tableau1[[#This Row],[Jour]]=\"di\",AND(Tableau1[[#This Row],[Jour]]=\"ve\",MOD(Tableau1[[#This Row],[N°S]],2)=1)),\"REPOS\",IF(Tableau1[[#This Row],[Jour]]=\"ve\",8,8.75))))","v":8}]
[null,"2020-09-19",{"$f":"_xlfn.ISOWEEKNUM(Tableau1[[#This Row],[Date]])","v":38},{"$f":"MONTH(Tableau1[[#This Row],[Date]])","v":9},{"$f":"TEXT(Tableau1[[#This Row],[Date]],\"mmmm\")","v":"septembre"},{"$f":"CHOOSE(WEEKDAY(Tableau1[[#This Row],[Date]],2),\"lu\",\"ma\",\"me\",\"je\",\"ve\",\"sa\",\"di\")","v":"sa"},{"$f":"IFERROR(VLOOKUP(B359,Tableau30[],3,FALSE),IF(OR(AND($K$5<=B359,$L$5>B359),AND($K$6<=Tableau1[[#This Row],[Date]],$L$6>=Tableau1[[#This Row],[Date]])),\"FERMÉE\",IF(OR(Tableau1[[#This Row],[Jour]]=\"sa\",Tableau1[[#This Row],[Jour]]=\"di\",AND(Tableau1[[#This Row],[Jour]]=\"ve\",MOD(Tableau1[[#This Row],[N°S]],2)=1)),\"REPOS\",IF(Tableau1[[#This Row],[Jour]]=\"ve\",8,8.75))))","v":"REPOS"}]
[null,"2020-09-20",{"$f":"_xlfn.ISOWEEKNUM(Tableau1[[#This Row],[Date]])","v":38},{"$f":"MONTH(Tableau1[[#This Row],[Date]])","v":9},{"$f":"TEXT(Tableau1[[#This Row],[Date]],\"mmmm\")","v":"septembre"},{"$f":"CHOOSE(WEEKDAY(Tableau1[[#This Row],[Date]],2),\"lu\",\"ma\",\"me\",\"je\",\"ve\",\"sa\",\"di\")","v":"di"},{"$f":"IFERROR(VLOOKUP(B360,Tableau30[],3,FALSE),IF(OR(AND($K$5<=B360,$L$5>B360),AND($K$6<=Tableau1[[#This Row],[Date]],$L$6>=Tableau1[[#This Row],[Date]])),\"FERMÉE\",IF(OR(Tableau1[[#This Row],[Jour]]=\"sa\",Tableau1[[#This Row],[Jour]]=\"di\",AND(Tableau1[[#This Row],[Jour]]=\"ve\",MOD(Tableau1[[#This Row],[N°S]],2)=1)),\"REPOS\",IF(Tableau1[[#This Row],[Jour]]=\"ve\",8,8.75))))","v":"REPOS"}]
[null,"2020-09-21",{"$f":"_xlfn.ISOWEEKNUM(Tableau1[[#This Row],[Date]])","v":39},{"$f":"MONTH(Tableau1[[#This Row],[Date]])","v":9},{"$f":"TEXT(Tableau1[[#This Row],[Date]],\"mmmm\")","v":"septembre"},{"$f":"CHOOSE(WEEKDAY(Tableau1[[#This Row],[Date]],2),\"lu\",\"ma\",\"me\",\"je\",\"ve\",\"sa\",\"di\")","v":"lu"},{"$f":"IFERROR(VLOOKUP(B361,Tableau30[],3,FALSE),IF(OR(AND($K$5<=B361,$L$5>B361),AND($K$6<=Tableau1[[#This Row],[Date]],$L$6>=Tableau1[[#This Row],[Date]])),\"FERMÉE\",IF(OR(Tableau1[[#This Row],[Jour]]=\"sa\",Tableau1[[#This Row],[Jour]]=\"di\",AND(Tableau1[[#This Row],[Jour]]=\"ve\",MOD(Tableau1[[#This Row],[N°S]],2)=1)),\"REPOS\",IF(Tableau1[[#This Row],[Jour]]=\"ve\",8,8.75))))","v":8.75}]
[null,"2020-09-22",{"$f":"_xlfn.ISOWEEKNUM(Tableau1[[#This Row],[Date]])","v":39},{"$f":"MONTH(Tableau1[[#This Row],[Date]])","v":9},{"$f":"TEXT(Tableau1[[#This Row],[Date]],\"mmmm\")","v":"septembre"},{"$f":"CHOOSE(WEEKDAY(Tableau1[[#This Row],[Date]],2),\"lu\",\"ma\",\"me\",\"je\",\"ve\",\"sa\",\"di\")","v":"ma"},{"$f":"IFERROR(VLOOKUP(B362,Tableau30[],3,FALSE),IF(OR(AND($K$5<=B362,$L$5>B362),AND($K$6<=Tableau1[[#This Row],[Date]],$L$6>=Tableau1[[#This Row],[Date]])),\"FERMÉE\",IF(OR(Tableau1[[#This Row],[Jour]]=\"sa\",Tableau1[[#This Row],[Jour]]=\"di\",AND(Tableau1[[#This Row],[Jour]]=\"ve\",MOD(Tableau1[[#This Row],[N°S]],2)=1)),\"REPOS\",IF(Tableau1[[#This Row],[Jour]]=\"ve\",8,8.75))))","v":8.75}]
[null,"2020-09-23",{"$f":"_xlfn.ISOWEEKNUM(Tableau1[[#This Row],[Date]])","v":39},{"$f":"MONTH(Tableau1[[#This Row],[Date]])","v":9},{"$f":"TEXT(Tableau1[[#This Row],[Date]],\"mmmm\")","v":"septembre"},{"$f":"CHOOSE(WEEKDAY(Tableau1[[#This Row],[Date]],2),\"lu\",\"ma\",\"me\",\"je\",\"ve\",\"sa\",\"di\")","v":"me"},{"$f":"IFERROR(VLOOKUP(B363,Tableau30[],3,FALSE),IF(OR(AND($K$5<=B363,$L$5>B363),AND($K$6<=Tableau1[[#This Row],[Date]],$L$6>=Tableau1[[#This Row],[Date]])),\"FERMÉE\",IF(OR(Tableau1[[#This Row],[Jour]]=\"sa\",Tableau1[[#This Row],[Jour]]=\"di\",AND(Tableau1[[#This Row],[Jour]]=\"ve\",MOD(Tableau1[[#This Row],[N°S]],2)=1)),\"REPOS\",IF(Tableau1[[#This Row],[Jour]]=\"ve\",8,8.75))))","v":8.75}]
[null,"2020-09-24",{"$f":"_xlfn.ISOWEEKNUM(Tableau1[[#This Row],[Date]])","v":39},{"$f":"MONTH(Tableau1[[#This Row],[Date]])","v":9},{"$f":"TEXT(Tableau1[[#This Row],[Date]],\"mmmm\")","v":"septembre"},{"$f":"CHOOSE(WEEKDAY(Tableau1[[#This Row],[Date]],2),\"lu\",\"ma\",\"me\",\"je\",\"ve\",\"sa\",\"di\")","v":"je"},{"$f":"IFERROR(VLOOKUP(B364,Tableau30[],3,FALSE),IF(OR(AND($K$5<=B364,$L$5>B364),AND($K$6<=Tableau1[[#This Row],[Date]],$L$6>=Tableau1[[#This Row],[Date]])),\"FERMÉE\",IF(OR(Tableau1[[#This Row],[Jour]]=\"sa\",Tableau1[[#This Row],[Jour]]=\"di\",AND(Tableau1[[#This Row],[Jour]]=\"ve\",MOD(Tableau1[[#This Row],[N°S]],2)=1)),\"REPOS\",IF(Tableau1[[#This Row],[Jour]]=\"ve\",8,8.75))))","v":8.75}]
[null,"2020-09-25",{"$f":"_xlfn.ISOWEEKNUM(Tableau1[[#This Row],[Date]])","v":39},{"$f":"MONTH(Tableau1[[#This Row],[Date]])","v":9},{"$f":"TEXT(Tableau1[[#This Row],[Date]],\"mmmm\")","v":"septembre"},{"$f":"CHOOSE(WEEKDAY(Tableau1[[#This Row],[Date]],2),\"lu\",\"ma\",\"me\",\"je\",\"ve\",\"sa\",\"di\")","v":"ve"},{"$f":"IFERROR(VLOOKUP(B365,Tableau30[],3,FALSE),IF(OR(AND($K$5<=B365,$L$5>B365),AND($K$6<=Tableau1[[#This Row],[Date]],$L$6>=Tableau1[[#This Row],[Date]])),\"FERMÉE\",IF(OR(Tableau1[[#This Row],[Jour]]=\"sa\",Tableau1[[#This Row],[Jour]]=\"di\",AND(Tableau1[[#This Row],[Jour]]=\"ve\",MOD(Tableau1[[#This Row],[N°S]],2)=1)),\"REPOS\",IF(Tableau1[[#This Row],[Jour]]=\"ve\",8,8.75))))","v":"REPOS"}]
[null,"2020-09-26",{"$f":"_xlfn.ISOWEEKNUM(Tableau1[[#This Row],[Date]])","v":39},{"$f":"MONTH(Tableau1[[#This Row],[Date]])","v":9},{"$f":"TEXT(Tableau1[[#This Row],[Date]],\"mmmm\")","v":"septembre"},{"$f":"CHOOSE(WEEKDAY(Tableau1[[#This Row],[Date]],2),\"lu\",\"ma\",\"me\",\"je\",\"ve\",\"sa\",\"di\")","v":"sa"},{"$f":"IFERROR(VLOOKUP(B366,Tableau30[],3,FALSE),IF(OR(AND($K$5<=B366,$L$5>B366),AND($K$6<=Tableau1[[#This Row],[Date]],$L$6>=Tableau1[[#This Row],[Date]])),\"FERMÉE\",IF(OR(Tableau1[[#This Row],[Jour]]=\"sa\",Tableau1[[#This Row],[Jour]]=\"di\",AND(Tableau1[[#This Row],[Jour]]=\"ve\",MOD(Tableau1[[#This Row],[N°S]],2)=1)),\"REPOS\",IF(Tableau1[[#This Row],[Jour]]=\"ve\",8,8.75))))","v":"REPOS"}]
[null,"2020-09-27",{"$f":"_xlfn.ISOWEEKNUM(Tableau1[[#This Row],[Date]])","v":39},{"$f":"MONTH(Tableau1[[#This Row],[Date]])","v":9},{"$f":"TEXT(Tableau1[[#This Row],[Date]],\"mmmm\")","v":"septembre"},{"$f":"CHOOSE(WEEKDAY(Tableau1[[#This Row],[Date]],2),\"lu\",\"ma\",\"me\",\"je\",\"ve\",\"sa\",\"di\")","v":"di"},{"$f":"IFERROR(VLOOKUP(B367,Tableau30[],3,FALSE),IF(OR(AND($K$5<=B367,$L$5>B367),AND($K$6<=Tableau1[[#This Row],[Date]],$L$6>=Tableau1[[#This Row],[Date]])),\"FERMÉE\",IF(OR(Tableau1[[#This Row],[Jour]]=\"sa\",Tableau1[[#This Row],[Jour]]=\"di\",AND(Tableau1[[#This Row],[Jour]]=\"ve\",MOD(Tableau1[[#This Row],[N°S]],2)=1)),\"REPOS\",IF(Tableau1[[#This Row],[Jour]]=\"ve\",8,8.75))))","v":"REPOS"}]
[null,"2020-09-28",{"$f":"_xlfn.ISOWEEKNUM(Tableau1[[#This Row],[Date]])","v":40},{"$f":"MONTH(Tableau1[[#This Row],[Date]])","v":9},{"$f":"TEXT(Tableau1[[#This Row],[Date]],\"mmmm\")","v":"septembre"},{"$f":"CHOOSE(WEEKDAY(Tableau1[[#This Row],[Date]],2),\"lu\",\"ma\",\"me\",\"je\",\"ve\",\"sa\",\"di\")","v":"lu"},{"$f":"IFERROR(VLOOKUP(B368,Tableau30[],3,FALSE),IF(OR(AND($K$5<=B368,$L$5>B368),AND($K$6<=Tableau1[[#This Row],[Date]],$L$6>=Tableau1[[#This Row],[Date]])),\"FERMÉE\",IF(OR(Tableau1[[#This Row],[Jour]]=\"sa\",Tableau1[[#This Row],[Jour]]=\"di\",AND(Tableau1[[#This Row],[Jour]]=\"ve\",MOD(Tableau1[[#This Row],[N°S]],2)=1)),\"REPOS\",IF(Tableau1[[#This Row],[Jour]]=\"ve\",8,8.75))))","v":8.75}]
[null,"2020-09-29",{"$f":"_xlfn.ISOWEEKNUM(Tableau1[[#This Row],[Date]])","v":40},{"$f":"MONTH(Tableau1[[#This Row],[Date]])","v":9},{"$f":"TEXT(Tableau1[[#This Row],[Date]],\"mmmm\")","v":"septembre"},{"$f":"CHOOSE(WEEKDAY(Tableau1[[#This Row],[Date]],2),\"lu\",\"ma\",\"me\",\"je\",\"ve\",\"sa\",\"di\")","v":"ma"},{"$f":"IFERROR(VLOOKUP(B369,Tableau30[],3,FALSE),IF(OR(AND($K$5<=B369,$L$5>B369),AND($K$6<=Tableau1[[#This Row],[Date]],$L$6>=Tableau1[[#This Row],[Date]])),\"FERMÉE\",IF(OR(Tableau1[[#This Row],[Jour]]=\"sa\",Tableau1[[#This Row],[Jour]]=\"di\",AND(Tableau1[[#This Row],[Jour]]=\"ve\",MOD(Tableau1[[#This Row],[N°S]],2)=1)),\"REPOS\",IF(Tableau1[[#This Row],[Jour]]=\"ve\",8,8.75))))","v":8.75}]
[null,"2020-09-30",{"$f":"_xlfn.ISOWEEKNUM(Tableau1[[#This Row],[Date]])","v":40},{"$f":"MONTH(Tableau1[[#This Row],[Date]])","v":9},{"$f":"TEXT(Tableau1[[#This Row],[Date]],\"mmmm\")","v":"septembre"},{"$f":"CHOOSE(WEEKDAY(Tableau1[[#This Row],[Date]],2),\"lu\",\"ma\",\"me\",\"je\",\"ve\",\"sa\",\"di\")","v":"me"},{"$f":"IFERROR(VLOOKUP(B370,Tableau30[],3,FALSE),IF(OR(AND($K$5<=B370,$L$5>B370),AND($K$6<=Tableau1[[#This Row],[Date]],$L$6>=Tableau1[[#This Row],[Date]])),\"FERMÉE\",IF(OR(Tableau1[[#This Row],[Jour]]=\"sa\",Tableau1[[#This Row],[Jour]]=\"di\",AND(Tableau1[[#This Row],[Jour]]=\"ve\",MOD(Tableau1[[#This Row],[N°S]],2)=1)),\"REPOS\",IF(Tableau1[[#This Row],[Jour]]=\"ve\",8,8.75))))","v":8.75}]

{"sheet":"H productives","index":13,"n_rows":64,"n_cols":18,"rows_kept":64,"cut":false,"hidden":true,"merged":[[14,12,14,16]]}
[null,"N°S","N°Mois","Mois","Poseur 1","Poseur 2","Poseur 3","Poseur 4","Poseur 5","Poseur 6","Poseur 7"]
[null,40,10,{"$f":"TEXT(DATE('Fermetures & jours fériés'!$D$1,H_productives[[#This Row],[N°Mois]],1),\"mmmm\")","v":"octobre"},{"$f":"COUNTIFS(Tableau1[Etat],\"8,75\",Tableau1[Mois],H_productives[[#This Row],[Mois]],Tableau1[N°S],H_productives[[#This Row],[N°S]])*8.75+COUNTIFS(Tableau1[Etat],\"8\",Tableau1[Mois],H_productives[[#This Row],[Mois]],Tableau1[N°S],H_productives[[#This Row],[N°S]])*8","v":34.25},{"$f":"COUNTIFS(Tableau1[Etat],\"8,75\",Tableau1[Mois],H_productives[[#This Row],[Mois]],Tableau1[N°S],H_productives[[#This Row],[N°S]])*8.75+COUNTIFS(Tableau1[Etat],\"8\",Tableau1[Mois],H_productives[[#This Row],[Mois]],Tableau1[N°S],H_productives[[#This Row],[N°S]])*8","v":34.25},{"$f":"COUNTIFS(Tableau1[Etat],\"8,75\",Tableau1[Mois],H_productives[[#This Row],[Mois]],Tableau1[N°S],H_productives[[#This Row],[N°S]])*8.75+COUNTIFS(Tableau1[Etat],\"8\",Tableau1[Mois],H_productives[[#This Row],[Mois]],Tableau1[N°S],H_productives[[#This Row],[N°S]])*8","v":34.25},{"$f":"COUNTIFS(Tableau1[Etat],\"8,75\",Tableau1[Mois],H_productives[[#This Row],[Mois]],Tableau1[N°S],H_productives[[#This Row],[N°S]])*8.75+COUNTIFS(Tableau1[Etat],\"8\",Tableau1[Mois],H_productives[[#This Row],[Mois]],Tableau1[N°S],H_productives[[#This Row],[N°S]])*8","v":34.25},{"$f":"COUNTIFS(Tableau1[Etat],\"8,75\",Tableau1[Mois],H_productives[[#This Row],[Mois]],Tableau1[N°S],H_productives[[#This Row],[N°S]])*8.75+COUNTIFS(Tableau1[Etat],\"8\",Tableau1[Mois],H_productives[[#This Row],[Mois]],Tableau1[N°S],H_productives[[#This Row],[N°S]])*8","v":34.25},{"$f":"COUNTIFS(Tableau1[Etat],\"8,75\",Tableau1[Mois],H_productives[[#This Row],[Mois]],Tableau1[N°S],H_productives[[#This Row],[N°S]])*8.75+COUNTIFS(Tableau1[Etat],\"8\",Tableau1[Mois],H_productives[[#This Row],[Mois]],Tableau1[N°S],H_productives[[#This Row],[N°S]])*8","v":34.25},0,null,"Jours",""]
[null,41,10,{"$f":"TEXT(DATE('Fermetures & jours fériés'!$D$1,H_productives[[#This Row],[N°Mois]],1),\"mmmm\")","v":"octobre"},{"$f":"COUNTIFS(Tableau1[Etat],\"8,75\",Tableau1[Mois],H_productives[[#This Row],[Mois]],Tableau1[N°S],H_productives[[#This Row],[N°S]])*8.75+COUNTIFS(Tableau1[Etat],\"8\",Tableau1[Mois],H_productives[[#This Row],[Mois]],Tableau1[N°S],H_productives[[#This Row],[N°S]])*8","v":26.25},{"$f":"COUNTIFS(Tableau1[Etat],\"8,75\",Tableau1[Mois],H_productives[[#This Row],[Mois]],Tableau1[N°S],H_productives[[#This Row],[N°S]])*8.75+COUNTIFS(Tableau1[Etat],\"8\",Tableau1[Mois],H_productives[[#This Row],[Mois]],Tableau1[N°S],H_productives[[#This Row],[N°S]])*8","v":26.25},{"$f":"COUNTIFS(Tableau1[Etat],\"8,75\",Tableau1[Mois],H_productives[[#This Row],[Mois]],Tableau1[N°S],H_productives[[#This Row],[N°S]])*8.75+COUNTIFS(Tableau1[Etat],\"8\",Tableau1[Mois],H_productives[[#This Row],[Mois]],Tableau1[N°S],H_productives[[#This Row],[N°S]])*8","v":26.25},{"$f":"COUNTIFS(Tableau1[Etat],\"8,75\",Tableau1[Mois],H_productives[[#This Row],[Mois]],Tableau1[N°S],H_productives[[#This Row],[N°S]])*8.75+COUNTIFS(Tableau1[Etat],\"8\",Tableau1[Mois],H_productives[[#This Row],[Mois]],Tableau1[N°S],H_productives[[#This Row],[N°S]])*8","v":26.25},{"$f":"COUNTIFS(Tableau1[Etat],\"8,75\",Tableau1[Mois],H_productives[[#This Row],[Mois]],Tableau1[N°S],H_productives[[#This Row],[N°S]])*8.75+COUNTIFS(Tableau1[Etat],\"8\",Tableau1[Mois],H_productives[[#This Row],[Mois]],Tableau1[N°S],H_productives[[#This Row],[N°S]])*8","v":26.25},{"$f":"COUNTIFS(Tableau1[Etat],\"8,75\",Tableau1[Mois],H_productives[[#This Row],[Mois]],Tableau1[N°S],H_productives[[#This Row],[N°S]])*8.75+COUNTIFS(Tableau1[Etat],\"8\",Tableau1[Mois],H_productives[[#This Row],[Mois]],Tableau1[N°S],H_productives[[#This Row],[N°S]])*8","v":26.25},0,null,"S n°","REPOS",8.75,8,"FÉRIÉ/INACTIF","Total"]
[null,42,10,{"$f":"TEXT(DATE('Fermetures & jours fériés'!$D$1,H_productives[[#This Row],[N°Mois]],1),\"mmmm\")","v":"octobre"},{"$f":"COUNTIFS(Tableau1[Etat],\"8,75\",Tableau1[Mois],H_productives[[#This Row],[Mois]],Tableau1[N°S],H_productives[[#This Row],[N°S]])*8.75+COUNTIFS(Tableau1[Etat],\"8\",Tableau1[Mois],H_productives[[#This Row],[Mois]],Tableau1[N°S],H_productives[[#This Row],[N°S]])*8","v":43},{"$f":"COUNTIFS(Tableau1[Etat],\"8,75\",Tableau1[Mois],H_productives[[#This Row],[Mois]],Tableau1[N°S],H_productives[[#This Row],[N°S]])*8.75+COUNTIFS(Tableau1[Etat],\"8\",Tableau1[Mois],H_productives[[#This Row],[Mois]],Tableau1[N°S],H_productives[[#This Row],[N°S]])*8","v":43},{"$f":"COUNTIFS(Tableau1[Etat],\"8,75\",Tableau1[Mois],H_productives[[#This Row],[Mois]],Tableau1[N°S],H_productives[[#This Row],[N°S]])*8.75+COUNTIFS(Tableau1[Etat],\"8\",Tableau1[Mois],H_productives[[#This Row],[Mois]],Tableau1[N°S],H_productives[[#This Row],[N°S]])*8","v":43},{"$f":"COUNTIFS(Tableau1[Etat],\"8,75\",Tableau1[Mois],H_productives[[#This Row],[Mois]],Tableau1[N°S],H_productives[[#This Row],[N°S]])*8.75+COUNTIFS(Tableau1[Etat],\"8\",Tableau1[Mois],H_productives[[#This Row],[Mois]],Tableau1[N°S],H_productives[[#This Row],[N°S]])*8","v":43},{"$f":"COUNTIFS(Tableau1[Etat],\"8,75\",Tableau1[Mois],H_productives[[#This Row],[Mois]],Tableau1[N°S],H_productives[[#This Row],[N°S]])*8.75+COUNTIFS(Tableau1[Etat],\"8\",Tableau1[Mois],H_productives[[#This Row],[Mois]],Tableau1[N°S],H_productives[[#This Row],[N°S]])*8","v":43},{"$f":"COUNTIFS(Tableau1[Etat],\"8,75\",Tableau1[Mois],H_productives[[#This Row],[Mois]],Tableau1[N°S],H_productives[[#This Row],[N°S]])*8.75+COUNTIFS(Tableau1[Etat],\"8\",Tableau1[Mois],H_productives[[#This Row],[Mois]],Tableau1[N°S],H_productives[[#This Row],[N°S]])*8","v":43},0,null,40,2,3,1,null,6]
[null,43,10,{"$f":"TEXT(DATE('Fermetures & jours fériés'!$D$1,H_productives[[#This Row],[N°Mois]],1),\"mmmm\")","v":"octobre"},{"$f":"COUNTIFS(Tableau1[Etat],\"8,75\",Tableau1[Mois],H_productives[[#This Row],[Mois]],Tableau1[N°S],H_productives[[#This Row],[N°S]])*8.75+COUNTIFS(Tableau1[Etat],\"8\",Tableau1[Mois],H_productives[[#This Row],[Mois]],Tableau1[N°S],H_productives[[#This Row],[N°S]])*8","v":35},{"$f":"COUNTIFS(Tableau1[Etat],\"8,75\",Tableau1[Mois],H_productives[[#This Row],[Mois]],Tableau1[N°S],H_productives[[#This Row],[N°S]])*8.75+COUNTIFS(Tableau1[Etat],\"8\",Tableau1[Mois],H_productives[[#This Row],[Mois]],Tableau1[N°S],H_productives[[#This Row],[N°S]])*8","v":35},{"$f":"COUNTIFS(Tableau1[Etat],\"8,75\",Tableau1[Mois],H_productives[[#This Row],[Mois]],Tableau1[N°S],H_productives[[#This Row],[N°S]])*8.75+COUNTIFS(Tableau1[Etat],\"8\",Tableau1[Mois],H_productives[[#This Row],[Mois]],Tableau1[N°S],H_productives[[#This Row],[N°S]])*8","v":35},{"$f":"COUNTIFS(Tableau1[Etat],\"8,75\",Tableau1[Mois],H_productives[[#This Row],[Mois]],Tableau1[N°S],H_productives[[#This Row],[N°S]])*8.75+COUNTIFS(Tableau1[Etat],\"8\",Tableau1[Mois],H_productives[[#This Row],[Mois]],Tableau1[N°S],H_productives[[#This Row],[N°S]])*8","v":35},{"$f":"COUNTIFS(Tableau1[Etat],\"8,75\",Tableau1[Mois],H_productives[[#This Row],[Mois]],Tableau1[N°S],H_productives[[#This Row],[N°S]])*8.75+COUNTIFS(Tableau1[Etat],\"8\",Tableau1[Mois],H_productives[[#This Row],[Mois]],Tableau1[N°S],H_productives[[#This Row],[N°S]])*8","v":35},{"$f":"COUNTIFS(Tableau1[Etat],\"8,75\",Tableau1[Mois],H_productives[[#This Row],[Mois]],Tableau1[N°S],H_productives[[#This Row],[N°S]])*8.75+COUNTIFS(Tableau1[Etat],\"8\",Tableau1[Mois],H_productives[[#This Row],[Mois]],Tableau1[N°S],H_productives[[#This Row],[N°S]])*8","v":35},0,null,41,3,3,null,1,7]
[null,44,10,{"$f":"TEXT(DATE('Fermetures & jours fériés'!$D$1,H_productives[[#This Row],[N°Mois]],1),\"mmmm\")","v":"octobre"},{"$f":"COUNTIFS(Tableau1[Etat],\"8,75\",Tableau1[Mois],H_productives[[#This Row],[Mois]],Tableau1[N°S],H_productives[[#This Row],[N°S]])*8.75+COUNTIFS(Tableau1[Etat],\"8\",Tableau1[Mois],H_productives[[#This Row],[Mois]],Tableau1[N°S],H_productives[[#This Row],[N°S]])*8","v":35},{"$f":"COUNTIFS(Tableau1[Etat],\"8,75\",Tableau1[Mois],H_productives[[#This Row],[Mois]],Tableau1[N°S],H_productives[[#This Row],[N°S]])*8.75+COUNTIFS(Tableau1[Etat],\"8\",Tableau1[Mois],H_productives[[#This Row],[Mois]],Tableau1[N°S],H_productives[[#This Row],[N°S]])*8","v":35},{"$f":"COUNTIFS(Tableau1[Etat],\"8,75\",Tableau1[Mois],H_productives[[#This Row],[Mois]],Tableau1[N°S],H_productives[[#This Row],[N°S]])*8.75+COUNTIFS(Tableau1[Etat],\"8\",Tableau1[Mois],H_productives[[#This Row],[Mois]],Tableau1[N°S],H_productives[[#This Row],[N°S]])*8","v":35},{"$f":"COUNTIFS(Tableau1[Etat],\"8,75\",Tableau1[Mois],H_productives[[#This Row],[Mois]],Tableau1[N°S],H_productives[[#This Row],[N°S]])*8.75+COUNTIFS(Tableau1[Etat],\"8\",Tableau1[Mois],H_productives[[#This Row],[Mois]],Tableau1[N°S],H_productives[[#This Row],[N°S]])*8","v":35},{"$f":"COUNTIFS(Tableau1[Etat],\"8,75\",Tableau1[Mois],H_productives[[#This Row],[Mois]],Tableau1[N°S],H_productives[[#This Row],[N°S]])*8.75+COUNTIFS(Tableau1[Etat],\"8\",Tableau1[Mois],H_productives[[#This Row],[Mois]],Tableau1[N°S],H_productives[[#This Row],[N°S]])*8","v":35},{"$f":"COUNTIFS(Tableau1[Etat],\"8,75\",Tableau1[Mois],H_productives[[#This Row],[Mois]],Tableau1[N°S],H_productives[[#This Row],[N°S]])*8.75+COUNTIFS(Tableau1[Etat],\"8\",Tableau1[Mois],H_productives[[#This Row],[Mois]],Tableau1[N°S],H_productives[[#This Row],[N°S]])*8","v":35},0,null,42,2,4,1,null,7]
[null,44,11,{"$f":"TEXT(DATE('Fermetures & jours fériés'!$D$1,H_productives[[#This Row],[N°Mois]],1),\"mmmm\")","v":"novembre"},{"$f":"COUNTIFS(Tableau1[Etat],\"8,75\",Tableau1[Mois],H_productives[[#This Row],[Mois]],Tableau1[N°S],H_productives[[#This Row],[N°S]])*8.75+COUNTIFS(Tableau1[Etat],\"8\",Tableau1[Mois],H_productives[[#This Row],[Mois]],Tableau1[N°S],H_productives[[#This Row],[N°S]])*8","v":0},{"$f":"COUNTIFS(Tableau1[Etat],\"8,75\",Tableau1[Mois],H_productives[[#This Row],[Mois]],Tableau1[N°S],H_productives[[#This Row],[N°S]])*8.75+COUNTIFS(Tableau1[Etat],\"8\",Tableau1[Mois],H_productives[[#This Row],[Mois]],Tableau1[N°S],H_productives[[#This Row],[N°S]])*8","v":0},{"$f":"COUNTIFS(Tableau1[Etat],\"8,75\",Tableau1[Mois],H_productives[[#This Row],[Mois]],Tableau1[N°S],H_productives[[#This Row],[N°S]])*8.75+COUNTIFS(Tableau1[Etat],\"8\",Tableau1[Mois],H_productives[[#This Row],[Mois]],Tableau1[N°S],H_productives[[#This Row],[N°S]])*8","v":0},{"$f":"COUNTIFS(Tableau1[Etat],\"8,75\",Tableau1[Mois],H_productives[[#This Row],[Mois]],Tableau1[N°S],H_productives[[#This Row],[N°S]])*8.75+COUNTIFS(Tableau1[Etat],\"8\",Tableau1[Mois],H_productives[[#This Row],[Mois]],Tableau1[N°S],H_productives[[#This Row],[N°S]])*8","v":0},{"$f":"COUNTIFS(Tableau1[Etat],\"8,75\",Tableau1[Mois],H_productives[[#This Row],[Mois]],Tableau1[N°S],H_productives[[#This Row],[N°S]])*8.75+COUNTIFS(Tableau1[Etat],\"8\",Tableau1[Mois],H_productives[[#This Row],[Mois]],Tableau1[N°S],H_productives[[#This Row],[N°S]])*8","v":0},{"$f":"COUNTIFS(Tableau1[Etat],\"8,75\",Tableau1[Mois],H_productives[[#This Row],[Mois]],Tableau1[N°S],H_productives[[#This Row],[N°S]])*8.75+COUNTIFS(Tableau1[Etat],\"8\",Tableau1[Mois],H_productives[[#This Row],[Mois]],Tableau1[N°S],H_productives[[#This Row],[N°S]])*8","v":0},0,null,43,3,4,null,null,7]
[null,45,11,{"$f":"TEXT(DATE('Fermetures & jours fériés'!$D$1,H_productives[[#This Row],[N°Mois]],1),\"mmmm\")","v":"novembre"},{"$f":"COUNTIFS(Tableau1[Etat],\"8,75\",Tableau1[Mois],H_productives[[#This Row],[Mois]],Tableau1[N°S],H_productives[[#This Row],[N°S]])*8.75+COUNTIFS(Tableau1[Etat],\"8\",Tableau1[Mois],H_productives[[#This Row],[Mois]],Tableau1[N°S],H_productives[[#This Row],[N°S]])*8","v":35},{"$f":"COUNTIFS(Tableau1[Etat],\"8,75\",Tableau1[Mois],H_productives[[#This Row],[Mois]],Tableau1[N°S],H_productives[[#This Row],[N°S]])*8.75+COUNTIFS(Tableau1[Etat],\"8\",Tableau1[Mois],H_productives[[#This Row],[Mois]],Tableau1[N°S],H_productives[[#This Row],[N°S]])*8","v":35},{"$f":"COUNTIFS(Tableau1[Etat],\"8,75\",Tableau1[Mois],H_productives[[#This Row],[Mois]],Tableau1[N°S],H_productives[[#This Row],[N°S]])*8.75+COUNTIFS(Tableau1[Etat],\"8\",Tableau1[Mois],H_productives[[#This Row],[Mois]],Tableau1[N°S],H_productives[[#This Row],[N°S]])*8","v":35},{"$f":"COUNTIFS(Tableau1[Etat],\"8,75\",Tableau1[Mois],H_productives[[#This Row],[Mois]],Tableau1[N°S],H_productives[[#This Row],[N°S]])*8.75+COUNTIFS(Tableau1[Etat],\"8\",Tableau1[Mois],H_productives[[#This Row],[Mois]],Tableau1[N°S],H_productives[[#This Row],[N°S]])*8","v":35},{"$f":"COUNTIFS(Tableau1[Etat],\"8,75\",Tableau1[Mois],H_productives[[#This Row],[Mois]],Tableau1[N°S],H_productives[[#This Row],[N°S]])*8.75+COUNTIFS(Tableau1[Etat],\"8\",Tableau1[Mois],H_productives[[#This Row],[Mois]],Tableau1[N°S],H_productives[[#This Row],[N°S]])*8","v":35},{"$f":"COUNTIFS(Tableau1[Etat],\"8,75\",Tableau1[Mois],H_productives[[#This Row],[Mois]],Tableau1[N°S],H_productives[[#This Row],[N°S]])*8.75+COUNTIFS(Tableau1[Etat],\"8\",Tableau1[Mois],H_productives[[#This Row],[Mois]],Tableau1[N°S],H_productives[[#This Row],[N°S]])*8","v":35},0,null,44,null,4,null,null,4]
[null,46,11,{"$f":"TEXT(DATE('Fermetures & jours fériés'!$D$1,H_productives[[#This Row],[N°Mois]],1),\"mmmm\")","v":"novembre"},{"$f":"COUNTIFS(Tableau1[Etat],\"8,75\",Tableau1[Mois],H_productives[[#This Row],[Mois]],Tableau1[N°S],H_productives[[#This Row],[N°S]])*8.75+COUNTIFS(Tableau1[Etat],\"8\",Tableau1[Mois],H_productives[[#This Row],[Mois]],Tableau1[N°S],H_productives[[#This Row],[N°S]])*8","v":34.25},{"$f":"COUNTIFS(Tableau1[Etat],\"8,75\",Tableau1[Mois],H_productives[[#This Row],[Mois]],Tableau1[N°S],H_productives[[#This Row],[N°S]])*8.75+COUNTIFS(Tableau1[Etat],\"8\",Tableau1[Mois],H_productives[[#This Row],[Mois]],Tableau1[N°S],H_productives[[#This Row],[N°S]])*8","v":34.25},{"$f":"COUNTIFS(Tableau1[Etat],\"8,75\",Tableau1[Mois],H_productives[[#This Row],[Mois]],Tableau1[N°S],H_productives[[#This Row],[N°S]])*8.75+COUNTIFS(Tableau1[Etat],\"8\",Tableau1[Mois],H_productives[[#This Row],[Mois]],Tableau1[N°S],H_productives[[#This Row],[N°S]])*8","v":34.25},{"$f":"COUNTIFS(Tableau1[Etat],\"8,75\",Tableau1[Mois],H_productives[[#This Row],[Mois]],Tableau1[N°S],H_productives[[#This Row],[N°S]])*8.75+COUNTIFS(Tableau1[Etat],\"8\",Tableau1[Mois],H_productives[[#This Row],[Mois]],Tableau1[N°S],H_productives[[#This Row],[N°S]])*8","v":34.25},{"$f":"COUNTIFS(Tableau1[Etat],\"8,75\",Tableau1[Mois],H_productives[[#This Row],[Mois]],Tableau1[N°S],H_productives[[#This Row],[N°S]])*8.75+COUNTIFS(Tableau1[Etat],\"8\",Tableau1[Mois],H_productives[[#This Row],[Mois]],Tableau1[N°S],H_productives[[#This Row],[N°S]])*8","v":34.25},{"$f":"COUNTIFS(Tableau1[Etat],\"8,75\",Tableau1[Mois],H_productives[[#This Row],[Mois]],Tableau1[N°S],H_productives[[#This Row],[N°S]])*8.75+COUNTIFS(Tableau1[Etat],\"8\",Tableau1[Mois],H_productives[[#This Row],[Mois]],Tableau1[N°S],H_productives[[#This Row],[N°S]])*8","v":34.25},0,null,"Total",10,18,2,1,31]
[null,47,11,{"$f":"TEXT(DATE('Fermetures & jours fériés'!$D$1,H_productives[[#This Row],[N°Mois]],1),\"mmmm\")","v":"novembre"},{"$f":"COUNTIFS(Tableau1[Etat],\"8,75\",Tableau1[Mois],H_productives[[#This Row],[Mois]],Tableau1[N°S],H_productives[[#This Row],[N°S]])*8.75+COUNTIFS(Tableau1[Etat],\"8\",Tableau1[Mois],H_productives[[#This Row],[Mois]],Tableau1[N°S],H_productives[[#This Row],[N°S]])*8","v":35},{"$f":"COUNTIFS(Tableau1[Etat],\"8,75\",Tableau1[Mois],H_productives[[#This Row],[Mois]],Tableau1[N°S],H_productives[[#This Row],[N°S]])*8.75+COUNTIFS(Tableau1[Etat],\"8\",Tableau1[Mois],H_productives[[#This Row],[Mois]],Tableau1[N°S],H_productives[[#This Row],[N°S]])*8","v":35},{"$f":"COUNTIFS(Tableau1[Etat],\"8,75\",Tableau1[Mois],H_productives[[#This Row],[Mois]],Tableau1[N°S],H_productives[[#This Row],[N°S]])*8.75+COUNTIFS(Tableau1[Etat],\"8\",Tableau1[Mois],H_productives[[#This Row],[Mois]],Tableau1[N°S],H_productives[[#This Row],[N°S]])*8","v":35},{"$f":"COUNTIFS(Tableau1[Etat],\"8,75\",Tableau1[Mois],H_productives[[#This Row],[Mois]],Tableau1[N°S],H_productives[[#This Row],[N°S]])*8.75+COUNTIFS(Tableau1[Etat],\"8\",Tableau1[Mois],H_productives[[#This Row],[Mois]],Tableau1[N°S],H_productives[[#This Row],[N°S]])*8","v":35},{"$f":"COUNTIFS(Tableau1[Etat],\"8,75\",Tableau1[Mois],H_productives[[#This Row],[Mois]],Tableau1[N°S],H_productives[[#This Row],[N°S]])*8.75+COUNTIFS(Tableau1[Etat],\"8\",Tableau1[Mois],H_productives[[#This Row],[Mois]],Tableau1[N°S],H_productives[[#This Row],[N°S]])*8","v":35},{"$f":"COUNTIFS(Tableau1[Etat],\"8,75\",Tableau1[Mois],H_productives[[#This Row],[Mois]],Tableau1[N°S],H_productives[[#This Row],[N°S]])*8.75+COUNTIFS(Tableau1[Etat],\"8\",Tableau1[Mois],H_productives[[#This Row],[Mois]],Tableau1[N°S],H_productives[[#This Row],[N°S]])*8","v":35},35]
[null,48,11,{"$f":"TEXT(DATE('Fermetures & jours fériés'!$D$1,H_productives[[#This Row],[N°Mois]],1),\"mmmm\")","v":"novembre"},{"$f":"COUNTIFS(Tableau1[Etat],\"8,75\",Tableau1[Mois],H_productives[[#This Row],[Mois]],Tableau1[N°S],H_productives[[#This Row],[N°S]])*8.75+COUNTIFS(Tableau1[Etat],\"8\",Tableau1[Mois],H_productives[[#This Row],[Mois]],Tableau1[N°S],H_productives[[#This Row],[N°S]])*8","v":43},{"$f":"COUNTIFS(Tableau1[Etat],\"8,75\",Tableau1[Mois],H_productives[[#This Row],[Mois]],Tableau1[N°S],H_productives[[#This Row],[N°S]])*8.75+COUNTIFS(Tableau1[Etat],\"8\",Tableau1[Mois],H_productives[[#This Row],[Mois]],Tableau1[N°S],H_productives[[#This Row],[N°S]])*8","v":43},{"$f":"COUNTIFS(Tableau1[Etat],\"8,75\",Tableau1[Mois],H_productives[[#This Row],[Mois]],Tableau1[N°S],H_productives[[#This Row],[N°S]])*8.75+COUNTIFS(Tableau1[Etat],\"8\",Tableau1[Mois],H_productives[[#This Row],[Mois]],Tableau1[N°S],H_productives[[#This Row],[N°S]])*8","v":43},{"$f":"COUNTIFS(Tableau1[Etat],\"8,75\",Tableau1[Mois],H_productives[[#This Row],[Mois]],Tableau1[N°S],H_productives[[#This Row],[N°S]])*8.75+COUNTIFS(Tableau1[Etat],\"8\",Tableau1[Mois],H_productives[[#This Row],[Mois]],Tableau1[N°S],H_productives[[#This Row],[N°S]])*8","v":43},{"$f":"COUNTIFS(Tableau1[Etat],\"8,75\",Tableau1[Mois],H_productives[[#This Row],[Mois]],Tableau1[N°S],H_productives[[#This Row],[N°S]])*8.75+COUNTIFS(Tableau1[Etat],\"8\",Tableau1[Mois],H_productives[[#This Row],[Mois]],Tableau1[N°S],H_productives[[#This Row],[N°S]])*8","v":43},{"$f":"COUNTIFS(Tableau1[Etat],\"8,75\",Tableau1[Mois],H_productives[[#This Row],[Mois]],Tableau1[N°S],H_productives[[#This Row],[N°S]])*8.75+COUNTIFS(Tableau1[Etat],\"8\",Tableau1[Mois],H_productives[[#This Row],[Mois]],Tableau1[N°S],H_productives[[#This Row],[N°S]])*8","v":43},35]
[null,48,12,{"$f":"TEXT(DATE('Fermetures & jours fériés'!$D$1,H_productives[[#This Row],[N°Mois]],1),\"mmmm\")","v":"décembre"},{"$f":"COUNTIFS(Tableau1[Etat],\"8,75\",Tableau1[Mois],H_productives[[#This Row],[Mois]],Tableau1[N°S],H_productives[[#This Row],[N°S]])*8.75+COUNTIFS(Tableau1[Etat],\"8\",Tableau1[Mois],H_productives[[#This Row],[Mois]],Tableau1[N°S],H_productives[[#This Row],[N°S]])*8","v":0},{"$f":"COUNTIFS(Tableau1[Etat],\"8,75\",Tableau1[Mois],H_productives[[#This Row],[Mois]],Tableau1[N°S],H_productives[[#This Row],[N°S]])*8.75+COUNTIFS(Tableau1[Etat],\"8\",Tableau1[Mois],H_productives[[#This Row],[Mois]],Tableau1[N°S],H_productives[[#This Row],[N°S]])*8","v":0},{"$f":"COUNTIFS(Tableau1[Etat],\"8,75\",Tableau1[Mois],H_productives[[#This Row],[Mois]],Tableau1[N°S],H_productives[[#This Row],[N°S]])*8.75+COUNTIFS(Tableau1[Etat],\"8\",Tableau1[Mois],H_productives[[#This Row],[Mois]],Tableau1[N°S],H_productives[[#This Row],[N°S]])*8","v":0},{"$f":"COUNTIFS(Tableau1[Etat],\"8,75\",Tableau1[Mois],H_productives[[#This Row],[Mois]],Tableau1[N°S],H_productives[[#This Row],[N°S]])*8.75+COUNTIFS(Tableau1[Etat],\"8\",Tableau1[Mois],H_productives[[#This Row],[Mois]],Tableau1[N°S],H_productives[[#This Row],[N°S]])*8","v":0},{"$f":"COUNTIFS(Tableau1[Etat],\"8,75\",Tableau1[Mois],H_productives[[#This Row],[Mois]],Tableau1[N°S],H_productives[[#This Row],[N°S]])*8.75+COUNTIFS(Tableau1[Etat],\"8\",Tableau1[Mois],H_productives[[#This Row],[Mois]],Tableau1[N°S],H_productives[[#This Row],[N°S]])*8","v":0},{"$f":"COUNTIFS(Tableau1[Etat],\"8,75\",Tableau1[Mois],H_productives[[#This Row],[Mois]],Tableau1[N°S],H_productives[[#This Row],[N°S]])*8.75+COUNTIFS(Tableau1[Etat],\"8\",Tableau1[Mois],H_productives[[#This Row],[Mois]],Tableau1[N°S],H_productives[[#This Row],[N°S]])*8","v":0},0]
[null,49,12,{"$f":"TEXT(DATE('Fermetures & jours fériés'!$D$1,H_productives[[#This Row],[N°Mois]],1),\"mmmm\")","v":"décembre"},{"$f":"COUNTIFS(Tableau1[Etat],\"8,75\",Tableau1[Mois],H_productives[[#This Row],[Mois]],Tableau1[N°S],H_productives[[#This Row],[N°S]])*8.75+COUNTIFS(Tableau1[Etat],\"8\",Tableau1[Mois],H_productives[[#This Row],[Mois]],Tableau1[N°S],H_productives[[#This Row],[N°S]])*8","v":35},{"$f":"COUNTIFS(Tableau1[Etat],\"8,75\",Tableau1[Mois],H_productives[[#This Row],[Mois]],Tableau1[N°S],H_productives[[#This Row],[N°S]])*8.75+COUNTIFS(Tableau1[Etat],\"8\",Tableau1[Mois],H_productives[[#This Row],[Mois]],Tableau1[N°S],H_productives[[#This Row],[N°S]])*8","v":35},{"$f":"COUNTIFS(Tableau1[Etat],\"8,75\",Tableau1[Mois],H_productives[[#This Row],[Mois]],Tableau1[N°S],H_productives[[#This Row],[N°S]])*8.75+COUNTIFS(Tableau1[Etat],\"8\",Tableau1[Mois],H_productives[[#This Row],[Mois]],Tableau1[N°S],H_productives[[#This Row],[N°S]])*8","v":35},{"$f":"COUNTIFS(Tableau1[Etat],\"8,75\",Tableau1[Mois],H_productives[[#This Row],[Mois]],Tableau1[N°S],H_productives[[#This Row],[N°S]])*8.75+COUNTIFS(Tableau1[Etat],\"8\",Tableau1[Mois],H_productives[[#This Row],[Mois]],Tableau1[N°S],H_productives[[#This Row],[N°S]])*8","v":35},{"$f":"COUNTIFS(Tableau1[Etat],\"8,75\",Tableau1[Mois],H_productives[[#This Row],[Mois]],Tableau1[N°S],H_productives[[#This Row],[N°S]])*8.75+COUNTIFS(Tableau1[Etat],\"8\",Tableau1[Mois],H_productives[[#This Row],[Mois]],Tableau1[N°S],H_productives[[#This Row],[N°S]])*8","v":35},{"$f":"COUNTIFS(Tableau1[Etat],\"8,75\",Tableau1[Mois],H_productives[[#This Row],[Mois]],Tableau1[N°S],H_productives[[#This Row],[N°S]])*8.75+COUNTIFS(Tableau1[Etat],\"8\",Tableau1[Mois],H_productives[[#This Row],[Mois]],Tableau1[N°S],H_productives[[#This Row],[N°S]])*8","v":35},35]
[null,50,12,{"$f":"TEXT(DATE('Fermetures & jours fériés'!$D$1,H_productives[[#This Row],[N°Mois]],1),\"mmmm\")","v":"décembre"},{"$f":"COUNTIFS(Tableau1[Etat],\"8,75\",Tableau1[Mois],H_productives[[#This Row],[Mois]],Tableau1[N°S],H_productives[[#This Row],[N°S]])*8.75+COUNTIFS(Tableau1[Etat],\"8\",Tableau1[Mois],H_productives[[#This Row],[Mois]],Tableau1[N°S],H_productives[[#This Row],[N°S]])*8","v":43},{"$f":"COUNTIFS(Tableau1[Etat],\"8,75\",Tableau1[Mois],H_productives[[#This Row],[Mois]],Tableau1[N°S],H_productives[[#This Row],[N°S]])*8.75+COUNTIFS(Tableau1[Etat],\"8\",Tableau1[Mois],H_productives[[#This Row],[Mois]],Tableau1[N°S],H_productives[[#This Row],[N°S]])*8","v":43},{"$f":"COUNTIFS(Tableau1[Etat],\"8,75\",Tableau1[Mois],H_productives[[#This Row],[Mois]],Tableau1[N°S],H_productives[[#This Row],[N°S]])*8.75+COUNTIFS(Tableau1[Etat],\"8\",Tableau1[Mois],H_productives[[#This Row],[Mois]],Tableau1[N°S],H_productives[[#This Row],[N°S]])*8","v":43},{"$f":"COUNTIFS(Tableau1[Etat],\"8,75\",Tableau1[Mois],H_productives[[#This Row],[Mois]],Tableau1[N°S],H_productives[[#This Row],[N°S]])*8.75+COUNTIFS(Tableau1[Etat],\"8\",Tableau1[Mois],H_productives[[#This Row],[Mois]],Tableau1[N°S],H_productives[[#This Row],[N°S]])*8","v":43},{"$f":"COUNTIFS(Tableau1[Etat],\"8,75\",Tableau1[Mois],H_productives[[#This Row],[Mois]],Tableau1[N°S],H_productives[[#This Row],[N°S]])*8.75+COUNTIFS(Tableau1[Etat],\"8\",Tableau1[Mois],H_productives[[#This Row],[Mois]],Tableau1[N°S],H_productives[[#This Row],[N°S]])*8","v":43},{"$f":"COUNTIFS(Tableau1[Etat],\"8,75\",Tableau1[Mois],H_productives[[#This Row],[Mois]],Tableau1[N°S],H_productives[[#This Row],[N°S]])*8.75+COUNTIFS(Tableau1[Etat],\"8\",Tableau1[Mois],H_productives[[#This Row],[Mois]],Tableau1[N°S],H_productives[[#This Row],[N°S]])*8","v":43},35]
[null,51,12,{"$f":"TEXT(DATE('Fermetures & jours fériés'!$D$1,H_productives[[#This Row],[N°Mois]],1),\"mmmm\")","v":"décembre"},{"$f":"COUNTIFS(Tableau1[Etat],\"8,75\",Tableau1[Mois],H_productives[[#This Row],[Mois]],Tableau1[N°S],H_productives[[#This Row],[N°S]])*8.75+COUNTIFS(Tableau1[Etat],\"8\",Tableau1[Mois],H_productives[[#This Row],[Mois]],Tableau1[N°S],H_productives[[#This Row],[N°S]])*8","v":35},{"$f":"COUNTIFS(Tableau1[Etat],\"8,75\",Tableau1[Mois],H_productives[[#This Row],[Mois]],Tableau1[N°S],H_productives[[#This Row],[N°S]])*8.75+COUNTIFS(Tableau1[Etat],\"8\",Tableau1[Mois],H_productives[[#This Row],[Mois]],Tableau1[N°S],H_productives[[#This Row],[N°S]])*8","v":35},{"$f":"COUNTIFS(Tableau1[Etat],\"8,75\",Tableau1[Mois],H_productives[[#This Row],[Mois]],Tableau1[N°S],H_productives[[#This Row],[N°S]])*8.75+COUNTIFS(Tableau1[Etat],\"8\",Tableau1[Mois],H_productives[[#This Row],[Mois]],Tableau1[N°S],H_productives[[#This Row],[N°S]])*8","v":35},{"$f":"COUNTIFS(Tableau1[Etat],\"8,75\",Tableau1[Mois],H_productives[[#This Row],[Mois]],Tableau1[N°S],H_productives[[#This Row],[N°S]])*8.75+COUNTIFS(Tableau1[Etat],\"8\",Tableau1[Mois],H_productives[[#This Row],[Mois]],Tableau1[N°S],H_productives[[#This Row],[N°S]])*8","v":35},{"$f":"COUNTIFS(Tableau1[Etat],\"8,75\",Tableau1[Mois],H_productives[[#This Row],[Mois]],Tableau1[N°S],H_productives[[#This Row],[N°S]])*8.75+COUNTIFS(Tableau1[Etat],\"8\",Tableau1[Mois],H_productives[[#This Row],[Mois]],Tableau1[N°S],H_productives[[#This Row],[N°S]])*8","v":35},{"$f":"COUNTIFS(Tableau1[Etat],\"8,75\",Tableau1[Mois],H_productives[[#This Row],[Mois]],Tableau1[N°S],H_productives[[#This Row],[N°S]])*8.75+COUNTIFS(Tableau1[Etat],\"8\",Tableau1[Mois],H_productives[[#This Row],[Mois]],Tableau1[N°S],H_productives[[#This Row],[N°S]])*8","v":35},35]
[null,52,12,{"$f":"TEXT(DATE('Fermetures & jours fériés'!$D$1,H_productives[[#This Row],[N°Mois]],1),\"mmmm\")","v":"décembre"},{"$f":"COUNTIFS(Tableau1[Etat],\"8,75\",Tableau1[Mois],H_productives[[#This Row],[Mois]],Tableau1[N°S],H_productives[[#This Row],[N°S]])*8.75+COUNTIFS(Tableau1[Etat],\"8\",Tableau1[Mois],H_productives[[#This Row],[Mois]],Tableau1[N°S],H_productives[[#This Row],[N°S]])*8","v":17.5},{"$f":"COUNTIFS(Tableau1[Etat],\"8,75\",Tableau1[Mois],H_productives[[#This Row],[Mois]],Tableau1[N°S],H_productives[[#This Row],[N°S]])*8.75+COUNTIFS(Tableau1[Etat],\"8\",Tableau1[Mois],H_productives[[#This Row],[Mois]],Tableau1[N°S],H_productives[[#This Row],[N°S]])*8","v":17.5},{"$f":"COUNTIFS(Tableau1[Etat],\"8,75\",Tableau1[Mois],H_productives[[#This Row],[Mois]],Tableau1[N°S],H_productives[[#This Row],[N°S]])*8.75+COUNTIFS(Tableau1[Etat],\"8\",Tableau1[Mois],H_productives[[#This Row],[Mois]],Tableau1[N°S],H_productives[[#This Row],[N°S]])*8","v":17.5},{"$f":"COUNTIFS(Tableau1[Etat],\"8,75\",Tableau1[Mois],H_productives[[#This Row],[Mois]],Tableau1[N°S],H_productives[[#This Row],[N°S]])*8.75+COUNTIFS(Tableau1[Etat],\"8\",Tableau1[Mois],H_productives[[#This Row],[Mois]],Tableau1[N°S],H_productives[[#This Row],[N°S]])*8","v":17.5},{"$f":"COUNTIFS(Tableau1[Etat],\"8,75\",Tableau1[Mois],H_productives[[#This Row],[Mois]],Tableau1[N°S],H_productives[[#This Row],[N°S]])*8.75+COUNTIFS(Tableau1[Etat],\"8\",Tableau1[Mois],H_productives[[#This Row],[Mois]],Tableau1[N°S],H_productives[[#This Row],[N°S]])*8","v":17.5},{"$f":"COUNTIFS(Tableau1[Etat],\"8,75\",Tableau1[Mois],H_productives[[#This Row],[Mois]],Tableau1[N°S],H_productives[[#This Row],[N°S]])*8.75+COUNTIFS(Tableau1[Etat],\"8\",Tableau1[Mois],H_productives[[#This Row],[Mois]],Tableau1[N°S],H_productives[[#This Row],[N°S]])*8","v":17.5},17.5]
[null,1,12,{"$f":"TEXT(DATE('Fermetures & jours fériés'!$D$1,H_productives[[#This Row],[N°Mois]],1),\"mmmm\")","v":"décembre"},{"$f":"COUNTIFS(Tableau1[Etat],\"8,75\",Tableau1[Mois],H_productives[[#This Row],[Mois]],Tableau1[N°S],H_productives[[#This Row],[N°S]])*8.75+COUNTIFS(Tableau1[Etat],\"8\",Tableau1[Mois],H_productives[[#This Row],[Mois]],Tableau1[N°S],H_productives[[#This Row],[N°S]])*8","v":0},{"$f":"COUNTIFS(Tableau1[Etat],\"8,75\",Tableau1[Mois],H_productives[[#This Row],[Mois]],Tableau1[N°S],H_productives[[#This Row],[N°S]])*8.75+COUNTIFS(Tableau1[Etat],\"8\",Tableau1[Mois],H_productives[[#This Row],[Mois]],Tableau1[N°S],H_productives[[#This Row],[N°S]])*8","v":0},{"$f":"COUNTIFS(Tableau1[Etat],\"8,75\",Tableau1[Mois],H_productives[[#This Row],[Mois]],Tableau1[N°S],H_productives[[#This Row],[N°S]])*8.75+COUNTIFS(Tableau1[Etat],\"8\",Tableau1[Mois],H_productives[[#This Row],[Mois]],Tableau1[N°S],H_productives[[#This Row],[N°S]])*8","v":0},{"$f":"COUNTIFS(Tableau1[Etat],\"8,75\",Tableau1[Mois],H_productives[[#This Row],[Mois]],Tableau1[N°S],H_productives[[#This Row],[N°S]])*8.75+COUNTIFS(Tableau1[Etat],\"8\",Tableau1[Mois],H_productives[[#This Row],[Mois]],Tableau1[N°S],H_productives[[#This Row],[N°S]])*8","v":0},{"$f":"COUNTIFS(Tableau1[Etat],\"8,75\",Tableau1[Mois],H_productives[[#This Row],[Mois]],Tableau1[N°S],H_productives[[#This Row],[N°S]])*8.75+COUNTIFS(Tableau1[Etat],\"8\",Tableau1[Mois],H_productives[[#This Row],[Mois]],Tableau1[N°S],H_productives[[#This Row],[N°S]])*8","v":0},{"$f":"COUNTIFS(Tableau1[Etat],\"8,75\",Tableau1[Mois],H_productives[[#This Row],[Mois]],Tableau1[N°S],H_productives[[#This Row],[N°S]])*8.75+COUNTIFS(Tableau1[Etat],\"8\",Tableau1[Mois],H_productives[[#This Row],[Mois]],Tableau1[N°S],H_productives[[#This Row],[N°S]])*8","v":0},0]
[null,1,1,{"$f":"TEXT(DATE('Fermetures & jours fériés'!$D$1,H_productives[[#This Row],[N°Mois]],1),\"mmmm\")","v":"janvier"},{"$f":"COUNTIFS(Tableau1[Etat],\"8,75\",Tableau1[Mois],H_productives[[#This Row],[Mois]],Tableau1[N°S],H_productives[[#This Row],[N°S]])*8.75+COUNTIFS(Tableau1[Etat],\"8\",Tableau1[Mois],H_productives[[#This Row],[Mois]],Tableau1[N°S],H_productives[[#This Row],[N°S]])*8","v":0},{"$f":"COUNTIFS(Tableau1[Etat],\"8,75\",Tableau1[Mois],H_productives[[#This Row],[Mois]],Tableau1[N°S],H_productives[[#This Row],[N°S]])*8.75+COUNTIFS(Tableau1[Etat],\"8\",Tableau1[Mois],H_productives[[#This Row],[Mois]],Tableau1[N°S],H_productives[[#This Row],[N°S]])*8","v":0},{"$f":"COUNTIFS(Tableau1[Etat],\"8,75\",Tableau1[Mois],H_productives[[#This Row],[Mois]],Tableau1[N°S],H_productives[[#This Row],[N°S]])*8.75+COUNTIFS(Tableau1[Etat],\"8\",Tableau1[Mois],H_productives[[#This Row],[Mois]],Tableau1[N°S],H_productives[[#This Row],[N°S]])*8","v":0},{"$f":"COUNTIFS(Tableau1[Etat],\"8,75\",Tableau1[Mois],H_productives[[#This Row],[Mois]],Tableau1[N°S],H_productives[[#This Row],[N°S]])*8.75+COUNTIFS(Tableau1[Etat],\"8\",Tableau1[Mois],H_productives[[#This Row],[Mois]],Tableau1[N°S],H_productives[[#This Row],[N°S]])*8","v":0},{"$f":"COUNTIFS(Tableau1[Etat],\"8,75\",Tableau1[Mois],H_productives[[#This Row],[Mois]],Tableau1[N°S],H_productives[[#This Row],[N°S]])*8.75+COUNTIFS(Tableau1[Etat],\"8\",Tableau1[Mois],H_productives[[#This Row],[Mois]],Tableau1[N°S],H_productives[[#This Row],[N°S]])*8","v":0},{"$f":"COUNTIFS(Tableau1[Etat],\"8,75\",Tableau1[Mois],H_productives[[#This Row],[Mois]],Tableau1[N°S],H_productives[[#This Row],[N°S]])*8.75+COUNTIFS(Tableau1[Etat],\"8\",Tableau1[Mois],H_productives[[#This Row],[Mois]],Tableau1[N°S],H_productives[[#This Row],[N°S]])*8","v":0},35]
[null,2,1,{"$f":"TEXT(DATE('Fermetures & jours fériés'!$D$1,H_productives[[#This Row],[N°Mois]],1),\"mmmm\")","v":"janvier"},{"$f":"COUNTIFS(Tableau1[Etat],\"8,75\",Tableau1[Mois],H_productives[[#This Row],[Mois]],Tableau1[N°S],H_productives[[#This Row],[N°S]])*8.75+COUNTIFS(Tableau1[Etat],\"8\",Tableau1[Mois],H_productives[[#This Row],[Mois]],Tableau1[N°S],H_productives[[#This Row],[N°S]])*8","v":43},{"$f":"COUNTIFS(Tableau1[Etat],\"8,75\",Tableau1[Mois],H_productives[[#This Row],[Mois]],Tableau1[N°S],H_productives[[#This Row],[N°S]])*8.75+COUNTIFS(Tableau1[Etat],\"8\",Tableau1[Mois],H_productives[[#This Row],[Mois]],Tableau1[N°S],H_productives[[#This Row],[N°S]])*8","v":43},{"$f":"COUNTIFS(Tableau1[Etat],\"8,75\",Tableau1[Mois],H_productives[[#This Row],[Mois]],Tableau1[N°S],H_productives[[#This Row],[N°S]])*8.75+COUNTIFS(Tableau1[Etat],\"8\",Tableau1[Mois],H_productives[[#This Row],[Mois]],Tableau1[N°S],H_productives[[#This Row],[N°S]])*8","v":43},{"$f":"COUNTIFS(Tableau1[Etat],\"8,75\",Tableau1[Mois],H_productives[[#This Row],[Mois]],Tableau1[N°S],H_productives[[#This Row],[N°S]])*8.75+COUNTIFS(Tableau1[Etat],\"8\",Tableau1[Mois],H_productives[[#This Row],[Mois]],Tableau1[N°S],H_productives[[#This Row],[N°S]])*8","v":43},{"$f":"COUNTIFS(Tableau1[Etat],\"8,75\",Tableau1[Mois],H_productives[[#This Row],[Mois]],Tableau1[N°S],H_productives[[#This Row],[N°S]])*8.75+COUNTIFS(Tableau1[Etat],\"8\",Tableau1[Mois],H_productives[[#This Row],[Mois]],Tableau1[N°S],H_productives[[#This Row],[N°S]])*8","v":43},{"$f":"COUNTIFS(Tableau1[Etat],\"8,75\",Tableau1[Mois],H_productives[[#This Row],[Mois]],Tableau1[N°S],H_productives[[#This Row],[N°S]])*8.75+COUNTIFS(Tableau1[Etat],\"8\",Tableau1[Mois],H_productives[[#This Row],[Mois]],Tableau1[N°S],H_productives[[#This Row],[N°S]])*8","v":43},35]
[null,3,1,{"$f":"TEXT(DATE('Fermetures & jours fériés'!$D$1,H_productives[[#This Row],[N°Mois]],1),\"mmmm\")","v":"janvier"},{"$f":"COUNTIFS(Tableau1[Etat],\"8,75\",Tableau1[Mois],H_productives[[#This Row],[Mois]],Tableau1[N°S],H_productives[[#This Row],[N°S]])*8.75+COUNTIFS(Tableau1[Etat],\"8\",Tableau1[Mois],H_productives[[#This Row],[Mois]],Tableau1[N°S],H_productives[[#This Row],[N°S]])*8","v":35},{"$f":"COUNTIFS(Tableau1[Etat],\"8,75\",Tableau1[Mois],H_productives[[#This Row],[Mois]],Tableau1[N°S],H_productives[[#This Row],[N°S]])*8.75+COUNTIFS(Tableau1[Etat],\"8\",Tableau1[Mois],H_productives[[#This Row],[Mois]],Tableau1[N°S],H_productives[[#This Row],[N°S]])*8","v":35},{"$f":"COUNTIFS(Tableau1[Etat],\"8,75\",Tableau1[Mois],H_productives[[#This Row],[Mois]],Tableau1[N°S],H_productives[[#This Row],[N°S]])*8.75+COUNTIFS(Tableau1[Etat],\"8\",Tableau1[Mois],H_productives[[#This Row],[Mois]],Tableau1[N°S],H_productives[[#This Row],[N°S]])*8","v":35},{"$f":"COUNTIFS(Tableau1[Etat],\"8,75\",Tableau1[Mois],H_productives[[#This Row],[Mois]],Tableau1[N°S],H_productives[[#This Row],[N°S]])*8.75+COUNTIFS(Tableau1[Etat],\"8\",Tableau1[Mois],H_productives[[#This Row],[Mois]],Tableau1[N°S],H_productives[[#This Row],[N°S]])*8","v":35},{"$f":"COUNTIFS(Tableau1[Etat],\"8,75\",Tableau1[Mois],H_productives[[#This Row],[Mois]],Tableau1[N°S],H_productives[[#This Row],[N°S]])*8.75+COUNTIFS(Tableau1[Etat],\"8\",Tableau1[Mois],H_productives[[#This Row],[Mois]],Tableau1[N°S],H_productives[[#This Row],[N°S]])*8","v":35},{"$f":"COUNTIFS(Tableau1[Etat],\"8,75\",Tableau1[Mois],H_productives[[#This Row],[Mois]],Tableau1[N°S],H_productives[[#This Row],[N°S]])*8.75+COUNTIFS(Tableau1[Etat],\"8\",Tableau1[Mois],H_productives[[#This Row],[Mois]],Tableau1[N°S],H_productives[[#This Row],[N°S]])*8","v":35},35]
[null,4,1,{"$f":"TEXT(DATE('Fermetures & jours fériés'!$D$1,H_productives[[#This Row],[N°Mois]],1),\"mmmm\")","v":"janvier"},{"$f":"COUNTIFS(Tableau1[Etat],\"8,75\",Tableau1[Mois],H_productives[[#This Row],[Mois]],Tableau1[N°S],H_productives[[#This Row],[N°S]])*8.75+COUNTIFS(Tableau1[Etat],\"8\",Tableau1[Mois],H_productives[[#This Row],[Mois]],Tableau1[N°S],H_productives[[#This Row],[N°S]])*8","v":43},{"$f":"COUNTIFS(Tableau1[Etat],\"8,75\",Tableau1[Mois],H_productives[[#This Row],[Mois]],Tableau1[N°S],H_productives[[#This Row],[N°S]])*8.75+COUNTIFS(Tableau1[Etat],\"8\",Tableau1[Mois],H_productives[[#This Row],[Mois]],Tableau1[N°S],H_productives[[#This Row],[N°S]])*8","v":43},{"$f":"COUNTIFS(Tableau1[Etat],\"8,75\",Tableau1[Mois],H_productives[[#This Row],[Mois]],Tableau1[N°S],H_productives[[#This Row],[N°S]])*8.75+COUNTIFS(Tableau1[Etat],\"8\",Tableau1[Mois],H_productives[[#This Row],[Mois]],Tableau1[N°S],H_productives[[#This Row],[N°S]])*8","v":43},{"$f":"COUNTIFS(Tableau1[Etat],\"8,75\",Tableau1[Mois],H_productives[[#This Row],[Mois]],Tableau1[N°S],H_productives[[#This Row],[N°S]])*8.75+COUNTIFS(Tableau1[Etat],\"8\",Tableau1[Mois],H_productives[[#This Row],[Mois]],Tableau1[N°S],H_productives[[#This Row],[N°S]])*8","v":43},{"$f":"COUNTIFS(Tableau1[Etat],\"8,75\",Tableau1[Mois],H_productives[[#This Row],[Mois]],Tableau1[N°S],H_productives[[#This Row],[N°S]])*8.75+COUNTIFS(Tableau1[Etat],\"8\",Tableau1[Mois],H_productives[[#This Row],[Mois]],Tableau1[N°S],H_productives[[#This Row],[N°S]])*8","v":43},{"$f":"COUNTIFS(Tableau1[Etat],\"8,75\",Tableau1[Mois],H_productives[[#This Row],[Mois]],Tableau1[N°S],H_productives[[#This Row],[N°S]])*8.75+COUNTIFS(Tableau1[Etat],\"8\",Tableau1[Mois],H_productives[[#This Row],[Mois]],Tableau1[N°S],H_productives[[#This Row],[N°S]])*8","v":43},35]
[null,5,1,{"$f":"TEXT(DATE('Fermetures & jours fériés'!$D$1,H_productives[[#This Row],[N°Mois]],1),\"mmmm\")","v":"janvier"},{"$f":"COUNTIFS(Tableau1[Etat],\"8,75\",Tableau1[Mois],H_productives[[#This Row],[Mois]],Tableau1[N°S],H_productives[[#This Row],[N°S]])*8.75+COUNTIFS(Tableau1[Etat],\"8\",Tableau1[Mois],H_productives[[#This Row],[Mois]],Tableau1[N°S],H_productives[[#This Row],[N°S]])*8","v":35},{"$f":"COUNTIFS(Tableau1[Etat],\"8,75\",Tableau1[Mois],H_productives[[#This Row],[Mois]],Tableau1[N°S],H_productives[[#This Row],[N°S]])*8.75+COUNTIFS(Tableau1[Etat],\"8\",Tableau1[Mois],H_productives[[#This Row],[Mois]],Tableau1[N°S],H_productives[[#This Row],[N°S]])*8","v":35},{"$f":"COUNTIFS(Tableau1[Etat],\"8,75\",Tableau1[Mois],H_productives[[#This Row],[Mois]],Tableau1[N°S],H_productives[[#This Row],[N°S]])*8.75+COUNTIFS(Tableau1[Etat],\"8\",Tableau1[Mois],H_productives[[#This Row],[Mois]],Tableau1[N°S],H_productives[[#This Row],[N°S]])*8","v":35},{"$f":"COUNTIFS(Tableau1[Etat],\"8,75\",Tableau1[Mois],H_productives[[#This Row],[Mois]],Tableau1[N°S],H_productives[[#This Row],[N°S]])*8.75+COUNTIFS(Tableau1[Etat],\"8\",Tableau1[Mois],H_productives[[#This Row],[Mois]],Tableau1[N°S],H_productives[[#This Row],[N°S]])*8","v":35},{"$f":"COUNTIFS(Tableau1[Etat],\"8,75\",Tableau1[Mois],H_productives[[#This Row],[Mois]],Tableau1[N°S],H_productives[[#This Row],[N°S]])*8.75+COUNTIFS(Tableau1[Etat],\"8\",Tableau1[Mois],H_productives[[#This Row],[Mois]],Tableau1[N°S],H_productives[[#This Row],[N°S]])*8","v":35},{"$f":"COUNTIFS(Tableau1[Etat],\"8,75\",Tableau1[Mois],H_productives[[#This Row],[Mois]],Tableau1[N°S],H_productives[[#This Row],[N°S]])*8.75+COUNTIFS(Tableau1[Etat],\"8\",Tableau1[Mois],H_productives[[#This Row],[Mois]],Tableau1[N°S],H_productives[[#This Row],[N°S]])*8","v":35},35]
[null,5,2,{"$f":"TEXT(DATE('Fermetures & jours fériés'!$D$1,H_productives[[#This Row],[N°Mois]],1),\"mmmm\")","v":"février"},{"$f":"COUNTIFS(Tableau1[Etat],\"8,75\",Tableau1[Mois],H_productives[[#This Row],[Mois]],Tableau1[N°S],H_productives[[#This Row],[N°S]])*8.75+COUNTIFS(Tableau1[Etat],\"8\",Tableau1[Mois],H_productives[[#This Row],[Mois]],Tableau1[N°S],H_productives[[#This Row],[N°S]])*8","v":0},{"$f":"COUNTIFS(Tableau1[Etat],\"8,75\",Tableau1[Mois],H_productives[[#This Row],[Mois]],Tableau1[N°S],H_productives[[#This Row],[N°S]])*8.75+COUNTIFS(Tableau1[Etat],\"8\",Tableau1[Mois],H_productives[[#This Row],[Mois]],Tableau1[N°S],H_productives[[#This Row],[N°S]])*8","v":0},{"$f":"COUNTIFS(Tableau1[Etat],\"8,75\",Tableau1[Mois],H_productives[[#This Row],[Mois]],Tableau1[N°S],H_productives[[#This Row],[N°S]])*8.75+COUNTIFS(Tableau1[Etat],\"8\",Tableau1[Mois],H_productives[[#This Row],[Mois]],Tableau1[N°S],H_productives[[#This Row],[N°S]])*8","v":0},{"$f":"COUNTIFS(Tableau1[Etat],\"8,75\",Tableau1[Mois],H_productives[[#This Row],[Mois]],Tableau1[N°S],H_productives[[#This Row],[N°S]])*8.75+COUNTIFS(Tableau1[Etat],\"8\",Tableau1[Mois],H_productives[[#This Row],[Mois]],Tableau1[N°S],H_productives[[#This Row],[N°S]])*8","v":0},{"$f":"COUNTIFS(Tableau1[Etat],\"8,75\",Tableau1[Mois],H_productives[[#This Row],[Mois]],Tableau1[N°S],H_productives[[#This Row],[N°S]])*8.75+COUNTIFS(Tableau1[Etat],\"8\",Tableau1[Mois],H_productives[[#This Row],[Mois]],Tableau1[N°S],H_productives[[#This Row],[N°S]])*8","v":0},{"$f":"COUNTIFS(Tableau1[Etat],\"8,75\",Tableau1[Mois],H_productives[[#This Row],[Mois]],Tableau1[N°S],H_productives[[#This Row],[N°S]])*8.75+COUNTIFS(Tableau1[Etat],\"8\",Tableau1[Mois],H_productives[[#This Row],[Mois]],Tableau1[N°S],H_productives[[#This Row],[N°S]])*8","v":0},0]
[null,6,2,{"$f":"TEXT(DATE('Fermetures & jours fériés'!$D$1,H_productives[[#This Row],[N°Mois]],1),\"mmmm\")","v":"février"},{"$f":"COUNTIFS(Tableau1[Etat],\"8,75\",Tableau1[Mois],H_productives[[#This Row],[Mois]],Tableau1[N°S],H_productives[[#This Row],[N°S]])*8.75+COUNTIFS(Tableau1[Etat],\"8\",Tableau1[Mois],H_productives[[#This Row],[Mois]],Tableau1[N°S],H_productives[[#This Row],[N°S]])*8","v":43},{"$f":"COUNTIFS(Tableau1[Etat],\"8,75\",Tableau1[Mois],H_productives[[#This Row],[Mois]],Tableau1[N°S],H_productives[[#This Row],[N°S]])*8.75+COUNTIFS(Tableau1[Etat],\"8\",Tableau1[Mois],H_productives[[#This Row],[Mois]],Tableau1[N°S],H_productives[[#This Row],[N°S]])*8","v":43},{"$f":"COUNTIFS(Tableau1[Etat],\"8,75\",Tableau1[Mois],H_productives[[#This Row],[Mois]],Tableau1[N°S],H_productives[[#This Row],[N°S]])*8.75+COUNTIFS(Tableau1[Etat],\"8\",Tableau1[Mois],H_productives[[#This Row],[Mois]],Tableau1[N°S],H_productives[[#This Row],[N°S]])*8","v":43},{"$f":"COUNTIFS(Tableau1[Etat],\"8,75\",Tableau1[Mois],H_productives[[#This Row],[Mois]],Tableau1[N°S],H_productives[[#This Row],[N°S]])*8.75+COUNTIFS(Tableau1[Etat],\"8\",Tableau1[Mois],H_productives[[#This Row],[Mois]],Tableau1[N°S],H_productives[[#This Row],[N°S]])*8","v":43},{"$f":"COUNTIFS(Tableau1[Etat],\"8,75\",Tableau1[Mois],H_productives[[#This Row],[Mois]],Tableau1[N°S],H_productives[[#This Row],[N°S]])*8.75+COUNTIFS(Tableau1[Etat],\"8\",Tableau1[Mois],H_productives[[#This Row],[Mois]],Tableau1[N°S],H_productives[[#This Row],[N°S]])*8","v":43},{"$f":"COUNTIFS(Tableau1[Etat],\"8,75\",Tableau1[Mois],H_productives[[#This Row],[Mois]],Tableau1[N°S],H_productives[[#This Row],[N°S]])*8.75+COUNTIFS(Tableau1[Etat],\"8\",Tableau1[Mois],H_productives[[#This Row],[Mois]],Tableau1[N°S],H_productives[[#This Row],[N°S]])*8","v":43},35]
[null,7,2,{"$f":"TEXT(DATE('Fermetures & jours fériés'!$D$1,H_productives[[#This Row],[N°Mois]],1),\"mmmm\")","v":"février"},{"$f":"COUNTIFS(Tableau1[Etat],\"8,75\",Tableau1[Mois],H_productives[[#This Row],[Mois]],Tableau1[N°S],H_productives[[#This Row],[N°S]])*8.75+COUNTIFS(Tableau1[Etat],\"8\",Tableau1[Mois],H_productives[[#This Row],[Mois]],Tableau1[N°S],H_productives[[#This Row],[N°S]])*8","v":35},{"$f":"COUNTIFS(Tableau1[Etat],\"8,75\",Tableau1[Mois],H_productives[[#This Row],[Mois]],Tableau1[N°S],H_productives[[#This Row],[N°S]])*8.75+COUNTIFS(Tableau1[Etat],\"8\",Tableau1[Mois],H_productives[[#This Row],[Mois]],Tableau1[N°S],H_productives[[#This Row],[N°S]])*8","v":35},{"$f":"COUNTIFS(Tableau1[Etat],\"8,75\",Tableau1[Mois],H_productives[[#This Row],[Mois]],Tableau1[N°S],H_productives[[#This Row],[N°S]])*8.75+COUNTIFS(Tableau1[Etat],\"8\",Tableau1[Mois],H_productives[[#This Row],[Mois]],Tableau1[N°S],H_productives[[#This Row],[N°S]])*8","v":35},{"$f":"COUNTIFS(Tableau1[Etat],\"8,75\",Tableau1[Mois],H_productives[[#This Row],[Mois]],Tableau1[N°S],H_productives[[#This Row],[N°S]])*8.75+COUNTIFS(Tableau1[Etat],\"8\",Tableau1[Mois],H_productives[[#This Row],[Mois]],Tableau1[N°S],H_productives[[#This Row],[N°S]])*8","v":35},{"$f":"COUNTIFS(Tableau1[Etat],\"8,75\",Tableau1[Mois],H_productives[[#This Row],[Mois]],Tableau1[N°S],H_productives[[#This Row],[N°S]])*8.75+COUNTIFS(Tableau1[Etat],\"8\",Tableau1[Mois],H_productives[[#This Row],[Mois]],Tableau1[N°S],H_productives[[#This Row],[N°S]])*8","v":35},{"$f":"COUNTIFS(Tableau1[Etat],\"8,75\",Tableau1[Mois],H_productives[[#This Row],[Mois]],Tableau1[N°S],H_productives[[#This Row],[N°S]])*8.75+COUNTIFS(Tableau1[Etat],\"8\",Tableau1[Mois],H_productives[[#This Row],[Mois]],Tableau1[N°S],H_productives[[#This Row],[N°S]])*8","v":35},35]
[null,8,2,{"$f":"TEXT(DATE('Fermetures & jours fériés'!$D$1,H_productives[[#This Row],[N°Mois]],1),\"mmmm\")","v":"février"},{"$f":"COUNTIFS(Tableau1[Etat],\"8,75\",Tableau1[Mois],H_productives[[#This Row],[Mois]],Tableau1[N°S],H_productives[[#This Row],[N°S]])*8.75+COUNTIFS(Tableau1[Etat],\"8\",Tableau1[Mois],H_productives[[#This Row],[Mois]],Tableau1[N°S],H_productives[[#This Row],[N°S]])*8","v":43},{"$f":"COUNTIFS(Tableau1[Etat],\"8,75\",Tableau1[Mois],H_productives[[#This Row],[Mois]],Tableau1[N°S],H_productives[[#This Row],[N°S]])*8.75+COUNTIFS(Tableau1[Etat],\"8\",Tableau1[Mois],H_productives[[#This Row],[Mois]],Tableau1[N°S],H_productives[[#This Row],[N°S]])*8","v":43},{"$f":"COUNTIFS(Tableau1[Etat],\"8,75\",Tableau1[Mois],H_productives[[#This Row],[Mois]],Tableau1[N°S],H_productives[[#This Row],[N°S]])*8.75+COUNTIFS(Tableau1[Etat],\"8\",Tableau1[Mois],H_productives[[#This Row],[Mois]],Tableau1[N°S],H_productives[[#This Row],[N°S]])*8","v":43},{"$f":"COUNTIFS(Tableau1[Etat],\"8,75\",Tableau1[Mois],H_productives[[#This Row],[Mois]],Tableau1[N°S],H_productives[[#This Row],[N°S]])*8.75+COUNTIFS(Tableau1[Etat],\"8\",Tableau1[Mois],H_productives[[#This Row],[Mois]],Tableau1[N°S],H_productives[[#This Row],[N°S]])*8","v":43},{"$f":"COUNTIFS(Tableau1[Etat],\"8,75\",Tableau1[Mois],H_productives[[#This Row],[Mois]],Tableau1[N°S],H_productives[[#This Row],[N°S]])*8.75+COUNTIFS(Tableau1[Etat],\"8\",Tableau1[Mois],H_productives[[#This Row],[Mois]],Tableau1[N°S],H_productives[[#This Row],[N°S]])*8","v":43},{"$f":"COUNTIFS(Tableau1[Etat],\"8,75\",Tableau1[Mois],H_productives[[#This Row],[Mois]],Tableau1[N°S],H_productives[[#This Row],[N°S]])*8.75+COUNTIFS(Tableau1[Etat],\"8\",Tableau1[Mois],H_productives[[#This Row],[Mois]],Tableau1[N°S],H_productives[[#This Row],[N°S]])*8","v":43},35]
[null,9,2,{"$f":"TEXT(DATE('Fermetures & jours fériés'!$D$1,H_productives[[#This Row],[N°Mois]],1),\"mmmm\")","v":"février"},{"$f":"COUNTIFS(Tableau1[Etat],\"8,75\",Tableau1[Mois],H_productives[[#This Row],[Mois]],Tableau1[N°S],H_productives[[#This Row],[N°S]])*8.75+COUNTIFS(Tableau1[Etat],\"8\",Tableau1[Mois],H_productives[[#This Row],[Mois]],Tableau1[N°S],H_productives[[#This Row],[N°S]])*8","v":35},{"$f":"COUNTIFS(Tableau1[Etat],\"8,75\",Tableau1[Mois],H_productives[[#This Row],[Mois]],Tableau1[N°S],H_productives[[#This Row],[N°S]])*8.75+COUNTIFS(Tableau1[Etat],\"8\",Tableau1[Mois],H_productives[[#This Row],[Mois]],Tableau1[N°S],H_productives[[#This Row],[N°S]])*8","v":35},{"$f":"COUNTIFS(Tableau1[Etat],\"8,75\",Tableau1[Mois],H_productives[[#This Row],[Mois]],Tableau1[N°S],H_productives[[#This Row],[N°S]])*8.75+COUNTIFS(Tableau1[Etat],\"8\",Tableau1[Mois],H_productives[[#This Row],[Mois]],Tableau1[N°S],H_productives[[#This Row],[N°S]])*8","v":35},{"$f":"COUNTIFS(Tableau1[Etat],\"8,75\",Tableau1[Mois],H_productives[[#This Row],[Mois]],Tableau1[N°S],H_productives[[#This Row],[N°S]])*8.75+COUNTIFS(Tableau1[Etat],\"8\",Tableau1[Mois],H_productives[[#This Row],[Mois]],Tableau1[N°S],H_productives[[#This Row],[N°S]])*8","v":35},{"$f":"COUNTIFS(Tableau1[Etat],\"8,75\",Tableau1[Mois],H_productives[[#This Row],[Mois]],Tableau1[N°S],H_productives[[#This Row],[N°S]])*8.75+COUNTIFS(Tableau1[Etat],\"8\",Tableau1[Mois],H_productives[[#This Row],[Mois]],Tableau1[N°S],H_productives[[#This Row],[N°S]])*8","v":35},{"$f":"COUNTIFS(Tableau1[Etat],\"8,75\",Tableau1[Mois],H_productives[[#This Row],[Mois]],Tableau1[N°S],H_productives[[#This Row],[N°S]])*8.75+COUNTIFS(Tableau1[Etat],\"8\",Tableau1[Mois],H_productives[[#This Row],[Mois]],Tableau1[N°S],H_productives[[#This Row],[N°S]])*8","v":35},35]
[null,9,3,{"$f":"TEXT(DATE('Fermetures & jours fériés'!$D$1,H_productives[[#This Row],[N°Mois]],1),\"mmmm\")","v":"mars"},{"$f":"COUNTIFS(Tableau1[Etat],\"8,75\",Tableau1[Mois],H_productives[[#This Row],[Mois]],Tableau1[N°S],H_productives[[#This Row],[N°S]])*8.75+COUNTIFS(Tableau1[Etat],\"8\",Tableau1[Mois],H_productives[[#This Row],[Mois]],Tableau1[N°S],H_productives[[#This Row],[N°S]])*8","v":0},{"$f":"COUNTIFS(Tableau1[Etat],\"8,75\",Tableau1[Mois],H_productives[[#This Row],[Mois]],Tableau1[N°S],H_productives[[#This Row],[N°S]])*8.75+COUNTIFS(Tableau1[Etat],\"8\",Tableau1[Mois],H_productives[[#This Row],[Mois]],Tableau1[N°S],H_productives[[#This Row],[N°S]])*8","v":0},{"$f":"COUNTIFS(Tableau1[Etat],\"8,75\",Tableau1[Mois],H_productives[[#This Row],[Mois]],Tableau1[N°S],H_productives[[#This Row],[N°S]])*8.75+COUNTIFS(Tableau1[Etat],\"8\",Tableau1[Mois],H_productives[[#This Row],[Mois]],Tableau1[N°S],H_productives[[#This Row],[N°S]])*8","v":0},{"$f":"COUNTIFS(Tableau1[Etat],\"8,75\",Tableau1[Mois],H_productives[[#This Row],[Mois]],Tableau1[N°S],H_productives[[#This Row],[N°S]])*8.75+COUNTIFS(Tableau1[Etat],\"8\",Tableau1[Mois],H_productives[[#This Row],[Mois]],Tableau1[N°S],H_productives[[#This Row],[N°S]])*8","v":0},{"$f":"COUNTIFS(Tableau1[Etat],\"8,75\",Tableau1[Mois],H_productives[[#This Row],[Mois]],Tableau1[N°S],H_productives[[#This Row],[N°S]])*8.75+COUNTIFS(Tableau1[Etat],\"8\",Tableau1[Mois],H_productives[[#This Row],[Mois]],Tableau1[N°S],H_productives[[#This Row],[N°S]])*8","v":0},{"$f":"COUNTIFS(Tableau1[Etat],\"8,75\",Tableau1[Mois],H_productives[[#This Row],[Mois]],Tableau1[N°S],H_productives[[#This Row],[N°S]])*8.75+COUNTIFS(Tableau1[Etat],\"8\",Tableau1[Mois],H_productives[[#This Row],[Mois]],Tableau1[N°S],H_productives[[#This Row],[N°S]])*8","v":0},0]
[null,10,3,{"$f":"TEXT(DATE('Fermetures & jours fériés'!$D$1,H_productives[[#This Row],[N°Mois]],1),\"mmmm\")","v":"mars"},{"$f":"COUNTIFS(Tableau1[Etat],\"8,75\",Tableau1[Mois],H_productives[[#This Row],[Mois]],Tableau1[N°S],H_productives[[#This Row],[N°S]])*8.75+COUNTIFS(Tableau1[Etat],\"8\",Tableau1[Mois],H_productives[[#This Row],[Mois]],Tableau1[N°S],H_productives[[#This Row],[N°S]])*8","v":43},{"$f":"COUNTIFS(Tableau1[Etat],\"8,75\",Tableau1[Mois],H_productives[[#This Row],[Mois]],Tableau1[N°S],H_productives[[#This Row],[N°S]])*8.75+COUNTIFS(Tableau1[Etat],\"8\",Tableau1[Mois],H_productives[[#This Row],[Mois]],Tableau1[N°S],H_productives[[#This Row],[N°S]])*8","v":43},{"$f":"COUNTIFS(Tableau1[Etat],\"8,75\",Tableau1[Mois],H_productives[[#This Row],[Mois]],Tableau1[N°S],H_productives[[#This Row],[N°S]])*8.75+COUNTIFS(Tableau1[Etat],\"8\",Tableau1[Mois],H_productives[[#This Row],[Mois]],Tableau1[N°S],H_productives[[#This Row],[N°S]])*8","v":43},{"$f":"COUNTIFS(Tableau1[Etat],\"8,75\",Tableau1[Mois],H_productives[[#This Row],[Mois]],Tableau1[N°S],H_productives[[#This Row],[N°S]])*8.75+COUNTIFS(Tableau1[Etat],\"8\",Tableau1[Mois],H_productives[[#This Row],[Mois]],Tableau1[N°S],H_productives[[#This Row],[N°S]])*8","v":43},{"$f":"COUNTIFS(Tableau1[Etat],\"8,75\",Tableau1[Mois],H_productives[[#This Row],[Mois]],Tableau1[N°S],H_productives[[#This Row],[N°S]])*8.75+COUNTIFS(Tableau1[Etat],\"8\",Tableau1[Mois],H_productives[[#This Row],[Mois]],Tableau1[N°S],H_productives[[#This Row],[N°S]])*8","v":43},{"$f":"COUNTIFS(Tableau1[Etat],\"8,75\",Tableau1[Mois],H_productives[[#This Row],[Mois]],Tableau1[N°S],H_productives[[#This Row],[N°S]])*8.75+COUNTIFS(Tableau1[Etat],\"8\",Tableau1[Mois],H_productives[[#This Row],[Mois]],Tableau1[N°S],H_productives[[#This Row],[N°S]])*8","v":43},35]
[null,11,3,{"$f":"TEXT(DATE('Fermetures & jours fériés'!$D$1,H_productives[[#This Row],[N°Mois]],1),\"mmmm\")","v":"mars"},{"$f":"COUNTIFS(Tableau1[Etat],\"8,75\",Tableau1[Mois],H_productives[[#This Row],[Mois]],Tableau1[N°S],H_productives[[#This Row],[N°S]])*8.75+COUNTIFS(Tableau1[Etat],\"8\",Tableau1[Mois],H_productives[[#This Row],[Mois]],Tableau1[N°S],H_productives[[#This Row],[N°S]])*8","v":35},{"$f":"COUNTIFS(Tableau1[Etat],\"8,75\",Tableau1[Mois],H_productives[[#This Row],[Mois]],Tableau1[N°S],H_productives[[#This Row],[N°S]])*8.75+COUNTIFS(Tableau1[Etat],\"8\",Tableau1[Mois],H_productives[[#This Row],[Mois]],Tableau1[N°S],H_productives[[#This Row],[N°S]])*8","v":35},{"$f":"COUNTIFS(Tableau1[Etat],\"8,75\",Tableau1[Mois],H_productives[[#This Row],[Mois]],Tableau1[N°S],H_productives[[#This Row],[N°S]])*8.75+COUNTIFS(Tableau1[Etat],\"8\",Tableau1[Mois],H_productives[[#This Row],[Mois]],Tableau1[N°S],H_productives[[#This Row],[N°S]])*8","v":35},{"$f":"COUNTIFS(Tableau1[Etat],\"8,75\",Tableau1[Mois],H_productives[[#This Row],[Mois]],Tableau1[N°S],H_productives[[#This Row],[N°S]])*8.75+COUNTIFS(Tableau1[Etat],\"8\",Tableau1[Mois],H_productives[[#This Row],[Mois]],Tableau1[N°S],H_productives[[#This Row],[N°S]])*8","v":35},{"$f":"COUNTIFS(Tableau1[Etat],\"8,75\",Tableau1[Mois],H_productives[[#This Row],[Mois]],Tableau1[N°S],H_productives[[#This Row],[N°S]])*8.75+COUNTIFS(Tableau1[Etat],\"8\",Tableau1[Mois],H_productives[[#This Row],[Mois]],Tableau1[N°S],H_productives[[#This Row],[N°S]])*8","v":35},{"$f":"COUNTIFS(Tableau1[Etat],\"8,75\",Tableau1[Mois],H_productives[[#This Row],[Mois]],Tableau1[N°S],H_productives[[#This Row],[N°S]])*8.75+COUNTIFS(Tableau1[Etat],\"8\",Tableau1[Mois],H_productives[[#This Row],[Mois]],Tableau1[N°S],H_productives[[#This Row],[N°S]])*8","v":35},35]
[null,12,3,{"$f":"TEXT(DATE('Fermetures & jours fériés'!$D$1,H_productives[[#This Row],[N°Mois]],1),\"mmmm\")","v":"mars"},{"$f":"COUNTIFS(Tableau1[Etat],\"8,75\",Tableau1[Mois],H_productives[[#This Row],[Mois]],Tableau1[N°S],H_productives[[#This Row],[N°S]])*8.75+COUNTIFS(Tableau1[Etat],\"8\",Tableau1[Mois],H_productives[[#This Row],[Mois]],Tableau1[N°S],H_productives[[#This Row],[N°S]])*8","v":43},{"$f":"COUNTIFS(Tableau1[Etat],\"8,75\",Tableau1[Mois],H_productives[[#This Row],[Mois]],Tableau1[N°S],H_productives[[#This Row],[N°S]])*8.75+COUNTIFS(Tableau1[Etat],\"8\",Tableau1[Mois],H_productives[[#This Row],[Mois]],Tableau1[N°S],H_productives[[#This Row],[N°S]])*8","v":43},{"$f":"COUNTIFS(Tableau1[Etat],\"8,75\",Tableau1[Mois],H_productives[[#This Row],[Mois]],Tableau1[N°S],H_productives[[#This Row],[N°S]])*8.75+COUNTIFS(Tableau1[Etat],\"8\",Tableau1[Mois],H_productives[[#This Row],[Mois]],Tableau1[N°S],H_productives[[#This Row],[N°S]])*8","v":43},{"$f":"COUNTIFS(Tableau1[Etat],\"8,75\",Tableau1[Mois],H_productives[[#This Row],[Mois]],Tableau1[N°S],H_productives[[#This Row],[N°S]])*8.75+COUNTIFS(Tableau1[Etat],\"8\",Tableau1[Mois],H_productives[[#This Row],[Mois]],Tableau1[N°S],H_productives[[#This Row],[N°S]])*8","v":43},{"$f":"COUNTIFS(Tableau1[Etat],\"8,75\",Tableau1[Mois],H_productives[[#This Row],[Mois]],Tableau1[N°S],H_productives[[#This Row],[N°S]])*8.75+COUNTIFS(Tableau1[Etat],\"8\",Tableau1[Mois],H_productives[[#This Row],[Mois]],Tableau1[N°S],H_productives[[#This Row],[N°S]])*8","v":43},{"$f":"COUNTIFS(Tableau1[Etat],\"8,75\",Tableau1[Mois],H_productives[[#This Row],[Mois]],Tableau1[N°S],H_productives[[#This Row],[N°S]])*8.75+COUNTIFS(Tableau1[Etat],\"8\",Tableau1[Mois],H_productives[[#This Row],[Mois]],Tableau1[N°S],H_productives[[#This Row],[N°S]])*8","v":43},35]
[null,13,3,{"$f":"TEXT(DATE('Fermetures & jours fériés'!$D$1,H_productives[[#This Row],[N°Mois]],1),\"mmmm\")","v":"mars"},{"$f":"COUNTIFS(Tableau1[Etat],\"8,75\",Tableau1[Mois],H_productives[[#This Row],[Mois]],Tableau1[N°S],H_productives[[#This Row],[N°S]])*8.75+COUNTIFS(Tableau1[Etat],\"8\",Tableau1[Mois],H_productives[[#This Row],[Mois]],Tableau1[N°S],H_productives[[#This Row],[N°S]])*8","v":35},{"$f":"COUNTIFS(Tableau1[Etat],\"8,75\",Tableau1[Mois],H_productives[[#This Row],[Mois]],Tableau1[N°S],H_productives[[#This Row],[N°S]])*8.75+COUNTIFS(Tableau1[Etat],\"8\",Tableau1[Mois],H_productives[[#This Row],[Mois]],Tableau1[N°S],H_productives[[#This Row],[N°S]])*8","v":35},{"$f":"COUNTIFS(Tableau1[Etat],\"8,75\",Tableau1[Mois],H_productives[[#This Row],[Mois]],Tableau1[N°S],H_productives[[#This Row],[N°S]])*8.75+COUNTIFS(Tableau1[Etat],\"8\",Tableau1[Mois],H_productives[[#This Row],[Mois]],Tableau1[N°S],H_productives[[#This Row],[N°S]])*8","v":35},{"$f":"COUNTIFS(Tableau1[Etat],\"8,75\",Tableau1[Mois],H_productives[[#This Row],[Mois]],Tableau1[N°S],H_productives[[#This Row],[N°S]])*8.75+COUNTIFS(Tableau1[Etat],\"8\",Tableau1[Mois],H_productives[[#This Row],[Mois]],Tableau1[N°S],H_productives[[#This Row],[N°S]])*8","v":35},{"$f":"COUNTIFS(Tableau1[Etat],\"8,75\",Tableau1[Mois],H_productives[[#This Row],[Mois]],Tableau1[N°S],H_productives[[#This Row],[N°S]])*8.75+COUNTIFS(Tableau1[Etat],\"8\",Tableau1[Mois],H_productives[[#This Row],[Mois]],Tableau1[N°S],H_productives[[#This Row],[N°S]])*8","v":35},{"$f":"COUNTIFS(Tableau1[Etat],\"8,75\",Tableau1[Mois],H_productives[[#This Row],[Mois]],Tableau1[N°S],H_productives[[#This Row],[N°S]])*8.75+COUNTIFS(Tableau1[Etat],\"8\",Tableau1[Mois],H_productives[[#This Row],[Mois]],Tableau1[N°S],H_productives[[#This Row],[N°S]])*8","v":35},35]
[null,14,3,{"$f":"TEXT(DATE('Fermetures & jours fériés'!$D$1,H_productives[[#This Row],[N°Mois]],1),\"mmmm\")","v":"mars"},{"$f":"COUNTIFS(Tableau1[Etat],\"8,75\",Tableau1[Mois],H_productives[[#This Row],[Mois]],Tableau1[N°S],H_productives[[#This Row],[N°S]])*8.75+COUNTIFS(Tableau1[Etat],\"8\",Tableau1[Mois],H_productives[[#This Row],[Mois]],Tableau1[N°S],H_productives[[#This Row],[N°S]])*8","v":17.5},{"$f":"COUNTIFS(Tableau1[Etat],\"8,75\",Tableau1[Mois],H_productives[[#This Row],[Mois]],Tableau1[N°S],H_productives[[#This Row],[N°S]])*8.75+COUNTIFS(Tableau1[Etat],\"8\",Tableau1[Mois],H_productives[[#This Row],[Mois]],Tableau1[N°S],H_productives[[#This Row],[N°S]])*8","v":17.5},{"$f":"COUNTIFS(Tableau1[Etat],\"8,75\",Tableau1[Mois],H_productives[[#This Row],[Mois]],Tableau1[N°S],H_productives[[#This Row],[N°S]])*8.75+COUNTIFS(Tableau1[Etat],\"8\",Tableau1[Mois],H_productives[[#This Row],[Mois]],Tableau1[N°S],H_productives[[#This Row],[N°S]])*8","v":17.5},{"$f":"COUNTIFS(Tableau1[Etat],\"8,75\",Tableau1[Mois],H_productives[[#This Row],[Mois]],Tableau1[N°S],H_productives[[#This Row],[N°S]])*8.75+COUNTIFS(Tableau1[Etat],\"8\",Tableau1[Mois],H_productives[[#This Row],[Mois]],Tableau1[N°S],H_productives[[#This Row],[N°S]])*8","v":17.5},{"$f":"COUNTIFS(Tableau1[Etat],\"8,75\",Tableau1[Mois],H_productives[[#This Row],[Mois]],Tableau1[N°S],H_productives[[#This Row],[N°S]])*8.75+COUNTIFS(Tableau1[Etat],\"8\",Tableau1[Mois],H_productives[[#This Row],[Mois]],Tableau1[N°S],H_productives[[#This Row],[N°S]])*8","v":17.5},{"$f":"COUNTIFS(Tableau1[Etat],\"8,75\",Tableau1[Mois],H_productives[[#This Row],[Mois]],Tableau1[N°S],H_productives[[#This Row],[N°S]])*8.75+COUNTIFS(Tableau1[Etat],\"8\",Tableau1[Mois],H_productives[[#This Row],[Mois]],Tableau1[N°S],H_productives[[#This Row],[N°S]])*8","v":17.5},35]
[null,14,4,{"$f":"TEXT(DATE('Fermetures & jours fériés'!$D$1,H_productives[[#This Row],[N°Mois]],1),\"mmmm\")","v":"avril"},{"$f":"COUNTIFS(Tableau1[Etat],\"8,75\",Tableau1[Mois],H_productives[[#This Row],[Mois]],Tableau1[N°S],H_productives[[#This Row],[N°S]])*8.75+COUNTIFS(Tableau1[Etat],\"8\",Tableau1[Mois],H_productives[[#This Row],[Mois]],Tableau1[N°S],H_productives[[#This Row],[N°S]])*8","v":25.5},{"$f":"COUNTIFS(Tableau1[Etat],\"8,75\",Tableau1[Mois],H_productives[[#This Row],[Mois]],Tableau1[N°S],H_productives[[#This Row],[N°S]])*8.75+COUNTIFS(Tableau1[Etat],\"8\",Tableau1[Mois],H_productives[[#This Row],[Mois]],Tableau1[N°S],H_productives[[#This Row],[N°S]])*8","v":25.5},{"$f":"COUNTIFS(Tableau1[Etat],\"8,75\",Tableau1[Mois],H_productives[[#This Row],[Mois]],Tableau1[N°S],H_productives[[#This Row],[N°S]])*8.75+COUNTIFS(Tableau1[Etat],\"8\",Tableau1[Mois],H_productives[[#This Row],[Mois]],Tableau1[N°S],H_productives[[#This Row],[N°S]])*8","v":25.5},{"$f":"COUNTIFS(Tableau1[Etat],\"8,75\",Tableau1[Mois],H_productives[[#This Row],[Mois]],Tableau1[N°S],H_productives[[#This Row],[N°S]])*8.75+COUNTIFS(Tableau1[Etat],\"8\",Tableau1[Mois],H_productives[[#This Row],[Mois]],Tableau1[N°S],H_productives[[#This Row],[N°S]])*8","v":25.5},{"$f":"COUNTIFS(Tableau1[Etat],\"8,75\",Tableau1[Mois],H_productives[[#This Row],[Mois]],Tableau1[N°S],H_productives[[#This Row],[N°S]])*8.75+COUNTIFS(Tableau1[Etat],\"8\",Tableau1[Mois],H_productives[[#This Row],[Mois]],Tableau1[N°S],H_productives[[#This Row],[N°S]])*8","v":25.5},{"$f":"COUNTIFS(Tableau1[Etat],\"8,75\",Tableau1[Mois],H_productives[[#This Row],[Mois]],Tableau1[N°S],H_productives[[#This Row],[N°S]])*8.75+COUNTIFS(Tableau1[Etat],\"8\",Tableau1[Mois],H_productives[[#This Row],[Mois]],Tableau1[N°S],H_productives[[#This Row],[N°S]])*8","v":25.5},24]
[null,15,4,{"$f":"TEXT(DATE('Fermetures & jours fériés'!$D$1,H_productives[[#This Row],[N°Mois]],1),\"mmmm\")","v":"avril"},{"$f":"COUNTIFS(Tableau1[Etat],\"8,75\",Tableau1[Mois],H_productives[[#This Row],[Mois]],Tableau1[N°S],H_productives[[#This Row],[N°S]])*8.75+COUNTIFS(Tableau1[Etat],\"8\",Tableau1[Mois],H_productives[[#This Row],[Mois]],Tableau1[N°S],H_productives[[#This Row],[N°S]])*8","v":35},{"$f":"COUNTIFS(Tableau1[Etat],\"8,75\",Tableau1[Mois],H_productives[[#This Row],[Mois]],Tableau1[N°S],H_productives[[#This Row],[N°S]])*8.75+COUNTIFS(Tableau1[Etat],\"8\",Tableau1[Mois],H_productives[[#This Row],[Mois]],Tableau1[N°S],H_productives[[#This Row],[N°S]])*8","v":35},{"$f":"COUNTIFS(Tableau1[Etat],\"8,75\",Tableau1[Mois],H_productives[[#This Row],[Mois]],Tableau1[N°S],H_productives[[#This Row],[N°S]])*8.75+COUNTIFS(Tableau1[Etat],\"8\",Tableau1[Mois],H_productives[[#This Row],[Mois]],Tableau1[N°S],H_productives[[#This Row],[N°S]])*8","v":35},{"$f":"COUNTIFS(Tableau1[Etat],\"8,75\",Tableau1[Mois],H_productives[[#This Row],[Mois]],Tableau1[N°S],H_productives[[#This Row],[N°S]])*8.75+COUNTIFS(Tableau1[Etat],\"8\",Tableau1[Mois],H_productives[[#This Row],[Mois]],Tableau1[N°S],H_productives[[#This Row],[N°S]])*8","v":35},{"$f":"COUNTIFS(Tableau1[Etat],\"8,75\",Tableau1[Mois],H_productives[[#This Row],[Mois]],Tableau1[N°S],H_productives[[#This Row],[N°S]])*8.75+COUNTIFS(Tableau1[Etat],\"8\",Tableau1[Mois],H_productives[[#This Row],[Mois]],Tableau1[N°S],H_productives[[#This Row],[N°S]])*8","v":35},{"$f":"COUNTIFS(Tableau1[Etat],\"8,75\",Tableau1[Mois],H_productives[[#This Row],[Mois]],Tableau1[N°S],H_productives[[#This Row],[N°S]])*8.75+COUNTIFS(Tableau1[Etat],\"8\",Tableau1[Mois],H_productives[[#This Row],[Mois]],Tableau1[N°S],H_productives[[#This Row],[N°S]])*8","v":35},40]
[null,16,4,{"$f":"TEXT(DATE('Fermetures & jours fériés'!$D$1,H_productives[[#This Row],[N°Mois]],1),\"mmmm\")","v":"avril"},{"$f":"COUNTIFS(Tableau1[Etat],\"8,75\",Tableau1[Mois],H_productives[[#This Row],[Mois]],Tableau1[N°S],H_productives[[#This Row],[N°S]])*8.75+COUNTIFS(Tableau1[Etat],\"8\",Tableau1[Mois],H_productives[[#This Row],[Mois]],Tableau1[N°S],H_productives[[#This Row],[N°S]])*8","v":34.25},{"$f":"COUNTIFS(Tableau1[Etat],\"8,75\",Tableau1[Mois],H_productives[[#This Row],[Mois]],Tableau1[N°S],H_productives[[#This Row],[N°S]])*8.75+COUNTIFS(Tableau1[Etat],\"8\",Tableau1[Mois],H_productives[[#This Row],[Mois]],Tableau1[N°S],H_productives[[#This Row],[N°S]])*8","v":34.25},{"$f":"COUNTIFS(Tableau1[Etat],\"8,75\",Tableau1[Mois],H_productives[[#This Row],[Mois]],Tableau1[N°S],H_productives[[#This Row],[N°S]])*8.75+COUNTIFS(Tableau1[Etat],\"8\",Tableau1[Mois],H_productives[[#This Row],[Mois]],Tableau1[N°S],H_productives[[#This Row],[N°S]])*8","v":34.25},{"$f":"COUNTIFS(Tableau1[Etat],\"8,75\",Tableau1[Mois],H_productives[[#This Row],[Mois]],Tableau1[N°S],H_productives[[#This Row],[N°S]])*8.75+COUNTIFS(Tableau1[Etat],\"8\",Tableau1[Mois],H_productives[[#This Row],[Mois]],Tableau1[N°S],H_productives[[#This Row],[N°S]])*8","v":34.25},{"$f":"COUNTIFS(Tableau1[Etat],\"8,75\",Tableau1[Mois],H_productives[[#This Row],[Mois]],Tableau1[N°S],H_productives[[#This Row],[N°S]])*8.75+COUNTIFS(Tableau1[Etat],\"8\",Tableau1[Mois],H_productives[[#This Row],[Mois]],Tableau1[N°S],H_productives[[#This Row],[N°S]])*8","v":34.25},{"$f":"COUNTIFS(Tableau1[Etat],\"8,75\",Tableau1[Mois],H_productives[[#This Row],[Mois]],Tableau1[N°S],H_productives[[#This Row],[N°S]])*8.75+COUNTIFS(Tableau1[Etat],\"8\",Tableau1[Mois],H_productives[[#This Row],[Mois]],Tableau1[N°S],H_productives[[#This Row],[N°S]])*8","v":34.25},32]
[null,17,4,{"$f":"TEXT(DATE('Fermetures & jours fériés'!$D$1,H_productives[[#This Row],[N°Mois]],1),\"mmmm\")","v":"avril"},{"$f":"COUNTIFS(Tableau1[Etat],\"8,75\",Tableau1[Mois],H_productives[[#This Row],[Mois]],Tableau1[N°S],H_productives[[#This Row],[N°S]])*8.75+COUNTIFS(Tableau1[Etat],\"8\",Tableau1[Mois],H_productives[[#This Row],[Mois]],Tableau1[N°S],H_productives[[#This Row],[N°S]])*8","v":35},{"$f":"COUNTIFS(Tableau1[Etat],\"8,75\",Tableau1[Mois],H_productives[[#This Row],[Mois]],Tableau1[N°S],H_productives[[#This Row],[N°S]])*8.75+COUNTIFS(Tableau1[Etat],\"8\",Tableau1[Mois],H_productives[[#This Row],[Mois]],Tableau1[N°S],H_productives[[#This Row],[N°S]])*8","v":35},{"$f":"COUNTIFS(Tableau1[Etat],\"8,75\",Tableau1[Mois],H_productives[[#This Row],[Mois]],Tableau1[N°S],H_productives[[#This Row],[N°S]])*8.75+COUNTIFS(Tableau1[Etat],\"8\",Tableau1[Mois],H_productives[[#This Row],[Mois]],Tableau1[N°S],H_productives[[#This Row],[N°S]])*8","v":35},{"$f":"COUNTIFS(Tableau1[Etat],\"8,75\",Tableau1[Mois],H_productives[[#This Row],[Mois]],Tableau1[N°S],H_productives[[#This Row],[N°S]])*8.75+COUNTIFS(Tableau1[Etat],\"8\",Tableau1[Mois],H_productives[[#This Row],[Mois]],Tableau1[N°S],H_productives[[#This Row],[N°S]])*8","v":35},{"$f":"COUNTIFS(Tableau1[Etat],\"8,75\",Tableau1[Mois],H_productives[[#This Row],[Mois]],Tableau1[N°S],H_productives[[#This Row],[N°S]])*8.75+COUNTIFS(Tableau1[Etat],\"8\",Tableau1[Mois],H_productives[[#This Row],[Mois]],Tableau1[N°S],H_productives[[#This Row],[N°S]])*8","v":35},{"$f":"COUNTIFS(Tableau1[Etat],\"8,75\",Tableau1[Mois],H_productives[[#This Row],[Mois]],Tableau1[N°S],H_productives[[#This Row],[N°S]])*8.75+COUNTIFS(Tableau1[Etat],\"8\",Tableau1[Mois],H_productives[[#This Row],[Mois]],Tableau1[N°S],H_productives[[#This Row],[N°S]])*8","v":35},40]
[null,18,4,{"$f":"TEXT(DATE('Fermetures & jours fériés'!$D$1,H_productives[[#This Row],[N°Mois]],1),\"mmmm\")","v":"avril"},{"$f":"COUNTIFS(Tableau1[Etat],\"8,75\",Tableau1[Mois],H_productives[[#This Row],[Mois]],Tableau1[N°S],H_productives[[#This Row],[N°S]])*8.75+COUNTIFS(Tableau1[Etat],\"8\",Tableau1[Mois],H_productives[[#This Row],[Mois]],Tableau1[N°S],H_productives[[#This Row],[N°S]])*8","v":35},{"$f":"COUNTIFS(Tableau1[Etat],\"8,75\",Tableau1[Mois],H_productives[[#This Row],[Mois]],Tableau1[N°S],H_productives[[#This Row],[N°S]])*8.75+COUNTIFS(Tableau1[Etat],\"8\",Tableau1[Mois],H_productives[[#This Row],[Mois]],Tableau1[N°S],H_productives[[#This Row],[N°S]])*8","v":35},{"$f":"COUNTIFS(Tableau1[Etat],\"8,75\",Tableau1[Mois],H_productives[[#This Row],[Mois]],Tableau1[N°S],H_productives[[#This Row],[N°S]])*8.75+COUNTIFS(Tableau1[Etat],\"8\",Tableau1[Mois],H_productives[[#This Row],[Mois]],Tableau1[N°S],H_productives[[#This Row],[N°S]])*8","v":35},{"$f":"COUNTIFS(Tableau1[Etat],\"8,75\",Tableau1[Mois],H_productives[[#This Row],[Mois]],Tableau1[N°S],H_productives[[#This Row],[N°S]])*8.75+COUNTIFS(Tableau1[Etat],\"8\",Tableau1[Mois],H_productives[[#This Row],[Mois]],Tableau1[N°S],H_productives[[#This Row],[N°S]])*8","v":35},{"$f":"COUNTIFS(Tableau1[Etat],\"8,75\",Tableau1[Mois],H_productives[[#This Row],[Mois]],Tableau1[N°S],H_productives[[#This Row],[N°S]])*8.75+COUNTIFS(Tableau1[Etat],\"8\",Tableau1[Mois],H_productives[[#This Row],[Mois]],Tableau1[N°S],H_productives[[#This Row],[N°S]])*8","v":35},{"$f":"COUNTIFS(Tableau1[Etat],\"8,75\",Tableau1[Mois],H_productives[[#This Row],[Mois]],Tableau1[N°S],H_productives[[#This Row],[N°S]])*8.75+COUNTIFS(Tableau1[Etat],\"8\",Tableau1[Mois],H_productives[[#This Row],[Mois]],Tableau1[N°S],H_productives[[#This Row],[N°S]])*8","v":35},32]
[null,18,5,{"$f":"TEXT(DATE('Fermetures & jours fériés'!$D$1,H_productives[[#This Row],[N°Mois]],1),\"mmmm\")","v":"mai"},{"$f":"COUNTIFS(Tableau1[Etat],\"8,75\",Tableau1[Mois],H_productives[[#This Row],[Mois]],Tableau1[N°S],H_productives[[#This Row],[N°S]])*8.75+COUNTIFS(Tableau1[Etat],\"8\",Tableau1[Mois],H_productives[[#This Row],[Mois]],Tableau1[N°S],H_productives[[#This Row],[N°S]])*8","v":0},{"$f":"COUNTIFS(Tableau1[Etat],\"8,75\",Tableau1[Mois],H_productives[[#This Row],[Mois]],Tableau1[N°S],H_productives[[#This Row],[N°S]])*8.75+COUNTIFS(Tableau1[Etat],\"8\",Tableau1[Mois],H_productives[[#This Row],[Mois]],Tableau1[N°S],H_productives[[#This Row],[N°S]])*8","v":0},{"$f":"COUNTIFS(Tableau1[Etat],\"8,75\",Tableau1[Mois],H_productives[[#This Row],[Mois]],Tableau1[N°S],H_productives[[#This Row],[N°S]])*8.75+COUNTIFS(Tableau1[Etat],\"8\",Tableau1[Mois],H_productives[[#This Row],[Mois]],Tableau1[N°S],H_productives[[#This Row],[N°S]])*8","v":0},{"$f":"COUNTIFS(Tableau1[Etat],\"8,75\",Tableau1[Mois],H_productives[[#This Row],[Mois]],Tableau1[N°S],H_productives[[#This Row],[N°S]])*8.75+COUNTIFS(Tableau1[Etat],\"8\",Tableau1[Mois],H_productives[[#This Row],[Mois]],Tableau1[N°S],H_productives[[#This Row],[N°S]])*8","v":0},{"$f":"COUNTIFS(Tableau1[Etat],\"8,75\",Tableau1[Mois],H_productives[[#This Row],[Mois]],Tableau1[N°S],H_productives[[#This Row],[N°S]])*8.75+COUNTIFS(Tableau1[Etat],\"8\",Tableau1[Mois],H_productives[[#This Row],[Mois]],Tableau1[N°S],H_productives[[#This Row],[N°S]])*8","v":0},{"$f":"COUNTIFS(Tableau1[Etat],\"8,75\",Tableau1[Mois],H_productives[[#This Row],[Mois]],Tableau1[N°S],H_productives[[#This Row],[N°S]])*8.75+COUNTIFS(Tableau1[Etat],\"8\",Tableau1[Mois],H_productives[[#This Row],[Mois]],Tableau1[N°S],H_productives[[#This Row],[N°S]])*8","v":0},0]
[null,19,5,{"$f":"TEXT(DATE('Fermetures & jours fériés'!$D$1,H_productives[[#This Row],[N°Mois]],1),\"mmmm\")","v":"mai"},{"$f":"COUNTIFS(Tableau1[Etat],\"8,75\",Tableau1[Mois],H_productives[[#This Row],[Mois]],Tableau1[N°S],H_productives[[#This Row],[N°S]])*8.75+COUNTIFS(Tableau1[Etat],\"8\",Tableau1[Mois],H_productives[[#This Row],[Mois]],Tableau1[N°S],H_productives[[#This Row],[N°S]])*8","v":35},{"$f":"COUNTIFS(Tableau1[Etat],\"8,75\",Tableau1[Mois],H_productives[[#This Row],[Mois]],Tableau1[N°S],H_productives[[#This Row],[N°S]])*8.75+COUNTIFS(Tableau1[Etat],\"8\",Tableau1[Mois],H_productives[[#This Row],[Mois]],Tableau1[N°S],H_productives[[#This Row],[N°S]])*8","v":35},{"$f":"COUNTIFS(Tableau1[Etat],\"8,75\",Tableau1[Mois],H_productives[[#This Row],[Mois]],Tableau1[N°S],H_productives[[#This Row],[N°S]])*8.75+COUNTIFS(Tableau1[Etat],\"8\",Tableau1[Mois],H_productives[[#This Row],[Mois]],Tableau1[N°S],H_productives[[#This Row],[N°S]])*8","v":35},{"$f":"COUNTIFS(Tableau1[Etat],\"8,75\",Tableau1[Mois],H_productives[[#This Row],[Mois]],Tableau1[N°S],H_productives[[#This Row],[N°S]])*8.75+COUNTIFS(Tableau1[Etat],\"8\",Tableau1[Mois],H_productives[[#This Row],[Mois]],Tableau1[N°S],H_productives[[#This Row],[N°S]])*8","v":35},{"$f":"COUNTIFS(Tableau1[Etat],\"8,75\",Tableau1[Mois],H_productives[[#This Row],[Mois]],Tableau1[N°S],H_productives[[#This Row],[N°S]])*8.75+COUNTIFS(Tableau1[Etat],\"8\",Tableau1[Mois],H_productives[[#This Row],[Mois]],Tableau1[N°S],H_productives[[#This Row],[N°S]])*8","v":35},{"$f":"COUNTIFS(Tableau1[Etat],\"8,75\",Tableau1[Mois],H_productives[[#This Row],[Mois]],Tableau1[N°S],H_productives[[#This Row],[N°S]])*8.75+COUNTIFS(Tableau1[Etat],\"8\",Tableau1[Mois],H_productives[[#This Row],[Mois]],Tableau1[N°S],H_productives[[#This Row],[N°S]])*8","v":35},40]
[null,20,5,{"$f":"TEXT(DATE('Fermetures & jours fériés'!$D$1,H_productives[[#This Row],[N°Mois]],1),\"mmmm\")","v":"mai"},{"$f":"COUNTIFS(Tableau1[Etat],\"8,75\",Tableau1[Mois],H_productives[[#This Row],[Mois]],Tableau1[N°S],H_productives[[#This Row],[N°S]])*8.75+COUNTIFS(Tableau1[Etat],\"8\",Tableau1[Mois],H_productives[[#This Row],[Mois]],Tableau1[N°S],H_productives[[#This Row],[N°S]])*8","v":43},{"$f":"COUNTIFS(Tableau1[Etat],\"8,75\",Tableau1[Mois],H_productives[[#This Row],[Mois]],Tableau1[N°S],H_productives[[#This Row],[N°S]])*8.75+COUNTIFS(Tableau1[Etat],\"8\",Tableau1[Mois],H_productives[[#This Row],[Mois]],Tableau1[N°S],H_productives[[#This Row],[N°S]])*8","v":43},{"$f":"COUNTIFS(Tableau1[Etat],\"8,75\",Tableau1[Mois],H_productives[[#This Row],[Mois]],Tableau1[N°S],H_productives[[#This Row],[N°S]])*8.75+COUNTIFS(Tableau1[Etat],\"8\",Tableau1[Mois],H_productives[[#This Row],[Mois]],Tableau1[N°S],H_productives[[#This Row],[N°S]])*8","v":43},{"$f":"COUNTIFS(Tableau1[Etat],\"8,75\",Tableau1[Mois],H_productives[[#This Row],[Mois]],Tableau1[N°S],H_productives[[#This Row],[N°S]])*8.75+COUNTIFS(Tableau1[Etat],\"8\",Tableau1[Mois],H_productives[[#This Row],[Mois]],Tableau1[N°S],H_productives[[#This Row],[N°S]])*8","v":43},{"$f":"COUNTIFS(Tableau1[Etat],\"8,75\",Tableau1[Mois],H_productives[[#This Row],[Mois]],Tableau1[N°S],H_productives[[#This Row],[N°S]])*8.75+COUNTIFS(Tableau1[Etat],\"8\",Tableau1[Mois],H_productives[[#This Row],[Mois]],Tableau1[N°S],H_productives[[#This Row],[N°S]])*8","v":43},{"$f":"COUNTIFS(Tableau1[Etat],\"8,75\",Tableau1[Mois],H_productives[[#This Row],[Mois]],Tableau1[N°S],H_productives[[#This Row],[N°S]])*8.75+COUNTIFS(Tableau1[Etat],\"8\",Tableau1[Mois],H_productives[[#This Row],[Mois]],Tableau1[N°S],H_productives[[#This Row],[N°S]])*8","v":43},40]
[null,21,5,{"$f":"TEXT(DATE('Fermetures & jours fériés'!$D$1,H_productives[[#This Row],[N°Mois]],1),\"mmmm\")","v":"mai"},{"$f":"COUNTIFS(Tableau1[Etat],\"8,75\",Tableau1[Mois],H_productives[[#This Row],[Mois]],Tableau1[N°S],H_productives[[#This Row],[N°S]])*8.75+COUNTIFS(Tableau1[Etat],\"8\",Tableau1[Mois],H_productives[[#This Row],[Mois]],Tableau1[N°S],H_productives[[#This Row],[N°S]])*8","v":26.25},{"$f":"COUNTIFS(Tableau1[Etat],\"8,75\",Tableau1[Mois],H_productives[[#This Row],[Mois]],Tableau1[N°S],H_productives[[#This Row],[N°S]])*8.75+COUNTIFS(Tableau1[Etat],\"8\",Tableau1[Mois],H_productives[[#This Row],[Mois]],Tableau1[N°S],H_productives[[#This Row],[N°S]])*8","v":26.25},{"$f":"COUNTIFS(Tableau1[Etat],\"8,75\",Tableau1[Mois],H_productives[[#This Row],[Mois]],Tableau1[N°S],H_productives[[#This Row],[N°S]])*8.75+COUNTIFS(Tableau1[Etat],\"8\",Tableau1[Mois],H_productives[[#This Row],[Mois]],Tableau1[N°S],H_productives[[#This Row],[N°S]])*8","v":26.25},{"$f":"COUNTIFS(Tableau1[Etat],\"8,75\",Tableau1[Mois],H_productives[[#This Row],[Mois]],Tableau1[N°S],H_productives[[#This Row],[N°S]])*8.75+COUNTIFS(Tableau1[Etat],\"8\",Tableau1[Mois],H_productives[[#This Row],[Mois]],Tableau1[N°S],H_productives[[#This Row],[N°S]])*8","v":26.25},{"$f":"COUNTIFS(Tableau1[Etat],\"8,75\",Tableau1[Mois],H_productives[[#This Row],[Mois]],Tableau1[N°S],H_productives[[#This Row],[N°S]])*8.75+COUNTIFS(Tableau1[Etat],\"8\",Tableau1[Mois],H_productives[[#This Row],[Mois]],Tableau1[N°S],H_productives[[#This Row],[N°S]])*8","v":26.25},{"$f":"COUNTIFS(Tableau1[Etat],\"8,75\",Tableau1[Mois],H_productives[[#This Row],[Mois]],Tableau1[N°S],H_productives[[#This Row],[N°S]])*8.75+COUNTIFS(Tableau1[Etat],\"8\",Tableau1[Mois],H_productives[[#This Row],[Mois]],Tableau1[N°S],H_productives[[#This Row],[N°S]])*8","v":26.25},32]
[null,22,5,{"$f":"TEXT(DATE('Fermetures & jours fériés'!$D$1,H_productives[[#This Row],[N°Mois]],1),\"mmmm\")","v":"mai"},{"$f":"COUNTIFS(Tableau1[Etat],\"8,75\",Tableau1[Mois],H_productives[[#This Row],[Mois]],Tableau1[N°S],H_productives[[#This Row],[N°S]])*8.75+COUNTIFS(Tableau1[Etat],\"8\",Tableau1[Mois],H_productives[[#This Row],[Mois]],Tableau1[N°S],H_productives[[#This Row],[N°S]])*8","v":43},{"$f":"COUNTIFS(Tableau1[Etat],\"8,75\",Tableau1[Mois],H_productives[[#This Row],[Mois]],Tableau1[N°S],H_productives[[#This Row],[N°S]])*8.75+COUNTIFS(Tableau1[Etat],\"8\",Tableau1[Mois],H_productives[[#This Row],[Mois]],Tableau1[N°S],H_productives[[#This Row],[N°S]])*8","v":43},{"$f":"COUNTIFS(Tableau1[Etat],\"8,75\",Tableau1[Mois],H_productives[[#This Row],[Mois]],Tableau1[N°S],H_productives[[#This Row],[N°S]])*8.75+COUNTIFS(Tableau1[Etat],\"8\",Tableau1[Mois],H_productives[[#This Row],[Mois]],Tableau1[N°S],H_productives[[#This Row],[N°S]])*8","v":43},{"$f":"COUNTIFS(Tableau1[Etat],\"8,75\",Tableau1[Mois],H_productives[[#This Row],[Mois]],Tableau1[N°S],H_productives[[#This Row],[N°S]])*8.75+COUNTIFS(Tableau1[Etat],\"8\",Tableau1[Mois],H_productives[[#This Row],[Mois]],Tableau1[N°S],H_productives[[#This Row],[N°S]])*8","v":43},{"$f":"COUNTIFS(Tableau1[Etat],\"8,75\",Tableau1[Mois],H_productives[[#This Row],[Mois]],Tableau1[N°S],H_productives[[#This Row],[N°S]])*8.75+COUNTIFS(Tableau1[Etat],\"8\",Tableau1[Mois],H_productives[[#This Row],[Mois]],Tableau1[N°S],H_productives[[#This Row],[N°S]])*8","v":43},{"$f":"COUNTIFS(Tableau1[Etat],\"8,75\",Tableau1[Mois],H_productives[[#This Row],[Mois]],Tableau1[N°S],H_productives[[#This Row],[N°S]])*8.75+COUNTIFS(Tableau1[Etat],\"8\",Tableau1[Mois],H_productives[[#This Row],[Mois]],Tableau1[N°S],H_productives[[#This Row],[N°S]])*8","v":43},40]
[null,23,6,{"$f":"TEXT(DATE('Fermetures & jours fériés'!$D$1,H_productives[[#This Row],[N°Mois]],1),\"mmmm\")","v":"juin"},{"$f":"COUNTIFS(Tableau1[Etat],\"8,75\",Tableau1[Mois],H_productives[[#This Row],[Mois]],Tableau1[N°S],H_productives[[#This Row],[N°S]])*8.75+COUNTIFS(Tableau1[Etat],\"8\",Tableau1[Mois],H_productives[[#This Row],[Mois]],Tableau1[N°S],H_productives[[#This Row],[N°S]])*8","v":26.25},{"$f":"COUNTIFS(Tableau1[Etat],\"8,75\",Tableau1[Mois],H_productives[[#This Row],[Mois]],Tableau1[N°S],H_productives[[#This Row],[N°S]])*8.75+COUNTIFS(Tableau1[Etat],\"8\",Tableau1[Mois],H_productives[[#This Row],[Mois]],Tableau1[N°S],H_productives[[#This Row],[N°S]])*8","v":26.25},{"$f":"COUNTIFS(Tableau1[Etat],\"8,75\",Tableau1[Mois],H_productives[[#This Row],[Mois]],Tableau1[N°S],H_productives[[#This Row],[N°S]])*8.75+COUNTIFS(Tableau1[Etat],\"8\",Tableau1[Mois],H_productives[[#This Row],[Mois]],Tableau1[N°S],H_productives[[#This Row],[N°S]])*8","v":26.25},{"$f":"COUNTIFS(Tableau1[Etat],\"8,75\",Tableau1[Mois],H_productives[[#This Row],[Mois]],Tableau1[N°S],H_productives[[#This Row],[N°S]])*8.75+COUNTIFS(Tableau1[Etat],\"8\",Tableau1[Mois],H_productives[[#This Row],[Mois]],Tableau1[N°S],H_productives[[#This Row],[N°S]])*8","v":26.25},{"$f":"COUNTIFS(Tableau1[Etat],\"8,75\",Tableau1[Mois],H_productives[[#This Row],[Mois]],Tableau1[N°S],H_productives[[#This Row],[N°S]])*8.75+COUNTIFS(Tableau1[Etat],\"8\",Tableau1[Mois],H_productives[[#This Row],[Mois]],Tableau1[N°S],H_productives[[#This Row],[N°S]])*8","v":26.25},{"$f":"COUNTIFS(Tableau1[Etat],\"8,75\",Tableau1[Mois],H_productives[[#This Row],[Mois]],Tableau1[N°S],H_productives[[#This Row],[N°S]])*8.75+COUNTIFS(Tableau1[Etat],\"8\",Tableau1[Mois],H_productives[[#This Row],[Mois]],Tableau1[N°S],H_productives[[#This Row],[N°S]])*8","v":26.25},32]
[null,24,6,{"$f":"TEXT(DATE('Fermetures & jours fériés'!$D$1,H_productives[[#This Row],[N°Mois]],1),\"mmmm\")","v":"juin"},{"$f":"COUNTIFS(Tableau1[Etat],\"8,75\",Tableau1[Mois],H_productives[[#This Row],[Mois]],Tableau1[N°S],H_productives[[#This Row],[N°S]])*8.75+COUNTIFS(Tableau1[Etat],\"8\",Tableau1[Mois],H_productives[[#This Row],[Mois]],Tableau1[N°S],H_productives[[#This Row],[N°S]])*8","v":43},{"$f":"COUNTIFS(Tableau1[Etat],\"8,75\",Tableau1[Mois],H_productives[[#This Row],[Mois]],Tableau1[N°S],H_productives[[#This Row],[N°S]])*8.75+COUNTIFS(Tableau1[Etat],\"8\",Tableau1[Mois],H_productives[[#This Row],[Mois]],Tableau1[N°S],H_productives[[#This Row],[N°S]])*8","v":43},{"$f":"COUNTIFS(Tableau1[Etat],\"8,75\",Tableau1[Mois],H_productives[[#This Row],[Mois]],Tableau1[N°S],H_productives[[#This Row],[N°S]])*8.75+COUNTIFS(Tableau1[Etat],\"8\",Tableau1[Mois],H_productives[[#This Row],[Mois]],Tableau1[N°S],H_productives[[#This Row],[N°S]])*8","v":43},{"$f":"COUNTIFS(Tableau1[Etat],\"8,75\",Tableau1[Mois],H_productives[[#This Row],[Mois]],Tableau1[N°S],H_productives[[#This Row],[N°S]])*8.75+COUNTIFS(Tableau1[Etat],\"8\",Tableau1[Mois],H_productives[[#This Row],[Mois]],Tableau1[N°S],H_productives[[#This Row],[N°S]])*8","v":43},{"$f":"COUNTIFS(Tableau1[Etat],\"8,75\",Tableau1[Mois],H_productives[[#This Row],[Mois]],Tableau1[N°S],H_productives[[#This Row],[N°S]])*8.75+COUNTIFS(Tableau1[Etat],\"8\",Tableau1[Mois],H_productives[[#This Row],[Mois]],Tableau1[N°S],H_productives[[#This Row],[N°S]])*8","v":43},{"$f":"COUNTIFS(Tableau1[Etat],\"8,75\",Tableau1[Mois],H_productives[[#This Row],[Mois]],Tableau1[N°S],H_productives[[#This Row],[N°S]])*8.75+COUNTIFS(Tableau1[Etat],\"8\",Tableau1[Mois],H_productives[[#This Row],[Mois]],Tableau1[N°S],H_productives[[#This Row],[N°S]])*8","v":43},40]
[null,25,6,{"$f":"TEXT(DATE('Fermetures & jours fériés'!$D$1,H_productives[[#This Row],[N°Mois]],1),\"mmmm\")","v":"juin"},{"$f":"COUNTIFS(Tableau1[Etat],\"8,75\",Tableau1[Mois],H_productives[[#This Row],[Mois]],Tableau1[N°S],H_productives[[#This Row],[N°S]])*8.75+COUNTIFS(Tableau1[Etat],\"8\",Tableau1[Mois],H_productives[[#This Row],[Mois]],Tableau1[N°S],H_productives[[#This Row],[N°S]])*8","v":35},{"$f":"COUNTIFS(Tableau1[Etat],\"8,75\",Tableau1[Mois],H_productives[[#This Row],[Mois]],Tableau1[N°S],H_productives[[#This Row],[N°S]])*8.75+COUNTIFS(Tableau1[Etat],\"8\",Tableau1[Mois],H_productives[[#This Row],[Mois]],Tableau1[N°S],H_productives[[#This Row],[N°S]])*8","v":35},{"$f":"COUNTIFS(Tableau1[Etat],\"8,75\",Tableau1[Mois],H_productives[[#This Row],[Mois]],Tableau1[N°S],H_productives[[#This Row],[N°S]])*8.75+COUNTIFS(Tableau1[Etat],\"8\",Tableau1[Mois],H_productives[[#This Row],[Mois]],Tableau1[N°S],H_productives[[#This Row],[N°S]])*8","v":35},{"$f":"COUNTIFS(Tableau1[Etat],\"8,75\",Tableau1[Mois],H_productives[[#This Row],[Mois]],Tableau1[N°S],H_productives[[#This Row],[N°S]])*8.75+COUNTIFS(Tableau1[Etat],\"8\",Tableau1[Mois],H_productives[[#This Row],[Mois]],Tableau1[N°S],H_productives[[#This Row],[N°S]])*8","v":35},{"$f":"COUNTIFS(Tableau1[Etat],\"8,75\",Tableau1[Mois],H_productives[[#This Row],[Mois]],Tableau1[N°S],H_productives[[#This Row],[N°S]])*8.75+COUNTIFS(Tableau1[Etat],\"8\",Tableau1[Mois],H_productives[[#This Row],[Mois]],Tableau1[N°S],H_productives[[#This Row],[N°S]])*8","v":35},{"$f":"COUNTIFS(Tableau1[Etat],\"8,75\",Tableau1[Mois],H_productives[[#This Row],[Mois]],Tableau1[N°S],H_productives[[#This Row],[N°S]])*8.75+COUNTIFS(Tableau1[Etat],\"8\",Tableau1[Mois],H_productives[[#This Row],[Mois]],Tableau1[N°S],H_productives[[#This Row],[N°S]])*8","v":35},40]
[null,26,6,{"$f":"TEXT(DATE('Fermetures & jours fériés'!$D$1,H_productives[[#This Row],[N°Mois]],1),\"mmmm\")","v":"juin"},{"$f":"COUNTIFS(Tableau1[Etat],\"8,75\",Tableau1[Mois],H_productives[[#This Row],[Mois]],Tableau1[N°S],H_productives[[#This Row],[N°S]])*8.75+COUNTIFS(Tableau1[Etat],\"8\",Tableau1[Mois],H_productives[[#This Row],[Mois]],Tableau1[N°S],H_productives[[#This Row],[N°S]])*8","v":43},{"$f":"COUNTIFS(Tableau1[Etat],\"8,75\",Tableau1[Mois],H_productives[[#This Row],[Mois]],Tableau1[N°S],H_productives[[#This Row],[N°S]])*8.75+COUNTIFS(Tableau1[Etat],\"8\",Tableau1[Mois],H_productives[[#This Row],[Mois]],Tableau1[N°S],H_productives[[#This Row],[N°S]])*8","v":43},{"$f":"COUNTIFS(Tableau1[Etat],\"8,75\",Tableau1[Mois],H_productives[[#This Row],[Mois]],Tableau1[N°S],H_productives[[#This Row],[N°S]])*8.75+COUNTIFS(Tableau1[Etat],\"8\",Tableau1[Mois],H_productives[[#This Row],[Mois]],Tableau1[N°S],H_productives[[#This Row],[N°S]])*8","v":43},{"$f":"COUNTIFS(Tableau1[Etat],\"8,75\",Tableau1[Mois],H_productives[[#This Row],[Mois]],Tableau1[N°S],H_productives[[#This Row],[N°S]])*8.75+COUNTIFS(Tableau1[Etat],\"8\",Tableau1[Mois],H_productives[[#This Row],[Mois]],Tableau1[N°S],H_productives[[#This Row],[N°S]])*8","v":43},{"$f":"COUNTIFS(Tableau1[Etat],\"8,75\",Tableau1[Mois],H_productives[[#This Row],[Mois]],Tableau1[N°S],H_productives[[#This Row],[N°S]])*8.75+COUNTIFS(Tableau1[Etat],\"8\",Tableau1[Mois],H_productives[[#This Row],[Mois]],Tableau1[N°S],H_productives[[#This Row],[N°S]])*8","v":43},{"$f":"COUNTIFS(Tableau1[Etat],\"8,75\",Tableau1[Mois],H_productives[[#This Row],[Mois]],Tableau1[N°S],H_productives[[#This Row],[N°S]])*8.75+COUNTIFS(Tableau1[Etat],\"8\",Tableau1[Mois],H_productives[[#This Row],[Mois]],Tableau1[N°S],H_productives[[#This Row],[N°S]])*8","v":43},40]
[null,27,6,{"$f":"TEXT(DATE('Fermetures & jours fériés'!$D$1,H_productives[[#This Row],[N°Mois]],1),\"mmmm\")","v":"juin"},{"$f":"COUNTIFS(Tableau1[Etat],\"8,75\",Tableau1[Mois],H_productives[[#This Row],[Mois]],Tableau1[N°S],H_productives[[#This Row],[N°S]])*8.75+COUNTIFS(Tableau1[Etat],\"8\",Tableau1[Mois],H_productives[[#This Row],[Mois]],Tableau1[N°S],H_productives[[#This Row],[N°S]])*8","v":17.5},{"$f":"COUNTIFS(Tableau1[Etat],\"8,75\",Tableau1[Mois],H_productives[[#This Row],[Mois]],Tableau1[N°S],H_productives[[#This Row],[N°S]])*8.75+COUNTIFS(Tableau1[Etat],\"8\",Tableau1[Mois],H_productives[[#This Row],[Mois]],Tableau1[N°S],H_productives[[#This Row],[N°S]])*8","v":17.5},{"$f":"COUNTIFS(Tableau1[Etat],\"8,75\",Tableau1[Mois],H_productives[[#This Row],[Mois]],Tableau1[N°S],H_productives[[#This Row],[N°S]])*8.75+COUNTIFS(Tableau1[Etat],\"8\",Tableau1[Mois],H_productives[[#This Row],[Mois]],Tableau1[N°S],H_productives[[#This Row],[N°S]])*8","v":17.5},{"$f":"COUNTIFS(Tableau1[Etat],\"8,75\",Tableau1[Mois],H_productives[[#This Row],[Mois]],Tableau1[N°S],H_productives[[#This Row],[N°S]])*8.75+COUNTIFS(Tableau1[Etat],\"8\",Tableau1[Mois],H_productives[[#This Row],[Mois]],Tableau1[N°S],H_productives[[#This Row],[N°S]])*8","v":17.5},{"$f":"COUNTIFS(Tableau1[Etat],\"8,75\",Tableau1[Mois],H_productives[[#This Row],[Mois]],Tableau1[N°S],H_productives[[#This Row],[N°S]])*8.75+COUNTIFS(Tableau1[Etat],\"8\",Tableau1[Mois],H_productives[[#This Row],[Mois]],Tableau1[N°S],H_productives[[#This Row],[N°S]])*8","v":17.5},{"$f":"COUNTIFS(Tableau1[Etat],\"8,75\",Tableau1[Mois],H_productives[[#This Row],[Mois]],Tableau1[N°S],H_productives[[#This Row],[N°S]])*8.75+COUNTIFS(Tableau1[Etat],\"8\",Tableau1[Mois],H_productives[[#This Row],[Mois]],Tableau1[N°S],H_productives[[#This Row],[N°S]])*8","v":17.5},16]
[null,27,7,{"$f":"TEXT(DATE('Fermetures & jours fériés'!$D$1,H_productives[[#This Row],[N°Mois]],1),\"mmmm\")","v":"juillet"},{"$f":"COUNTIFS(Tableau1[Etat],\"8,75\",Tableau1[Mois],H_productives[[#This Row],[Mois]],Tableau1[N°S],H_productives[[#This Row],[N°S]])*8.75+COUNTIFS(Tableau1[Etat],\"8\",Tableau1[Mois],H_productives[[#This Row],[Mois]],Tableau1[N°S],H_productives[[#This Row],[N°S]])*8","v":17.5},{"$f":"COUNTIFS(Tableau1[Etat],\"8,75\",Tableau1[Mois],H_productives[[#This Row],[Mois]],Tableau1[N°S],H_productives[[#This Row],[N°S]])*8.75+COUNTIFS(Tableau1[Etat],\"8\",Tableau1[Mois],H_productives[[#This Row],[Mois]],Tableau1[N°S],H_productives[[#This Row],[N°S]])*8","v":17.5},{"$f":"COUNTIFS(Tableau1[Etat],\"8,75\",Tableau1[Mois],H_productives[[#This Row],[Mois]],Tableau1[N°S],H_productives[[#This Row],[N°S]])*8.75+COUNTIFS(Tableau1[Etat],\"8\",Tableau1[Mois],H_productives[[#This Row],[Mois]],Tableau1[N°S],H_productives[[#This Row],[N°S]])*8","v":17.5},{"$f":"COUNTIFS(Tableau1[Etat],\"8,75\",Tableau1[Mois],H_productives[[#This Row],[Mois]],Tableau1[N°S],H_productives[[#This Row],[N°S]])*8.75+COUNTIFS(Tableau1[Etat],\"8\",Tableau1[Mois],H_productives[[#This Row],[Mois]],Tableau1[N°S],H_productives[[#This Row],[N°S]])*8","v":17.5},{"$f":"COUNTIFS(Tableau1[Etat],\"8,75\",Tableau1[Mois],H_productives[[#This Row],[Mois]],Tableau1[N°S],H_productives[[#This Row],[N°S]])*8.75+COUNTIFS(Tableau1[Etat],\"8\",Tableau1[Mois],H_productives[[#This Row],[Mois]],Tableau1[N°S],H_productives[[#This Row],[N°S]])*8","v":17.5},{"$f":"COUNTIFS(Tableau1[Etat],\"8,75\",Tableau1[Mois],H_productives[[#This Row],[Mois]],Tableau1[N°S],H_productives[[#This Row],[N°S]])*8.75+COUNTIFS(Tableau1[Etat],\"8\",Tableau1[Mois],H_productives[[#This Row],[Mois]],Tableau1[N°S],H_productives[[#This Row],[N°S]])*8","v":17.5},24]
[null,28,7,{"$f":"TEXT(DATE('Fermetures & jours fériés'!$D$1,H_productives[[#This Row],[N°Mois]],1),\"mmmm\")","v":"juillet"},{"$f":"COUNTIFS(Tableau1[Etat],\"8,75\",Tableau1[Mois],H_productives[[#This Row],[Mois]],Tableau1[N°S],H_productives[[#This Row],[N°S]])*8.75+COUNTIFS(Tableau1[Etat],\"8\",Tableau1[Mois],H_productives[[#This Row],[Mois]],Tableau1[N°S],H_productives[[#This Row],[N°S]])*8","v":43},{"$f":"COUNTIFS(Tableau1[Etat],\"8,75\",Tableau1[Mois],H_productives[[#This Row],[Mois]],Tableau1[N°S],H_productives[[#This Row],[N°S]])*8.75+COUNTIFS(Tableau1[Etat],\"8\",Tableau1[Mois],H_productives[[#This Row],[Mois]],Tableau1[N°S],H_productives[[#This Row],[N°S]])*8","v":43},{"$f":"COUNTIFS(Tableau1[Etat],\"8,75\",Tableau1[Mois],H_productives[[#This Row],[Mois]],Tableau1[N°S],H_productives[[#This Row],[N°S]])*8.75+COUNTIFS(Tableau1[Etat],\"8\",Tableau1[Mois],H_productives[[#This Row],[Mois]],Tableau1[N°S],H_productives[[#This Row],[N°S]])*8","v":43},{"$f":"COUNTIFS(Tableau1[Etat],\"8,75\",Tableau1[Mois],H_productives[[#This Row],[Mois]],Tableau1[N°S],H_productives[[#This Row],[N°S]])*8.75+COUNTIFS(Tableau1[Etat],\"8\",Tableau1[Mois],H_productives[[#This Row],[Mois]],Tableau1[N°S],H_productives[[#This Row],[N°S]])*8","v":43},{"$f":"COUNTIFS(Tableau1[Etat],\"8,75\",Tableau1[Mois],H_productives[[#This Row],[Mois]],Tableau1[N°S],H_productives[[#This Row],[N°S]])*8.75+COUNTIFS(Tableau1[Etat],\"8\",Tableau1[Mois],H_productives[[#This Row],[Mois]],Tableau1[N°S],H_productives[[#This Row],[N°S]])*8","v":43},{"$f":"COUNTIFS(Tableau1[Etat],\"8,75\",Tableau1[Mois],H_productives[[#This Row],[Mois]],Tableau1[N°S],H_productives[[#This Row],[N°S]])*8.75+COUNTIFS(Tableau1[Etat],\"8\",Tableau1[Mois],H_productives[[#This Row],[Mois]],Tableau1[N°S],H_productives[[#This Row],[N°S]])*8","v":43},40]
[null,29,7,{"$f":"TEXT(DATE('Fermetures & jours fériés'!$D$1,H_productives[[#This Row],[N°Mois]],1),\"mmmm\")","v":"juillet"},{"$f":"COUNTIFS(Tableau1[Etat],\"8,75\",Tableau1[Mois],H_productives[[#This Row],[Mois]],Tableau1[N°S],H_productives[[#This Row],[N°S]])*8.75+COUNTIFS(Tableau1[Etat],\"8\",Tableau1[Mois],H_productives[[#This Row],[Mois]],Tableau1[N°S],H_productives[[#This Row],[N°S]])*8","v":26.25},{"$f":"COUNTIFS(Tableau1[Etat],\"8,75\",Tableau1[Mois],H_productives[[#This Row],[Mois]],Tableau1[N°S],H_productives[[#This Row],[N°S]])*8.75+COUNTIFS(Tableau1[Etat],\"8\",Tableau1[Mois],H_productives[[#This Row],[Mois]],Tableau1[N°S],H_productives[[#This Row],[N°S]])*8","v":26.25},{"$f":"COUNTIFS(Tableau1[Etat],\"8,75\",Tableau1[Mois],H_productives[[#This Row],[Mois]],Tableau1[N°S],H_productives[[#This Row],[N°S]])*8.75+COUNTIFS(Tableau1[Etat],\"8\",Tableau1[Mois],H_productives[[#This Row],[Mois]],Tableau1[N°S],H_productives[[#This Row],[N°S]])*8","v":26.25},{"$f":"COUNTIFS(Tableau1[Etat],\"8,75\",Tableau1[Mois],H_productives[[#This Row],[Mois]],Tableau1[N°S],H_productives[[#This Row],[N°S]])*8.75+COUNTIFS(Tableau1[Etat],\"8\",Tableau1[Mois],H_productives[[#This Row],[Mois]],Tableau1[N°S],H_productives[[#This Row],[N°S]])*8","v":26.25},{"$f":"COUNTIFS(Tableau1[Etat],\"8,75\",Tableau1[Mois],H_productives[[#This Row],[Mois]],Tableau1[N°S],H_productives[[#This Row],[N°S]])*8.75+COUNTIFS(Tableau1[Etat],\"8\",Tableau1[Mois],H_productives[[#This Row],[Mois]],Tableau1[N°S],H_productives[[#This Row],[N°S]])*8","v":26.25},{"$f":"COUNTIFS(Tableau1[Etat],\"8,75\",Tableau1[Mois],H_productives[[#This Row],[Mois]],Tableau1[N°S],H_productives[[#This Row],[N°S]])*8.75+COUNTIFS(Tableau1[Etat],\"8\",Tableau1[Mois],H_productives[[#This Row],[Mois]],Tableau1[N°S],H_productives[[#This Row],[N°S]])*8","v":26.25},32]
[null,30,7,{"$f":"TEXT(DATE('Fermetures & jours fériés'!$D$1,H_productives[[#This Row],[N°Mois]],1),\"mmmm\")","v":"juillet"},{"$f":"COUNTIFS(Tableau1[Etat],\"8,75\",Tableau1[Mois],H_productives[[#This Row],[Mois]],Tableau1[N°S],H_productives[[#This Row],[N°S]])*8.75+COUNTIFS(Tableau1[Etat],\"8\",Tableau1[Mois],H_productives[[#This Row],[Mois]],Tableau1[N°S],H_productives[[#This Row],[N°S]])*8","v":43},{"$f":"COUNTIFS(Tableau1[Etat],\"8,75\",Tableau1[Mois],H_productives[[#This Row],[Mois]],Tableau1[N°S],H_productives[[#This Row],[N°S]])*8.75+COUNTIFS(Tableau1[Etat],\"8\",Tableau1[Mois],H_productives[[#This Row],[Mois]],Tableau1[N°S],H_productives[[#This Row],[N°S]])*8","v":43},{"$f":"COUNTIFS(Tableau1[Etat],\"8,75\",Tableau1[Mois],H_productives[[#This Row],[Mois]],Tableau1[N°S],H_productives[[#This Row],[N°S]])*8.75+COUNTIFS(Tableau1[Etat],\"8\",Tableau1[Mois],H_productives[[#This Row],[Mois]],Tableau1[N°S],H_productives[[#This Row],[N°S]])*8","v":43},{"$f":"COUNTIFS(Tableau1[Etat],\"8,75\",Tableau1[Mois],H_productives[[#This Row],[Mois]],Tableau1[N°S],H_productives[[#This Row],[N°S]])*8.75+COUNTIFS(Tableau1[Etat],\"8\",Tableau1[Mois],H_productives[[#This Row],[Mois]],Tableau1[N°S],H_productives[[#This Row],[N°S]])*8","v":43},{"$f":"COUNTIFS(Tableau1[Etat],\"8,75\",Tableau1[Mois],H_productives[[#This Row],[Mois]],Tableau1[N°S],H_productives[[#This Row],[N°S]])*8.75+COUNTIFS(Tableau1[Etat],\"8\",Tableau1[Mois],H_productives[[#This Row],[Mois]],Tableau1[N°S],H_productives[[#This Row],[N°S]])*8","v":43},{"$f":"COUNTIFS(Tableau1[Etat],\"8,75\",Tableau1[Mois],H_productives[[#This Row],[Mois]],Tableau1[N°S],H_productives[[#This Row],[N°S]])*8.75+COUNTIFS(Tableau1[Etat],\"8\",Tableau1[Mois],H_productives[[#This Row],[Mois]],Tableau1[N°S],H_productives[[#This Row],[N°S]])*8","v":43},40]
[null,31,7,{"$f":"TEXT(DATE('Fermetures & jours fériés'!$D$1,H_productives[[#This Row],[N°Mois]],1),\"mmmm\")","v":"juillet"},{"$f":"COUNTIFS(Tableau1[Etat],\"8,75\",Tableau1[Mois],H_productives[[#This Row],[Mois]],Tableau1[N°S],H_productives[[#This Row],[N°S]])*8.75+COUNTIFS(Tableau1[Etat],\"8\",Tableau1[Mois],H_productives[[#This Row],[Mois]],Tableau1[N°S],H_productives[[#This Row],[N°S]])*8","v":35},{"$f":"COUNTIFS(Tableau1[Etat],\"8,75\",Tableau1[Mois],H_productives[[#This Row],[Mois]],Tableau1[N°S],H_productives[[#This Row],[N°S]])*8.75+COUNTIFS(Tableau1[Etat],\"8\",Tableau1[Mois],H_productives[[#This Row],[Mois]],Tableau1[N°S],H_productives[[#This Row],[N°S]])*8","v":35},{"$f":"COUNTIFS(Tableau1[Etat],\"8,75\",Tableau1[Mois],H_productives[[#This Row],[Mois]],Tableau1[N°S],H_productives[[#This Row],[N°S]])*8.75+COUNTIFS(Tableau1[Etat],\"8\",Tableau1[Mois],H_productives[[#This Row],[Mois]],Tableau1[N°S],H_productives[[#This Row],[N°S]])*8","v":35},{"$f":"COUNTIFS(Tableau1[Etat],\"8,75\",Tableau1[Mois],H_productives[[#This Row],[Mois]],Tableau1[N°S],H_productives[[#This Row],[N°S]])*8.75+COUNTIFS(Tableau1[Etat],\"8\",Tableau1[Mois],H_productives[[#This Row],[Mois]],Tableau1[N°S],H_productives[[#This Row],[N°S]])*8","v":35},{"$f":"COUNTIFS(Tableau1[Etat],\"8,75\",Tableau1[Mois],H_productives[[#This Row],[Mois]],Tableau1[N°S],H_productives[[#This Row],[N°S]])*8.75+COUNTIFS(Tableau1[Etat],\"8\",Tableau1[Mois],H_productives[[#This Row],[Mois]],Tableau1[N°S],H_productives[[#This Row],[N°S]])*8","v":35},{"$f":"COUNTIFS(Tableau1[Etat],\"8,75\",Tableau1[Mois],H_productives[[#This Row],[Mois]],Tableau1[N°S],H_productives[[#This Row],[N°S]])*8.75+COUNTIFS(Tableau1[Etat],\"8\",Tableau1[Mois],H_productives[[#This Row],[Mois]],Tableau1[N°S],H_productives[[#This Row],[N°S]])*8","v":35},40]
[null,31,8,{"$f":"TEXT(DATE('Fermetures & jours fériés'!$D$1,H_productives[[#This Row],[N°Mois]],1),\"mmmm\")","v":"août"},{"$f":"COUNTIFS(Tableau1[Etat],\"8,75\",Tableau1[Mois],H_productives[[#This Row],[Mois]],Tableau1[N°S],H_productives[[#This Row],[N°S]])*8.75+COUNTIFS(Tableau1[Etat],\"8\",Tableau1[Mois],H_productives[[#This Row],[Mois]],Tableau1[N°S],H_productives[[#This Row],[N°S]])*8","v":0},{"$f":"COUNTIFS(Tableau1[Etat],\"8,75\",Tableau1[Mois],H_productives[[#This Row],[Mois]],Tableau1[N°S],H_productives[[#This Row],[N°S]])*8.75+COUNTIFS(Tableau1[Etat],\"8\",Tableau1[Mois],H_productives[[#This Row],[Mois]],Tableau1[N°S],H_productives[[#This Row],[N°S]])*8","v":0},{"$f":"COUNTIFS(Tableau1[Etat],\"8,75\",Tableau1[Mois],H_productives[[#This Row],[Mois]],Tableau1[N°S],H_productives[[#This Row],[N°S]])*8.75+COUNTIFS(Tableau1[Etat],\"8\",Tableau1[Mois],H_productives[[#This Row],[Mois]],Tableau1[N°S],H_productives[[#This Row],[N°S]])*8","v":0},{"$f":"COUNTIFS(Tableau1[Etat],\"8,75\",Tableau1[Mois],H_productives[[#This Row],[Mois]],Tableau1[N°S],H_productives[[#This Row],[N°S]])*8.75+COUNTIFS(Tableau1[Etat],\"8\",Tableau1[Mois],H_productives[[#This Row],[Mois]],Tableau1[N°S],H_productives[[#This Row],[N°S]])*8","v":0},{"$f":"COUNTIFS(Tableau1[Etat],\"8,75\",Tableau1[Mois],H_productives[[#This Row],[Mois]],Tableau1[N°S],H_productives[[#This Row],[N°S]])*8.75+COUNTIFS(Tableau1[Etat],\"8\",Tableau1[Mois],H_productives[[#This Row],[Mois]],Tableau1[N°S],H_productives[[#This Row],[N°S]])*8","v":0},{"$f":"COUNTIFS(Tableau1[Etat],\"8,75\",Tableau1[Mois],H_productives[[#This Row],[Mois]],Tableau1[N°S],H_productives[[#This Row],[N°S]])*8.75+COUNTIFS(Tableau1[Etat],\"8\",Tableau1[Mois],H_productives[[#This Row],[Mois]],Tableau1[N°S],H_productives[[#This Row],[N°S]])*8","v":0},0]
[null,32,8,{"$f":"TEXT(DATE('Fermetures & jours fériés'!$D$1,H_productives[[#This Row],[N°Mois]],1),\"mmmm\")","v":"août"},{"$f":"COUNTIFS(Tableau1[Etat],\"8,75\",Tableau1[Mois],H_productives[[#This Row],[Mois]],Tableau1[N°S],H_productives[[#This Row],[N°S]])*8.75+COUNTIFS(Tableau1[Etat],\"8\",Tableau1[Mois],H_productives[[#This Row],[Mois]],Tableau1[N°S],H_productives[[#This Row],[N°S]])*8","v":43},{"$f":"COUNTIFS(Tableau1[Etat],\"8,75\",Tableau1[Mois],H_productives[[#This Row],[Mois]],Tableau1[N°S],H_productives[[#This Row],[N°S]])*8.75+COUNTIFS(Tableau1[Etat],\"8\",Tableau1[Mois],H_productives[[#This Row],[Mois]],Tableau1[N°S],H_productives[[#This Row],[N°S]])*8","v":43},{"$f":"COUNTIFS(Tableau1[Etat],\"8,75\",Tableau1[Mois],H_productives[[#This Row],[Mois]],Tableau1[N°S],H_productives[[#This Row],[N°S]])*8.75+COUNTIFS(Tableau1[Etat],\"8\",Tableau1[Mois],H_productives[[#This Row],[Mois]],Tableau1[N°S],H_productives[[#This Row],[N°S]])*8","v":43},{"$f":"COUNTIFS(Tableau1[Etat],\"8,75\",Tableau1[Mois],H_productives[[#This Row],[Mois]],Tableau1[N°S],H_productives[[#This Row],[N°S]])*8.75+COUNTIFS(Tableau1[Etat],\"8\",Tableau1[Mois],H_productives[[#This Row],[Mois]],Tableau1[N°S],H_productives[[#This Row],[N°S]])*8","v":43},{"$f":"COUNTIFS(Tableau1[Etat],\"8,75\",Tableau1[Mois],H_productives[[#This Row],[Mois]],Tableau1[N°S],H_productives[[#This Row],[N°S]])*8.75+COUNTIFS(Tableau1[Etat],\"8\",Tableau1[Mois],H_productives[[#This Row],[Mois]],Tableau1[N°S],H_productives[[#This Row],[N°S]])*8","v":43},{"$f":"COUNTIFS(Tableau1[Etat],\"8,75\",Tableau1[Mois],H_productives[[#This Row],[Mois]],Tableau1[N°S],H_productives[[#This Row],[N°S]])*8.75+COUNTIFS(Tableau1[Etat],\"8\",Tableau1[Mois],H_productives[[#This Row],[Mois]],Tableau1[N°S],H_productives[[#This Row],[N°S]])*8","v":43},40]
[null,33,8,{"$f":"TEXT(DATE('Fermetures & jours fériés'!$D$1,H_productives[[#This Row],[N°Mois]],1),\"mmmm\")","v":"août"},{"$f":"COUNTIFS(Tableau1[Etat],\"8,75\",Tableau1[Mois],H_productives[[#This Row],[Mois]],Tableau1[N°S],H_productives[[#This Row],[N°S]])*8.75+COUNTIFS(Tableau1[Etat],\"8\",Tableau1[Mois],H_productives[[#This Row],[Mois]],Tableau1[N°S],H_productives[[#This Row],[N°S]])*8","v":35},{"$f":"COUNTIFS(Tableau1[Etat],\"8,75\",Tableau1[Mois],H_productives[[#This Row],[Mois]],Tableau1[N°S],H_productives[[#This Row],[N°S]])*8.75+COUNTIFS(Tableau1[Etat],\"8\",Tableau1[Mois],H_productives[[#This Row],[Mois]],Tableau1[N°S],H_productives[[#This Row],[N°S]])*8","v":35},{"$f":"COUNTIFS(Tableau1[Etat],\"8,75\",Tableau1[Mois],H_productives[[#This Row],[Mois]],Tableau1[N°S],H_productives[[#This Row],[N°S]])*8.75+COUNTIFS(Tableau1[Etat],\"8\",Tableau1[Mois],H_productives[[#This Row],[Mois]],Tableau1[N°S],H_productives[[#This Row],[N°S]])*8","v":35},{"$f":"COUNTIFS(Tableau1[Etat],\"8,75\",Tableau1[Mois],H_productives[[#This Row],[Mois]],Tableau1[N°S],H_productives[[#This Row],[N°S]])*8.75+COUNTIFS(Tableau1[Etat],\"8\",Tableau1[Mois],H_productives[[#This Row],[Mois]],Tableau1[N°S],H_productives[[#This Row],[N°S]])*8","v":35},{"$f":"COUNTIFS(Tableau1[Etat],\"8,75\",Tableau1[Mois],H_productives[[#This Row],[Mois]],Tableau1[N°S],H_productives[[#This Row],[N°S]])*8.75+COUNTIFS(Tableau1[Etat],\"8\",Tableau1[Mois],H_productives[[#This Row],[Mois]],Tableau1[N°S],H_productives[[#This Row],[N°S]])*8","v":35},{"$f":"COUNTIFS(Tableau1[Etat],\"8,75\",Tableau1[Mois],H_productives[[#This Row],[Mois]],Tableau1[N°S],H_productives[[#This Row],[N°S]])*8.75+COUNTIFS(Tableau1[Etat],\"8\",Tableau1[Mois],H_productives[[#This Row],[Mois]],Tableau1[N°S],H_productives[[#This Row],[N°S]])*8","v":35},40]
[null,34,8,{"$f":"TEXT(DATE('Fermetures & jours fériés'!$D$1,H_productives[[#This Row],[N°Mois]],1),\"mmmm\")","v":"août"},{"$f":"COUNTIFS(Tableau1[Etat],\"8,75\",Tableau1[Mois],H_productives[[#This Row],[Mois]],Tableau1[N°S],H_productives[[#This Row],[N°S]])*8.75+COUNTIFS(Tableau1[Etat],\"8\",Tableau1[Mois],H_productives[[#This Row],[Mois]],Tableau1[N°S],H_productives[[#This Row],[N°S]])*8","v":43},{"$f":"COUNTIFS(Tableau1[Etat],\"8,75\",Tableau1[Mois],H_productives[[#This Row],[Mois]],Tableau1[N°S],H_productives[[#This Row],[N°S]])*8.75+COUNTIFS(Tableau1[Etat],\"8\",Tableau1[Mois],H_productives[[#This Row],[Mois]],Tableau1[N°S],H_productives[[#This Row],[N°S]])*8","v":43},{"$f":"COUNTIFS(Tableau1[Etat],\"8,75\",Tableau1[Mois],H_productives[[#This Row],[Mois]],Tableau1[N°S],H_productives[[#This Row],[N°S]])*8.75+COUNTIFS(Tableau1[Etat],\"8\",Tableau1[Mois],H_productives[[#This Row],[Mois]],Tableau1[N°S],H_productives[[#This Row],[N°S]])*8","v":43},{"$f":"COUNTIFS(Tableau1[Etat],\"8,75\",Tableau1[Mois],H_productives[[#This Row],[Mois]],Tableau1[N°S],H_productives[[#This Row],[N°S]])*8.75+COUNTIFS(Tableau1[Etat],\"8\",Tableau1[Mois],H_productives[[#This Row],[Mois]],Tableau1[N°S],H_productives[[#This Row],[N°S]])*8","v":43},{"$f":"COUNTIFS(Tableau1[Etat],\"8,75\",Tableau1[Mois],H_productives[[#This Row],[Mois]],Tableau1[N°S],H_productives[[#This Row],[N°S]])*8.75+COUNTIFS(Tableau1[Etat],\"8\",Tableau1[Mois],H_productives[[#This Row],[Mois]],Tableau1[N°S],H_productives[[#This Row],[N°S]])*8","v":43},{"$f":"COUNTIFS(Tableau1[Etat],\"8,75\",Tableau1[Mois],H_productives[[#This Row],[Mois]],Tableau1[N°S],H_productives[[#This Row],[N°S]])*8.75+COUNTIFS(Tableau1[Etat],\"8\",Tableau1[Mois],H_productives[[#This Row],[Mois]],Tableau1[N°S],H_productives[[#This Row],[N°S]])*8","v":43},40]
[null,35,8,{"$f":"TEXT(DATE('Fermetures & jours fériés'!$D$1,H_productives[[#This Row],[N°Mois]],1),\"mmmm\")","v":"août"},{"$f":"COUNTIFS(Tableau1[Etat],\"8,75\",Tableau1[Mois],H_productives[[#This Row],[Mois]],Tableau1[N°S],H_productives[[#This Row],[N°S]])*8.75+COUNTIFS(Tableau1[Etat],\"8\",Tableau1[Mois],H_productives[[#This Row],[Mois]],Tableau1[N°S],H_productives[[#This Row],[N°S]])*8","v":35},{"$f":"COUNTIFS(Tableau1[Etat],\"8,75\",Tableau1[Mois],H_productives[[#This Row],[Mois]],Tableau1[N°S],H_productives[[#This Row],[N°S]])*8.75+COUNTIFS(Tableau1[Etat],\"8\",Tableau1[Mois],H_productives[[#This Row],[Mois]],Tableau1[N°S],H_productives[[#This Row],[N°S]])*8","v":35},{"$f":"COUNTIFS(Tableau1[Etat],\"8,75\",Tableau1[Mois],H_productives[[#This Row],[Mois]],Tableau1[N°S],H_productives[[#This Row],[N°S]])*8.75+COUNTIFS(Tableau1[Etat],\"8\",Tableau1[Mois],H_productives[[#This Row],[Mois]],Tableau1[N°S],H_productives[[#This Row],[N°S]])*8","v":35},{"$f":"COUNTIFS(Tableau1[Etat],\"8,75\",Tableau1[Mois],H_productives[[#This Row],[Mois]],Tableau1[N°S],H_productives[[#This Row],[N°S]])*8.75+COUNTIFS(Tableau1[Etat],\"8\",Tableau1[Mois],H_productives[[#This Row],[Mois]],Tableau1[N°S],H_productives[[#This Row],[N°S]])*8","v":35},{"$f":"COUNTIFS(Tableau1[Etat],\"8,75\",Tableau1[Mois],H_productives[[#This Row],[Mois]],Tableau1[N°S],H_productives[[#This Row],[N°S]])*8.75+COUNTIFS(Tableau1[Etat],\"8\",Tableau1[Mois],H_productives[[#This Row],[Mois]],Tableau1[N°S],H_productives[[#This Row],[N°S]])*8","v":35},{"$f":"COUNTIFS(Tableau1[Etat],\"8,75\",Tableau1[Mois],H_productives[[#This Row],[Mois]],Tableau1[N°S],H_productives[[#This Row],[N°S]])*8.75+COUNTIFS(Tableau1[Etat],\"8\",Tableau1[Mois],H_productives[[#This Row],[Mois]],Tableau1[N°S],H_productives[[#This Row],[N°S]])*8","v":35},40]
[null,36,8,{"$f":"TEXT(DATE('Fermetures & jours fériés'!$D$1,H_productives[[#This Row],[N°Mois]],1),\"mmmm\")","v":"août"},{"$f":"COUNTIFS(Tableau1[Etat],\"8,75\",Tableau1[Mois],H_productives[[#This Row],[Mois]],Tableau1[N°S],H_productives[[#This Row],[N°S]])*8.75+COUNTIFS(Tableau1[Etat],\"8\",Tableau1[Mois],H_productives[[#This Row],[Mois]],Tableau1[N°S],H_productives[[#This Row],[N°S]])*8","v":8.75},{"$f":"COUNTIFS(Tableau1[Etat],\"8,75\",Tableau1[Mois],H_productives[[#This Row],[Mois]],Tableau1[N°S],H_productives[[#This Row],[N°S]])*8.75+COUNTIFS(Tableau1[Etat],\"8\",Tableau1[Mois],H_productives[[#This Row],[Mois]],Tableau1[N°S],H_productives[[#This Row],[N°S]])*8","v":8.75},{"$f":"COUNTIFS(Tableau1[Etat],\"8,75\",Tableau1[Mois],H_productives[[#This Row],[Mois]],Tableau1[N°S],H_productives[[#This Row],[N°S]])*8.75+COUNTIFS(Tableau1[Etat],\"8\",Tableau1[Mois],H_productives[[#This Row],[Mois]],Tableau1[N°S],H_productives[[#This Row],[N°S]])*8","v":8.75},{"$f":"COUNTIFS(Tableau1[Etat],\"8,75\",Tableau1[Mois],H_productives[[#This Row],[Mois]],Tableau1[N°S],H_productives[[#This Row],[N°S]])*8.75+COUNTIFS(Tableau1[Etat],\"8\",Tableau1[Mois],H_productives[[#This Row],[Mois]],Tableau1[N°S],H_productives[[#This Row],[N°S]])*8","v":8.75},{"$f":"COUNTIFS(Tableau1[Etat],\"8,75\",Tableau1[Mois],H_productives[[#This Row],[Mois]],Tableau1[N°S],H_productives[[#This Row],[N°S]])*8.75+COUNTIFS(Tableau1[Etat],\"8\",Tableau1[Mois],H_productives[[#This Row],[Mois]],Tableau1[N°S],H_productives[[#This Row],[N°S]])*8","v":8.75},{"$f":"COUNTIFS(Tableau1[Etat],\"8,75\",Tableau1[Mois],H_productives[[#This Row],[Mois]],Tableau1[N°S],H_productives[[#This Row],[N°S]])*8.75+COUNTIFS(Tableau1[Etat],\"8\",Tableau1[Mois],H_productives[[#This Row],[Mois]],Tableau1[N°S],H_productives[[#This Row],[N°S]])*8","v":8.75},8]
[null,36,9,{"$f":"TEXT(DATE('Fermetures & jours fériés'!$D$1,H_productives[[#This Row],[N°Mois]],1),\"mmmm\")","v":"septembre"},{"$f":"COUNTIFS(Tableau1[Etat],\"8,75\",Tableau1[Mois],H_productives[[#This Row],[Mois]],Tableau1[N°S],H_productives[[#This Row],[N°S]])*8.75+COUNTIFS(Tableau1[Etat],\"8\",Tableau1[Mois],H_productives[[#This Row],[Mois]],Tableau1[N°S],H_productives[[#This Row],[N°S]])*8","v":34.25},{"$f":"COUNTIFS(Tableau1[Etat],\"8,75\",Tableau1[Mois],H_productives[[#This Row],[Mois]],Tableau1[N°S],H_productives[[#This Row],[N°S]])*8.75+COUNTIFS(Tableau1[Etat],\"8\",Tableau1[Mois],H_productives[[#This Row],[Mois]],Tableau1[N°S],H_productives[[#This Row],[N°S]])*8","v":34.25},{"$f":"COUNTIFS(Tableau1[Etat],\"8,75\",Tableau1[Mois],H_productives[[#This Row],[Mois]],Tableau1[N°S],H_productives[[#This Row],[N°S]])*8.75+COUNTIFS(Tableau1[Etat],\"8\",Tableau1[Mois],H_productives[[#This Row],[Mois]],Tableau1[N°S],H_productives[[#This Row],[N°S]])*8","v":34.25},{"$f":"COUNTIFS(Tableau1[Etat],\"8,75\",Tableau1[Mois],H_productives[[#This Row],[Mois]],Tableau1[N°S],H_productives[[#This Row],[N°S]])*8.75+COUNTIFS(Tableau1[Etat],\"8\",Tableau1[Mois],H_productives[[#This Row],[Mois]],Tableau1[N°S],H_productives[[#This Row],[N°S]])*8","v":34.25},{"$f":"COUNTIFS(Tableau1[Etat],\"8,75\",Tableau1[Mois],H_productives[[#This Row],[Mois]],Tableau1[N°S],H_productives[[#This Row],[N°S]])*8.75+COUNTIFS(Tableau1[Etat],\"8\",Tableau1[Mois],H_productives[[#This Row],[Mois]],Tableau1[N°S],H_productives[[#This Row],[N°S]])*8","v":34.25},{"$f":"COUNTIFS(Tableau1[Etat],\"8,75\",Tableau1[Mois],H_productives[[#This Row],[Mois]],Tableau1[N°S],H_productives[[#This Row],[N°S]])*8.75+COUNTIFS(Tableau1[Etat],\"8\",Tableau1[Mois],H_productives[[#This Row],[Mois]],Tableau1[N°S],H_productives[[#This Row],[N°S]])*8","v":34.25},32]
[null,37,9,{"$f":"TEXT(DATE('Fermetures & jours fériés'!$D$1,H_productives[[#This Row],[N°Mois]],1),\"mmmm\")","v":"septembre"},{"$f":"COUNTIFS(Tableau1[Etat],\"8,75\",Tableau1[Mois],H_productives[[#This Row],[Mois]],Tableau1[N°S],H_productives[[#This Row],[N°S]])*8.75+COUNTIFS(Tableau1[Etat],\"8\",Tableau1[Mois],H_productives[[#This Row],[Mois]],Tableau1[N°S],H_productives[[#This Row],[N°S]])*8","v":35},{"$f":"COUNTIFS(Tableau1[Etat],\"8,75\",Tableau1[Mois],H_productives[[#This Row],[Mois]],Tableau1[N°S],H_productives[[#This Row],[N°S]])*8.75+COUNTIFS(Tableau1[Etat],\"8\",Tableau1[Mois],H_productives[[#This Row],[Mois]],Tableau1[N°S],H_productives[[#This Row],[N°S]])*8","v":35},{"$f":"COUNTIFS(Tableau1[Etat],\"8,75\",Tableau1[Mois],H_productives[[#This Row],[Mois]],Tableau1[N°S],H_productives[[#This Row],[N°S]])*8.75+COUNTIFS(Tableau1[Etat],\"8\",Tableau1[Mois],H_productives[[#This Row],[Mois]],Tableau1[N°S],H_productives[[#This Row],[N°S]])*8","v":35},{"$f":"COUNTIFS(Tableau1[Etat],\"8,75\",Tableau1[Mois],H_productives[[#This Row],[Mois]],Tableau1[N°S],H_productives[[#This Row],[N°S]])*8.75+COUNTIFS(Tableau1[Etat],\"8\",Tableau1[Mois],H_productives[[#This Row],[Mois]],Tableau1[N°S],H_productives[[#This Row],[N°S]])*8","v":35},{"$f":"COUNTIFS(Tableau1[Etat],\"8,75\",Tableau1[Mois],H_productives[[#This Row],[Mois]],Tableau1[N°S],H_productives[[#This Row],[N°S]])*8.75+COUNTIFS(Tableau1[Etat],\"8\",Tableau1[Mois],H_productives[[#This Row],[Mois]],Tableau1[N°S],H_productives[[#This Row],[N°S]])*8","v":35},{"$f":"COUNTIFS(Tableau1[Etat],\"8,75\",Tableau1[Mois],H_productives[[#This Row],[Mois]],Tableau1[N°S],H_productives[[#This Row],[N°S]])*8.75+COUNTIFS(Tableau1[Etat],\"8\",Tableau1[Mois],H_productives[[#This Row],[Mois]],Tableau1[N°S],H_productives[[#This Row],[N°S]])*8","v":35},40]
[null,38,9,{"$f":"TEXT(DATE('Fermetures & jours fériés'!$D$1,H_productives[[#This Row],[N°Mois]],1),\"mmmm\")","v":"septembre"},{"$f":"COUNTIFS(Tableau1[Etat],\"8,75\",Tableau1[Mois],H_productives[[#This Row],[Mois]],Tableau1[N°S],H_productives[[#This Row],[N°S]])*8.75+COUNTIFS(Tableau1[Etat],\"8\",Tableau1[Mois],H_productives[[#This Row],[Mois]],Tableau1[N°S],H_productives[[#This Row],[N°S]])*8","v":43},{"$f":"COUNTIFS(Tableau1[Etat],\"8,75\",Tableau1[Mois],H_productives[[#This Row],[Mois]],Tableau1[N°S],H_productives[[#This Row],[N°S]])*8.75+COUNTIFS(Tableau1[Etat],\"8\",Tableau1[Mois],H_productives[[#This Row],[Mois]],Tableau1[N°S],H_productives[[#This Row],[N°S]])*8","v":43},{"$f":"COUNTIFS(Tableau1[Etat],\"8,75\",Tableau1[Mois],H_productives[[#This Row],[Mois]],Tableau1[N°S],H_productives[[#This Row],[N°S]])*8.75+COUNTIFS(Tableau1[Etat],\"8\",Tableau1[Mois],H_productives[[#This Row],[Mois]],Tableau1[N°S],H_productives[[#This Row],[N°S]])*8","v":43},{"$f":"COUNTIFS(Tableau1[Etat],\"8,75\",Tableau1[Mois],H_productives[[#This Row],[Mois]],Tableau1[N°S],H_productives[[#This Row],[N°S]])*8.75+COUNTIFS(Tableau1[Etat],\"8\",Tableau1[Mois],H_productives[[#This Row],[Mois]],Tableau1[N°S],H_productives[[#This Row],[N°S]])*8","v":43},{"$f":"COUNTIFS(Tableau1[Etat],\"8,75\",Tableau1[Mois],H_productives[[#This Row],[Mois]],Tableau1[N°S],H_productives[[#This Row],[N°S]])*8.75+COUNTIFS(Tableau1[Etat],\"8\",Tableau1[Mois],H_productives[[#This Row],[Mois]],Tableau1[N°S],H_productives[[#This Row],[N°S]])*8","v":43},{"$f":"COUNTIFS(Tableau1[Etat],\"8,75\",Tableau1[Mois],H_productives[[#This Row],[Mois]],Tableau1[N°S],H_productives[[#This Row],[N°S]])*8.75+COUNTIFS(Tableau1[Etat],\"8\",Tableau1[Mois],H_productives[[#This Row],[Mois]],Tableau1[N°S],H_productives[[#This Row],[N°S]])*8","v":43},40]
[null,39,9,{"$f":"TEXT(DATE('Fermetures & jours fériés'!$D$1,H_productives[[#This Row],[N°Mois]],1),\"mmmm\")","v":"septembre"},{"$f":"COUNTIFS(Tableau1[Etat],\"8,75\",Tableau1[Mois],H_productives[[#This Row],[Mois]],Tableau1[N°S],H_productives[[#This Row],[N°S]])*8.75+COUNTIFS(Tableau1[Etat],\"8\",Tableau1[Mois],H_productives[[#This Row],[Mois]],Tableau1[N°S],H_productives[[#This Row],[N°S]])*8","v":35},{"$f":"COUNTIFS(Tableau1[Etat],\"8,75\",Tableau1[Mois],H_productives[[#This Row],[Mois]],Tableau1[N°S],H_productives[[#This Row],[N°S]])*8.75+COUNTIFS(Tableau1[Etat],\"8\",Tableau1[Mois],H_productives[[#This Row],[Mois]],Tableau1[N°S],H_productives[[#This Row],[N°S]])*8","v":35},{"$f":"COUNTIFS(Tableau1[Etat],\"8,75\",Tableau1[Mois],H_productives[[#This Row],[Mois]],Tableau1[N°S],H_productives[[#This Row],[N°S]])*8.75+COUNTIFS(Tableau1[Etat],\"8\",Tableau1[Mois],H_productives[[#This Row],[Mois]],Tableau1[N°S],H_productives[[#This Row],[N°S]])*8","v":35},{"$f":"COUNTIFS(Tableau1[Etat],\"8,75\",Tableau1[Mois],H_productives[[#This Row],[Mois]],Tableau1[N°S],H_productives[[#This Row],[N°S]])*8.75+COUNTIFS(Tableau1[Etat],\"8\",Tableau1[Mois],H_productives[[#This Row],[Mois]],Tableau1[N°S],H_productives[[#This Row],[N°S]])*8","v":35},{"$f":"COUNTIFS(Tableau1[Etat],\"8,75\",Tableau1[Mois],H_productives[[#This Row],[Mois]],Tableau1[N°S],H_productives[[#This Row],[N°S]])*8.75+COUNTIFS(Tableau1[Etat],\"8\",Tableau1[Mois],H_productives[[#This Row],[Mois]],Tableau1[N°S],H_productives[[#This Row],[N°S]])*8","v":35},{"$f":"COUNTIFS(Tableau1[Etat],\"8,75\",Tableau1[Mois],H_productives[[#This Row],[Mois]],Tableau1[N°S],H_productives[[#This Row],[N°S]])*8.75+COUNTIFS(Tableau1[Etat],\"8\",Tableau1[Mois],H_productives[[#This Row],[Mois]],Tableau1[N°S],H_productives[[#This Row],[N°S]])*8","v":35},40]
[null,40,9,{"$f":"TEXT(DATE('Fermetures & jours fériés'!$D$1,H_productives[[#This Row],[N°Mois]],1),\"mmmm\")","v":"septembre"},{"$f":"COUNTIFS(Tableau1[Etat],\"8,75\",Tableau1[Mois],H_productives[[#This Row],[Mois]],Tableau1[N°S],H_productives[[#This Row],[N°S]])*8.75+COUNTIFS(Tableau1[Etat],\"8\",Tableau1[Mois],H_productives[[#This Row],[Mois]],Tableau1[N°S],H_productives[[#This Row],[N°S]])*8","v":26.25},{"$f":"COUNTIFS(Tableau1[Etat],\"8,75\",Tableau1[Mois],H_productives[[#This Row],[Mois]],Tableau1[N°S],H_productives[[#This Row],[N°S]])*8.75+COUNTIFS(Tableau1[Etat],\"8\",Tableau1[Mois],H_productives[[#This Row],[Mois]],Tableau1[N°S],H_productives[[#This Row],[N°S]])*8","v":26.25},{"$f":"COUNTIFS(Tableau1[Etat],\"8,75\",Tableau1[Mois],H_productives[[#This Row],[Mois]],Tableau1[N°S],H_productives[[#This Row],[N°S]])*8.75+COUNTIFS(Tableau1[Etat],\"8\",Tableau1[Mois],H_productives[[#This Row],[Mois]],Tableau1[N°S],H_productives[[#This Row],[N°S]])*8","v":26.25},{"$f":"COUNTIFS(Tableau1[Etat],\"8,75\",Tableau1[Mois],H_productives[[#This Row],[Mois]],Tableau1[N°S],H_productives[[#This Row],[N°S]])*8.75+COUNTIFS(Tableau1[Etat],\"8\",Tableau1[Mois],H_productives[[#This Row],[Mois]],Tableau1[N°S],H_productives[[#This Row],[N°S]])*8","v":26.25},{"$f":"COUNTIFS(Tableau1[Etat],\"8,75\",Tableau1[Mois],H_productives[[#This Row],[Mois]],Tableau1[N°S],H_productives[[#This Row],[N°S]])*8.75+COUNTIFS(Tableau1[Etat],\"8\",Tableau1[Mois],H_productives[[#This Row],[Mois]],Tableau1[N°S],H_productives[[#This Row],[N°S]])*8","v":26.25},{"$f":"COUNTIFS(Tableau1[Etat],\"8,75\",Tableau1[Mois],H_productives[[#This Row],[Mois]],Tableau1[N°S],H_productives[[#This Row],[N°S]])*8.75+COUNTIFS(Tableau1[Etat],\"8\",Tableau1[Mois],H_productives[[#This Row],[Mois]],Tableau1[N°S],H_productives[[#This Row],[N°S]])*8","v":26.25},24]

{"sheet":"Menus déroulants","index":14,"n_rows":29,"n_cols":10,"rows_kept":29,"cut":false,"hidden":false,"merged":[[1,4,1,9]]}
[]
[null,"Commercial","Projet",null,"Coefficient mois mensuelle"]
[null,"Ccial 1","Menuiseries",null,"MOIS","Jours calendaire","Jours FERMÉ&FÉRIÉ","Jours travaillé","Calcul","Cumulé"]
[null,"Ccial 2","Abri",null,10,{"$f":"COUNTIF(Tableau1[N° mois],Tableau2[[#This Row],[MOIS]])","v":31},{"$f":"COUNTIFS(Tableau1[N° mois],Tableau2[[#This Row],[MOIS]],Tableau1[Etat],\"FERMÉE\")+COUNTIFS(Tableau1[N° mois],Tableau2[[#This Row],[MOIS]],Tableau1[Etat],\"FÉRIÉ/INACTIF\")","v":1},{"$f":"Tableau2[[#This Row],[Jours calendaire]]-Tableau2[[#This Row],[Jours FERMÉ&FÉRIÉ]]","v":30},{"$f":"Tableau2[[#This Row],[Jours travaillé]]/Tableau2[[#This Row],[Jours calendaire]]","v":0.967741935483871},{"$f":"Tableau2[[#This Row],[Calcul]]","v":0.967741935483871}]
[null,"Ccial 3","Isolation",null,11,{"$f":"COUNTIF(Tableau1[N° mois],Tableau2[[#This Row],[MOIS]])","v":30},{"$f":"COUNTIFS(Tableau1[N° mois],Tableau2[[#This Row],[MOIS]],Tableau1[Etat],\"FERMÉE\")+COUNTIFS(Tableau1[N° mois],Tableau2[[#This Row],[MOIS]],Tableau1[Etat],\"FÉRIÉ/INACTIF\")","v":2},{"$f":"Tableau2[[#This Row],[Jours calendaire]]-Tableau2[[#This Row],[Jours FERMÉ&FÉRIÉ]]","v":28},{"$f":"Tableau2[[#This Row],[Jours travaillé]]/Tableau2[[#This Row],[Jours calendaire]]","v":0.93333333333333335},{"$f":"J4+Tableau2[[#This Row],[Calcul]]","v":1.9010752688172043}]
[null,"Ccial 4","Menuiseries int",null,12,{"$f":"COUNTIF(Tableau1[N° mois],Tableau2[[#This Row],[MOIS]])","v":31},{"$f":"COUNTIFS(Tableau1[N° mois],Tableau2[[#This Row],[MOIS]],Tableau1[Etat],\"FERMÉE\")+COUNTIFS(Tableau1[N° mois],Tableau2[[#This Row],[MOIS]],Tableau1[Etat],\"FÉRIÉ/INACTIF\")","v":7},{"$f":"Tableau2[[#This Row],[Jours calendaire]]-Tableau2[[#This Row],[Jours FERMÉ&FÉRIÉ]]","v":24},{"$f":"Tableau2[[#This Row],[Jours travaillé]]/Tableau2[[#This Row],[Jours calendaire]]","v":0.77419354838709675},{"$f":"J5+Tableau2[[#This Row],[Calcul]]","v":2.6752688172043011}]
[null,null,"Alarme/Domotique",null,1,{"$f":"COUNTIF(Tableau1[N° mois],Tableau2[[#This Row],[MOIS]])","v":31},{"$f":"COUNTIFS(Tableau1[N° mois],Tableau2[[#This Row],[MOIS]],Tableau1[Etat],\"FERMÉE\")+COUNTIFS(Tableau1[N° mois],Tableau2[[#This Row],[MOIS]],Tableau1[Etat],\"FÉRIÉ/INACTIF\")","v":5},{"$f":"Tableau2[[#This Row],[Jours calendaire]]-Tableau2[[#This Row],[Jours FERMÉ&FÉRIÉ]]","v":26},{"$f":"Tableau2[[#This Row],[Jours travaillé]]/Tableau2[[#This Row],[Jours calendaire]]","v":0.83870967741935487},{"$f":"J6+Tableau2[[#This Row],[Calcul]]","v":3.5139784946236561}]
[null,null,null,null,2,{"$f":"COUNTIF(Tableau1[N° mois],Tableau2[[#This Row],[MOIS]])","v":29},{"$f":"COUNTIFS(Tableau1[N° mois],Tableau2[[#This Row],[MOIS]],Tableau1[Etat],\"FERMÉE\")+COUNTIFS(Tableau1[N° mois],Tableau2[[#This Row],[MOIS]],Tableau1[Etat],\"FÉRIÉ/INACTIF\")","v":0},{"$f":"Tableau2[[#This Row],[Jours calendaire]]-Tableau2[[#This Row],[Jours FERMÉ&FÉRIÉ]]","v":29},{"$f":"Tableau2[[#This Row],[Jours travaillé]]/Tableau2[[#This Row],[Jours calendaire]]","v":1},{"$f":"J7+Tableau2[[#This Row],[Calcul]]","v":4.5139784946236556}]
[null,null,null,null,3,{"$f":"COUNTIF(Tableau1[N° mois],Tableau2[[#This Row],[MOIS]])","v":31},{"$f":"COUNTIFS(Tableau1[N° mois],Tableau2[[#This Row],[MOIS]],Tableau1[Etat],\"FERMÉE\")+COUNTIFS(Tableau1[N° mois],Tableau2[[#This Row],[MOIS]],Tableau1[Etat],\"FÉRIÉ/INACTIF\")","v":0},{"$f":"Tableau2[[#This Row],[Jours calendaire]]-Tableau2[[#This Row],[Jours FERMÉ&FÉRIÉ]]","v":31},{"$f":"Tableau2[[#This Row],[Jours travaillé]]/Tableau2[[#This Row],[Jours calendaire]]","v":1},{"$f":"J8+Tableau2[[#This Row],[Calcul]]","v":5.5139784946236556}]
[null,null,null,null,4,{"$f":"COUNTIF(Tableau1[N° mois],Tableau2[[#This Row],[MOIS]])","v":30},{"$f":"COUNTIFS(Tableau1[N° mois],Tableau2[[#This Row],[MOIS]],Tableau1[Etat],\"FERMÉE\")+COUNTIFS(Tableau1[N° mois],Tableau2[[#This Row],[MOIS]],Tableau1[Etat],\"FÉRIÉ/INACTIF\")","v":1},{"$f":"Tableau2[[#This Row],[Jours calendaire]]-Tableau2[[#This Row],[Jours FERMÉ&FÉRIÉ]]","v":29},{"$f":"Tableau2[[#This Row],[Jours travaillé]]/Tableau2[[#This Row],[Jours calendaire]]","v":0.96666666666666667},{"$f":"J9+Tableau2[[#This Row],[Calcul]]","v":6.4806451612903224}]
[null,null,null,null,5,{"$f":"COUNTIF(Tableau1[N° mois],Tableau2[[#This Row],[MOIS]])","v":31},{"$f":"COUNTIFS(Tableau1[N° mois],Tableau2[[#This Row],[MOIS]],Tableau1[Etat],\"FERMÉE\")+COUNTIFS(Tableau1[N° mois],Tableau2[[#This Row],[MOIS]],Tableau1[Etat],\"FÉRIÉ/INACTIF\")","v":2},{"$f":"Tableau2[[#This Row],[Jours calendaire]]-Tableau2[[#This Row],[Jours FERMÉ&FÉRIÉ]]","v":29},{"$f":"Tableau2[[#This Row],[Jours travaillé]]/Tableau2[[#This Row],[Jours calendaire]]","v":0.93548387096774188},{"$f":"J10+Tableau2[[#This Row],[Calcul]]","v":7.4161290322580644}]
[null,null,null,null,6,{"$f":"COUNTIF(Tableau1[N° mois],Tableau2[[#This Row],[MOIS]])","v":30},{"$f":"COUNTIFS(Tableau1[N° mois],Tableau2[[#This Row],[MOIS]],Tableau1[Etat],\"FERMÉE\")+COUNTIFS(Tableau1[N° mois],Tableau2[[#This Row],[MOIS]],Tableau1[Etat],\"FÉRIÉ/INACTIF\")","v":1},{"$f":"Tableau2[[#This Row],[Jours calendaire]]-Tableau2[[#This Row],[Jours FERMÉ&FÉRIÉ]]","v":29},{"$f":"Tableau2[[#This Row],[Jours travaillé]]/Tableau2[[#This Row],[Jours calendaire]]","v":0.96666666666666667},{"$f":"J11+Tableau2[[#This Row],[Calcul]]","v":8.3827956989247312}]
[null,null,null,null,7,{"$f":"COUNTIF(Tableau1[N° mois],Tableau2[[#This Row],[MOIS]])","v":31},{"$f":"COUNTIFS(Tableau1[N° mois],Tableau2[[#This Row],[MOIS]],Tableau1[Etat],\"FERMÉE\")+COUNTIFS(Tableau1[N° mois],Tableau2[[#This Row],[MOIS]],Tableau1[Etat],\"FÉRIÉ/INACTIF\")","v":1},{"$f":"Tableau2[[#This Row],[Jours calendaire]]-Tableau2[[#This Row],[Jours FERMÉ&FÉRIÉ]]","v":30},{"$f":"Tableau2[[#This Row],[Jours travaillé]]/Tableau2[[#This Row],[Jours calendaire]]","v":0.967741935483871},{"$f":"J12+Tableau2[[#This Row],[Calcul]]","v":9.3505376344086031}]
[null,null,null,null,8,{"$f":"COUNTIF(Tableau1[N° mois],Tableau2[[#This Row],[MOIS]])","v":31},{"$f":"COUNTIFS(Tableau1[N° mois],Tableau2[[#This Row],[MOIS]],Tableau1[Etat],\"FERMÉE\")+COUNTIFS(Tableau1[N° mois],Tableau2[[#This Row],[MOIS]],Tableau1[Etat],\"FÉRIÉ/INACTIF\")","v":1},{"$f":"Tableau2[[#This Row],[Jours calendaire]]-Tableau2[[#This Row],[Jours FERMÉ&FÉRIÉ]]","v":30},{"$f":"Tableau2[[#This Row],[Jours travaillé]]/Tableau2[[#This Row],[Jours calendaire]]","v":0.967741935483871},{"$f":"J13+Tableau2[[#This Row],[Calcul]]","v":10.318279569892475}]
[null,null,null,null,9,{"$f":"COUNTIF(Tableau1[N° mois],Tableau2[[#This Row],[MOIS]])","v":30},{"$f":"COUNTIFS(Tableau1[N° mois],Tableau2[[#This Row],[MOIS]],Tableau1[Etat],\"FERMÉE\")+COUNTIFS(Tableau1[N° mois],Tableau2[[#This Row],[MOIS]],Tableau1[Etat],\"FÉRIÉ/INACTIF\")","v":0},{"$f":"Tableau2[[#This Row],[Jours calendaire]]-Tableau2[[#This Row],[Jours FERMÉ&FÉRIÉ]]","v":30},{"$f":"Tableau2[[#This Row],[Jours travaillé]]/Tableau2[[#This Row],[Jours calendaire]]","v":1},{"$f":"J14+Tableau2[[#This Row],[Calcul]]","v":11.318279569892475}]
[]
[null,null,null,null,"MOIS","Heures en surplus","Cumulé"]
[null,null,null,null,10,{"$f":"OCT!R10","v":0},{"$f":"Tableau6[[#This Row],[Heures en surplus]]+G19","v":0}]
[null,null,null,null,11,{"$f":"NOV!R10","v":0},{"$f":"Tableau6[[#This Row],[Heures en surplus]]+G20","v":0}]
[null,null,null,null,12,{"$f":"DEC!S10","v":0},{"$f":"Tableau6[[#This Row],[Heures en surplus]]+G21","v":0}]
[null,null,null,null,1,{"$f":"JAN!R10","v":0},{"$f":"Tableau6[[#This Row],[Heures en surplus]]+G22","v":0}]
[null,null,null,null,2,{"$f":"FEV!R10","v":0},{"$f":"Tableau6[[#This Row],[Heures en surplus]]+G23","v":0}]
[null,null,null,null,3,{"$f":"MARS!S10","v":0},{"$f":"Tableau6[[#This Row],[Heures en surplus]]+G24","v":0}]
[null,null,null,null,4,{"$f":"AVRIL!R10","v":0},{"$f":"Tableau6[[#This Row],[Heures en surplus]]+G25","v":0}]
[null,null,null,null,5,{"$f":"MAI!R10","v":0},{"$f":"Tableau6[[#This Row],[Heures en surplus]]+G26","v":0}]
[null,null,null,null,6,{"$f":"JUIN!R10","v":0},{"$f":"Tableau6[[#This Row],[Heures en surplus]]+G27","v":0}]
[null,null,null,null,7,{"$f":"JUILLET!R10","v":0},{"$f":"Tableau6[[#This Row],[Heures en surplus]]+G28","v":0}]
[null,null,null,null,8,{"$f":"AOUT!S10","v":0},{"$f":"Tableau6[[#This Row],[Heures en surplus]]+G29","v":0}]
[null,null,null,null,9,{"$f":"SEPT!R10","v":0},{"$f":"Tableau6[[#This Row],[Heures en surplus]]","v":0}]

{"sheet":"Listes","index":15,"n_rows":35,"n_cols":1,"rows_kept":35,"cut":false,"hidden":false,"merged":[]}
["Projet"]
["Agencement"]
["Alarme"]
["Bardage"]
["BOZARC"]
["Clôture"]
["Domotique"]
["Escalier"]
["Fenêtre"]
["Garde-corps"]
["Garde-corps"]
["Injection microbille"]
["Isolation des combles"]
["Lambris"]
["Marquise"]
["Motorisation PG"]
["Motorisation VB"]
["Motorisation VR"]
["Oasis de verre"]
["Parquet"]
["PB"]
["PE"]
["PG"]
["Placard/Dressing"]
["Plaza Viva"]
["Portail"]
["Porte int"]
["Portillon"]
["PS"]
["Store ext"]
["Store int"]
["Terrazza"]
["VB"]
["Véranda"]
["VR"]