{"text_format":"1","workbook":"xlsx","n_sheets":26,"sheets":["Liste choix menus","Accueil","Saisie des référentiels","Liste référentiels","Saisie des menus","Menus midi retraite","Menus journaliers","Menus viandes weekend","Janvier","Février","Mars","Avril","Mai","Juin","Juillet","Août","Septembre","Octobre","Novembre","Décembre","Quantité desserts","Quantité légumes","Quantité viandes","Propostion MMR","Proposition MJ","Proposition MVWE"],"not_rendered":{"charts":0,"images":0,"macros":1,"external_links":0,"defined_names":27,"comments":0,"pivot_tables":0},"unopened":[],"bounds":{"document_bytes":16777216,"sheet_cells":100000,"rows_first":2000,"rows_last":500,"rows_between":2000,"halvings":0,"cell_chars":16384,"cell_head_chars":4096},"cells_cut":0,"cells_raw":0,"read":"whole","date_system":"1900"}

{"sheet":"Liste choix menus","index":0,"n_rows":98,"n_cols":7,"rows_kept":98,"cut":false,"hidden":false,"merged":[]}
["Nature des produits","Destination du produit","Observations","Jours ","Conditionnement","Aliments","Période concernée"]
["Desserts","Menus journaliers","Armistice du 11 novembre 1918","Dimanche midi","1 bocal ou 1 boîte pour 1 repas","Ananas","Janvier"]
["Légume deux","Menus midi retraite","Ascension","Dimanche midi et soir","1 boîte de six œufs. 3 œufs pour 1 repas","Autres fruits","Février"]
["Légumes","Menus viandes week-end deuxième semestre","Assomption","Dimanche soir","1 boîte ou 1 pot pour 1 repas","Avocats","Mars"]
["Observations","Menus viandes week-end premier semestre","Fête du travail","Lundi à dimanche soirs","1 boîte pour 1 repas","Bananes","Avril"]
["Période concernée","Viandes","Fête nationale","Lundi à vendredi midis","1 boîte pour 2 repas","Clémentines","Mai"]
["Viandes","Menus midi retraite janvier","Jour de l'an","lundi à vendredi soirs","1 botte ou 1 sachet pour 1 repas","Crème","Juin"]
[null,"Menus midi retraite février","Lundi de Pâques","Lundi et mardi soirs","1 botte ou 1 sachet pour 2 repas","Dattes","Juillet"]
[null,"Menus midi retraite mars","Lundi de Pentecôte","Mercredi et jeudi soirs","1 morceau de 400 grammes (Leclerc) pour 3 repas","Figues","Août"]
[null,"Menus midi retraite avril","Noël","Samedi et dimanche midis","1 morceau de 500 grammes pour 5 repas","Fromage blanc","Septembre"]
[null,"Menus midi retraite mai","Pâques","Samedi et dimanche midis et soirs","1 pack de 4 pots pour le week-end. 1 pot pour 1 repas","Fruits au sirop","Octobre"]
[null,"Menus midi retraite juin","Pentecôte","Samedi midi et soir","1 pack de 6 pots. 3 pots pour 1 repas","Fruits de saison","Novembre"]
[null,"Menus midi retraite juillet","Toussaint","Vendredi soir","1 paquet pour 1 repas","Gâteau de riz","Décembre"]
[null,"Menus midi retraite août","Victoire du 08 mai 1945",null,"1 paquet pour 2 repas","Gâteaux samedi et dimanche"]
[null,"Menus midi retraite septembre",null,null,"1 paquet pour 2 repas. 1 ou 2 saucisses pour 1 repas","Mousse au chocolat"]
[null,"Menus midi retraite octobre",null,null,"1 paquet pour 4 repas","Oranges"]
[null,"Menus midi retraite novembre",null,null,"1 sachet de 2 kilogrammes. 1 pomme pour 1 repas","Petits suisses"]
[null,"Menus midi retraite décembre",null,null,"1 sachet pour 2 repas","Pomme"]
[null,"Menus journaliers janvier",null,null,"1 sachet pour 4 repas","Pruneaux"]
[null,"Menus journaliers février",null,null,"1 tranche pour 1 repas","Riz"]
[null,"Menus journaliers mars",null,null,"1 tranche pour 2 repas","Semoule de blé"]
[null,"Menus journaliers avril",null,null,"125 grammes pour 1 repas","Tapioca"]
[null,"Menus journaliers mai",null,null,"20 frites pour 1 repas","Yaourts"]
[null,"Menus journaliers juin",null,null,"25 grammes pour 1 repas","Cassoulet"]
[null,"Menus journaliers juillet",null,null,"3 tranches pour 1 repas","Choucroute"]
[null,"Menus journaliers août",null,null,"5 cuillères pour 1 repas","Chou-fleur"]
[null,"Menus journaliers septembre",null,null,"Unité : 1 branche pour 1 repas","Choux de Bruxelles"]
[null,"Menus journaliers octobre",null,null,"Unité : 1 morceau pour 2 repas","Couscous"]
[null,"Menus journaliers novembre",null,null,"Unité : 1 pour 1 repas","Endives"]
[null,"Menus journaliers décembre",null,null,"Unité : 1 pour 2 repas","Haricots verts"]
[null,"Menus viandes weekend premier semestre",null,null,"Unité : 1 pour 4 repas","Maïs"]
[null,"Menus viandes weekend deuxième semestre",null,null,"Unité : 1 tête pour 1 repas","Paella"]
[null,null,null,null,"Unité : 2 à 4 pour 1 repas","Poireau"]
[null,null,null,null,"Unité : 2 pour 1 repas","Pomme de terre"]
[null,null,null,null,null,"Purée"]
[null,null,null,null,null,"Quenelles"]
[null,null,null,null,null,"Riz"]
[null,null,null,null,null,"Macédoine de légumes"]
[null,null,null,null,null,"Petits pois"]
[null,null,null,null,null,"Petits pois et jeunes carottes"]
[null,null,null,null,null,"Ratatouille"]
[null,null,null,null,null,"Raviolis"]
[null,null,null,null,null,"Tomates pelées"]
[null,null,null,null,null,"Asperges"]
[null,null,null,null,null,"Avocat"]
[null,null,null,null,null,"Betterave rouge"]
[null,null,null,null,null,"Carottes"]
[null,null,null,null,null,"Céleri"]
[null,null,null,null,null,"Champignons"]
[null,null,null,null,null,"Concombre"]
[null,null,null,null,null,"Radis"]
[null,null,null,null,null,"Salade"]
[null,null,null,null,null,"Salsifis"]
[null,null,null,null,null,"Tomates "]
[null,null,null,null,null,"Pâtes à la sauce tomates"]
[null,null,null,null,null,"Pâtes au beurre"]
[null,null,null,null,null,"Pâtes au fromage râpé"]
[null,null,null,null,null,"Chips"]
[null,null,null,null,null,"Frites"]
[null,null,null,null,null,"Bifteck haché de bœuf"]
[null,null,null,null,null,"Bifteck haché de cheval"]
[null,null,null,null,null,"Bifteck haché de veau"]
[null,null,null,null,null,"Bouchée à la reine"]
[null,null,null,null,null,"Boudin"]
[null,null,null,null,null,"Cervelas"]
[null,null,null,null,null,"Cœur"]
[null,null,null,null,null,"Croque-monsieur"]
[null,null,null,null,null,"Foie"]
[null,null,null,null,null,"Fromage de tête"]
[null,null,null,null,null,"Jambon"]
[null,null,null,null,null,"Jambonneau"]
[null,null,null,null,null,"Mortadelle"]
[null,null,null,null,null,"Œufs"]
[null,null,null,null,null,"Pizza"]
[null,null,null,null,null,"Poisson"]
[null,null,null,null,null,"Quiche lorraine"]
[null,null,null,null,null,"Roulade à la pistache"]
[null,null,null,null,null,"Roulé au fromage"]
[null,null,null,null,null,"Salami"]
[null,null,null,null,null,"Saucisses"]
[null,null,null,null,null,"Saucisson"]
[null,null,null,null,null,"Tête persillée"]
[null,null,null,null,null,"Tête roulée"]
[null,null,null,null,null,"Thon"]
[null,null,null,null,null,"Viande cassoulet"]
[null,null,null,null,null,"Viande choucroute"]
[null,null,null,null,null,"Viande paella"]
[null,null,null,null,null,"Agneau"]
[null,null,null,null,null,"Bœuf"]
[null,null,null,null,null,"Cheval"]
[null,null,null,null,null,"Dinde"]
[null,null,null,null,null,"Porc"]
[null,null,null,null,null,"Veau"]
[null,null,null,null,null,"Rôti d'agneau"]
[null,null,null,null,null,"Rôti de bœuf"]
[null,null,null,null,null,"Rôti de cheval"]
[null,null,null,null,null,"Rôti de porc"]
[null,null,null,null,null,"Rôti de veau"]

{"sheet":"Accueil","index":1,"n_rows":23,"n_cols":1,"rows_kept":23,"cut":false,"hidden":false,"merged":[]}
["Accueil"]
[]
["Liste choix menus"]
["Saisie des référentiels"]
["Liste référentiels"]
["Menus midi retraite"]
["Menus journaliers"]
["Menus viandes week-end"]
["Quantités légumes"]
["Quantités viandes"]
["Quantités desserts"]
["Janvier"]
["Février"]
["Mars"]
["Avril"]
["Mai"]
["Juin"]
["Juillet"]
["Août"]
["Septembre"]
["Octobre"]
["Novembre"]
["Décembre"]

{"sheet":"Saisie des référentiels","index":2,"n_rows":11,"n_cols":3,"rows_kept":11,"cut":false,"hidden":false,"merged":[[0,0,0,1]]}
["Saisie des référentiels",null,"Accueil"]
[]
["Numéro du référentiel","PC-12"]
["Titre","Desserts"]
[{"$f":"IF($B$4=\"Desserts\",\"Desserts\",IF($B$4=\"Légume deux\",\"légumes deux\",IF($B$4=\"Légumes\",\"Légumes\",IF($B$4=\"Observations\",\"Observations\",IF($B$4=\"Viandes\",\"Viandes\",IF($B$4=\"période concernée\",\"Période concernée\",\"\"))))))","v":"Desserts"}]
["Date de création du référentiel","2017-10-28"]
["Code du référentiel","PC12"]
["Nom du référentiel","Décembre 2017"]
["Jour aliment"]
["Conditiopnnement aliment"]
["Destination aliment"]

{"sheet":"Liste référentiels","index":3,"n_rows":57,"n_cols":37,"rows_kept":57,"cut":false,"hidden":false,"merged":[[0,0,0,35]]}
["Liste des référentiels",null,null,null,null,null,null,null,null,null,null,null,null,null,null,null,null,null,null,null,null,null,null,null,null,null,null,null,null,null,null,null,null,null,null,null,"Accueil"]
[]
["Code desserts","Desserts","Jours desserts","Conditionnement desserts","Destination desserts","Numéro création dessert","Date création dessert","Code légume deux","Légume deux","Jour légume deux","Conditionnement légume deux","Destination légume deux","Numéro création légume deux","Date création légume deux","Code légumes","Légumes","Jours légumes","Conditionnement légumes","Destination légumes","Numéro création légumes","Date création légumes","Code viandes","Viandes","Jours viandes","Conditionnement viandes","Destination viandes","Numéro création viandes","Date création viandes","Code observations","Observations","Numéro création obserations","Date création observations","Code période concernée","Période concernée","Numéro création période concernée","Date création période concernée"]
["DWE01","Ananas","Samedi et dimanche midis et soirs","Unité : 1 pour 4 repas","Menus journaliers","D-01","2017-10-26","LWED01","Asperges","Dimanche soir","1 bocal ou 1 boîte pour 1 repas","Menus journaliers","LD-01","2017-10-27","LSLM01","Cassoulet","Lundi et mardi soirs","1 boîte pour 2 repas","Menus journaliers","LLM-01","2017-10-27","VS01","Bifteck haché de bœuf","Lundi à dimanche soirs","1 paquet pour 2 repas","Menus journaliers","V-01","2017-10-27","O01","Armistice du 11 novembre 1918","O-01","2017-10-28","PC01","Janvier","PC-01","2017-10-28"]
["DWE02","Autres fruits","Samedi et dimanche midis et soirs","Unité : 2 à 4 pour 1 repas","Menus journaliers","D-02","2017-10-26",null,null,null,null,null,null,null,"LSLM02","Choucroute","Lundi et mardi soirs","1 boîte pour 2 repas","Menus journaliers","LLM-02","2017-10-27","VS02","Bifteck haché de cheval","Lundi à dimanche soirs","125 grammes pour 1 repas","Menus journaliers","V-02","2017-10-27","O02","Ascension","O-02","2017-10-28","PC02","Février","PC-02","2017-10-28"]
["DWE03","Avocats","Samedi et dimanche midis et soirs","Unité : 1 pour 1 repas","Menus journaliers","D-03","2017-10-27",null,null,null,null,null,null,null,"LSLM03","Chou-fleur","Lundi et mardi soirs","Unité : 1 pour 2 repas","Menus journaliers","LLM-03","2017-10-27","VS03","Bifteck haché de veau","Lundi à dimanche soirs","1 paquet pour 2 repas","Menus journaliers","V-03","2017-10-27","O03","Assomption","O-03","2017-10-28","PC03","Mars","PC-03","2017-10-28"]
["DWE04","Bananes","Samedi et dimanche midis et soirs","Unité : 1 pour 1 repas","Menus journaliers","D-04","2017-10-27",null,null,null,null,null,null,null,"LSLM04","Choux de Bruxelles","Lundi et mardi soirs","1 boîte pour 2 repas","Menus journaliers","LLM-04","2017-10-27","VS04","Bouchée à la reine","Lundi à dimanche soirs","1 boîte pour 2 repas","Menus journaliers","V-04","2017-10-27","O04","Fête du travail","O-04","2017-10-28","PC04","Avril","PC-04","2017-10-28"]
["DWE05","Clémentines","Samedi et dimanche midis et soirs","Unité : 2 à 4 pour 1 repas","Menus journaliers","D-05","2017-10-27",null,null,null,null,null,null,null,"LSLM05","Couscous","Lundi et mardi soirs","25 grammes pour 1 repas","Menus journaliers","LLM-05","2017-10-27","VS05","Boudin","Lundi à dimanche soirs","1 paquet pour 2 repas","Menus journaliers","V-05","2017-10-27","O05","Fête nationale","O-05","2017-10-28","PC05","Mai","PC-05","2017-10-28"]
["DWE06","Crème","Samedi et dimanche midis et soirs","1 pack de 4 pots pour le week-end. 1 pot pour 1 repas","Menus journaliers","D-06","2017-10-27",null,null,null,null,null,null,null,"LSLM06","Endives","Lundi et mardi soirs","1 boîte pour 2 repas","Menus journaliers","LLM-06","2017-10-27","VS06","Cervelas","Lundi à dimanche soirs","1 paquet pour 2 repas","Menus journaliers","V-06","2017-10-27","O06","Jour de l'an","O-06","2017-10-28","PC06","Juin","PC-06","2017-10-28"]
["DWE07","Dattes","Samedi et dimanche midis et soirs","1 paquet pour 4 repas","Menus journaliers","D-07","2017-10-27",null,null,null,null,null,null,null,"LSLM07","Haricots verts","Lundi et mardi soirs","1 boîte pour 2 repas","Menus journaliers","LLM-07","2017-10-27","VS07","Cœur","Lundi à dimanche soirs","1 paquet pour 2 repas","Menus journaliers","V-07","2017-10-27","O07","Lundi de Pâques","O-07","2017-10-28","PC07","Juillet","PC-07","2017-10-28"]
["DWE08","Figues","Samedi et dimanche midis et soirs","1 paquet pour 4 repas","Menus journaliers","D-08","2017-10-27",null,null,null,null,null,null,null,"LSLM08","Maïs","Lundi et mardi soirs","1 boîte pour 2 repas","Menus journaliers","LLM-08","2017-10-27","VS08","Croque-monsieur","Lundi à dimanche soirs","1 paquet pour 2 repas","Menus journaliers","V-08","2017-10-27","O08","Lundi de Pentecôte","O-08","2017-10-28","PC08","Août","PC-08","2017-10-28"]
["DWE09","Fromage blanc","Samedi et dimanche midis et soirs","1 pack de 4 pots pour le week-end. 1 pot pour 1 repas","Menus journaliers","D-09","2017-10-27",null,null,null,null,null,null,null,"LSLM09","Paella","Lundi et mardi soirs","1 boîte pour 2 repas","Menus journaliers","LLM-09","2017-10-27","VS09","Foie","Lundi à dimanche soirs","1 paquet pour 2 repas","Menus journaliers","V-09","2017-10-27","O09","Noël","O-09","2017-10-28","PC09","Septembre","PC-09","2017-10-28"]
["DWE10","Fruits au sirop","Samedi et dimanche midis et soirs","1 boîte pour 2 repas","Menus journaliers","D-10","2017-10-27",null,null,null,null,null,null,null,"LSLM10","Poireau","Lundi et mardi soirs","Unité : 1 pour 1 repas","Menus journaliers","LLM-10","2017-10-27","VS10","Fromage de tête","Lundi à dimanche soirs","1 tranche pour 2 repas","Menus journaliers","V-10","2017-10-27","O10","Pâques","O-10","2017-10-28","PC10","Octobre","PC-10","2017-10-28"]
["DWE11","Fruits de saison","Samedi et dimanche midis et soirs","Unité : 2 à 4 pour 1 repas","Menus journaliers","D-11","2017-10-27",null,null,null,null,null,null,null,"LSLM11","Pomme de terre","Lundi et mardi soirs","Unité : 1 pour 1 repas","Menus journaliers","LLM-11","2017-10-27","VS11","Jambon","Lundi à dimanche soirs","1 paquet pour 2 repas","Menus journaliers","V-11","2017-10-27","O11","Pentecôte","O-11","2017-10-28","PC11","Novembre","PC-11","2017-10-28"]
["DWE12","Gâteau de riz","Samedi et dimanche midis et soirs","1 pack de 4 pots pour le week-end. 1 pot pour 1 repas","Menus journaliers","D-12","2017-10-27",null,null,null,null,null,null,null,"LSLM12","Purée","Lundi et mardi soirs","25 grammes pour 1 repas","Menus journaliers","LLM-12","2017-10-27","VS12","Jambonneau","Lundi à dimanche soirs","1 paquet pour 2 repas","Menus journaliers","V-12","2017-10-27","O12","Toussaint","O-12","2017-10-28","PC12","Décembre","PC-12","2017-10-28"]
["DWE13","Gâteau de semoule","Samedi et dimanche midis et soirs","1 boîte pour 2 repas","Menus journaliers","D-13","2017-10-27",null,null,null,null,null,null,null,"LSLM13","Quenelles","Lundi et mardi soirs","1 boîte pour 2 repas","Menus journaliers","LLM-13","2017-10-27","VS13","Mortadelle","Lundi à dimanche soirs","1 paquet pour 2 repas","Menus journaliers","V-13","2017-10-27","O13","Victoire du 08 mai 1945","O-13","2017-10-28"]
["DWE14","Gâteaux samedi et dimanche","Samedi et dimanche midis et soirs","1 boîte pour 2 repas","Menus journaliers","D-13","2017-10-27",null,null,null,null,null,null,null,"LSLM14","Riz","Lundi et mardi soirs","25 grammes pour 1 repas","Menus journaliers","LLM-14","2017-10-27","VS14","Œufs","Lundi à dimanche soirs","1 boîte de six œufs. 3 œufs pour 1 repas","Menus journaliers","V-14","2017-10-27"]
["DWE15","Mousse au chocolat","Samedi et dimanche midis et soirs","1 pack de 4 pots pour le week-end. 1 pot pour 1 repas","Menus journaliers","D-14","2017-10-27",null,null,null,null,null,null,null,"LSMJ01","Macédoine de légumes","Mercredi et jeudi soirs","1 boîte pour 2 repas","Menus journaliers","LMJ-01","2017-10-27","VS15","Pizza","Lundi à dimanche soirs","1 paquet pour 2 repas","Menus journaliers","V-15","2017-10-27"]
["DWE16","Oranges","Samedi et dimanche midis et soirs","Unité : 1 pour 1 repas","Menus journaliers","D-15","2017-10-27",null,null,null,null,null,null,null,"LSMJ02","Petits pois","Mercredi et jeudi soirs","1 boîte pour 2 repas","Menus journaliers","LMJ-02","2017-10-27","VS16","Poisson","Lundi à dimanche soirs","Unité : 1 pour 1 repas","Menus journaliers","V-16","2017-10-27"]
["DWE17","Petits suisses","Samedi et dimanche midis et soirs","1 pack de 6 pots. 3 pots pour 1 repas","Menus journaliers","D-16","2017-10-27",null,null,null,null,null,null,null,"LSMJ03","Petits pois et jeunes carottes","Mercredi et jeudi soirs","1 boîte pour 2 repas","Menus journaliers","LMJ-03","2017-10-27","VS17","Quiche lorraine","Lundi à dimanche soirs","1 boîte pour 2 repas","Menus journaliers","V-17","2017-10-27"]
["DWE18","Pruneaux","Samedi et dimanche midis et soirs","1 paquet pour 4 repas","Menus journaliers","D-18","2017-10-27",null,null,null,null,null,null,null,"LSMJ04","Ratatouille","Mercredi et jeudi soirs","1 boîte pour 2 repas","Menus journaliers","LMJ-04","2017-10-27","VS18","Roulade à la pistache","Lundi à dimanche soirs","3 tranches pour 1 repas","Menus journaliers","V-18","2017-10-27"]
["DWE19","Tapioca","Samedi et dimanche midis et soirs","25 grammes pour 1 repas","Menus journaliers","D-21","2017-10-27",null,null,null,null,null,null,null,"LSMJ05","Raviolis","Mercredi et jeudi soirs","1 boîte pour 2 repas","Menus journaliers","LMJ-05","2017-10-27","VS19","Roulé au fromage","Lundi à dimanche soirs","1 boîte pour 2 repas","Menus journaliers","V-19","2017-10-27"]
["DWE20","Yaourts","Samedi et dimanche midis et soirs","1 pack de 4 pots pour le week-end. 1 pot pour 1 repas","Menus journaliers","D-22","2017-10-27",null,null,null,null,null,null,null,"LSMJ06","Tomates pelées","Mercredi et jeudi soirs","1 boîte pour 2 repas","Menus journaliers","LMJ-06","2017-10-27","VS20","Salami","Lundi à dimanche soirs","1 paquet pour 2 repas","Menus journaliers","V-20","2017-10-27"]
["DMR01","Pomme","Lundi à vendredi midis","1 sachet de 2 kilogrammes. 1 pomme pour 1 repas","Menus midi retraite","D-23","2017-10-27",null,null,null,null,null,null,null,"LSV01","Asperges","Vendredi soir","1 bocal ou 1 boîte pour 1 repas","Menus journaliers","LV-01","2017-10-27","VS21","Saucisses","Lundi à dimanche soirs","1 paquet pour 2 repas. 1 ou 2 saucisses pour 1 repas","Menus journaliers","V-21","2017-10-27"]
["DS01","Pomme","lundi à vendredi soirs","1 sachet de 2 kilogrammes. 1 pomme pour 1 repas","Menus journaliers","D-24","2019-01-16",null,null,null,null,null,null,null,"LSV02","Avocat","Vendredi soir","Unité : 1 pour 1 repas","Menus journaliers","LV-02","2017-10-27","VS22","Saucisson","Lundi à dimanche soirs","1 morceau de 400 grammes (Leclerc) pour 3 repas","Menus journaliers","V-22","2017-10-27"]
[null,null,null,null,null,null,null,null,null,null,null,null,null,null,"LSV03","Betterave rouge","Vendredi soir","Unité : 1 pour 1 repas","Menus journaliers","LV-03","2017-10-27","VS23","Tête persillée","Lundi à dimanche soirs","1 tranche pour 2 repas","Menus journaliers","V-23","2017-10-27"]
[null,null,null,null,null,null,null,null,null,null,null,null,null,null,"LSV04","Carottes","Vendredi soir","Unité : 2 pour 1 repas","Menus journaliers","LV-04","2017-10-27","VS24","Tête roulée","Lundi à dimanche soirs","1 tranche pour 2 repas","Menus journaliers","V-24","2017-10-27"]
[null,null,null,null,null,null,null,null,null,null,null,null,null,null,"LSV05","Céleri","Vendredi soir","Unité : 1 branche pour 1 repas","Menus journaliers","LV-05","2017-10-27","VS25","Thon","Lundi à dimanche soirs","1 boîte pour 1 repas","Menus journaliers","V-25","2017-10-27"]
[null,null,null,null,null,null,null,null,null,null,null,null,null,null,"LSV06","Champignons","Vendredi soir","1 boîte pour 1 repas","Menus journaliers","LV-06","2017-10-27","VS26","Viande cassoulet","Lundi et mardi soirs","1 boîte pour 2 repas","Menus journaliers","V-26","2017-10-27"]
[null,null,null,null,null,null,null,null,null,null,null,null,null,null,"LSV07","Concombre","Vendredi soir","Unité : 1 pour 1 repas","Menus journaliers","LV-07","2017-10-27","VS27","Viande choucroute","Lundi et mardi soirs","1 boîte pour 2 repas","Menus journaliers","V-27","2017-10-27"]
[null,null,null,null,null,null,null,null,null,null,null,null,null,null,"LSV08","Radis","Vendredi soir","1 botte ou 1 sachet pour 1 repas","Menus journaliers","LV-08","2017-10-27","VS28","Viande paella","Lundi et mardi soirs","1 boîte pour 2 repas","Menus journaliers","V-28","2017-10-27"]
[null,null,null,null,null,null,null,null,null,null,null,null,null,null,"LSV09","Salade","Vendredi soir","Unité : 1 tête pour 1 repas","Menus journaliers","LV-09","2017-10-27","VWE01","Agneau","Samedi et dimanche midis","1 tranche pour 1 repas","Menus viandes week-end","V-29","2017-10-27"]
[null,null,null,null,null,null,null,null,null,null,null,null,null,null,"LSV10","Salsifis","Vendredi soir","1 boîte pour 1 repas","Menus journaliers","LV-10","2017-10-27","VWE02","Bœuf","Samedi et dimanche midis","1 tranche pour 1 repas","Menus viandes week-end","V-30","2017-10-27"]
[null,null,null,null,null,null,null,null,null,null,null,null,null,null,"LSV11","Tomates ","Vendredi soir","Unité : 2 pour 1 repas","Menus journaliers","LV-11","2017-10-27","VWE03","Cheval","Samedi et dimanche midis","1 tranche pour 1 repas","Menus viandes week-end","V-31","2017-10-27"]
[null,null,null,null,null,null,null,null,null,null,null,null,null,null,"LWES01","Pâtes à la sauce tomates","Samedi midi et soir","5 cuillères pour 1 repas","Menus journaliers","LS-01","2017-10-27","VWE04","Dinde","Samedi et dimanche midis","1 tranche pour 1 repas","Menus viandes week-end","V-32","2017-10-27"]
[null,null,null,null,null,null,null,null,null,null,null,null,null,null,"LWES02","Pâtes au beurre","Samedi midi et soir","5 cuillères pour 1 repas","Menus journaliers","LS-02","2017-10-27","VWE05","Poisson","Samedi et dimanche midis","Unité : 1 pour 1 repas","Menus viandes week-end","V-33","2017-10-27"]
[null,null,null,null,null,null,null,null,null,null,null,null,null,null,"LWES03","Pâtes au fromage râpé","Samedi midi et soir","5 cuillères pour 1 repas","Menus journaliers","LS-03","2017-10-27","VWE06","Porc","Samedi et dimanche midis","1 tranche pour 1 repas","Menus viandes week-end","V-34","2017-10-27"]
[null,null,null,null,null,null,null,null,null,null,null,null,null,null,"LWED02","Chips","Dimanche midi et soir","1 sachet pour 2 repas","Menus journaliers","LD-02","2017-10-27","VWE07","Veau","Samedi et dimanche midis","1 tranche pour 1 repas","Menus viandes week-end","V-35","2017-10-27"]
[null,null,null,null,null,null,null,null,null,null,null,null,null,null,"LWED03","Frites","Dimanche midi","20 frites pour 1 repas","Menus journaliers","LD-03","2017-10-27","VMR01","Rôti d'agneau","Lundi à vendredi midis","1 morceau de 500 grammes pour 5 repas","Menus midi retraite","VMR-01","2017-10-27"]
[null,null,null,null,null,null,null,null,null,null,null,null,null,null,"LWED04","Haricots verts","Dimanche midi et soir","1 boîte pour 2 repas","Menus journaliers","LD-04","2017-10-27","VMR02","Rôti de bœuf","Lundi à vendredi midis","1 morceau de 500 grammes pour 5 repas","Menus midi retraite","VMR-02","2017-10-27"]
[null,null,null,null,null,null,null,null,null,null,null,null,null,null,"LMR01","Asperges","Lundi à vendredi midis","1 boîte pour 1 repas","Menus midi retraite","LMR-01","2017-10-27","VMR03","Rôti de cheval","Lundi à vendredi midis","1 morceau de 500 grammes pour 5 repas","Menus midi retraite","VMR-03","2017-10-27"]
[null,null,null,null,null,null,null,null,null,null,null,null,null,null,"LMR02","Avocat","Lundi à vendredi midis","Unité : 1 pour 1 repas","Menus midi retraite","LMR-02","2017-10-27","VMR04","Rôti de porc","Lundi à vendredi midis","1 morceau de 500 grammes pour 5 repas","Menus midi retraite","VMR-04","2017-10-27"]
[null,null,null,null,null,null,null,null,null,null,null,null,null,null,"LMR03","Carottes","Lundi à vendredi midis","Unité : 2 pour 1 repas","Menus midi retraite","LMR-03","2017-10-27","VMR05","Rôti de veau","Lundi à vendredi midis","1 morceau de 500 grammes pour 5 repas","Menus midi retraite","VMR-05","2017-10-27"]
[null,null,null,null,null,null,null,null,null,null,null,null,null,null,"LMR04","Céleri","Lundi à vendredi midis","Unité : 1 branche pour 1 repas","Menus midi retraite","LMR-04","2017-10-27"]
[null,null,null,null,null,null,null,null,null,null,null,null,null,null,"LMR05","Champignons","Lundi à vendredi midis","1 boîte pour 1 repas","Menus midi retraite","LMR-05","2017-10-27"]
[null,null,null,null,null,null,null,null,null,null,null,null,null,null,"LMR06","Concombre","Lundi à vendredi midis","Unité : 1 pour 1 repas","Menus midi retraite","LMR-06","2017-10-27"]
[null,null,null,null,null,null,null,null,null,null,null,null,null,null,"LMR07","Couscous","Lundi à vendredi midis","25 grammes pour 1 repas","Menus midi retraite","LMR-07","2017-10-27"]
[null,null,null,null,null,null,null,null,null,null,null,null,null,null,"LMR08","Maïs","Lundi à vendredi midis","1 boîte pour 2 repas","Menus midi retraite","LMR-08","2017-10-27"]
[null,null,null,null,null,null,null,null,null,null,null,null,null,null,"LMR09","Pâtes à la sauce tomates","Lundi à vendredi midis","5 cuillères pour 1 repas","Menus midi retraite","LMR-09","2017-10-27"]
[null,null,null,null,null,null,null,null,null,null,null,null,null,null,"LMR10","Pâtes au beurre","Lundi à vendredi midis","5 cuillères pour 1 repas","Menus midi retraite","LMR-10","2017-10-27"]
[null,null,null,null,null,null,null,null,null,null,null,null,null,null,"LMR11","Poireau","Lundi à vendredi midis","Unité : 1 pour 1 repas","Menus midi retraite","LMR-11","2017-10-27"]
[null,null,null,null,null,null,null,null,null,null,null,null,null,null,"LMR12","Pomme de terre","Lundi à vendredi midis","Unité : 1 pour 1 repas","Menus midi retraite","LMR-12","2017-10-27"]
[null,null,null,null,null,null,null,null,null,null,null,null,null,null,"LMR13","Purée","Lundi à vendredi midis","25 grammes pour 1 repas","Menus midi retraite","LMR-13","2017-10-27"]
[null,null,null,null,null,null,null,null,null,null,null,null,null,null,"LMR14","Radis","Lundi à vendredi midis","1 botte ou 1 sachet pour 2 repas","Menus midi retraite","LMR-14","2017-10-27"]
[null,null,null,null,null,null,null,null,null,null,null,null,null,null,"LMR15","Riz","Lundi à vendredi midis","25 grammes pour 1 repas","Menus midi retraite","LMR-15","2017-10-27"]
[null,null,null,null,null,null,null,null,null,null,null,null,null,null,"LMR16","Salade","Lundi à vendredi midis","Unité : 1 tête pour 1 repas","Menus midi retraite","LMR-16","2017-10-27"]
[null,null,null,null,null,null,null,null,null,null,null,null,null,null,"LMR17","Tomates","Lundi à vendredi midis","Unité : 2 pour 1 repas","Menus midi retraite","LMR-17","2017-10-27"]

{"sheet":"Saisie des menus","index":4,"n_rows":33,"n_cols":3,"rows_kept":33,"cut":false,"hidden":false,"merged":[[0,0,0,2]]}
["Saisie des menus."]
[]
["Numéro du menu","MVWE104"]
["Date du menu","2019-12-29"]
["Code période concernée","PC12"]
["Période concernée",{"$f":"IF($B$5<>\"\",VLOOKUP($B$5,'Liste référentiels'!$AG$4:$AH$15,2,FALSE),\"\")","v":"Décembre"}]
["Code dessert"]
["Dessert",{"$f":"IF($B$7<>\"\",VLOOKUP($B$7,'Liste référentiels'!$A$4:$E$27,2,FALSE),\"\")","v":""}]
["Jour dessert",{"$f":"IF($B$7<>\"\",VLOOKUP($B$7,'Liste référentiels'!$A$4:$E$27,3,FALSE),\"\")","v":""}]
["Conditionnement dessert",{"$f":"IF($B$7<>\"\",VLOOKUP($B$7,'Liste référentiels'!$A$4:$E$27,4,FALSE),\"\")","v":""},","]
["Destination dessert",{"$f":"IF($B$7<>\"\",VLOOKUP($B$7,'Liste référentiels'!$A$4:$E$25,5,FALSE),\"\")","v":""}]
["Quantité dessert"]
["Code légume"]
["Légume",{"$f":"IF($B$13<>\"\",VLOOKUP($B$13,'Liste référentiels'!$O$4:$S$57,2,FALSE),\"\")","v":""}]
["Jour légume",{"$f":"IF($B$13<>\"\",VLOOKUP($B$13,'Liste référentiels'!$O$4:$S$57,3,FALSE),\"\")","v":""}]
["Conditionnement légume",{"$f":"IF($B$13<>\"\",VLOOKUP($B$13,'Liste référentiels'!$O$4:$S$57,4,FALSE),\"\")","v":""}]
["Destination légume",{"$f":"IF($B$13<>\"\",VLOOKUP($B$13,'Liste référentiels'!$O$4:$S$57,5,FALSE),\"\")","v":""}]
["Quantité légume"]
["Code légume deux",{"$f":"IF($B$13=\"LWED03\",\"LWED01\",\"\")","v":""}]
["Légume deux",{"$f":"IF($B$19<>\"\",VLOOKUP($B$19,'Liste référentiels'!$H$4:$M$4,2,FALSE),\"\")","v":""}]
["Jour légume deux",{"$f":"IF($B$19<>\"\",VLOOKUP($B$19,'Liste référentiels'!$H$4:$M$4,3,FALSE),\"\")","v":""}]
["Conditionnement légume deux",{"$f":"IF($B$19<>\"\",VLOOKUP($B$19,'Liste référentiels'!$H$4:$M$4,4,FALSE),\"\")","v":""}]
["Destination légume deux",{"$f":"IF($B$19<>\"\",VLOOKUP($B$19,'Liste référentiels'!$H$4:$M$4,5,FALSE),\"\")","v":""}]
["Quantité légume deux"]
["Code viande","VWE01"]
["Viande",{"$f":"IF($B$25<>\"\",VLOOKUP($B$25,'Liste référentiels'!$V$4:$Z$43,2,FALSE),\"\")","v":"Agneau"}]
["Jour viande",{"$f":"IF($B$25<>\"\",VLOOKUP($B$25,'Liste référentiels'!$V$4:$Z$43,3,FALSE),\"\")","v":"Samedi et dimanche midis"}]
["Conditionnement viande",{"$f":"IF($B$25<>\"\",VLOOKUP($B$25,'Liste référentiels'!$V$4:$Z$43,4,FALSE),\"\")","v":"1 tranche pour 1 repas"}]
["Destination viande",{"$f":"IF($B$25<>\"\",VLOOKUP($B$25,'Liste référentiels'!$V$4:$Z$43,5,FALSE),\"\")","v":"Menus viandes week-end"}]
["Quantité viande",1]
["Code observation"]
["Observation",{"$f":"IF($B$31<>\"\",VLOOKUP($B$31,'Liste référentiels'!$AC$4:$AD$16,2,FALSE),\"\")","v":""}]
["Titre","Menus viandes weekend deuxième semestre"]

{"sheet":"Menus midi retraite","index":5,"n_rows":298,"n_cols":7,"rows_kept":298,"cut":false,"hidden":false,"merged":[[249,0,249,6],[272,0,272,6],[273,0,273,6],[297,0,297,6],[198,0,198,6],[199,0,199,6],[222,0,222,6],[223,0,223,6],[248,0,248,6],[125,0,125,6],[147,0,147,6],[148,0,148,6],[173,0,173,6],[174,0,174,6],[73,0,73,6],[74,0,74,6],[98,0,98,6],[99,0,99,6],[124,0,124,6],[0,0,0,6],[25,0,25,6],[26,0,26,6],[49,0,49,6],[50,0,50,6]]}
["Menus midi retraite du mois de janvier 2019."]
["Date du menu","Légume","Viande","Dessert","Observation","Nature du menu","Numéro du menu"]
["2019-01-01","Salade","Rôti de cheval","Pomme","Jour de l'an","Menus midi retraite janvier","MMR01"]
["2019-01-02","Tomates","Rôti de cheval","Pomme",null,"Menus midi retraite janvier","MMR02"]
["2019-01-03","Asperges","Rôti de cheval","Pomme",null,"Menus midi retraite janvier","MMR03"]
["2019-01-04","Avocat","Rôti de cheval","Pomme",null,"Menus midi retraite janvier","MMR04"]
["2019-01-07","Carottes","Rôti de porc","Pomme",null,"Menus midi retraite janvier","MMR05"]
["2019-01-08","Céleri","Rôti de porc","Pomme",null,"Menus midi retraite janvier","MMR06"]
["2019-01-09","Champignons","Rôti de porc","Pomme",null,"Menus midi retraite janvier","MMR07"]
["2019-01-10","Concombre","Rôti de porc","Pomme",null,"Menus midi retraite janvier","MMR08"]
["2019-01-11","Couscous","Rôti de porc","Pomme",null,"Menus midi retraite janvier","MMR09"]
["2019-01-14","Maïs","Rôti de veau","Pomme",null,"Menus midi retraite janvier","MMR10"]
["2019-01-15","Maïs","Rôti de veau","Pomme",null,"Menus midi retraite janvier","MMR11"]
["2019-01-16","Pâtes à la sauce tomates","Rôti de veau","Pomme",null,"Menus midi retraite janvier","MMR12"]
["2019-01-17","Pâtes au beurre","Rôti de veau","Pomme",null,"Menus midi retraite janvier","MMR13"]
["2019-01-18","Poireau","Rôti de veau","Pomme",null,"Menus midi retraite janvier","MMR14"]
["2019-01-21","Pomme de terre","Rôti d'agneau","Pomme",null,"Menus midi retraite janvier","MMR15"]
["2019-01-22","Purée","Rôti d'agneau","Pomme",null,"Menus midi retraite janvier","MMR16"]
["2019-01-23","Radis","Rôti d'agneau","Pomme",null,"Menus midi retraite janvier","MMR17"]
["2019-01-24","Radis","Rôti d'agneau","Pomme",null,"Menus midi retraite janvier","MMR18"]
["2019-01-25","Riz","Rôti d'agneau","Pomme",null,"Menus midi retraite janvier","MMR19"]
["2019-01-28","Salade","Rôti de bœuf","Pomme",null,"Menus midi retraite janvier","MMR20"]
["2019-01-29","Tomates","Rôti de bœuf","Pomme",null,"Menus midi retraite janvier","MMR21"]
["2019-01-30","Asperges","Rôti de bœuf","Pomme",null,"Menus midi retraite janvier","MMR22"]
["2019-01-31","Avocat","Rôti de bœuf","Pomme",null,"Menus midi retraite janvier","MMR23"]
["Fait à Limeil-Brévannes, le mercredi 09 janvier  2019."]
["Menus midi retraite du mois de février 2019."]
["Date du menu","Légume","Viande","Dessert","Observation","Nature du menu","Numéro du menu"]
["2019-02-01","Carottes","Rôti de bœuf","Pomme",null,"Menus midi retraite février","MMR24"]
["2019-02-04","Céleri","Rôti de cheval","Pomme",null,"Menus midi retraite février","MMR25"]
["2019-02-05","Champignons","Rôti de cheval","Pomme",null,"Menus midi retraite février","MMR26"]
["2019-02-06","Concombre","Rôti de cheval","Pomme",null,"Menus midi retraite février","MMR27"]
["2019-02-07","Couscous","Rôti de cheval","Pomme",null,"Menus midi retraite février","MMR28"]
["2019-02-08","Maïs","Rôti de cheval","Pomme",null,"Menus midi retraite février","MMR29"]
["2019-02-11","Maïs","Rôti de porc","Pomme",null,"Menus midi retraite février","MMR30"]
["2019-02-12","Pâtes à la sauce tomates","Rôti de porc","Pomme",null,"Menus midi retraite février","MMR31"]
["2019-02-13","Pâtes au beurre","Rôti de porc","Pomme",null,"Menus midi retraite février","MMR32"]
["2019-02-14","Poireau","Rôti de porc","Pomme",null,"Menus midi retraite février","MMR33"]
["2019-02-15","Pomme de terre","Rôti de porc","Pomme",null,"Menus midi retraite février","MMR34"]
["2019-02-18","Purée","Rôti de veau","Pomme",null,"Menus midi retraite février","MMR35"]
["2019-02-19","Radis","Rôti de veau","Pomme",null,"Menus midi retraite février","MMR36"]
["2019-02-20","Radis","Rôti de veau","Pomme",null,"Menus midi retraite février","MMR37"]
["2019-02-21","Riz","Rôti de veau","Pomme",null,"Menus midi retraite février","MMR38"]
["2019-02-22","Salade","Rôti de veau","Pomme",null,"Menus midi retraite février","MMR39"]
["2019-02-25","Tomates","Rôti d'agneau","Pomme",null,"Menus midi retraite février","MMR40"]
["2019-02-26","Asperges","Rôti d'agneau","Pomme",null,"Menus midi retraite février","MMR41"]
["2019-02-27","Avocat","Rôti d'agneau","Pomme",null,"Menus midi retraite février","MMR42"]
["2019-02-28","Carottes","Rôti d'agneau","Pomme",null,"Menus midi retraite février","MMR43"]
["29/02/2017"]
["Fait à Limeil-Brévannes, le mercredi 09 janvier  2019."]
["Menus midi retraite du mois de mars 2019."]
["Date du menu","Légume","Viande","Dessert","Observation","Nature du menu","Numéro du menu"]
["2019-03-01","Céleri","Rôti d'agneau","Pomme",null,"Menus midi retraite mars","MMR44"]
["2019-03-04","Champignons","Rôti de bœuf","Pomme",null,"Menus midi retraite mars","MMR45"]
["2019-03-05","Concombre","Rôti de bœuf","Pomme",null,"Menus midi retraite mars","MMR46"]
["2019-03-06","Couscous","Rôti de bœuf","Pomme",null,"Menus midi retraite mars","MMR47"]
["2019-03-07","Maïs","Rôti de bœuf","Pomme",null,"Menus midi retraite mars","MMR48"]
["2019-03-08","Maïs","Rôti de bœuf","Pomme",null,"Menus midi retraite mars","MMR49"]
["2019-03-11","Pâtes à la sauce tomates","Rôti de cheval","Pomme",null,"Menus midi retraite mars","MMR50"]
["2019-03-12","Pâtes au beurre","Rôti de cheval","Pomme",null,"Menus midi retraite mars","MMR51"]
["2019-03-13","Poireau","Rôti de cheval","Pomme",null,"Menus midi retraite mars","MMR52"]
["2019-03-14","Pomme de terre","Rôti de cheval","Pomme",null,"Menus midi retraite mars","MMR53"]
["2019-03-15","Purée","Rôti de cheval","Pomme",null,"Menus midi retraite mars","MMR54"]
["2019-03-18","Radis","Rôti de porc","Pomme",null,"Menus midi retraite mars","MMR55"]
["2019-03-19","Radis","Rôti de porc","Pomme",null,"Menus midi retraite mars","MMR56"]
["2019-03-20","Riz","Rôti de porc","Pomme",null,"Menus midi retraite mars","MMR57"]
["2019-03-21","Salade","Rôti de porc","Pomme",null,"Menus midi retraite mars","MMR58"]
["2019-03-22","Tomates","Rôti de porc","Pomme",null,"Menus midi retraite mars","MMR59"]
["2019-03-25","Asperges","Rôti de veau","Pomme",null,"Menus midi retraite mars","MMR60"]
["2019-03-26","Avocat","Rôti de veau","Pomme",null,"Menus midi retraite mars","MMR61"]
["2019-03-27","Carottes","Rôti de veau","Pomme",null,"Menus midi retraite mars","MMR62"]
["2019-03-28","Céleri","Rôti de veau","Pomme",null,"Menus midi retraite mars","MMR63"]
["2019-03-29","Champignons","Rôti de veau","Pomme",null,"Menus midi retraite mars","MMR64"]
["Fait à Limeil-Brévannes, le vendredi 11 janvier 2019."]
["Menus midi retraite du mois d'avril 2019."]
["Date du menu","Légume","Viande","Dessert","Observation","Nature du menu","Numéro du menu"]
["2019-04-01","Concombre","Rôti d'agneau","Pomme",null,"Menus midi retraite avril","MMR65"]
["2019-04-02","Couscous","Rôti d'agneau","Pomme",null,"Menus midi retraite avril","MMR66"]
["2019-04-03","Maïs","Rôti d'agneau","Pomme",null,"Menus midi retraite avril","MMR67"]
["2019-04-04","Maïs","Rôti d'agneau","Pomme",null,"Menus midi retraite avril","MMR68"]
["2019-04-05","Pâtes à la sauce tomates","Rôti d'agneau","Pomme",null,"Menus midi retraite avril","MMR69"]
["2019-04-08","Pâtes au beurre","Rôti de bœuf","Pomme",null,"Menus midi retraite avril","MMR70"]
["2019-04-09","Poireau","Rôti de bœuf","Pomme",null,"Menus midi retraite avril","MMR71"]
["2019-04-10","Pomme de terre","Rôti de bœuf","Pomme",null,"Menus midi retraite avril","MMR72"]
["2019-04-11","Purée","Rôti de bœuf","Pomme",null,"Menus midi retraite avril","MMR73"]
["2019-04-12","Radis","Rôti de bœuf","Pomme",null,"Menus midi retraite avril","MMR74"]
["2019-04-15","Radis","Rôti de cheval","Pomme",null,"Menus midi retraite avril","MMR75"]
["2019-04-16","Riz","Rôti de cheval","Pomme",null,"Menus midi retraite avril","MMR76"]
["2019-04-17","Salade","Rôti de cheval","Pomme",null,"Menus midi retraite avril","MMR77"]
["2019-04-18","Tomates","Rôti de cheval","Pomme",null,"Menus midi retraite avril","MMR78"]
["2019-04-19","Asperges","Rôti de cheval","Pomme",null,"Menus midi retraite avril","MMR79"]
["2019-04-22","Avocat","Rôti de porc","Pomme",null,"Menus midi retraite avril","MMR80"]
["2019-04-23","Carottes","Rôti de porc","Pomme",null,"Menus midi retraite avril","MMR81"]
["2019-04-24","Céleri","Rôti de porc","Pomme",null,"Menus midi retraite avril","MMR82"]
["2019-04-25","Champignons","Rôti de porc","Pomme",null,"Menus midi retraite avril","MMR83"]
["2019-04-26","Concombre","Rôti de porc","Pomme",null,"Menus midi retraite avril","MMR84"]
["2019-04-29","Couscous","Rôti de veau","Pomme",null,"Menus midi retraite avril","MMR85"]
["2019-04-30","Maïs","Rôti de veau","Pomme",null,"Menus midi retraite avril","MMR86"]
["Fait à Limeil-Brévannes, le vendredi 11 janvier 2019."]
["Menus midi retraite du mois de mai 2019."]
["Date du menu","Légume","Viande","Dessert","Observation","Nature du menu","Numéro du menu"]
["2019-05-01","Maïs","Rôti de veau","Pomme","Fête du travail","Menus midi retraite mai","MMR87"]
["2019-05-02","Pâtes à la sauce tomates","Rôti de veau","Pomme",null,"Menus midi retraite mai","MMR88"]
["2019-05-03","Pâtes au beurre","Rôti de veau","Pomme",null,"Menus midi retraite mai","MMR89"]
["2019-05-06","Poireau","Rôti d'agneau","Pomme",null,"Menus midi retraite mai","MMR90"]
["2019-05-07","Pomme de terre","Rôti d'agneau","Pomme",null,"Menus midi retraite mai","MMR91"]
["2019-05-08","Purée","Rôti d'agneau","Pomme","Victoire du 08 mai 1945","Menus midi retraite mai","MMR92"]
["2019-05-09","Radis","Rôti d'agneau","Pomme",null,"Menus midi retraite mai","MMR93"]
["2019-05-10","Radis","Rôti d'agneau","Pomme",null,"Menus midi retraite mai","MMR94"]
["2019-05-13","Riz","Rôti de bœuf","Pomme",null,"Menus midi retraite mai","MMR95"]
["2019-05-14","Salade","Rôti de bœuf","Pomme",null,"Menus midi retraite mai","MMR96"]
["2019-05-15","Tomates","Rôti de bœuf","Pomme",null,"Menus midi retraite mai","MMR97"]
["2019-05-16","Asperges","Rôti de bœuf","Pomme",null,"Menus midi retraite mai","MMR98"]
["2019-05-17","Avocat","Rôti de bœuf","Pomme",null,"Menus midi retraite mai","MMR99"]
["2019-05-20","Carottes","Rôti de cheval","Pomme",null,"Menus midi retraite mai","MMR100"]
["2019-05-21","Céleri","Rôti de cheval","Pomme",null,"Menus midi retraite mai","MMR101"]
["2019-05-22","Champignons","Rôti de cheval","Pomme",null,"Menus midi retraite mai","MMR102"]
["2019-05-23","Concombre","Rôti de cheval","Pomme",null,"Menus midi retraite mai","MMR103"]
["2019-05-24","Couscous","Rôti de cheval","Pomme",null,"Menus midi retraite mai","MMR104"]
["2019-05-27","Maïs","Rôti de porc","Pomme",null,"Menus midi retraite mai","MMR105"]
["2019-05-28","Maïs","Rôti de porc","Pomme",null,"Menus midi retraite mai","MMR106"]
["2019-05-29","Pâtes à la sauce tomates","Rôti de porc","Pomme",null,"Menus midi retraite mai","MMR107"]
["2019-05-30","Pâtes au beurre","Rôti de porc","Pomme","Ascension","Menus midi retraite mai","MMR108"]
["2019-05-31","Poireau","Rôti de porc","Pomme",null,"Menus midi retraite mai","MMR109"]
["Fait à Limeil-Brévannes, le vendredi 11 janvier 2019."]
["Menus midi retraite du mois de juin 2019."]
["Date du menu","Légume","Viande","Dessert","Observation","Nature du menu","Numéro du menu"]
["2019-06-03","Pomme de terre","Rôti de veau","Pomme",null,"Menus midi retraite juin","MMR110"]
["2019-06-04","Purée","Rôti de veau","Pomme",null,"Menus midi retraite juin","MMR111"]
["2019-06-05","Radis","Rôti de veau","Pomme",null,"Menus midi retraite juin","MMR112"]
["2019-06-06","Radis","Rôti de veau","Pomme",null,"Menus midi retraite juin","MMR113"]
["2019-06-07","Riz","Rôti de veau","Pomme",null,"Menus midi retraite juin","MMR114"]
["2019-06-10","Salade","Rôti d'agneau","Pomme","Lundi de Pentecôte","Menus midi retraite juin","MMR115"]
["2019-06-11","Tomates","Rôti d'agneau","Pomme",null,"Menus midi retraite juin","MMR116"]
["2019-06-12","Asperges","Rôti d'agneau","Pomme",null,"Menus midi retraite juin","MMR117"]
["2019-06-13","Avocat","Rôti d'agneau","Pomme",null,"Menus midi retraite juin","MMR118"]
["2019-06-14","Carottes","Rôti d'agneau","Pomme",null,"Menus midi retraite juin","MMR119"]
["2019-06-17","Céleri","Rôti de bœuf","Pomme",null,"Menus midi retraite juin","MMR120"]
["2019-06-18","Champignons","Rôti de bœuf","Pomme",null,"Menus midi retraite juin","MMR121"]
["2019-06-19","Concombre","Rôti de bœuf","Pomme",null,"Menus midi retraite juin","MMR122"]
["2019-06-20","Couscous","Rôti de bœuf","Pomme",null,"Menus midi retraite juin","MMR123"]
["2019-06-21","Maïs","Rôti de bœuf","Pomme",null,"Menus midi retraite juin","MMR124"]
["2019-06-24","Maïs","Rôti de cheval","Pomme",null,"Menus midi retraite juin","MMR125"]
["2019-06-25","Pâtes à la sauce tomates","Rôti de cheval","Pomme",null,"Menus midi retraite juin","MMR126"]
["2019-06-26","Pâtes au beurre","Rôti de cheval","Pomme",null,"Menus midi retraite juin","MMR127"]
["2019-06-27","Poireau","Rôti de cheval","Pomme",null,"Menus midi retraite juin","MMR128"]
["2019-06-28","Pomme de terre","Rôti de cheval","Pomme",null,"Menus midi retraite juin","MMR129"]
["Fait à Limeil-Brévannes, le vendredi11 janvier 2019."]
["Menus midi retraite du mois de juillet 2019."]
["Date du menu","Légume","Viande","Dessert","Observation","Nature du menu","Numéro du menu"]
["2019-07-01","Purée","Rôti de porc","Pomme",null,"Menus midi retraite juillet","MMR130"]
["2019-07-02","Radis","Rôti de porc","Pomme",null,"Menus midi retraite juillet","MMR131"]
["2019-07-03","Radis","Rôti de porc","Pomme",null,"Menus midi retraite juillet","MMR132"]
["2019-07-04","Riz","Rôti de porc","Pomme",null,"Menus midi retraite juillet","MMR133"]
["2019-07-05","Salade","Rôti de porc","Pomme",null,"Menus midi retraite juillet","MMR134"]
["2019-07-08","Tomates","Rôti de veau","Pomme",null,"Menus midi retraite juillet","MMR135"]
["2019-07-09","Asperges","Rôti de veau","Pomme",null,"Menus midi retraite juillet","MMR136"]
["2019-07-10","Avocat","Rôti de veau","Pomme",null,"Menus midi retraite juillet","MMR137"]
["2019-07-11","Carottes","Rôti de veau","Pomme",null,"Menus midi retraite juillet","MMR138"]
["2019-07-12","Céleri","Rôti de veau","Pomme",null,"Menus midi retraite juillet","MMR139"]
["2019-07-15","Champignons","Rôti d'agneau","Pomme",null,"Menus midi retraite juillet","MMR140"]
["2019-07-16","Concombre","Rôti d'agneau","Pomme",null,"Menus midi retraite juillet","MMR141"]
["2019-07-17","Couscous","Rôti d'agneau","Pomme",null,"Menus midi retraite juillet","MMR142"]
["2019-07-18","Maïs","Rôti d'agneau","Pomme",null,"Menus midi retraite juillet","MMR143"]
["2019-07-19","Maïs","Rôti d'agneau","Pomme",null,"Menus midi retraite juillet","MMR144"]
["2019-07-22","Pâtes à la sauce tomates","Rôti de bœuf","Pomme",null,"Menus midi retraite juillet","MMR145"]
["2019-07-23","Pâtes au beurre","Rôti de bœuf","Pomme",null,"Menus midi retraite juillet","MMR146"]
["2019-07-24","Poireau","Rôti de bœuf","Pomme",null,"Menus midi retraite juillet","MMR147"]
["2019-07-25","Pomme de terre","Rôti de bœuf","Pomme",null,"Menus midi retraite juillet","MMR148"]
["2019-07-26","Purée","Rôti de bœuf","Pomme",null,"Menus midi retraite juillet","MMR149"]
["2019-07-29","Radis","Rôti de cheval","Pomme",null,"Menus midi retraite juillet","MMR150"]
["2019-07-30","Radis","Rôti de cheval","Pomme",null,"Menus midi retraite juillet","MMR151"]
["2019-07-31","Riz","Rôti de cheval","Pomme",null,"Menus midi retraite juillet","MMR152"]
["Fait à Limeil-Brévannes, le dimanche 13 janvier 2019."]
["Menus midi retraite du mois d'août 2019."]
["Date du menu","Légume","Viande","Dessert","Observation","Nature du menu","Numéro du menu"]
["2019-08-01","Salade","Rôti de cheval","Pomme",null,"Menus midi retraite août","MMR153"]
["2019-08-02","Tomates","Rôti de cheval","Pomme",null,"Menus midi retraite août","MMR154"]
["2019-08-05","Asperges","Rôti de porc","Pomme",null,"Menus midi retraite août","MMR155"]
["2019-08-06","Avocat","Rôti de porc","Pomme",null,"Menus midi retraite août","MMR156"]
["2019-08-07","Carottes","Rôti de porc","Pomme",null,"Menus midi retraite août","MMR157"]
["2019-08-08","Céleri","Rôti de porc","Pomme",null,"Menus midi retraite août","MMR158"]
["2019-08-09","Champignons","Rôti de porc","Pomme",null,"Menus midi retraite août","MMR159"]
["2019-08-12","Concombre","Rôti de veau","Pomme",null,"Menus midi retraite août","MMR160"]
["2019-08-13","Couscous","Rôti de veau","Pomme",null,"Menus midi retraite août","MMR161"]
["2019-08-14","Maïs","Rôti de veau","Pomme",null,"Menus midi retraite août","MMR162"]
["2019-08-15","Maïs","Rôti de veau","Pomme","Assomption","Menus midi retraite août","MMR163"]
["2019-08-16","Pâtes à la sauce tomates","Rôti de veau","Pomme",null,"Menus midi retraite août","MMR164"]
["2019-08-19","Pâtes au beurre","Rôti d'agneau","Pomme",null,"Menus midi retraite août","MMR165"]
["2019-08-20","Poireau","Rôti d'agneau","Pomme",null,"Menus midi retraite août","MMR166"]
["2019-08-21","Pomme de terre","Rôti d'agneau","Pomme",null,"Menus midi retraite août","MMR167"]
["2019-08-22","Purée","Rôti d'agneau","Pomme",null,"Menus midi retraite août","MMR168"]
["2019-08-23","Radis","Rôti d'agneau","Pomme",null,"Menus midi retraite août","MMR169"]
["2019-08-26","Radis","Rôti de bœuf","Pomme",null,"Menus midi retraite août","MMR170"]
["2019-08-27","Riz","Rôti de bœuf","Pomme",null,"Menus midi retraite août","MMR171"]
["2019-08-28","Salade","Rôti de bœuf","Pomme",null,"Menus midi retraite août","MMR172"]
["2019-08-29","Tomates","Rôti de bœuf","Pomme",null,"Menus midi retraite août","MMR173"]
["2019-08-30","Asperges","Rôti de bœuf","Pomme",null,"Menus midi retraite août","MMR174"]
["Fait à Limeil-Brévannes, le lundi 14 janvier 2019."]
["Menus midi retraite du mois de septembre 2019."]
["Date du menu","Légume","Viande","Dessert","Observation","Nature du menu","Numéro du menu"]
["2019-09-02","Avocat","Rôti de cheval","Pomme",null,"Menus midi retraite septembre","MMR175"]
["2019-09-03","Carottes","Rôti de cheval","Pomme",null,"Menus midi retraite septembre","MMR176"]
["2019-09-04","Céleri","Rôti de cheval","Pomme",null,"Menus midi retraite septembre","MMR177"]
["2019-09-05","Champignons","Rôti de cheval","Pomme",null,"Menus midi retraite septembre","MMR178"]
["2019-09-06","Concombre","Rôti de cheval","Pomme",null,"Menus midi retraite septembre","MMR179"]
["2019-09-09","Couscous","Rôti de porc","Pomme",null,"Menus midi retraite septembre","MMR180"]
["2019-09-10","Maïs","Rôti de porc","Pomme",null,"Menus midi retraite septembre","MMR181"]
["2019-09-11","Maïs","Rôti de porc","Pomme",null,"Menus midi retraite septembre","MMR182"]
["2019-09-12","Pâtes à la sauce tomates","Rôti de porc","Pomme",null,"Menus midi retraite septembre","MMR183"]
["2019-09-13","Pâtes au beurre","Rôti de porc","Pomme",null,"Menus midi retraite septembre","MMR184"]
["2019-09-16","Poireau","Rôti de veau","Pomme",null,"Menus midi retraite septembre","MMR185"]
["2019-09-17","Pomme de terre","Rôti de veau","Pomme",null,"Menus midi retraite septembre","MMR186"]
["2019-09-18","Purée","Rôti de veau","Pomme",null,"Menus midi retraite septembre","MMR187"]
["2019-09-19","Radis","Rôti de veau","Pomme",null,"Menus midi retraite septembre","MMR188"]
["2019-09-20","Radis","Rôti de veau","Pomme",null,"Menus midi retraite septembre","MMR189"]
["2019-09-23","Riz","Rôti d'agneau","Pomme",null,"Menus midi retraite septembre","MMR190"]
["2019-09-24","Salade","Rôti d'agneau","Pomme",null,"Menus midi retraite septembre","MMR191"]
["2019-09-25","Tomates","Rôti d'agneau","Pomme",null,"Menus midi retraite septembre","MMR192"]
["2019-09-26","Asperges","Rôti d'agneau","Pomme",null,"Menus midi retraite septembre","MMR193"]
["2019-09-27","Avocat","Rôti d'agneau","Pomme",null,"Menus midi retraite septembre","MMR194"]
["2019-09-30","Carottes","Rôti de bœuf","Pomme",null,"Menus midi retraite septembre","MMR195"]
["Fait à Limeil-Brévannes, le lundi 14 janvier 2019."]
["Menus midi retraite du mois d'octobre 2019."]
["Date du menu","Légume","Viande","Dessert","Observation","Nature du menu","Numéro du menu"]
["2019-10-01","Céleri","Rôti de bœuf","Pomme",null,"Menus midi retraite octobre","MMR196"]
["2019-10-02","Champignons","Rôti de bœuf","Pomme",null,"Menus midi retraite octobre","MMR197"]
["2019-10-03","Concombre","Rôti de bœuf","Pomme",null,"Menus midi retraite octobre","MMR198"]
["2019-10-04","Couscous","Rôti de bœuf","Pomme",null,"Menus midi retraite octobre","MMR199"]
["2019-10-07","Maïs","Rôti de cheval","Pomme",null,"Menus midi retraite octobre","MMR200"]
["2019-10-08","Maïs","Rôti de cheval","Pomme",null,"Menus midi retraite octobre","MMR201"]
["2019-10-09","Pâtes à la sauce tomates","Rôti de cheval","Pomme",null,"Menus midi retraite octobre","MMR202"]
["2019-10-10","Pâtes au beurre","Rôti de cheval","Pomme",null,"Menus midi retraite octobre","MMR203"]
["2019-10-11","Poireau","Rôti de cheval","Pomme",null,"Menus midi retraite octobre","MMR204"]
["2019-10-14","Pomme de terre","Rôti de porc","Pomme",null,"Menus midi retraite octobre","MMR205"]
["2019-10-15","Purée","Rôti de porc","Pomme",null,"Menus midi retraite octobre","MMR206"]
["2019-10-16","Radis","Rôti de porc","Pomme",null,"Menus midi retraite octobre","MMR207"]
["2019-10-17","Radis","Rôti de porc","Pomme",null,"Menus midi retraite octobre","MMR208"]
["2019-10-18","Riz","Rôti de porc","Pomme",null,"Menus midi retraite octobre","MMR209"]
["2019-10-21","Salade","Rôti de veau","Pomme",null,"Menus midi retraite octobre","MMR210"]
["2019-10-22","Tomates","Rôti de veau","Pomme",null,"Menus midi retraite octobre","MMR211"]
["2019-10-23","Asperges","Rôti de veau","Pomme",null,"Menus midi retraite octobre","MMR212"]
["2019-10-24","Avocat","Rôti de veau","Pomme",null,"Menus midi retraite octobre","MMR213"]
["2019-10-25","Carottes","Rôti de veau","Pomme",null,"Menus midi retraite octobre","MMR214"]
["2019-10-28","Céleri","Rôti d'agneau","Pomme",null,"Menus midi retraite octobre","MMR215"]
["2019-10-29","Champignons","Rôti d'agneau","Pomme",null,"Menus midi retraite octobre","MMR216"]
["2019-10-30","Concombre","Rôti d'agneau","Pomme",null,"Menus midi retraite octobre","MMR217"]
["2019-10-31","Couscous","Rôti d'agneau","Pomme",null,"Menus midi retraite octobre","MMR218"]
["Fait à Limeil-Brévannes, le lundi 14 janvier 2019."]
["Menus midi retraite du mois de novembre 2019."]
["Date du menu","Légume","Viande","Dessert","Observation","Nature du menu","Numéro du menu"]
["2019-11-01","Maïs","Rôti d'agneau","Pomme","Toussaint","Menus midi retraite novembre","MMR219"]
["2019-11-04","Maïs","Rôti de bœuf","Pomme",null,"Menus midi retraite novembre","MMR220"]
["2019-11-05","Pâtes à la sauce tomates","Rôti de bœuf","Pomme",null,"Menus midi retraite novembre","MMR221"]
["2019-11-06","Pâtes au beurre","Rôti de bœuf","Pomme",null,"Menus midi retraite novembre","MMR222"]
["2019-11-07","Poireau","Rôti de bœuf","Pomme",null,"Menus midi retraite novembre","MMR223"]
["2019-11-08","Pomme de terre","Rôti de bœuf","Pomme",null,"Menus midi retraite novembre","MMR224"]
["2019-11-11","Purée","Rôti de cheval","Pomme","Armistice du 11 novembre 1918","Menus midi retraite novembre","MMR225"]
["2019-11-12","Radis","Rôti de cheval","Pomme",null,"Menus midi retraite novembre","MMR226"]
["2019-11-13","Radis","Rôti de cheval","Pomme",null,"Menus midi retraite novembre","MMR227"]
["2019-11-14","Riz","Rôti de cheval","Pomme",null,"Menus midi retraite novembre","MMR228"]
["2019-11-15","Salade","Rôti de cheval","Pomme",null,"Menus midi retraite novembre","MMR229"]
["2019-11-18","Tomates","Rôti de porc","Pomme",null,"Menus midi retraite novembre","MMR230"]
["2019-11-19","Asperges","Rôti de porc","Pomme",null,"Menus midi retraite novembre","MMR231"]
["2019-11-20","Avocat","Rôti de porc","Pomme",null,"Menus midi retraite novembre","MMR232"]
["2019-11-21","Carottes","Rôti de porc","Pomme",null,"Menus midi retraite novembre","MMR233"]
["2019-11-22","Céleri","Rôti de porc","Pomme",null,"Menus midi retraite novembre","MMR234"]
["2019-11-25","Champignons","Rôti de veau","Pomme",null,"Menus midi retraite novembre","MMR235"]
["2019-11-26","Concombre","Rôti de veau","Pomme",null,"Menus midi retraite novembre","MMR236"]
["2019-11-27","Couscous","Rôti de veau","Pomme",null,"Menus midi retraite novembre","MMR237"]
["2019-11-28","Maïs","Rôti de veau","Pomme",null,"Menus midi retraite novembre","MMR238"]
["2019-11-29","Maïs","Rôti de veau","Pomme",null,"Menus midi retraite novembre","MMR239"]
["Fait à Limeil-Brévannes, le lundi 14 janvier 2019."]
["Menus midi retraite du mois de décembre 2019."]
["Date du menu","Légume","Viande","Dessert","Observation","Nature du menu","Numéro du menu"]
["2019-12-02","Pâtes à la sauce tomates","Rôti d'agneau","Pomme",null,"Menus midi retraite décembre","MMR240"]
["2019-12-03","Pâtes au beurre","Rôti d'agneau","Pomme",null,"Menus midi retraite décembre","MMR241"]
["2019-12-04","Poireau","Rôti d'agneau","Pomme",null,"Menus midi retraite décembre","MMR242"]
["2019-12-05","Pomme de terre","Rôti d'agneau","Pomme",null,"Menus midi retraite décembre","MMR243"]
["2019-12-06","Purée","Rôti d'agneau","Pomme",null,"Menus midi retraite décembre","MMR244"]
["2019-12-09","Radis","Rôti de bœuf","Pomme",null,"Menus midi retraite décembre","MMR245"]
["2019-12-10","Radis","Rôti de bœuf","Pomme",null,"Menus midi retraite décembre","MMR246"]
["2019-12-11","Riz","Rôti de bœuf","Pomme",null,"Menus midi retraite décembre","MMR247"]
["2019-12-12","Salade","Rôti de bœuf","Pomme",null,"Menus midi retraite décembre","MMR248"]
["2019-12-13","Tomates","Rôti de bœuf","Pomme",null,"Menus midi retraite décembre","MMR249"]
["2019-12-16","Asperges","Rôti de cheval","Pomme",null,"Menus midi retraite décembre","MMR250"]
["2019-12-17","Avocat","Rôti de cheval","Pomme",null,"Menus midi retraite décembre","MMR251"]
["2019-12-18","Carottes","Rôti de cheval","Pomme",null,"Menus midi retraite décembre","MMR252"]
["2019-12-19","Céleri","Rôti de cheval","Pomme",null,"Menus midi retraite décembre","MMR253"]
["2019-12-20","Champignons","Rôti de cheval","Pomme",null,"Menus midi retraite décembre","MMR254"]
["2019-12-23","Concombre","Rôti de porc","Pomme",null,"Menus midi retraite décembre","MMR255"]
["2019-12-24","Couscous","Rôti de porc","Pomme",null,"Menus midi retraite décembre","MMR256"]
["2019-12-25","Maïs","Rôti de porc","Pomme","Noël","Menus midi retraite décembre","MMR257"]
["2019-12-26","Maïs","Rôti de porc","Pomme",null,"Menus midi retraite décembre","MMR258"]
["2019-12-27","Pâtes à la sauce tomates","Rôti de porc","Pomme",null,"Menus midi retraite décembre","MMR259"]
["2019-12-30","Pâtes au beurre","Rôti de veau","Pomme",null,"Menus midi retraite décembre","MMR260"]
["2019-12-31","Poireau","Rôti de veau","Pomme",null,"Menus midi retraite décembre","MMR261"]
["Fait à Limeil-Brévannes, le lundi14 janvier 2019."]

{"sheet":"Menus journaliers","index":6,"n_rows":404,"n_cols":8,"rows_kept":404,"cut":false,"hidden":false,"merged":[[0,0,0,7],[35,0,35,7],[36,0,36,7],[67,0,67,7],[68,0,68,7],[101,0,101,7],[102,0,102,7],[134,0,134,7],[135,0,135,7],[168,0,168,7],[169,0,169,7],[201,0,201,7],[202,0,202,7],[235,0,235,7],[236,0,236,7],[369,0,369,7],[370,0,370,7],[403,0,403,7],[269,0,269,7],[270,0,270,7],[303,0,303,7],[337,0,337,7],[302,0,302,7],[336,0,336,7]]}
["Menus journaliers du mois de janvier 2019."]
[]
["Date du menu","Légume","Légume deux","Viande","Dessert","Observation","Nature du menu","Numéro du menu"]
["2019-01-01","Riz",null,"Saucisson","Pomme","Jour de l'an","Menus journaliers janvier","MJ01"]
["2019-01-02","Raviolis",null,"Pizza","Pomme",null,"Menus journaliers janvier","MJ02"]
["2019-01-03","Raviolis",null,"Saucisson","Pomme",null,"Menus journaliers janvier","MJ03"]
["2019-01-04","Carottes",null,"Poisson","Pomme",null,"Menus journaliers janvier","MJ04"]
["2019-01-05","Pâtes à la sauce tomates",null,"Saucisson","Oranges",null,"Menus journaliers janvier","MJ05"]
["2019-01-06","Haricots verts",null,"Quiche lorraine","Oranges",null,"Menus journaliers janvier","MJ06"]
["2019-01-07","Cassoulet",null,"Viande cassoulet","Pomme",null,"Menus journaliers janvier","MJ07"]
["2019-01-08","Cassoulet",null,"Viande cassoulet","Pomme",null,"Menus journaliers janvier","MJ08"]
["2019-01-09","Tomates pelées",null,"Saucisson","Pomme",null,"Menus journaliers janvier","MJ09"]
["2019-01-10","Tomates pelées",null,"Quiche lorraine","Pomme",null,"Menus journaliers janvier","MJ10"]
["2019-01-11","Céleri",null,"Saucisson","Pomme",null,"Menus journaliers janvier","MJ11"]
["2019-01-12","Pâtes au beurre",null,"Roulade à la pistache","Petits suisses",null,"Menus journaliers janvier","MJ12"]
["2019-01-13","Chips",null,"Saucisson","Petits suisses",null,"Menus journaliers janvier","MJ13"]
["2019-01-14","Choucroute",null,"Viande choucroute","Pomme",null,"Menus journaliers janvier","MJ14"]
["2019-01-15","Choucroute",null,"Viande choucroute","Pomme",null,"Menus journaliers janvier","MJ15"]
["2019-01-16","Macédoine de légumes",null,"Roulade à la pistache","Pomme",null,"Menus journaliers janvier","MJ16"]
["2019-01-17","Macédoine de légumes",null,"Saucisson","Pomme",null,"Menus journaliers janvier","MJ17"]
["2019-01-18","Champignons",null,"Roulé au fromage","Pomme",null,"Menus journaliers janvier","MJ18"]
["2019-01-19","Pâtes au fromage râpé",null,"Saucisson","Pruneaux",null,"Menus journaliers janvier","MJ19"]
["2019-01-20","Frites","Asperges","Roulé au fromage","Pruneaux",null,"Menus journaliers janvier","MJ20"]
["2019-01-21","Chou-fleur",null,"Saucisson","Pomme",null,"Menus journaliers janvier","MJ21"]
["2019-01-22","Chou-fleur",null,"Salami","Pomme",null,"Menus journaliers janvier","MJ22"]
["2019-01-23","Petits pois",null,"Saucisson","Pomme",null,"Menus journaliers janvier","MJ23"]
["2019-01-24","Petits pois",null,"Salami","Pomme",null,"Menus journaliers janvier","MJ24"]
["2019-01-25","Concombre",null,"Saucisson","Pomme",null,"Menus journaliers janvier","MJ25"]
["2019-01-26","Pâtes à la sauce tomates",null,"Saucisses","Gâteau de riz",null,"Menus journaliers janvier","MJ26"]
["2019-01-27","Haricots verts",null,"Saucisson","Gâteau de riz",null,"Menus journaliers janvier","MJ27"]
["2019-01-28","Choux de Bruxelles",null,"Saucisses","Pomme",null,"Menus journaliers janvier","MJ28"]
["2019-01-29","Choux de Bruxelles",null,"Saucisson","Pomme",null,"Menus journaliers janvier","MJ29"]
["2019-01-30","Petits pois et jeunes carottes",null,"Tête persillée","Pomme",null,"Menus journaliers janvier","MJ30"]
["2019-01-31","Petits pois et jeunes carottes",null,"Saucisson","Pomme",null,"Menus journaliers janvier","MJ31"]
[]
["Fait à Limeil-Brévannes, le mercredi 16 janvier 2019."]
["Menus journaliers du mois de février 2019."]
["Date du menu","Légume","Légume deux","Viande","Dessert","Observation","Nature du menu","Numéro du menu"]
["2019-02-01","Radis",null,"Tête persillée","Pomme",null,"Menus journaliers février","MJ32"]
["2019-02-02","Pâtes au beurre",null,"Saucisson","Tapioca",null,"Menus journaliers février","MJ33"]
["2019-02-03","Chips",null,"Tête roulée","Tapioca",null,"Menus journaliers février","MJ34"]
["2019-02-04","Couscous",null,"Saucisson","Pomme",null,"Menus journaliers février","MJ35"]
["2019-02-05","Couscous",null,"Tête roulée","Pomme",null,"Menus journaliers février","MJ36"]
["2019-02-06","Ratatouille",null,"Saucisson","Pomme",null,"Menus journaliers février","MJ37"]
["2019-02-07","Ratatouille",null,"Thon","Pomme",null,"Menus journaliers février","MJ38"]
["2019-02-08","Salade",null,"Saucisson","Pomme",null,"Menus journaliers février","MJ39"]
["2019-02-09","Pâtes au fromage râpé",null,"Bifteck haché de bœuf","Yaourts",null,"Menus journaliers février","MJ40"]
["2019-02-10","Frites","Asperges","Saucisson","Yaourts",null,"Menus journaliers février","MJ41"]
["2019-02-11","Endives",null,"Bifteck haché de bœuf","Pomme",null,"Menus journaliers février","MJ42"]
["2019-02-12","Endives",null,"Saucisson","Pomme",null,"Menus journaliers février","MJ43"]
["2019-02-13","Raviolis",null,"Bifteck haché de cheval","Pomme",null,"Menus journaliers février","MJ44"]
["2019-02-14","Raviolis",null,"Saucisson","Pomme",null,"Menus journaliers février","MJ45"]
["2019-02-15","Salsifis",null,"Bifteck haché de veau","Pomme",null,"Menus journaliers février","MJ46"]
["2019-02-16","Pâtes à la sauce tomates",null,"Saucisson","Ananas",null,"Menus journaliers février","MJ47"]
["2019-02-17","Haricots verts",null,"Bifteck haché de veau","Ananas",null,"Menus journaliers février","MJ48"]
["2019-02-18","Haricots verts",null,"Saucisson","Pomme",null,"Menus journaliers février","MJ49"]
["2019-02-19","Haricots verts",null,"Bouchée à la reine","Pomme",null,"Menus journaliers février","MJ50"]
["2019-02-20","Tomates pelées",null,"Saucisson","Pomme",null,"Menus journaliers février","MJ51"]
["2019-02-21","Tomates pelées",null,"Bouchée à la reine","Pomme",null,"Menus journaliers février","MJ52"]
["2019-02-22","Tomates ",null,"Saucisson","Pomme",null,"Menus journaliers février","MJ53"]
["2019-02-23","Pâtes au beurre",null,"Boudin","Autres fruits",null,"Menus journaliers février","MJ54"]
["2019-02-24","Chips",null,"Saucisson","Autres fruits",null,"Menus journaliers février","MJ55"]
["2019-02-25","Maïs",null,"Boudin","Pomme",null,"Menus journaliers février","MJ56"]
["2019-02-26","Maïs",null,"Saucisson","Pomme",null,"Menus journaliers février","MJ57"]
["2019-02-27","Macédoine de légumes",null,"Cervelas","Pomme",null,"Menus journaliers février","MJ58"]
["2019-02-28","Macédoine de légumes",null,"Saucisson","Pomme",null,"Menus journaliers février","MJ59"]
["29/02/2019"]
["Fait à Limeil-Brévannes, le mercredi 16 janvier 2019."]
["Menus journaliers du mois de mars 2019."]
["Date du menu","Légume","Légume deux","Viande","Dessert","Observation","Nature du menu","Numéro du menu"]
["2019-03-01","Asperges",null,"Cervelas","Pomme",null,"Menus journaliers mars","MJ60"]
["2019-03-02","Pâtes au fromage râpé",null,"Saucisson","Avocats",null,"Menus journaliers mars","MJ61"]
["2019-03-03","Frites","Asperges","Cœur","Avocats",null,"Menus journaliers mars","MJ62"]
["2019-03-04","Paella",null,"Viande paella","Pomme",null,"Menus journaliers mars","MJ63"]
["2019-03-05","Paella",null,"Viande paella","Pomme",null,"Menus journaliers mars","MJ64"]
["2019-03-06","Petits pois et jeunes carottes",null,"Saucisson","Pomme",null,"Menus journaliers mars","MJ65"]
["2019-03-07","Petits pois et jeunes carottes",null,"Cœur","Pomme",null,"Menus journaliers mars","MJ66"]
["2019-03-08","Avocat",null,"Saucisson","Pomme",null,"Menus journaliers mars","MJ67"]
["2019-03-09","Pâtes à la sauce tomates",null,"Croque-monsieur","Bananes",null,"Menus journaliers mars","MJ68"]
["2019-03-10","Haricots verts",null,"Saucisson","Bananes",null,"Menus journaliers mars","MJ69"]
["2019-03-11","Poireau",null,"Croque-monsieur","Pomme",null,"Menus journaliers mars","MJ70"]
["2019-03-12","Poireau",null,"Saucisson","Pomme",null,"Menus journaliers mars","MJ71"]
["2019-03-13","Ratatouille",null,"Foie","Pomme",null,"Menus journaliers mars","MJ72"]
["2019-03-14","Ratatouille",null,"Saucisson","Pomme",null,"Menus journaliers mars","MJ73"]
["2019-03-15","Betterave rouge",null,"Foie","Pomme",null,"Menus journaliers mars","MJ74"]
["2019-03-16","Pâtes au beurre",null,"Saucisson","Clémentines",null,"Menus journaliers mars","MJ75"]
["2019-03-17","Chips",null,"Fromage de tête","Clémentines",null,"Menus journaliers mars","MJ76"]
["2019-03-18","Pomme de terre",null,"Saucisson","Pomme",null,"Menus journaliers mars","MJ77"]
["2019-03-19","Pomme de terre",null,"Fromage de tête","Pomme",null,"Menus journaliers mars","MJ78"]
["2019-03-20","Ratatouille",null,"Saucisson","Pomme",null,"Menus journaliers mars","MJ79"]
["2019-03-21","Ratatouille",null,"Jambon","Pomme",null,"Menus journaliers mars","MJ80"]
["2019-03-22","Carottes",null,"Saucisson","Pomme",null,"Menus journaliers mars","MJ81"]
["2019-03-23","Pâtes au fromage râpé",null,"Jambon","Crème",null,"Menus journaliers mars","MJ82"]
["2019-03-24","Frites","Asperges","Saucisson","Crème",null,"Menus journaliers mars","MJ83"]
["2019-03-25","Purée",null,"Jambonneau","Pomme",null,"Menus journaliers mars","MJ84"]
["2019-03-26","Purée",null,"Saucisson","Pomme",null,"Menus journaliers mars","MJ85"]
["2019-03-27","Raviolis",null,"Jambonneau","Pomme",null,"Menus journaliers mars","MJ86"]
["2019-03-28","Raviolis",null,"Saucisson","Pomme",null,"Menus journaliers mars","MJ87"]
["2019-03-29","Céleri",null,"Mortadelle","Pomme",null,"Menus journaliers mars","MJ88"]
["2019-03-30","Pâtes à la sauce tomates",null,"Saucisson","Dattes",null,"Menus journaliers mars","MJ89"]
["2019-03-31","Haricots verts",null,"Mortadelle","Dattes",null,"Menus journaliers mars","MJ90"]
["Fait à Limeil-Brévannes, le mercredi 16 janvier 2019."]
["Menus journaliers du mois d'avril 2019."]
["Date du menu","Légume","Légume deux","Viande","Dessert","Observation","Nature du menu","Numéro du menu"]
["2019-04-01","Quenelles",null,"Saucisson","Pomme",null,"Menus journaliers avril","MJ91"]
["2019-04-02","Quenelles",null,"Œufs","Pomme",null,"Menus journaliers avril","MJ92"]
["2019-04-03","Tomates pelées",null,"Saucisson","Pomme",null,"Menus journaliers avril","MJ93"]
["2019-04-04","Tomates pelées",null,"Œufs","Pomme",null,"Menus journaliers avril","MJ94"]
["2019-04-05","Champignons",null,"Saucisson","Pomme",null,"Menus journaliers avril","MJ95"]
["2019-04-06","Pâtes au beurre",null,"Pizza","Figues",null,"Menus journaliers avril","MJ96"]
["2019-04-07","Chips",null,"Saucisson","Figues",null,"Menus journaliers avril","MJ97"]
["2019-04-08","Riz",null,"Pizza","Pomme",null,"Menus journaliers avril","MJ98"]
["2019-04-09","Riz",null,"Saucisson","Pomme",null,"Menus journaliers avril","MJ99"]
["2019-04-10","Macédoine de légumes",null,"Poisson","Pomme",null,"Menus journaliers avril","MJ100"]
["2019-04-11","Macédoine de légumes",null,"Saucisson","Pomme",null,"Menus journaliers avril","MJ101"]
["2019-04-12","Concombre",null,"Quiche lorraine","Pomme",null,"Menus journaliers avril","MJ102"]
["2019-04-13","Pâtes au fromage râpé",null,"Saucisson","Fromage blanc",null,"Menus journaliers avril","MJ103"]
["2019-04-14","Frites","Asperges","Quiche lorraine","Fromage blanc",null,"Menus journaliers avril","MJ104"]
["2019-04-15","Cassoulet",null,"Viande cassoulet","Pomme",null,"Menus journaliers avril","MJ105"]
["2019-04-16","Cassoulet",null,"Viande cassoulet","Pomme",null,"Menus journaliers avril","MJ106"]
["2019-04-17","Petits pois",null,"Saucisson","Pomme",null,"Menus journaliers avril","MJ107"]
["2019-04-18","Petits pois",null,"Roulade à la pistache","Pomme",null,"Menus journaliers avril","MJ108"]
["2019-04-19","Radis",null,"Saucisson","Pomme",null,"Menus journaliers avril","MJ109"]
["2019-04-20","Pâtes à la sauce tomates",null,"Roulade à la pistache","Fruits au sirop",null,"Menus journaliers avril","MJ110"]
["2019-04-21","Haricots verts",null,"Saucisson","Fruits au sirop","Pâques","Menus journaliers avril","MJ111"]
["2019-04-22","Choucroute",null,"Viande choucroute","Pomme","Lundi de Pâques","Menus journaliers avril","MJ112"]
["2019-04-23","Choucroute",null,"Viande choucroute","Pomme",null,"Menus journaliers avril","MJ113"]
["2019-04-24","Petits pois et jeunes carottes",null,"Roulé au fromage","Pomme",null,"Menus journaliers avril","MJ114"]
["2019-04-25","Petits pois et jeunes carottes",null,"Saucisson","Pomme",null,"Menus journaliers avril","MJ115"]
["2019-04-26","Salade",null,"Roulé au fromage","Pomme",null,"Menus journaliers avril","MJ116"]
["2019-04-27","Pâtes au beurre",null,"Saucisson","Fruits de saison",null,"Menus journaliers avril","MJ117"]
["2019-04-28","Chips",null,"Salami","Fruits de saison",null,"Menus journaliers avril","MJ118"]
["2019-04-29","Chou-fleur",null,"Saucisson","Pomme",null,"Menus journaliers avril","MJ119"]
["2019-04-30","Chou-fleur",null,"Salami","Pomme",null,"Menus journaliers avril","MJ120"]
["Fait à Limeil-Brévannes, le mercredi 16 janvier 2019."]
["Menus journaliers du mois de mai 2019."]
["Date du menu","Légume","Légume deux","Viande","Dessert","Observation","Nature du menu","Numéro du menu"]
["2019-05-01","Ratatouille",null,"Saucisson","Pomme","Fête du travail","Menus journaliers mai","MJ121"]
["2019-05-02","Ratatouille",null,"Saucisses","Pomme",null,"Menus journaliers mai","MJ122"]
["2019-05-03","Salsifis",null,"Saucisson","Pomme",null,"Menus journaliers mai","MJ123"]
["2019-05-04","Pâtes au fromage râpé",null,"Saucisses","Gâteau de riz",null,"Menus journaliers mai","MJ124"]
["2019-05-05","Frites","Asperges","Saucisson","Gâteau de riz",null,"Menus journaliers mai","MJ125"]
["2019-05-06","Choux de Bruxelles",null,"Tête persillée","Pomme",null,"Menus journaliers mai","MJ126"]
["2019-05-07","Choux de Bruxelles",null,"Saucisson","Pomme",null,"Menus journaliers mai","MJ127"]
["2019-05-08","Raviolis",null,"Tête persillée","Pomme","Victoire du 08 mai 1945","Menus journaliers mai","MJ128"]
["2019-05-09","Raviolis",null,"Saucisson","Pomme",null,"Menus journaliers mai","MJ129"]
["2019-05-10","Tomates ",null,"Tête roulée","Pomme",null,"Menus journaliers mai","MJ130"]
["2019-05-11","Pâtes à la sauce tomates",null,"Saucisson","Gâteau de semoule",null,"Menus journaliers mai","MJ131"]
["2019-05-12","Haricots verts",null,"Tête roulée","Gâteau de semoule",null,"Menus journaliers mai","MJ132"]
["2019-05-13","Couscous",null,"Saucisson","Pomme",null,"Menus journaliers mai","MJ133"]
["2019-05-14","Couscous",null,"Thon","Pomme",null,"Menus journaliers mai","MJ134"]
["2019-05-15","Tomates pelées",null,"Saucisson","Pomme",null,"Menus journaliers mai","MJ135"]
["2019-05-16","Tomates pelées",null,"Bifteck haché de bœuf","Pomme",null,"Menus journaliers mai","MJ136"]
["2019-05-17","Asperges",null,"Saucisson","Pomme",null,"Menus journaliers mai","MJ137"]
["2019-05-18","Pâtes au beurre",null,"Bifteck haché de bœuf","Gâteaux samedi et dimanche",null,"Menus journaliers mai","MJ138"]
["2019-05-19","Haricots verts",null,"Saucisson","Gâteaux samedi et dimanche",null,"Menus journaliers mai","MJ139"]
["2019-05-20","Endives",null,"Bifteck haché de cheval","Pomme",null,"Menus journaliers mai","MJ140"]
["2019-05-21","Endives",null,"Saucisson","Pomme",null,"Menus journaliers mai","MJ141"]
["2019-05-22","Macédoine de légumes",null,"Bifteck haché de veau","Pomme",null,"Menus journaliers mai","MJ142"]
["2019-05-23","Macédoine de légumes",null,"Saucisson","Pomme",null,"Menus journaliers mai","MJ143"]
["2019-05-24","Avocat",null,"Bifteck haché de veau","Pomme",null,"Menus journaliers mai","MJ144"]
["2019-05-25","Pâtes au fromage râpé",null,"Saucisson","Mousse au chocolat",null,"Menus journaliers mai","MJ145"]
["2019-05-26","Frites","Asperges","Bouchée à la reine","Mousse au chocolat",null,"Menus journaliers mai","MJ146"]
["2019-05-27","Haricots verts",null,"Saucisson","Pomme",null,"Menus journaliers mai","MJ147"]
["2019-05-28","Haricots verts",null,"Bouchée à la reine","Pomme",null,"Menus journaliers mai","MJ148"]
["2019-05-29","Petits pois",null,"Saucisson","Pomme",null,"Menus journaliers mai","MJ149"]
["2019-05-30","Petits pois",null,"Boudin","Pomme","Ascension","Menus journaliers mai","MJ150"]
["2019-05-31","Betterave rouge",null,"Saucisson","Pomme",null,"Menus journaliers mai","MJ151"]
["Fait à Limeil-Brévannes, le dimanche 20 janvier 2019."]
["Menus journaliers du mois de juin 2019."]
["Date du menu","Légume","Légume deux","Viande","Dessert","Observation","Nature du menu","Numéro du menu"]
["2019-06-01","Pâtes à la sauce tomates",null,"Boudin","Oranges",null,"Menus journaliers mai","MJ152"]
["2019-06-02","Haricots verts",null,"Saucisson","Oranges",null,"Menus journaliers juin","MJ153"]
["2019-06-03","Maïs",null,"Cervelas","Pomme",null,"Menus journaliers juin","MJ154"]
["2019-06-04","Maïs",null,"Saucisson","Pomme",null,"Menus journaliers juin","MJ155"]
["2019-06-05","Petits pois et jeunes carottes",null,"Cervelas","Pomme",null,"Menus journaliers juin","MJ156"]
["2019-06-06","Petits pois et jeunes carottes",null,"Saucisson","Pomme",null,"Menus journaliers juin","MJ157"]
["2019-06-07","Carottes",null,"Cœur","Pomme",null,"Menus journaliers juin","MJ158"]
["2019-06-08","Pâtes au beurre",null,"Saucisson","Petits suisses",null,"Menus journaliers juin","MJ159"]
["2019-06-09","Chips",null,"Cœur","Petits suisses","Pentecôte","Menus journaliers juin","MJ160"]
["2019-06-10","Paella",null,"Viande paella","Pomme","Lundi de Pentecôte","Menus journaliers juin","MJ161"]
["2019-06-11","Paella",null,"Viande paella","Pomme",null,"Menus journaliers juin","MJ162"]
["2019-06-12","Ratatouille",null,"Saucisson","Pomme",null,"Menus journaliers juin","MJ163"]
["2019-06-13","Ratatouille",null,"Croque-monsieur","Pomme",null,"Menus journaliers juin","MJ164"]
["2019-06-14","Céleri",null,"Saucisson","Pomme",null,"Menus journaliers juin","MJ165"]
["2019-06-15","Pâtes au fromage râpé",null,"Croque-monsieur","Pruneaux",null,"Menus journaliers juin","MJ166"]
["2019-06-16","Frites","Asperges","Saucisson","Pruneaux",null,"Menus journaliers juin","MJ167"]
["2019-06-17","Poireau",null,"Foie","Pomme",null,"Menus journaliers juin","MJ168"]
["2019-06-18","Poireau",null,"Saucisson","Pomme",null,"Menus journaliers juin","MJ169"]
["2019-06-19","Raviolis",null,"Foie","Pomme",null,"Menus journaliers juin","MJ170"]
["2019-06-20","Raviolis",null,"Saucisson","Pomme",null,"Menus journaliers juin","MJ171"]
["2019-06-21","Champignons",null,"Fromage de tête","Pomme",null,"Menus journaliers juin","MJ172"]
["2019-06-22","Pâtes à la sauce tomates",null,"Saucisson","Gâteau de riz",null,"Menus journaliers juin","MJ173"]
["2019-06-23","Haricots verts",null,"Fromage de tête","Gâteau de riz",null,"Menus journaliers juin","MJ174"]
["2019-06-24","Pomme de terre",null,"Saucisson","Pomme",null,"Menus journaliers juin","MJ175"]
["2019-06-25","Pomme de terre",null,"Jambon","Pomme",null,"Menus journaliers juin","MJ176"]
["2019-06-26","Tomates pelées",null,"Saucisson","Pomme",null,"Menus journaliers juin","MJ177"]
["2019-06-27","Tomates pelées",null,"Jambon","Pomme",null,"Menus journaliers juin","MJ178"]
["2019-06-28","Concombre",null,"Saucisson","Pomme",null,"Menus journaliers juin","MJ179"]
["2019-06-29","Pâtes au beurre",null,"Jambonneau","Tapioca",null,"Menus journaliers juin","MJ180"]
["2019-06-30","Chips",null,"Saucisson","Tapioca",null,"Menus journaliers juin","MJ181"]
["Fait à Limeil-Brévannes, le dimanche 20 janvier 2019."]
["Menus journaliers du mois de juillet 2019."]
["Date du menu","Légume","Légume deux","Viande","Dessert","Observation","Nature du menu","Numéro du menu"]
["2019-07-01","Purée",null,"Jambonneau","Pomme",null,"Menus journaliers juillet","MJ182"]
["2019-07-02","Purée",null,"Saucisson","Pomme",null,"Menus journaliers juillet","MJ183"]
["2019-07-03","Macédoine de légumes",null,"Mortadelle","Pomme",null,"Menus journaliers juillet","MJ184"]
["2019-07-04","Macédoine de légumes",null,"Saucisson","Pomme",null,"Menus journaliers juillet","MJ185"]
["2019-07-05","Radis",null,"Mortadelle","Pomme",null,"Menus journaliers juillet","MJ186"]
["2019-07-06","Pâtes au fromage râpé",null,"Saucisson","Yaourts",null,"Menus journaliers juillet","MJ187"]
["2019-07-07","Frites","Asperges","Œufs","Yaourts",null,"Menus journaliers juillet","MJ188"]
["2019-07-08","Quenelles",null,"Saucisson","Pomme",null,"Menus journaliers juillet","MJ189"]
["2019-07-09","Quenelles",null,"Œufs","Pomme",null,"Menus journaliers juillet","MJ190"]
["2019-07-10","Petits pois",null,"Saucisson","Pomme",null,"Menus journaliers juillet","MJ191"]
["2019-07-11","Petits pois",null,"Pizza","Pomme",null,"Menus journaliers juillet","MJ192"]
["2019-07-12","Salade",null,"Saucisson","Pomme",null,"Menus journaliers juillet","MJ193"]
["2019-07-13","Pâtes à la sauce tomates",null,"Pizza","Ananas",null,"Menus journaliers juillet","MJ194"]
["2019-07-14","Haricots verts",null,"Saucisson","Ananas","Fête nationale","Menus journaliers juillet","MJ195"]
["2019-07-15","Riz",null,"Poisson","Pomme",null,"Menus journaliers juillet","MJ196"]
["2019-07-16","Riz",null,"Saucisson","Pomme",null,"Menus journaliers juillet","MJ197"]
["2019-07-17","Petits pois et jeunes carottes",null,"Quiche lorraine","Pomme",null,"Menus journaliers juillet","MJ198"]
["2019-07-18","Petits pois et jeunes carottes",null,"Saucisson","Pomme",null,"Menus journaliers juillet","MJ199"]
["2019-07-19","Salsifis",null,"Quiche lorraine","Pomme",null,"Menus journaliers juillet","MJ200"]
["2019-07-20","Pâtes au beurre",null,"Saucisson","Autres fruits",null,"Menus journaliers juillet","MJ201"]
["2019-07-21","Chips",null,"Roulade à la pistache","Autres fruits",null,"Menus journaliers juillet","MJ202"]
["2019-07-22","Cassoulet",null,"Viande cassoulet","Pomme",null,"Menus journaliers juillet","MJ203"]
["2019-07-23","Cassoulet",null,"Viande cassoulet","Pomme",null,"Menus journaliers juillet","MJ204"]
["2019-07-24","Ratatouille",null,"Saucisson","Pomme",null,"Menus journaliers juillet","MJ205"]
["2019-07-25","Ratatouille",null,"Roulade à la pistache","Pomme",null,"Menus journaliers juillet","MJ206"]
["2019-07-26","Tomates ",null,"Saucisson","Pomme",null,"Menus journaliers juillet","MJ207"]
["2019-07-27","Pâtes au fromage râpé",null,"Roulé au fromage","Avocats",null,"Menus journaliers juillet","MJ208"]
["2019-07-28","Frites","Asperges","Saucisson","Avocats",null,"Menus journaliers juillet","MJ209"]
["2019-07-29","Choucroute",null,"Viande choucroute","Pomme",null,"Menus journaliers juillet","MJ210"]
["2019-07-30","Choucroute",null,"Viande choucroute","Pomme",null,"Menus journaliers juillet","MJ211"]
["2019-07-31","Raviolis",null,"Roulé au fromage","Pomme",null,"Menus journaliers juillet","MJ212"]
["Fait à Limeil-Brévannes, le lundi 21 janvier 2019."]
["Menus journaliers du mois d'août 2019."]
["Date du menu","Légume","Légume deux","Viande","Dessert","Observation","Nature du menu","Numéro du menu"]
["2019-08-01","Raviolis",null,"Saucisson","Pomme",null,"Menus journaliers août","MJ213"]
["2019-08-02","Asperges",null,"Salami","Pomme",null,"Menus journaliers août","MJ214"]
["2019-08-03","Pâtes à la sauce tomates",null,"Saucisson","Bananes",null,"Menus journaliers août","MJ215"]
["2019-08-04","Haricots verts",null,"Salami","Bananes",null,"Menus journaliers août","MJ216"]
["2019-08-05","Chou-fleur",null,"Saucisson","Pomme",null,"Menus journaliers août","MJ217"]
["2019-08-06","Chou-fleur",null,"Saucisses","Pomme",null,"Menus journaliers août","MJ218"]
["2019-08-07","Tomates pelées",null,"Saucisson","Pomme",null,"Menus journaliers août","MJ219"]
["2019-08-08","Tomates pelées",null,"Saucisses","Pomme",null,"Menus journaliers août","MJ220"]
["2019-08-09","Avocat",null,"Saucisson","Pomme",null,"Menus journaliers août","MJ221"]
["2019-08-10","Pâtes au beurre",null,"Tête persillée","Clémentines",null,"Menus journaliers août","MJ222"]
["2019-08-11","Chips",null,"Saucisson","Clémentines",null,"Menus journaliers août","MJ223"]
["2019-08-12","Choux de Bruxelles",null,"Tête persillée","Pomme",null,"Menus journaliers août","MJ224"]
["2019-08-13","Choux de Bruxelles",null,"Saucisson","Pomme",null,"Menus journaliers août","MJ225"]
["2019-08-14","Macédoine de légumes",null,"Tête roulée","Pomme",null,"Menus journaliers août","MJ226"]
["2019-08-15","Macédoine de légumes",null,"Saucisson","Pomme","Assomption","Menus journaliers août","MJ227"]
["2019-08-16","Betterave rouge",null,"Tête roulée","Pomme",null,"Menus journaliers août","MJ228"]
["2019-08-17","Pâtes au fromage râpé",null,"Saucisson","Crème",null,"Menus journaliers août","MJ229"]
["2019-08-18","Frites","Asperges","Thon","Crème",null,"Menus journaliers août","MJ230"]
["2019-08-19","Couscous",null,"Saucisson","Pomme",null,"Menus journaliers août","MJ231"]
["2019-08-20","Couscous",null,"Bifteck haché de bœuf","Pomme",null,"Menus journaliers août","MJ232"]
["2019-08-21","Petits pois",null,"Saucisson","Pomme",null,"Menus journaliers août","MJ233"]
["2019-08-22","Petits pois",null,"Bifteck haché de bœuf","Pomme",null,"Menus journaliers août","MJ234"]
["2019-08-23","Carottes",null,"Saucisson","Pomme",null,"Menus journaliers août","MJ235"]
["2019-08-24","Pâtes à la sauce tomates",null,"Bifteck haché de cheval","Dattes",null,"Menus journaliers août","MJ236"]
["2019-08-25","Haricots verts",null,"Saucisson","Dattes",null,"Menus journaliers août","MJ237"]
["2019-08-26","Endives",null,"Bifteck haché de veau","Pomme",null,"Menus journaliers août","MJ238"]
["2019-08-27","Endives",null,"Saucisson","Pomme",null,"Menus journaliers août","MJ239"]
["2019-08-28","Petits pois et jeunes carottes",null,"Bifteck haché de veau","Pomme",null,"Menus journaliers août","MJ240"]
["2019-08-29","Petits pois et jeunes carottes",null,"Saucisson","Pomme",null,"Menus journaliers août","MJ241"]
["2019-08-30","Céleri",null,"Bouchée à la reine","Pomme",null,"Menus journaliers août","MJ242"]
["2019-08-31","Pâtes au beurre",null,"Saucisson","Figues",null,"Menus journaliers août","MJ243"]
["Fait à Limeil-Brévannes, le lundi 21 janvier 2019."]
["Menus journaliers du mois de septembre 2019."]
["Date du menu","Légume","Légume deux","Viande","Dessert","Observation","Nature du menu","Numéro du menu"]
["2019-09-01","Chips",null,"Bouchée à la reine","Figues",null,"Menus journaliers septembre","MJ244"]
["2019-09-02","Haricots verts",null,"Saucisson","Pomme",null,"Menus journaliers septembre","MJ245"]
["2019-09-03","Haricots verts",null,"Boudin","Pomme",null,"Menus journaliers septembre","MJ246"]
["2019-09-04","Ratatouille",null,"Saucisson","Pomme",null,"Menus journaliers septembre","MJ247"]
["2019-09-05","Ratatouille",null,"Boudin","Pomme",null,"Menus journaliers septembre","MJ248"]
["2019-09-06","Champignons",null,"Saucisson","Pomme",null,"Menus journaliers septembre","MJ249"]
["2019-09-07","Pâtes au fromage râpé",null,"Cervelas","Fromage blanc",null,"Menus journaliers septembre","MJ250"]
["2019-09-08","Frites","Asperges","Saucisson","Fromage blanc",null,"Menus journaliers septembre","MJ251"]
["2019-09-09","Maïs",null,"Cervelas","Pomme",null,"Menus journaliers septembre","MJ252"]
["2019-09-10","Maïs",null,"Saucisson","Pomme",null,"Menus journaliers septembre","MJ253"]
["2019-09-11","Raviolis",null,"Cœur","Pomme",null,"Menus journaliers septembre","MJ254"]
["2019-09-12","Raviolis",null,"Saucisson","Pomme",null,"Menus journaliers septembre","MJ255"]
["2019-09-13","Concombre",null,"Cœur","Pomme",null,"Menus journaliers septembre","MJ256"]
["2019-09-14","Pâtes à la sauce tomates",null,"Saucisson","Fruits au sirop",null,"Menus journaliers septembre","MJ257"]
["2019-09-15","Haricots verts",null,"Croque-monsieur","Fruits au sirop",null,"Menus journaliers septembre","MJ258"]
["2019-09-16","Paella",null,"Viande paella","Pomme",null,"Menus journaliers septembre","MJ259"]
["2019-09-17","Paella",null,"Viande paella","Pomme",null,"Menus journaliers septembre","MJ260"]
["2019-09-18","Tomates pelées",null,"Saucisson","Pomme",null,"Menus journaliers septembre","MJ261"]
["2019-09-19","Tomates pelées",null,"Croque-monsieur","Pomme",null,"Menus journaliers septembre","MJ262"]
["2019-09-20","Radis",null,"Saucisson","Pomme",null,"Menus journaliers septembre","MJ263"]
["2019-09-21","Pâtes au beurre",null,"Foie","Fruits de saison",null,"Menus journaliers septembre","MJ264"]
["2019-09-22","Chips",null,"Saucisson","Fruits de saison",null,"Menus journaliers septembre","MJ265"]
["2019-09-23","Poireau",null,"Foie","Pomme",null,"Menus journaliers septembre","MJ266"]
["2019-09-24","Poireau",null,"Saucisson","Pomme",null,"Menus journaliers septembre","MJ267"]
["2019-09-25","Macédoine de légumes",null,"Fromage de tête","Pomme",null,"Menus journaliers septembre","MJ268"]
["2019-09-26","Macédoine de légumes",null,"Saucisson","Pomme",null,"Menus journaliers septembre","MJ269"]
["2019-09-27","Salade",null,"Fromage de tête","Pomme",null,"Menus journaliers septembre","MJ270"]
["2019-09-28","Pâtes au fromage râpé",null,"Saucisson","Gâteau de riz",null,"Menus journaliers septembre","MJ271"]
["2019-09-29","Frites","Asperges","Jambon","Gâteau de riz",null,"Menus journaliers septembre","MJ272"]
["2019-09-30","Pomme de terre",null,"Saucisson","Pomme",null,"Menus journaliers septembre","MJ273"]
["Fait à Limeil-Brévannes, le lundi 21 janvier 2019."]
["Menus journaliers du mois d'octobre 2019."]
["Date du menu","Légume","Légume deux","Viande","Dessert","Observation","Nature du menu","Numéro du menu"]
["2019-10-01","Pomme de terre",null,"Jambon","Pomme",null,"Menus journaliers octobre","MJ274"]
["2019-10-02","Petits pois",null,"Saucisson","Pomme",null,"Menus journaliers octobre","MJ275"]
["2019-10-03","Petits pois",null,"Jambonneau","Pomme",null,"Menus journaliers octobre","MJ276"]
["2019-10-04","Salsifis",null,"Saucisson","Pomme",null,"Menus journaliers octobre","MJ277"]
["2019-10-05","Pâtes à la sauce tomates",null,"Jambonneau","Gâteau de semoule",null,"Menus journaliers octobre","MJ278"]
["2019-10-06","Haricots verts",null,"Saucisson","Gâteau de semoule",null,"Menus journaliers octobre","MJ279"]
["2019-10-07","Purée",null,"Mortadelle","Pomme",null,"Menus journaliers octobre","MJ280"]
["2019-10-08","Purée",null,"Saucisson","Pomme",null,"Menus journaliers octobre","MJ281"]
["2019-10-09","Petits pois et jeunes carottes",null,"Mortadelle","Pomme",null,"Menus journaliers octobre","MJ282"]
["2019-10-10","Petits pois et jeunes carottes",null,"Saucisson","Pomme",null,"Menus journaliers octobre","MJ283"]
["2019-10-11","Tomates ",null,"Œufs","Pomme",null,"Menus journaliers octobre","MJ284"]
["2019-10-12","Pâtes au beurre",null,"Saucisson","Gâteaux samedi et dimanche",null,"Menus journaliers octobre","MJ285"]
["2019-10-13","Chips",null,"Œufs","Gâteaux samedi et dimanche",null,"Menus journaliers octobre","MJ286"]
["2019-10-14","Quenelles",null,"Saucisson","Pomme",null,"Menus journaliers octobre","MJ287"]
["2019-10-15","Quenelles",null,"Pizza","Pomme",null,"Menus journaliers octobre","MJ288"]
["2019-10-16","Ratatouille",null,"Saucisson","Pomme",null,"Menus journaliers octobre","MJ289"]
["2019-10-17","Ratatouille",null,"Pizza","Pomme",null,"Menus journaliers octobre","MJ290"]
["2019-10-18","Asperges",null,"Saucisson","Pomme",null,"Menus journaliers octobre","MJ291"]
["2019-10-19","Pâtes au fromage râpé",null,"Poisson","Mousse au chocolat",null,"Menus journaliers octobre","MJ292"]
["2019-10-20","Frites","Asperges","Saucisson","Mousse au chocolat",null,"Menus journaliers octobre","MJ293"]
["2019-10-21","Riz",null,"Quiche lorraine","Pomme",null,"Menus journaliers octobre","MJ294"]
["2019-10-22","Riz",null,"Saucisson","Pomme",null,"Menus journaliers octobre","MJ295"]
["2019-10-23","Raviolis",null,"Quiche lorraine","Pomme",null,"Menus journaliers octobre","MJ296"]
["2019-10-24","Raviolis",null,"Saucisson","Pomme",null,"Menus journaliers octobre","MJ297"]
["2019-10-25","Avocat",null,"Roulade à la pistache","Pomme",null,"Menus journaliers octobre","MJ298"]
["2019-10-26","Pâtes à la sauce tomates",null,"Saucisson","Oranges",null,"Menus journaliers octobre","MJ299"]
["2019-10-27","Haricots verts",null,"Roulade à la pistache","Oranges",null,"Menus journaliers octobre","MJ300"]
["2019-10-28","Cassoulet",null,"Viande cassoulet","Pomme",null,"Menus journaliers octobre","MJ301"]
["2019-10-29","Cassoulet",null,"Viande cassoulet","Pomme",null,"Menus journaliers octobre","MJ302"]
["2019-10-30","Tomates pelées",null,"Saucisson","Pomme",null,"Menus journaliers octobre","MJ303"]
["2019-10-31","Tomates pelées",null,"Roulé au fromage","Pomme",null,"Menus journaliers octobre","MJ304"]
["Fait à Limeil-Brévannes, le lundi 21 janvier 2019."]
["Menus journaliers du mois de novembre 2019."]
["Date du menu","Légume","Légume deux","Viande","Dessert","Observation","Nature du menu","Numéro du menu"]
["2019-11-01","Betterave rouge",null,"Saucisson","Pomme","Toussaint","Menus journaliers novembre","MJ305"]
["2019-11-02","Pâtes au beurre",null,"Roulé au fromage","Petits suisses",null,"Menus journaliers novembre","MJ306"]
["2019-11-03","Chips",null,"Saucisson","Petits suisses",null,"Menus journaliers novembre","MJ307"]
["2019-11-04","Choucroute",null,"Viande choucroute","Pomme",null,"Menus journaliers novembre","MJ308"]
["2019-11-05","Choucroute",null,"Viande choucroute","Pomme",null,"Menus journaliers novembre","MJ309"]
["2019-11-06","Macédoine de légumes",null,"Salami","Pomme",null,"Menus journaliers novembre","MJ310"]
["2019-11-07","Macédoine de légumes",null,"Saucisson","Pomme",null,"Menus journaliers novembre","MJ311"]
["2019-11-08","Carottes",null,"Salami","Pomme",null,"Menus journaliers novembre","MJ312"]
["2019-11-09","Pâtes au fromage râpé",null,"Saucisson","Pruneaux",null,"Menus journaliers novembre","MJ313"]
["2019-11-10","Frites","Asperges","Saucisses","Pruneaux",null,"Menus journaliers novembre","MJ314"]
["2019-11-11","Chou-fleur",null,"Saucisson","Pomme","Armistice du 11 novembre 1918","Menus journaliers novembre","MJ315"]
["2019-11-12","Chou-fleur",null,"Saucisses","Pomme",null,"Menus journaliers novembre","MJ316"]
["2019-11-13","Petits pois",null,"Saucisson","Pomme",null,"Menus journaliers novembre","MJ317"]
["2019-11-14","Petits pois",null,"Tête persillée","Pomme",null,"Menus journaliers novembre","MJ318"]
["2019-11-15","Céleri",null,"Saucisson","Pomme",null,"Menus journaliers novembre","MJ319"]
["2019-11-16","Pâtes à la sauce tomates",null,"Tête persillée","Gâteau de riz",null,"Menus journaliers novembre","MJ320"]
["2019-11-17","Haricots verts",null,"Saucisson","Gâteau de riz",null,"Menus journaliers novembre","MJ321"]
["2019-11-18","Choux de Bruxelles",null,"Tête roulée","Pomme",null,"Menus journaliers novembre","MJ322"]
["2019-11-19","Choux de Bruxelles",null,"Saucisson","Pomme",null,"Menus journaliers novembre","MJ323"]
["2019-11-20","Petits pois et jeunes carottes",null,"Tête roulée","Pomme",null,"Menus journaliers novembre","MJ324"]
["2019-11-21","Petits pois et jeunes carottes",null,"Saucisson","Pomme",null,"Menus journaliers novembre","MJ325"]
["2019-11-22","Champignons",null,"Thon","Pomme",null,"Menus journaliers novembre","MJ326"]
["2019-11-23","Pâtes au beurre",null,"Saucisson","Tapioca",null,"Menus journaliers novembre","MJ327"]
["2019-11-24","Chips",null,"Bifteck haché de bœuf","Tapioca",null,"Menus journaliers novembre","MJ328"]
["2019-11-25","Couscous",null,"Saucisson","Pomme",null,"Menus journaliers novembre","MJ329"]
["2019-11-26","Couscous",null,"Bifteck haché de bœuf","Pomme",null,"Menus journaliers novembre","MJ330"]
["2019-11-27","Ratatouille",null,"Saucisson","Pomme",null,"Menus journaliers novembre","MJ331"]
["2019-11-28","Ratatouille",null,"Bifteck haché de cheval","Pomme",null,"Menus journaliers novembre","MJ332"]
["2019-11-29","Concombre",null,"Saucisson","Pomme",null,"Menus journaliers novembre","MJ333"]
["2019-11-30","Pâtes au fromage râpé",null,"Bifteck haché de veau","Yaourts",null,"Menus journaliers novembre","MJ334"]
["Fait à Limeil-Brévannes, le lundi 21 janvier 2019."]
["Menus journaliers du mois de décembre 2019."]
["Date du menu","Légume","Légume deux","Viande","Dessert","Observation","Nature du menu","Numéro du menu"]
["2019-12-01","Frites","Asperges","Saucisson","Yaourts",null,"Menus journaliers décembre","MJ335"]
["2019-12-02","Endives",null,"Bifteck haché de veau","Pomme",null,"Menus journaliers décembre","MJ336"]
["2019-12-03","Endives",null,"Saucisson","Pomme",null,"Menus journaliers décembre","MJ337"]
["2019-12-04","Raviolis",null,"Bouchée à la reine","Pomme",null,"Menus journaliers décembre","MJ338"]
["2019-12-05","Raviolis",null,"Saucisson","Pomme",null,"Menus journaliers décembre","MJ339"]
["2019-12-06","Radis",null,"Bouchée à la reine","Pomme",null,"Menus journaliers décembre","MJ340"]
["2019-12-07","Pâtes à la sauce tomates",null,"Saucisson","Ananas",null,"Menus journaliers décembre","MJ341"]
["2019-12-08","Haricots verts",null,"Boudin","Ananas",null,"Menus journaliers décembre","MJ342"]
["2019-12-09","Haricots verts",null,"Saucisson","Pomme",null,"Menus journaliers décembre","MJ343"]
["2019-12-10","Haricots verts",null,"Boudin","Pomme",null,"Menus journaliers décembre","MJ344"]
["2019-12-11","Tomates pelées",null,"Saucisson","Pomme",null,"Menus journaliers décembre","MJ345"]
["2019-12-12","Tomates pelées",null,"Cervelas","Pomme",null,"Menus journaliers décembre","MJ346"]
["2019-12-13","Salade",null,"Saucisson","Pomme",null,"Menus journaliers décembre","MJ347"]
["2019-12-14","Pâtes au beurre",null,"Cervelas","Autres fruits",null,"Menus journaliers décembre","MJ348"]
["2019-12-15","Chips",null,"Saucisson","Autres fruits",null,"Menus journaliers décembre","MJ349"]
["2019-12-16","Maïs",null,"Cœur","Pomme",null,"Menus journaliers décembre","MJ350"]
["2019-12-17","Maïs",null,"Saucisson","Pomme",null,"Menus journaliers décembre","MJ351"]
["2019-12-18","Macédoine de légumes",null,"Cœur","Pomme",null,"Menus journaliers décembre","MJ352"]
["2019-12-19","Macédoine de légumes",null,"Saucisson","Pomme",null,"Menus journaliers décembre","MJ353"]
["2019-12-20","Salsifis",null,"Croque-monsieur","Pomme",null,"Menus journaliers décembre","MJ354"]
["2019-12-21","Pâtes au fromage râpé",null,"Saucisson","Avocats",null,"Menus journaliers décembre","MJ355"]
["2019-12-22","Frites","Asperges","Croque-monsieur","Avocats",null,"Menus journaliers décembre","MJ356"]
["2019-12-23","Paella",null,"Viande paella","Pomme",null,"Menus journaliers décembre","MJ357"]
["2019-12-24","Paella",null,"Viande paella","Pomme",null,"Menus journaliers décembre","MJ358"]
["2019-12-25","Petits pois",null,"Saucisson","Pomme","Noël","Menus journaliers décembre","MJ359"]
["2019-12-26","Petits pois",null,"Foie","Pomme",null,"Menus journaliers décembre","MJ360"]
["2019-12-27","Tomates ",null,"Saucisson","Pomme",null,"Menus journaliers décembre","MJ361"]
["2019-12-28","Pâtes à la sauce tomates",null,"Foie","Bananes",null,"Menus journaliers décembre","MJ362"]
["2019-12-29","Haricots verts",null,"Saucisson","Bananes",null,"Menus journaliers décembre","MJ363"]
["2019-12-30","Poireau",null,"Fromage de tête","Pomme",null,"Menus journaliers décembre","MJ364"]
["2019-12-31","Poireau",null,"Saucisson","Pomme",null,"Menus journaliers décembre","MJ365"]
["Fait à Limeil-Brévannes, le lundi 21 janvier 2019."]

{"sheet":"Menus viandes weekend","index":7,"n_rows":113,"n_cols":5,"rows_kept":113,"cut":false,"hidden":false,"merged":[[0,0,0,4],[54,0,54,4],[55,0,55,4],[109,0,109,4]]}
["Menus viande weekend du premier semestre de l'année 2019."]
["Date du menu","Viande","Observation","Nature du menu","Numéro du menu"]
["2019-01-05","Cheval",null,"Menus viandes weekend premier semestre","MVWE01"]
["2019-01-06","Dinde",null,"Menus viandes weekend premier semestre","MVWE02"]
["2019-01-12","Poisson",null,"Menus viandes weekend premier semestre","MVWE03"]
["2019-01-13","Porc",null,"Menus viandes weekend premier semestre","MVWE04"]
["2019-01-19","Veau",null,"Menus viandes weekend premier semestre","MVWE05"]
["2019-01-20","Agneau",null,"Menus viandes weekend premier semestre","MVWE06"]
["2019-01-26","Bœuf",null,"Menus viandes weekend premier semestre","MVWE07"]
["2019-01-27","Cheval",null,"Menus viandes weekend premier semestre","MVWE08"]
["2019-02-02","Dinde",null,"Menus viandes weekend premier semestre","MVWE09"]
["2019-02-03","Poisson",null,"Menus viandes weekend premier semestre","MVWE10"]
["2019-02-09","Porc",null,"Menus viandes weekend premier semestre","MVWE11"]
["2019-02-10","Veau",null,"Menus viandes weekend premier semestre","MVWE12"]
["2019-02-16","Agneau",null,"Menus viandes weekend premier semestre","MVWE13"]
["2019-02-17","Bœuf",null,"Menus viandes weekend premier semestre","MVWE14"]
["2019-02-23","Cheval",null,"Menus viandes weekend premier semestre","MVWE15"]
["2019-02-24","Dinde",null,"Menus viandes weekend premier semestre","MVWE16"]
["2019-03-02","Poisson",null,"Menus viandes weekend premier semestre","MVWE17"]
["2019-03-03","Porc",null,"Menus viandes weekend premier semestre","MVWE18"]
["2019-03-09","Veau",null,"Menus viandes weekend premier semestre","MVWE19"]
["2019-03-10","Agneau",null,"Menus viandes weekend premier semestre","MVWE20"]
["2019-03-16","Bœuf",null,"Menus viandes weekend premier semestre","MVWE21"]
["2019-03-17","Cheval",null,"Menus viandes weekend premier semestre","MVWE22"]
["2019-03-23","Dinde",null,"Menus viandes weekend premier semestre","MVWE23"]
["2019-03-24","Poisson",null,"Menus viandes weekend premier semestre","MVWE24"]
["2019-03-30","Porc",null,"Menus viandes weekend premier semestre","MVWE25"]
["2019-03-31","Veau",null,"Menus viandes weekend premier semestre","MVWE26"]
["2019-04-06","Agneau",null,"Menus viandes weekend premier semestre","MVWE27"]
["2019-04-07","Bœuf",null,"Menus viandes weekend premier semestre","MVWE28"]
["2019-04-13","Cheval",null,"Menus viandes weekend premier semestre","MVWE29"]
["2019-04-14","Dinde",null,"Menus viandes weekend premier semestre","MVWE30"]
["2019-04-20","Poisson",null,"Menus viandes weekend premier semestre","MVWE31"]
["2019-04-21","Porc","Pâques","Menus viandes weekend premier semestre","MVWE32"]
["2019-04-27","Veau",null,"Menus viandes weekend premier semestre","MVWE33"]
["2019-04-28","Agneau",null,"Menus viandes weekend premier semestre","MVWE34"]
["2019-05-04","Bœuf",null,"Menus viandes weekend premier semestre","MVWE35"]
["2019-05-05","Cheval",null,"Menus viandes weekend premier semestre","MVWE36"]
["2019-05-11","Dinde",null,"Menus viandes weekend premier semestre","MVWE37"]
["2019-05-12","Poisson",null,"Menus viandes weekend premier semestre","MVWE38"]
["2019-05-18","Porc",null,"Menus viandes weekend premier semestre","MVWE39"]
["2019-05-19","Veau",null,"Menus viandes weekend premier semestre","MVWE40"]
["2019-05-25","Agneau",null,"Menus viandes weekend premier semestre","MVWE41"]
["2019-05-26","Bœuf",null,"Menus viandes weekend premier semestre","MVWE42"]
["2019-06-01","Cheval",null,"Menus viandes weekend premier semestre","MVWE43"]
["2019-06-02","Dinde",null,"Menus viandes weekend premier semestre","MVWE44"]
["2019-06-08","Poisson",null,"Menus viandes weekend premier semestre","MVWE45"]
["2019-06-09","Porc","Pentecôte","Menus viandes weekend premier semestre","MVWE46"]
["2019-06-15","Veau",null,"Menus viandes weekend premier semestre","MVWE47"]
["2019-06-16","Agneau",null,"Menus viandes weekend premier semestre","MVWE48"]
["2019-06-22","Bœuf",null,"Menus viandes weekend premier semestre","MVWE49"]
["2019-06-23","Cheval",null,"Menus viandes weekend premier semestre","MVWE50"]
["2019-06-29","Dinde",null,"Menus viandes weekend premier semestre","MVWE51"]
["2019-06-30","Poisson",null,"Menus viandes weekend premier semestre","MVWE52"]
["Fait à Limeil-Brévannes, le mardi 22 janvier  2019."]
["Menus viande weekend du deuxième semestre de l'année 2019."]
["Date du menu","Viande","Observation","Nature du menu","Numéro du menu"]
["2019-07-06","Porc",null,"Menus viandes weekend deuxième semestre","MVWE53"]
["2019-07-07","Veau",null,"Menus viandes weekend deuxième semestre","MVWE54"]
["2019-07-13","Agneau",null,"Menus viandes weekend deuxième semestre","MVWE55"]
["2019-07-14","Bœuf","Fête nationale","Menus viandes weekend deuxième semestre","MVWE56"]
["2019-07-20","Cheval",null,"Menus viandes weekend deuxième semestre","MVWE57"]
["2019-07-21","Dinde",null,"Menus viandes weekend deuxième semestre","MVWE58"]
["2019-07-27","Poisson",null,"Menus viandes weekend deuxième semestre","MVWE59"]
["2019-07-28","Porc",null,"Menus viandes weekend deuxième semestre","MVWE60"]
["2019-08-03","Veau",null,"Menus viandes weekend deuxième semestre","MVWE61"]
["2019-08-04","Agneau",null,"Menus viandes weekend deuxième semestre","MVWE62"]
["2019-08-10","Bœuf",null,"Menus viandes weekend deuxième semestre","MVWE63"]
["2019-08-11","Cheval",null,"Menus viandes weekend deuxième semestre","MVWE64"]
["2019-08-17","Dinde",null,"Menus viandes weekend deuxième semestre","MVWE65"]
["2019-08-18","Poisson",null,"Menus viandes weekend deuxième semestre","MVWE66"]
["2019-08-24","Porc",null,"Menus viandes weekend deuxième semestre","MVWE67"]
["2019-08-25","Veau",null,"Menus viandes weekend deuxième semestre","MVWE68"]
["2019-08-31","Agneau",null,"Menus viandes weekend deuxième semestre","MVWE69"]
["2019-09-01","Bœuf",null,"Menus viandes weekend deuxième semestre","MVWE70"]
["2019-09-07","Cheval",null,"Menus viandes weekend deuxième semestre","MVWE71"]
["2019-09-08","Dinde",null,"Menus viandes weekend deuxième semestre","MVWE72"]
["2019-09-14","Poisson",null,"Menus viandes weekend deuxième semestre","MVWE73"]
["2019-09-15","Porc",null,"Menus viandes weekend deuxième semestre","MVWE74"]
["2019-09-21","Veau",null,"Menus viandes weekend deuxième semestre","MVWE75"]
["2019-09-22","Agneau",null,"Menus viandes weekend deuxième semestre","MVWE76"]
["2019-09-28","Bœuf",null,"Menus viandes weekend deuxième semestre","MVWE77"]
["2019-09-29","Cheval",null,"Menus viandes weekend deuxième semestre","MVWE78"]
["2019-10-05","Dinde",null,"Menus viandes weekend deuxième semestre","MVWE79"]
["2019-10-06","Poisson",null,"Menus viandes weekend deuxième semestre","MVWE80"]
["2019-10-12","Porc",null,"Menus viandes weekend deuxième semestre","MVWE81"]
["2019-10-13","Veau",null,"Menus viandes weekend deuxième semestre","MVWE82"]
["2019-10-19","Agneau",null,"Menus viandes weekend deuxième semestre","MVWE83"]
["2019-10-20","Bœuf",null,"Menus viandes weekend deuxième semestre","MVWE84"]
["2019-10-26","Cheval",null,"Menus viandes weekend deuxième semestre","MVWE85"]
["2019-10-27","Dinde",null,"Menus viandes weekend deuxième semestre","MVWE86"]
["2019-11-02","Poisson",null,"Menus viandes weekend deuxième semestre","MVWE87"]
["2019-11-03","Porc",null,"Menus viandes weekend deuxième semestre","MVWE88"]
["2019-11-09","Veau",null,"Menus viandes weekend deuxième semestre","MVWE89"]
["2019-11-10","Agneau",null,"Menus viandes weekend deuxième semestre","MVWE90"]
["2019-11-16","Bœuf",null,"Menus viandes weekend deuxième semestre","MVWE91"]
["2019-11-17","Cheval",null,"Menus viandes weekend deuxième semestre","MVWE92"]
["2019-11-23","Dinde",null,"Menus viandes weekend deuxième semestre","MVWE93"]
["2019-11-24","Poisson",null,"Menus viandes weekend deuxième semestre","MVWE94"]
["2019-11-30","Porc",null,"Menus viandes weekend deuxième semestre","MVWE95"]
["2019-12-01","Veau",null,"Menus viandes weekend deuxième semestre","MVWE96"]
["2019-12-07","Agneau",null,"Menus viandes weekend deuxième semestre","MVWE97"]
["2019-12-08","Bœuf",null,"Menus viandes weekend deuxième semestre","MVWE98"]
["2019-12-14","Cheval",null,"Menus viandes weekend deuxième semestre","MVWE99"]
["2019-12-15","Dinde",null,"Menus viandes weekend deuxième semestre","MVWE100"]
["2019-12-21","Poisson",null,"Menus viandes weekend deuxième semestre","MVWE101"]
["2019-12-22","Porc",null,"Menus viandes weekend deuxième semestre","MVWE102"]
["2019-12-28","Veau",null,"Menus viandes weekend deuxième semestre","MVWE103"]
["2019-12-29","Agneau",null,"Menus viandes weekend deuxième semestre","MVWE104"]
["Fait à Limeil-Brévannes, le mardi 22 janvier 2019."]
["2019-12-29","Agneau",null,"Menus viandes weekend deuxième semestre","MVWE104"]
["2019-12-29","Agneau",null,"Menus viandes weekend deuxième semestre","MVWE104"]
["2019-12-29","Agneau",null,"Menus viandes weekend deuxième semestre","MVWE104"]

{"sheet":"Janvier","index":8,"n_rows":65,"n_cols":31,"rows_kept":65,"cut":false,"hidden":false,"merged":[[0,0,0,30]]}
["Menus du mois  de janvier 2018."]
[]
["Numéro du menu","Date du menu","Code période concernée","Période concernée","Code dessert","Dessert","Jour dessert","Conditionnement dessert","Destination dessert","Quantité dessert","Code légume","Légume","Jour légume","Conditionnement légume","Destination légume","Quantité légume","Code légume deux","Légume deux","Jour légume deux","Conditionnement légume deux","Destination légume deux","Quantité légume deux","Code viande","Viande","Jour viande","Conditionnement viande","Destination viande","Quantité viande","Code observation","Observation","Titre"]
["MMR01","2019-01-01","PC01","Janvier","DMR01","Pomme","Lundi à vendredi midis","1 sachet de 2 kilogrammes. 1 pomme pour 1 repas","Menus midi retraite",1,"LMR16","Salade","Lundi à vendredi midis","Unité : 1 tête pour 1 repas","Menus midi retraite",1,null,null,null,null,null,0,"VMR03","Rôti de cheval","Lundi à vendredi midis","1 morceau de 500 grammes pour 5 repas","Menus midi retraite",100,"O06","Jour de l'an","Menus midi retraite janvier"]
["MMR02","2019-01-02","PC01","Janvier","DMR01","Pomme","Lundi à vendredi midis","1 sachet de 2 kilogrammes. 1 pomme pour 1 repas","Menus midi retraite",1,"LMR17","Tomates","Lundi à vendredi midis","Unité : 2 pour 1 repas","Menus midi retraite",2,null,null,null,null,null,0,"VMR03","Rôti de cheval","Lundi à vendredi midis","1 morceau de 500 grammes pour 5 repas","Menus midi retraite",100,null,null,"Menus midi retraite janvier"]
["MMR03","2019-01-03","PC01","Janvier","DMR01","Pomme","Lundi à vendredi midis","1 sachet de 2 kilogrammes. 1 pomme pour 1 repas","Menus midi retraite",1,"LMR01","Asperges","Lundi à vendredi midis","1 boîte pour 1 repas","Menus midi retraite",1,null,null,null,null,null,0,"VMR03","Rôti de cheval","Lundi à vendredi midis","1 morceau de 500 grammes pour 5 repas","Menus midi retraite",100,null,null,"Menus midi retraite janvier"]
["MMR04","2019-01-04","PC01","Janvier","DMR01","Pomme","Lundi à vendredi midis","1 sachet de 2 kilogrammes. 1 pomme pour 1 repas","Menus midi retraite",1,"LMR02","Avocat","Lundi à vendredi midis","Unité : 1 pour 1 repas","Menus midi retraite",1,null,null,null,null,null,0,"VMR03","Rôti de cheval","Lundi à vendredi midis","1 morceau de 500 grammes pour 5 repas","Menus midi retraite",100,null,null,"Menus midi retraite janvier"]
["MMR05","2019-01-07","PC01","Janvier","DMR01","Pomme","Lundi à vendredi midis","1 sachet de 2 kilogrammes. 1 pomme pour 1 repas","Menus midi retraite",1,"LMR03","Carottes","Lundi à vendredi midis","Unité : 2 pour 1 repas","Menus midi retraite",1,null,null,null,null,null,0,"VMR04","Rôti de porc","Lundi à vendredi midis","1 morceau de 500 grammes pour 5 repas","Menus midi retraite",100,null,null,"Menus midi retraite janvier"]
["MMR06","2019-01-08","PC01","Janvier","DMR01","Pomme","Lundi à vendredi midis","1 sachet de 2 kilogrammes. 1 pomme pour 1 repas","Menus midi retraite",1,"LMR04","Céleri","Lundi à vendredi midis","Unité : 1 branche pour 1 repas","Menus midi retraite",1,null,null,null,null,null,0,"VMR04","Rôti de porc","Lundi à vendredi midis","1 morceau de 500 grammes pour 5 repas","Menus midi retraite",100,null,null,"Menus midi retraite janvier"]
["MMR09","2019-01-09","PC01","Janvier","DMR01","Pomme","Lundi à vendredi midis","1 sachet de 2 kilogrammes. 1 pomme pour 1 repas","Menus midi retraite",1,"LMR05","Champignons","Lundi à vendredi midis","1 boîte pour 1 repas","Menus midi retraite",1,null,null,null,null,null,0,"VMR04","Rôti de porc","Lundi à vendredi midis","1 morceau de 500 grammes pour 5 repas","Menus midi retraite",100,null,null,"Menus midi retraite janvier"]
["MMR10","2019-01-10","PC01","Janvier","DMR01","Pomme","Lundi à vendredi midis","1 sachet de 2 kilogrammes. 1 pomme pour 1 repas","Menus midi retraite",1,"LMR06","Concombre","Lundi à vendredi midis","Unité : 1 pour 1 repas","Menus midi retraite",1,null,null,null,null,null,0,"VMR04","Rôti de porc","Lundi à vendredi midis","1 morceau de 500 grammes pour 5 repas","Menus midi retraite",100,null,null,"Menus midi retraite janvier"]
["MMR11","2019-01-11","PC01","Janvier","DMR01","Pomme","Lundi à vendredi midis","1 sachet de 2 kilogrammes. 1 pomme pour 1 repas","Menus midi retraite",1,"LMR07","Couscous","Lundi à vendredi midis","25 grammes pour 1 repas","Menus midi retraite",25,null,null,null,null,null,0,"VMR04","Rôti de porc","Lundi à vendredi midis","1 morceau de 500 grammes pour 5 repas","Menus midi retraite",100,null,null,"Menus midi retraite janvier"]
["MMR12","2019-01-14","PC01","Janvier","DMR01","Pomme","Lundi à vendredi midis","1 sachet de 2 kilogrammes. 1 pomme pour 1 repas","Menus midi retraite",1,"LMR08","Maïs","Lundi à vendredi midis","1 boîte pour 2 repas","Menus midi retraite",0.5,null,null,null,null,null,0,"VMR05","Rôti de veau","Lundi à vendredi midis","1 morceau de 500 grammes pour 5 repas","Menus midi retraite",100,null,null,"Menus midi retraite janvier"]
["MMR13","2019-01-15","PC01","Janvier","DMR01","Pomme","Lundi à vendredi midis","1 sachet de 2 kilogrammes. 1 pomme pour 1 repas","Menus midi retraite",1,"LMR08","Maïs","Lundi à vendredi midis","1 boîte pour 2 repas","Menus midi retraite",0.5,null,null,null,null,null,0,"VMR05","Rôti de veau","Lundi à vendredi midis","1 morceau de 500 grammes pour 5 repas","Menus midi retraite",100,null,null,"Menus midi retraite janvier"]
["MMR14","2019-01-16","PC01","Janvier","DMR01","Pomme","Lundi à vendredi midis","1 sachet de 2 kilogrammes. 1 pomme pour 1 repas","Menus midi retraite",1,"LMR09","Pâtes à la sauce tomates","Lundi à vendredi midis","5 cuillères pour 1 repas","Menus midi retraite",5,null,null,null,null,null,0,"VMR05","Rôti de veau","Lundi à vendredi midis","1 morceau de 500 grammes pour 5 repas","Menus midi retraite",100,null,null,"Menus midi retraite janvier"]
["MMR13","2019-01-17","PC01","Janvier","DMR01","Pomme","Lundi à vendredi midis","1 sachet de 2 kilogrammes. 1 pomme pour 1 repas","Menus midi retraite",1,"LMR10","Pâtes au beurre","Lundi à vendredi midis","5 cuillères pour 1 repas","Menus midi retraite",5,null,null,null,null,null,0,"VMR05","Rôti de veau","Lundi à vendredi midis","1 morceau de 500 grammes pour 5 repas","Menus midi retraite",100,null,null,"Menus midi retraite janvier"]
["MMR14","2019-01-18","PC01","Janvier","DMR01","Pomme","Lundi à vendredi midis","1 sachet de 2 kilogrammes. 1 pomme pour 1 repas","Menus midi retraite",1,"LMR11","Poireau","Lundi à vendredi midis","Unité : 1 pour 1 repas","Menus midi retraite",1,null,null,null,null,null,0,"VMR05","Rôti de veau","Lundi à vendredi midis","1 morceau de 500 grammes pour 5 repas","Menus midi retraite",100,null,null,"Menus midi retraite janvier"]
["MMR15","2019-01-21","PC01","Janvier","DMR01","Pomme","Lundi à vendredi midis","1 sachet de 2 kilogrammes. 1 pomme pour 1 repas","Menus midi retraite",1,"LMR12","Pomme de terre","Lundi à vendredi midis","Unité : 1 pour 1 repas","Menus midi retraite",1,null,null,null,null,null,0,"VMR01","Rôti d'agneau","Lundi à vendredi midis","1 morceau de 500 grammes pour 5 repas","Menus midi retraite",100,null,null,"Menus midi retraite janvier"]
["MMR16","2019-01-22","PC01","Janvier","DMR01","Pomme","Lundi à vendredi midis","1 sachet de 2 kilogrammes. 1 pomme pour 1 repas","Menus midi retraite",1,"LMR13","Purée","Lundi à vendredi midis","25 grammes pour 1 repas","Menus midi retraite",25,null,null,null,null,null,0,"VMR01","Rôti d'agneau","Lundi à vendredi midis","1 morceau de 500 grammes pour 5 repas","Menus midi retraite",100,null,null,"Menus midi retraite janvier"]
["MMR17","2019-01-23","PC01","Janvier","DMR01","Pomme","Lundi à vendredi midis","1 sachet de 2 kilogrammes. 1 pomme pour 1 repas","Menus midi retraite",1,"LMR14","Radis","Lundi à vendredi midis","1 botte ou 1 sachet pour 2 repas","Menus midi retraite",0.5,null,null,null,null,null,0,"VMR01","Rôti d'agneau","Lundi à vendredi midis","1 morceau de 500 grammes pour 5 repas","Menus midi retraite",100,null,null,"Menus midi retraite janvier"]
["MMR18","2019-01-24","PC01","Janvier","DMR01","Pomme","Lundi à vendredi midis","1 sachet de 2 kilogrammes. 1 pomme pour 1 repas","Menus midi retraite",1,"LMR14","Radis","Lundi à vendredi midis","1 botte ou 1 sachet pour 2 repas","Menus midi retraite",0.5,null,null,null,null,null,0,"VMR01","Rôti d'agneau","Lundi à vendredi midis","1 morceau de 500 grammes pour 5 repas","Menus midi retraite",100,null,null,"Menus midi retraite janvier"]
["MMR19","2019-01-25","PC01","Janvier","DMR01","Pomme","Lundi à vendredi midis","1 sachet de 2 kilogrammes. 1 pomme pour 1 repas","Menus midi retraite",1,"LMR15","Riz","Lundi à vendredi midis","25 grammes pour 1 repas","Menus midi retraite",25,null,null,null,null,null,0,"VMR01","Rôti d'agneau","Lundi à vendredi midis","1 morceau de 500 grammes pour 5 repas","Menus midi retraite",100,null,null,"Menus midi retraite janvier"]
["MMR20","2019-01-28","PC01","Janvier","DMR01","Pomme","Lundi à vendredi midis","1 sachet de 2 kilogrammes. 1 pomme pour 1 repas","Menus midi retraite",1,"LMR16","Salade","Lundi à vendredi midis","Unité : 1 tête pour 1 repas","Menus midi retraite",1,null,null,null,null,null,0,"VMR02","Rôti de bœuf","Lundi à vendredi midis","1 morceau de 500 grammes pour 5 repas","Menus midi retraite",100,null,null,"Menus midi retraite janvier"]
["MMR21","2019-01-29","PC01","Janvier","DMR01","Pomme","Lundi à vendredi midis","1 sachet de 2 kilogrammes. 1 pomme pour 1 repas","Menus midi retraite",1,"LMR17","Tomates","Lundi à vendredi midis","Unité : 2 pour 1 repas","Menus midi retraite",2,null,null,null,null,null,0,"VMR02","Rôti de bœuf","Lundi à vendredi midis","1 morceau de 500 grammes pour 5 repas","Menus midi retraite",100,null,null,"Menus midi retraite janvier"]
["MMR22","2019-01-30","PC01","Janvier","DMR01","Pomme","Lundi à vendredi midis","1 sachet de 2 kilogrammes. 1 pomme pour 1 repas","Menus midi retraite",1,"LMR01","Asperges","Lundi à vendredi midis","1 boîte pour 1 repas","Menus midi retraite",1,null,null,null,null,null,0,"VMR02","Rôti de bœuf","Lundi à vendredi midis","1 morceau de 500 grammes pour 5 repas","Menus midi retraite",100,null,null,"Menus midi retraite janvier"]
["MMR23","2019-01-31","PC01","Janvier","DMR01","Pomme","Lundi à vendredi midis","1 sachet de 2 kilogrammes. 1 pomme pour 1 repas","Menus midi retraite",1,"LMR02","Avocat","Lundi à vendredi midis","Unité : 1 pour 1 repas","Menus midi retraite",1,null,null,null,null,null,0,"VMR02","Rôti de bœuf","Lundi à vendredi midis","1 morceau de 500 grammes pour 5 repas","Menus midi retraite",100,null,null,"Menus midi retraite janvier"]
["MJ01","2019-01-01","PC01","Janvier","DS01","Pomme","lundi à vendredi soirs","1 sachet de 2 kilogrammes. 1 pomme pour 1 repas","Menus journaliers",1,"LSLM14","Riz","Lundi et mardi soirs","25 grammes pour 1 repas","Menus journaliers",25,null,null,null,null,null,0,"VS22","Saucisson","Lundi à dimanche soirs","1 morceau de 400 grammes (Leclerc) pour 3 repas","Menus journaliers",0.34000000357627869,"O06","Jour de l'an","Menus journaliers janvier"]
["MJ02","2019-01-02","PC01","Janvier","DS01","Pomme","lundi à vendredi soirs","1 sachet de 2 kilogrammes. 1 pomme pour 1 repas","Menus journaliers",1,"LSMJ05","Raviolis","Mercredi et jeudi soirs","1 boîte pour 2 repas","Menus journaliers",0.5,null,null,null,null,null,0,"VS15","Pizza","Lundi à dimanche soirs","1 paquet pour 2 repas","Menus journaliers",0.5,null,null,"Menus journaliers janvier"]
["MJ03","2019-01-03","PC01","Janvier","DS01","Pomme","lundi à vendredi soirs","1 sachet de 2 kilogrammes. 1 pomme pour 1 repas","Menus journaliers",1,"LSMJ05","Raviolis","Mercredi et jeudi soirs","1 boîte pour 2 repas","Menus journaliers",0.5,null,null,null,null,null,0,"VS22","Saucisson","Lundi à dimanche soirs","1 morceau de 400 grammes (Leclerc) pour 3 repas","Menus journaliers",0.33000001311302185,null,null,"Menus journaliers janvier"]
["MJ04","2019-01-04","PC01","Janvier","DS01","Pomme","lundi à vendredi soirs","1 sachet de 2 kilogrammes. 1 pomme pour 1 repas","Menus journaliers",1,"LSV04","Carottes","Vendredi soir","Unité : 2 pour 1 repas","Menus journaliers",2,null,null,null,null,null,0,"VS16","Poisson","Lundi à dimanche soirs","Unité : 1 pour 1 repas","Menus journaliers",1,null,null,"Menus journaliers janvier"]
["MJ05","2019-01-05","PC01","Janvier","DWE16","Oranges","Samedi et dimanche midis et soirs","Unité : 1 pour 1 repas","Menus journaliers",2,"LWES01","Pâtes à la sauce tomates","Samedi midi et soir","5 cuillères pour 1 repas","Menus journaliers",10,null,null,null,null,null,0,"VS22","Saucisson","Lundi à dimanche soirs","1 morceau de 400 grammes (Leclerc) pour 3 repas","Menus journaliers",0.33000001311302185,null,null,"Menus journaliers janvier"]
["MJ06","2019-01-06","PC01","Janvier","DWE16","Oranges","Samedi et dimanche midis et soirs","Unité : 1 pour 1 repas","Menus journaliers",2,"LWED04","Haricots verts","Dimanche midi et soir","1 boîte pour 2 repas","Menus journaliers",1,null,null,null,null,null,0,"VS17","Quiche lorraine","Lundi à dimanche soirs","1 boîte pour 2 repas","Menus journaliers",1,null,null,"Menus journaliers janvier"]
["MJ07","2019-01-07","PC01","Janvier","DS01","Pomme","lundi à vendredi soirs","1 sachet de 2 kilogrammes. 1 pomme pour 1 repas","Menus journaliers",1,"LSLM01","Cassoulet","Lundi et mardi soirs","1 boîte pour 2 repas","Menus journaliers",0.5,null,null,null,null,null,0,"VS26","Viande cassoulet","Lundi et mardi soirs","1 boîte pour 2 repas","Menus journaliers",0.5,null,null,"Menus journaliers janvier"]
["MJ08","2019-01-08","PC01","Janvier","DS01","Pomme","lundi à vendredi soirs","1 sachet de 2 kilogrammes. 1 pomme pour 1 repas","Menus journaliers",1,"LSLM01","Cassoulet","Lundi et mardi soirs","1 boîte pour 2 repas","Menus journaliers",0.5,null,null,null,null,null,0,"VS26","Viande cassoulet","Lundi et mardi soirs","1 boîte pour 2 repas","Menus journaliers",0.5,null,null,"Menus journaliers janvier"]
["MJ09","2019-01-09","PC01","Janvier","DS01","Pomme","lundi à vendredi soirs","1 sachet de 2 kilogrammes. 1 pomme pour 1 repas","Menus journaliers",1,"LSMJ06","Tomates pelées","Mercredi et jeudi soirs","1 boîte pour 2 repas","Menus journaliers",0.5,null,null,null,null,null,0,"VS22","Saucisson","Lundi à dimanche soirs","1 morceau de 400 grammes (Leclerc) pour 3 repas","Menus journaliers",0.34000000357627869,null,null,"Menus journaliers janvier"]
["MJ10","2019-01-10","PC01","Janvier","DS01","Pomme","lundi à vendredi soirs","1 sachet de 2 kilogrammes. 1 pomme pour 1 repas","Menus journaliers",1,"LSMJ06","Tomates pelées","Mercredi et jeudi soirs","1 boîte pour 2 repas","Menus journaliers",0.5,null,null,null,null,null,0,"VS17","Quiche lorraine","Lundi à dimanche soirs","1 boîte pour 2 repas","Menus journaliers",1,null,null,"Menus journaliers janvier"]
["MJ11","2019-01-11","PC01","Janvier","DS01","Pomme","lundi à vendredi soirs","1 sachet de 2 kilogrammes. 1 pomme pour 1 repas","Menus journaliers",1,"LSV05","Céleri","Vendredi soir","Unité : 1 branche pour 1 repas","Menus journaliers",1,null,null,null,null,null,0,"VS22","Saucisson","Lundi à dimanche soirs","1 morceau de 400 grammes (Leclerc) pour 3 repas","Menus journaliers",0.33000001311302185,null,null,"Menus journaliers janvier"]
["MJ12","2019-01-12","PC01","Janvier","DWE17","Petits suisses","Samedi et dimanche midis et soirs","1 pack de 6 pots. 3 pots pour 1 repas","Menus journaliers",6,"LWES02","Pâtes au beurre","Samedi midi et soir","5 cuillères pour 1 repas","Menus journaliers",10,null,null,null,null,null,0,"VS18","Roulade à la pistache","Lundi à dimanche soirs","3 tranches pour 1 repas","Menus journaliers",3,null,null,"Menus journaliers janvier"]
["MJ13","2019-01-13","PC01","Janvier","DWE17","Petits suisses","Samedi et dimanche midis et soirs","1 pack de 6 pots. 3 pots pour 1 repas","Menus journaliers",6,"LWED02","Chips","Dimanche midi et soir","1 sachet pour 2 repas","Menus journaliers",1,null,null,null,null,null,0,"VS22","Saucisson","Lundi à dimanche soirs","1 morceau de 400 grammes (Leclerc) pour 3 repas","Menus journaliers",0.33000001311302185,null,null,"Menus journaliers janvier"]
["MJ14","2019-01-14","PC01","Janvier","DS01","Pomme","lundi à vendredi soirs","1 sachet de 2 kilogrammes. 1 pomme pour 1 repas","Menus journaliers",1,"LSLM02","Choucroute","Lundi et mardi soirs","1 boîte pour 2 repas","Menus journaliers",0.5,null,null,null,null,null,0,"VS27","Viande choucroute","Lundi et mardi soirs","1 boîte pour 2 repas","Menus journaliers",0.5,null,null,"Menus journaliers janvier"]
["MJ15","2019-01-15","PC01","Janvier","DS01","Pomme","lundi à vendredi soirs","1 sachet de 2 kilogrammes. 1 pomme pour 1 repas","Menus journaliers",1,"LSLM02","Choucroute","Lundi et mardi soirs","1 boîte pour 2 repas","Menus journaliers",0.5,null,null,null,null,null,0,"VS27","Viande choucroute","Lundi et mardi soirs","1 boîte pour 2 repas","Menus journaliers",0.5,null,null,"Menus journaliers janvier"]
["MJ16","2019-01-16","PC01","Janvier","DS01","Pomme","lundi à vendredi soirs","1 sachet de 2 kilogrammes. 1 pomme pour 1 repas","Menus journaliers",1,"LSMJ01","Macédoine de légumes","Mercredi et jeudi soirs","1 boîte pour 2 repas","Menus journaliers",0.5,null,null,null,null,null,0,"VS18","Roulade à la pistache","Lundi à dimanche soirs","3 tranches pour 1 repas","Menus journaliers",3,null,null,"Menus journaliers janvier"]
["MJ17","2019-01-17","PC01","Janvier","DS01","Pomme","lundi à vendredi soirs","1 sachet de 2 kilogrammes. 1 pomme pour 1 repas","Menus journaliers",1,"LSMJ01","Macédoine de légumes","Mercredi et jeudi soirs","1 boîte pour 2 repas","Menus journaliers",0.5,null,null,null,null,null,0,"VS22","Saucisson","Lundi à dimanche soirs","1 morceau de 400 grammes (Leclerc) pour 3 repas","Menus journaliers",0.34000000357627869,null,null,"Menus journaliers janvier"]
["MJ18","2019-01-18","PC01","Janvier","DS01","Pomme","lundi à vendredi soirs","1 sachet de 2 kilogrammes. 1 pomme pour 1 repas","Menus journaliers",1,"LSV06","Champignons","Vendredi soir","1 boîte pour 1 repas","Menus journaliers",1,null,null,null,null,null,0,"VS19","Roulé au fromage","Lundi à dimanche soirs","1 boîte pour 2 repas","Menus journaliers",1,null,null,"Menus journaliers janvier"]
["MJ19","2019-01-19","PC01","Janvier","DWE18","Pruneaux","Samedi et dimanche midis et soirs","1 paquet pour 4 repas","Menus journaliers",0.5,"LWES03","Pâtes au fromage râpé","Samedi midi et soir","5 cuillères pour 1 repas","Menus journaliers",10,null,null,null,null,null,0,"VS22","Saucisson","Lundi à dimanche soirs","1 morceau de 400 grammes (Leclerc) pour 3 repas","Menus journaliers",0.33000001311302185,null,null,"Menus journaliers janvier"]
["MJ20","2019-01-20","PC01","Janvier","DWE18","Pruneaux","Samedi et dimanche midis et soirs","1 paquet pour 4 repas","Menus journaliers",0.5,"LWED03","Frites","Dimanche midi","20 frites pour 1 repas","Menus journaliers",20,"LWED01","Asperges","Dimanche soir","1 bocal ou 1 boîte pour 1 repas","Menus journaliers",1,"VS19","Roulé au fromage","Lundi à dimanche soirs","1 boîte pour 2 repas","Menus journaliers",1,null,null,"Menus journaliers janvier"]
["MJ21","2019-01-21","PC01","Janvier","DS01","Pomme","lundi à vendredi soirs","1 sachet de 2 kilogrammes. 1 pomme pour 1 repas","Menus journaliers",1,"LSLM03","Chou-fleur","Lundi et mardi soirs","Unité : 1 pour 2 repas","Menus journaliers",0.5,null,null,null,null,null,0,"VS22","Saucisson","Lundi à dimanche soirs","1 morceau de 400 grammes (Leclerc) pour 3 repas","Menus journaliers",0.33000001311302185,null,null,"Menus journaliers janvier"]
["MJ22","2019-01-22","PC01","Janvier","DS01","Pomme","lundi à vendredi soirs","1 sachet de 2 kilogrammes. 1 pomme pour 1 repas","Menus journaliers",1,"LSLM03","Chou-fleur","Lundi et mardi soirs","Unité : 1 pour 2 repas","Menus journaliers",0.5,null,null,null,null,null,0,"VS20","Salami","Lundi à dimanche soirs","1 paquet pour 2 repas","Menus journaliers",0.5,null,null,"Menus journaliers janvier"]
["MJ23","2019-01-23","PC01","Janvier","DS01","Pomme","lundi à vendredi soirs","1 sachet de 2 kilogrammes. 1 pomme pour 1 repas","Menus journaliers",1,"LSMJ02","Petits pois","Mercredi et jeudi soirs","1 boîte pour 2 repas","Menus journaliers",0.5,null,null,null,null,null,0,"VS22","Saucisson","Lundi à dimanche soirs","1 morceau de 400 grammes (Leclerc) pour 3 repas","Menus journaliers",0.34000000357627869,null,null,"Menus journaliers janvier"]
["MJ24","2019-01-24","PC01","Janvier","DS01","Pomme","lundi à vendredi soirs","1 sachet de 2 kilogrammes. 1 pomme pour 1 repas","Menus journaliers",1,"LSMJ02","Petits pois","Mercredi et jeudi soirs","1 boîte pour 2 repas","Menus journaliers",0.5,null,null,null,null,null,0,"VS20","Salami","Lundi à dimanche soirs","1 paquet pour 2 repas","Menus journaliers",0.5,null,null,"Menus journaliers janvier"]
["MJ25","2019-01-25","PC01","Janvier","DS01","Pomme","lundi à vendredi soirs","1 sachet de 2 kilogrammes. 1 pomme pour 1 repas","Menus journaliers",1,"LSV07","Concombre","Vendredi soir","Unité : 1 pour 1 repas","Menus journaliers",1,null,null,null,null,null,0,"VS22","Saucisson","Lundi à dimanche soirs","1 morceau de 400 grammes (Leclerc) pour 3 repas","Menus journaliers",0.33000001311302185,null,null,"Menus journaliers janvier"]
["MJ26","2019-01-26","PC01","Janvier","DWE12","Gâteau de riz","Samedi et dimanche midis et soirs","1 pack de 4 pots pour le week-end. 1 pot pour 1 repas","Menus journaliers",2,"LWES01","Pâtes à la sauce tomates","Samedi midi et soir","5 cuillères pour 1 repas","Menus journaliers",10,null,null,null,null,null,0,"VS21","Saucisses","Lundi à dimanche soirs","1 paquet pour 2 repas. 1 ou 2 saucisses pour 1 repas","Menus journaliers",0.5,null,null,"Menus journaliers janvier"]
["MJ27","2019-01-27","PC01","Janvier","DWE12","Gâteau de riz","Samedi et dimanche midis et soirs","1 pack de 4 pots pour le week-end. 1 pot pour 1 repas","Menus journaliers",2,"LWED04","Haricots verts","Dimanche midi et soir","1 boîte pour 2 repas","Menus journaliers",1,null,null,null,null,null,0,"VS22","Saucisson","Lundi à dimanche soirs","1 morceau de 400 grammes (Leclerc) pour 3 repas","Menus journaliers",0.33000001311302185,null,null,"Menus journaliers janvier"]
["MJ28","2019-01-28","PC01","Janvier","DS01","Pomme","lundi à vendredi soirs","1 sachet de 2 kilogrammes. 1 pomme pour 1 repas","Menus journaliers",1,"LSLM04","Choux de Bruxelles","Lundi et mardi soirs","1 boîte pour 2 repas","Menus journaliers",0.5,null,null,null,null,null,0,"VS21","Saucisses","Lundi à dimanche soirs","1 paquet pour 2 repas. 1 ou 2 saucisses pour 1 repas","Menus journaliers",0.5,null,null,"Menus journaliers janvier"]
["MJ29","2019-01-29","PC01","Janvier","DS01","Pomme","lundi à vendredi soirs","1 sachet de 2 kilogrammes. 1 pomme pour 1 repas","Menus journaliers",1,"LSLM04","Choux de Bruxelles","Lundi et mardi soirs","1 boîte pour 2 repas","Menus journaliers",0.5,null,null,null,null,null,0,"VS22","Saucisson","Lundi à dimanche soirs","1 morceau de 400 grammes (Leclerc) pour 3 repas","Menus journaliers",0.34000000357627869,null,null,"Menus journaliers janvier"]
["MJ30","2019-01-30","PC01","Janvier","DS01","Pomme","lundi à vendredi soirs","1 sachet de 2 kilogrammes. 1 pomme pour 1 repas","Menus journaliers",1,"LSMJ03","Petits pois et jeunes carottes","Mercredi et jeudi soirs","1 boîte pour 2 repas","Menus journaliers",0.5,null,null,null,null,null,0,"VS23","Tête persillée","Lundi à dimanche soirs","1 tranche pour 2 repas","Menus journaliers",3,null,null,"Menus journaliers janvier"]
["MJ31","2019-01-31","PC01","Janvier","DS01","Pomme","lundi à vendredi soirs","1 sachet de 2 kilogrammes. 1 pomme pour 1 repas","Menus journaliers",1,"LSMJ03","Petits pois et jeunes carottes","Mercredi et jeudi soirs","1 boîte pour 2 repas","Menus journaliers",0.5,null,null,null,null,null,0,"VS22","Saucisson","Lundi à dimanche soirs","1 morceau de 400 grammes (Leclerc) pour 3 repas","Menus journaliers",0.33000001311302185,null,null,"Menus journaliers janvier"]
["MVWE01","2019-01-05","PC01","Janvier",null,null,null,null,null,0,null,null,null,null,null,0,null,null,null,null,null,0,"VWE03","Cheval","Samedi et dimanche midis","1 tranche pour 1 repas","Menus viandes week-end",1,null,null,"Menus viandes weekend premier semestre"]
["MVWE02","2019-01-06","PC01","Janvier",null,null,null,null,null,0,null,null,null,null,null,0,null,null,null,null,null,0,"VWE04","Dinde","Samedi et dimanche midis","1 tranche pour 1 repas","Menus viandes week-end",1,null,null,"Menus viandes weekend premier semestre"]
["MVWE03","2019-01-12","PC01","Janvier",null,null,null,null,null,0,null,null,null,null,null,0,null,null,null,null,null,0,"VWE05","Poisson","Samedi et dimanche midis","Unité : 1 pour 1 repas","Menus viandes week-end",1,null,null,"Menus viandes weekend premier semestre"]
["MVWE04","2019-01-13","PC01","Janvier",null,null,null,null,null,0,null,null,null,null,null,0,null,null,null,null,null,0,"VWE06","Porc","Samedi et dimanche midis","1 tranche pour 1 repas","Menus viandes week-end",1,null,null,"Menus viandes weekend premier semestre"]
["MVWE05","2019-01-19","PC01","Janvier",null,null,null,null,null,0,null,null,null,null,null,0,null,null,null,null,null,0,"VWE07","Veau","Samedi et dimanche midis","1 tranche pour 1 repas","Menus viandes week-end",1,null,null,"Menus viandes weekend premier semestre"]
["MVWE06","2019-01-20","PC01","Janvier",null,null,null,null,null,0,null,null,null,null,null,0,null,null,null,null,null,0,"VWE01","Agneau","Samedi et dimanche midis","1 tranche pour 1 repas","Menus viandes week-end",1,null,null,"Menus viandes weekend premier semestre"]
["MVWE07","2019-01-26","PC01","Janvier",null,null,null,null,null,0,null,null,null,null,null,0,null,null,null,null,null,0,"VWE02","Bœuf","Samedi et dimanche midis","1 tranche pour 1 repas","Menus viandes week-end",1,null,null,"Menus viandes weekend premier semestre"]
["MVWE08","2019-01-27","PC01","Janvier",null,null,null,null,null,0,null,null,null,null,null,0,null,null,null,null,null,0,"VWE03","Cheval","Samedi et dimanche midis","1 tranche pour 1 repas","Menus viandes week-end",1,null,null,"Menus viandes weekend premier semestre"]

{"sheet":"Février","index":9,"n_rows":59,"n_cols":31,"rows_kept":59,"cut":false,"hidden":false,"merged":[[0,0,0,30]]}
["Menus du mois de février  2018."]
[]
["Numéro du menu","Date du menu","Code période concernée","Période concernée","Code dessert","Dessert","Jour dessert","Conditionnement dessert","Destination dessert","Quantité dessert","Code légume","Légume","Jour légume","Conditionnement légume","Destination légume","Quantité légume","Code légume deux","Légume deux","Jour légume deux","Conditionnement légume deux","Destination légume deux","Quantité légume deux","Code viande","Viande","Jour viande","Conditionnement viande","Destination viande","Quantité viande","Code observation","Observation","Titre"]
["MMR24","2019-02-01","PC02","Février","DMR01","Pomme","Lundi à vendredi midis","1 sachet de 2 kilogrammes. 1 pomme pour 1 repas","Menus midi retraite",1,"LMR03","Carottes","Lundi à vendredi midis","Unité : 2 pour 1 repas","Menus midi retraite",2,null,null,null,null,null,0,"VMR02","Rôti de bœuf","Lundi à vendredi midis","1 morceau de 500 grammes pour 5 repas","Menus midi retraite",100,null,null,"Menus midi retraite février"]
["MMR25","2019-02-04","PC02","Février","DMR01","Pomme","Lundi à vendredi midis","1 sachet de 2 kilogrammes. 1 pomme pour 1 repas","Menus midi retraite",1,"LMR04","Céleri","Lundi à vendredi midis","Unité : 1 branche pour 1 repas","Menus midi retraite",2,null,null,null,null,null,0,"VMR03","Rôti de cheval","Lundi à vendredi midis","1 morceau de 500 grammes pour 5 repas","Menus midi retraite",100,null,null,"Menus midi retraite février"]
["MMR26","2019-02-05","PC02","Février","DMR01","Pomme","Lundi à vendredi midis","1 sachet de 2 kilogrammes. 1 pomme pour 1 repas","Menus midi retraite",1,"LMR05","Champignons","Lundi à vendredi midis","1 boîte pour 1 repas","Menus midi retraite",1,null,null,null,null,null,0,"VMR03","Rôti de cheval","Lundi à vendredi midis","1 morceau de 500 grammes pour 5 repas","Menus midi retraite",100,null,null,"Menus midi retraite février"]
["MMR27","2019-02-06","PC02","Février","DMR01","Pomme","Lundi à vendredi midis","1 sachet de 2 kilogrammes. 1 pomme pour 1 repas","Menus midi retraite",1,"LMR06","Concombre","Lundi à vendredi midis","Unité : 1 pour 1 repas","Menus midi retraite",1,null,null,null,null,null,0,"VMR03","Rôti de cheval","Lundi à vendredi midis","1 morceau de 500 grammes pour 5 repas","Menus midi retraite",100,null,null,"Menus midi retraite février"]
["MMR28","2019-02-07","PC02","Février","DMR01","Pomme","Lundi à vendredi midis","1 sachet de 2 kilogrammes. 1 pomme pour 1 repas","Menus midi retraite",1,"LMR07","Couscous","Lundi à vendredi midis","25 grammes pour 1 repas","Menus midi retraite",25,null,null,null,null,null,0,"VMR03","Rôti de cheval","Lundi à vendredi midis","1 morceau de 500 grammes pour 5 repas","Menus midi retraite",100,null,null,"Menus midi retraite février"]
["MMR29","2019-02-08","PC02","Février","DMR01","Pomme","Lundi à vendredi midis","1 sachet de 2 kilogrammes. 1 pomme pour 1 repas","Menus midi retraite",1,"LMR08","Maïs","Lundi à vendredi midis","1 boîte pour 2 repas","Menus midi retraite",0.5,null,null,null,null,null,0,"VMR03","Rôti de cheval","Lundi à vendredi midis","1 morceau de 500 grammes pour 5 repas","Menus midi retraite",100,null,null,"Menus midi retraite février"]
["MMR30","2019-02-11","PC02","Février","DMR01","Pomme","Lundi à vendredi midis","1 sachet de 2 kilogrammes. 1 pomme pour 1 repas","Menus midi retraite",1,"LMR08","Maïs","Lundi à vendredi midis","1 boîte pour 2 repas","Menus midi retraite",0.5,null,null,null,null,null,0,"VMR04","Rôti de porc","Lundi à vendredi midis","1 morceau de 500 grammes pour 5 repas","Menus midi retraite",100,null,null,"Menus midi retraite février"]
["MMR31","2019-02-12","PC02","Février","DMR01","Pomme","Lundi à vendredi midis","1 sachet de 2 kilogrammes. 1 pomme pour 1 repas","Menus midi retraite",1,"LMR09","Pâtes à la sauce tomates","Lundi à vendredi midis","5 cuillères pour 1 repas","Menus midi retraite",5,null,null,null,null,null,0,"VMR04","Rôti de porc","Lundi à vendredi midis","1 morceau de 500 grammes pour 5 repas","Menus midi retraite",100,null,null,"Menus midi retraite février"]
["MMR32","2019-02-13","PC02","Février","DMR01","Pomme","Lundi à vendredi midis","1 sachet de 2 kilogrammes. 1 pomme pour 1 repas","Menus midi retraite",1,"LMR10","Pâtes au beurre","Lundi à vendredi midis","5 cuillères pour 1 repas","Menus midi retraite",5,null,null,null,null,null,0,"VMR04","Rôti de porc","Lundi à vendredi midis","1 morceau de 500 grammes pour 5 repas","Menus midi retraite",100,null,null,"Menus midi retraite février"]
["MMR33","2019-02-14","PC02","Février","DMR01","Pomme","Lundi à vendredi midis","1 sachet de 2 kilogrammes. 1 pomme pour 1 repas","Menus midi retraite",1,"LMR11","Poireau","Lundi à vendredi midis","Unité : 1 pour 1 repas","Menus midi retraite",1,null,null,null,null,null,0,"VMR04","Rôti de porc","Lundi à vendredi midis","1 morceau de 500 grammes pour 5 repas","Menus midi retraite",100,null,null,"Menus midi retraite février"]
["MMR34","2019-02-15","PC02","Février","DMR01","Pomme","Lundi à vendredi midis","1 sachet de 2 kilogrammes. 1 pomme pour 1 repas","Menus midi retraite",1,"LMR12","Pomme de terre","Lundi à vendredi midis","Unité : 1 pour 1 repas","Menus midi retraite",1,null,null,null,null,null,0,"VMR04","Rôti de porc","Lundi à vendredi midis","1 morceau de 500 grammes pour 5 repas","Menus midi retraite",100,null,null,"Menus midi retraite février"]
["MMR35","2019-02-18","PC02","Février","DMR01","Pomme","Lundi à vendredi midis","1 sachet de 2 kilogrammes. 1 pomme pour 1 repas","Menus midi retraite",1,"LMR13","Purée","Lundi à vendredi midis","25 grammes pour 1 repas","Menus midi retraite",25,null,null,null,null,null,0,"VMR05","Rôti de veau","Lundi à vendredi midis","1 morceau de 500 grammes pour 5 repas","Menus midi retraite",100,null,null,"Menus midi retraite février"]
["MMR36","2019-02-19","PC02","Février","DMR01","Pomme","Lundi à vendredi midis","1 sachet de 2 kilogrammes. 1 pomme pour 1 repas","Menus midi retraite",1,"LMR14","Radis","Lundi à vendredi midis","1 botte ou 1 sachet pour 2 repas","Menus midi retraite",0.5,null,null,null,null,null,0,"VMR05","Rôti de veau","Lundi à vendredi midis","1 morceau de 500 grammes pour 5 repas","Menus midi retraite",100,null,null,"Menus midi retraite février"]
["MMR37","2019-02-20","PC02","Février","DMR01","Pomme","Lundi à vendredi midis","1 sachet de 2 kilogrammes. 1 pomme pour 1 repas","Menus midi retraite",1,"LMR14","Radis","Lundi à vendredi midis","1 botte ou 1 sachet pour 2 repas","Menus midi retraite",0.5,null,null,null,null,null,0,"VMR05","Rôti de veau","Lundi à vendredi midis","1 morceau de 500 grammes pour 5 repas","Menus midi retraite",100,null,null,"Menus midi retraite février"]
["MMR38","2019-02-21","PC02","Février","DMR01","Pomme","Lundi à vendredi midis","1 sachet de 2 kilogrammes. 1 pomme pour 1 repas","Menus midi retraite",1,"LMR15","Riz","Lundi à vendredi midis","25 grammes pour 1 repas","Menus midi retraite",25,null,null,null,null,null,0,"VMR05","Rôti de veau","Lundi à vendredi midis","1 morceau de 500 grammes pour 5 repas","Menus midi retraite",100,null,null,"Menus midi retraite février"]
["MMR39","2019-02-22","PC02","Février","DMR01","Pomme","Lundi à vendredi midis","1 sachet de 2 kilogrammes. 1 pomme pour 1 repas","Menus midi retraite",1,"LMR16","Salade","Lundi à vendredi midis","Unité : 1 tête pour 1 repas","Menus midi retraite",1,null,null,null,null,null,0,"VMR05","Rôti de veau","Lundi à vendredi midis","1 morceau de 500 grammes pour 5 repas","Menus midi retraite",100,null,null,"Menus midi retraite février"]
["MMR40","2019-02-25","PC02","Février","DMR01","Pomme","Lundi à vendredi midis","1 sachet de 2 kilogrammes. 1 pomme pour 1 repas","Menus midi retraite",1,"LMR17","Tomates","Lundi à vendredi midis","Unité : 2 pour 1 repas","Menus midi retraite",2,null,null,null,null,null,0,"VMR01","Rôti d'agneau","Lundi à vendredi midis","1 morceau de 500 grammes pour 5 repas","Menus midi retraite",100,null,null,"Menus midi retraite février"]
["MMR41","2019-02-26","PC02","Février","DMR01","Pomme","Lundi à vendredi midis","1 sachet de 2 kilogrammes. 1 pomme pour 1 repas","Menus midi retraite",1,"LMR01","Asperges","Lundi à vendredi midis","1 boîte pour 1 repas","Menus midi retraite",1,null,null,null,null,null,0,"VMR01","Rôti d'agneau","Lundi à vendredi midis","1 morceau de 500 grammes pour 5 repas","Menus midi retraite",100,null,null,"Menus midi retraite février"]
["MMR42","2019-02-27","PC02","Février","DMR01","Pomme","Lundi à vendredi midis","1 sachet de 2 kilogrammes. 1 pomme pour 1 repas","Menus midi retraite",1,"LMR02","Avocat","Lundi à vendredi midis","Unité : 1 pour 1 repas","Menus midi retraite",1,null,null,null,null,null,0,"VMR01","Rôti d'agneau","Lundi à vendredi midis","1 morceau de 500 grammes pour 5 repas","Menus midi retraite",100,null,null,"Menus midi retraite février"]
["MMR43","2019-02-28","PC02","Février","DMR01","Pomme","Lundi à vendredi midis","1 sachet de 2 kilogrammes. 1 pomme pour 1 repas","Menus midi retraite",1,"LMR03","Carottes","Lundi à vendredi midis","Unité : 2 pour 1 repas","Menus midi retraite",2,null,null,null,null,null,0,"VMR01","Rôti d'agneau","Lundi à vendredi midis","1 morceau de 500 grammes pour 5 repas","Menus midi retraite",100,null,null,"Menus midi retraite février"]
["MJ32","2019-02-01","PC02","Février","DS01","Pomme","lundi à vendredi soirs","1 sachet de 2 kilogrammes. 1 pomme pour 1 repas","Menus journaliers",1,"LSV08","Radis","Vendredi soir","1 botte ou 1 sachet pour 1 repas","Menus journaliers",1,null,null,null,null,null,0,"VS23","Tête persillée","Lundi à dimanche soirs","1 tranche pour 2 repas","Menus journaliers",3,null,null,"Menus journaliers février"]
["MJ33","2019-02-02","PC02","Février","DWE19","Tapioca","Samedi et dimanche midis et soirs","25 grammes pour 1 repas","Menus journaliers",50,"LWES02","Pâtes au beurre","Samedi midi et soir","5 cuillères pour 1 repas","Menus journaliers",10,null,null,null,null,null,0,"VS22","Saucisson","Lundi à dimanche soirs","1 morceau de 400 grammes (Leclerc) pour 3 repas","Menus journaliers",0.33000001311302185,null,null,"Menus journaliers février"]
["MJ34","2019-02-03","PC02","Février","DWE19","Tapioca","Samedi et dimanche midis et soirs","25 grammes pour 1 repas","Menus journaliers",50,"LWED02","Chips","Dimanche midi et soir","1 sachet pour 2 repas","Menus journaliers",1,null,null,null,null,null,0,"VS24","Tête roulée","Lundi à dimanche soirs","1 tranche pour 2 repas","Menus journaliers",0.5,null,null,"Menus journaliers février"]
["MJ35","2019-02-04","PC02","Février","DS01","Pomme","lundi à vendredi soirs","1 sachet de 2 kilogrammes. 1 pomme pour 1 repas","Menus journaliers",1,"LSLM05","Couscous","Lundi et mardi soirs","25 grammes pour 1 repas","Menus journaliers",25,null,null,null,null,null,0,"VS22","Saucisson","Lundi à dimanche soirs","1 morceau de 400 grammes (Leclerc) pour 3 repas","Menus journaliers",0.34000000357627869,null,null,"Menus journaliers février"]
["MJ36","2019-02-05","PC02","Février","DS01","Pomme","lundi à vendredi soirs","1 sachet de 2 kilogrammes. 1 pomme pour 1 repas","Menus journaliers",1,"LSLM05","Couscous","Lundi et mardi soirs","25 grammes pour 1 repas","Menus journaliers",25,null,null,null,null,null,0,"VS24","Tête roulée","Lundi à dimanche soirs","1 tranche pour 2 repas","Menus journaliers",0.5,null,null,"Menus journaliers février"]
["MJ37","2019-02-06","PC02","Février","DS01","Pomme","lundi à vendredi soirs","1 sachet de 2 kilogrammes. 1 pomme pour 1 repas","Menus journaliers",1,"LSMJ04","Ratatouille","Mercredi et jeudi soirs","1 boîte pour 2 repas","Menus journaliers",0.5,null,null,null,null,null,0,"VS22","Saucisson","Lundi à dimanche soirs","1 morceau de 400 grammes (Leclerc) pour 3 repas","Menus journaliers",0.33000001311302185,null,null,"Menus journaliers février"]
["MJ38","2019-02-07","PC02","Février","DS01","Pomme","lundi à vendredi soirs","1 sachet de 2 kilogrammes. 1 pomme pour 1 repas","Menus journaliers",1,"LSMJ04","Ratatouille","Mercredi et jeudi soirs","1 boîte pour 2 repas","Menus journaliers",0.5,null,null,null,null,null,0,"VS25","Thon","Lundi à dimanche soirs","1 boîte pour 1 repas","Menus journaliers",1,null,null,"Menus journaliers février"]
["MJ39","2019-02-08","PC02","Février","DS01","Pomme","lundi à vendredi soirs","1 sachet de 2 kilogrammes. 1 pomme pour 1 repas","Menus journaliers",1,"LSV09","Salade","Vendredi soir","Unité : 1 tête pour 1 repas","Menus journaliers",1,null,null,null,null,null,0,"VS22","Saucisson","Lundi à dimanche soirs","1 morceau de 400 grammes (Leclerc) pour 3 repas","Menus journaliers",0.33000001311302185,null,null,"Menus journaliers février"]
["MJ40","2019-02-09","PC02","Février","DWE20","Yaourts","Samedi et dimanche midis et soirs","1 pack de 4 pots pour le week-end. 1 pot pour 1 repas","Menus journaliers",2,"LWES03","Pâtes au fromage râpé","Samedi midi et soir","5 cuillères pour 1 repas","Menus journaliers",10,null,null,null,null,null,0,"VS01","Bifteck haché de bœuf","Lundi à dimanche soirs","1 paquet pour 2 repas","Menus journaliers",1,null,null,"Menus journaliers février"]
["MJ41","2019-02-10","PC02","Février","DWE20","Yaourts","Samedi et dimanche midis et soirs","1 pack de 4 pots pour le week-end. 1 pot pour 1 repas","Menus journaliers",2,"LWED03","Frites","Dimanche midi","20 frites pour 1 repas","Menus journaliers",20,"LWED01","Asperges","Dimanche soir","1 bocal ou 1 boîte pour 1 repas","Menus journaliers",1,"VS22","Saucisson","Lundi à dimanche soirs","1 morceau de 400 grammes (Leclerc) pour 3 repas","Menus journaliers",0.34000000357627869,null,null,"Menus journaliers février"]
["MJ42","2019-02-11","PC02","Février","DS01","Pomme","lundi à vendredi soirs","1 sachet de 2 kilogrammes. 1 pomme pour 1 repas","Menus journaliers",1,"LSLM06","Endives","Lundi et mardi soirs","1 boîte pour 2 repas","Menus journaliers",0.5,null,null,null,null,null,0,"VS01","Bifteck haché de bœuf","Lundi à dimanche soirs","1 paquet pour 2 repas","Menus journaliers",1,null,null,"Menus journaliers février"]
["MJ43","2019-02-12","PC02","Février","DS01","Pomme","lundi à vendredi soirs","1 sachet de 2 kilogrammes. 1 pomme pour 1 repas","Menus journaliers",1,"LSLM06","Endives","Lundi et mardi soirs","1 boîte pour 2 repas","Menus journaliers",0.5,null,null,null,null,null,0,"VS22","Saucisson","Lundi à dimanche soirs","1 morceau de 400 grammes (Leclerc) pour 3 repas","Menus journaliers",0.33000001311302185,null,null,"Menus journaliers février"]
["MJ44","2019-02-13","PC02","Février","DS01","Pomme","lundi à vendredi soirs","1 sachet de 2 kilogrammes. 1 pomme pour 1 repas","Menus journaliers",1,"LSMJ05","Raviolis","Mercredi et jeudi soirs","1 boîte pour 2 repas","Menus journaliers",0.5,null,null,null,null,null,0,"VS02","Bifteck haché de cheval","Lundi à dimanche soirs","125 grammes pour 1 repas","Menus journaliers",125,null,null,"Menus journaliers février"]
["MJ45","2019-02-14","PC02","Février","DS01","Pomme","lundi à vendredi soirs","1 sachet de 2 kilogrammes. 1 pomme pour 1 repas","Menus journaliers",1,"LSMJ05","Raviolis","Mercredi et jeudi soirs","1 boîte pour 2 repas","Menus journaliers",0.5,null,null,null,null,null,0,"VS22","Saucisson","Lundi à dimanche soirs","1 morceau de 400 grammes (Leclerc) pour 3 repas","Menus journaliers",0.33000001311302185,null,null,"Menus journaliers février"]
["MJ46","2019-02-15","PC02","Février","DS01","Pomme","lundi à vendredi soirs","1 sachet de 2 kilogrammes. 1 pomme pour 1 repas","Menus journaliers",1,"LSV10","Salsifis","Vendredi soir","1 boîte pour 1 repas","Menus journaliers",1,null,null,null,null,null,0,"VS03","Bifteck haché de veau","Lundi à dimanche soirs","1 paquet pour 2 repas","Menus journaliers",1,null,null,"Menus journaliers février"]
["MJ47","2019-02-16","PC02","Février","DWE01","Ananas","Samedi et dimanche midis et soirs","Unité : 1 pour 4 repas","Menus journaliers",0.5,"LWES01","Pâtes à la sauce tomates","Samedi midi et soir","5 cuillères pour 1 repas","Menus journaliers",10,null,null,null,null,null,0,"VS22","Saucisson","Lundi à dimanche soirs","1 morceau de 400 grammes (Leclerc) pour 3 repas","Menus journaliers",0.34000000357627869,null,null,"Menus journaliers février"]
["MJ48","2019-02-17","PC02","Février","DWE01","Ananas","Samedi et dimanche midis et soirs","Unité : 1 pour 4 repas","Menus journaliers",0.5,"LWED04","Haricots verts","Dimanche midi et soir","1 boîte pour 2 repas","Menus journaliers",1,null,null,null,null,null,0,"VS03","Bifteck haché de veau","Lundi à dimanche soirs","1 paquet pour 2 repas","Menus journaliers",1,null,null,"Menus journaliers février"]
["MJ49","2019-02-18","PC02","Février","DS01","Pomme","lundi à vendredi soirs","1 sachet de 2 kilogrammes. 1 pomme pour 1 repas","Menus journaliers",1,"LSLM07","Haricots verts","Lundi et mardi soirs","1 boîte pour 2 repas","Menus journaliers",0.5,null,null,null,null,null,0,"VS22","Saucisson","Lundi à dimanche soirs","1 morceau de 400 grammes (Leclerc) pour 3 repas","Menus journaliers",0.33000001311302185,null,null,"Menus journaliers février"]
["MJ50","2019-02-19","PC02","Février","DS01","Pomme","lundi à vendredi soirs","1 sachet de 2 kilogrammes. 1 pomme pour 1 repas","Menus journaliers",1,"LSLM07","Haricots verts","Lundi et mardi soirs","1 boîte pour 2 repas","Menus journaliers",0.5,null,null,null,null,null,0,"VS04","Bouchée à la reine","Lundi à dimanche soirs","1 boîte pour 2 repas","Menus journaliers",1,null,null,"Menus journaliers février"]
["MJ51","2019-02-20","PC02","Février","DS01","Pomme","lundi à vendredi soirs","1 sachet de 2 kilogrammes. 1 pomme pour 1 repas","Menus journaliers",1,"LSMJ06","Tomates pelées","Mercredi et jeudi soirs","1 boîte pour 2 repas","Menus journaliers",0.5,null,null,null,null,null,0,"VS22","Saucisson","Lundi à dimanche soirs","1 morceau de 400 grammes (Leclerc) pour 3 repas","Menus journaliers",0.33000001311302185,null,null,"Menus journaliers février"]
["MJ52","2019-02-21","PC02","Février","DS01","Pomme","lundi à vendredi soirs","1 sachet de 2 kilogrammes. 1 pomme pour 1 repas","Menus journaliers",1,"LSMJ06","Tomates pelées","Mercredi et jeudi soirs","1 boîte pour 2 repas","Menus journaliers",0.5,null,null,null,null,null,0,"VS04","Bouchée à la reine","Lundi à dimanche soirs","1 boîte pour 2 repas","Menus journaliers",1,null,null,"Menus journaliers février"]
["MJ53","2019-02-22","PC02","Février","DS01","Pomme","lundi à vendredi soirs","1 sachet de 2 kilogrammes. 1 pomme pour 1 repas","Menus journaliers",1,"LSV11","Tomates ","Vendredi soir","Unité : 2 pour 1 repas","Menus journaliers",2,null,null,null,null,null,0,"VS22","Saucisson","Lundi à dimanche soirs","1 morceau de 400 grammes (Leclerc) pour 3 repas","Menus journaliers",0.34000000357627869,null,null,"Menus journaliers février"]
["MJ54","2019-02-23","PC02","Février","DWE02","Autres fruits","Samedi et dimanche midis et soirs","Unité : 2 à 4 pour 1 repas","Menus journaliers",8,"LWES02","Pâtes au beurre","Samedi midi et soir","5 cuillères pour 1 repas","Menus journaliers",10,null,null,null,null,null,0,"VS05","Boudin","Lundi à dimanche soirs","1 paquet pour 2 repas","Menus journaliers",0.5,null,null,"Menus journaliers février"]
["MJ55","2019-02-24","PC02","Février","DWE02","Autres fruits","Samedi et dimanche midis et soirs","Unité : 2 à 4 pour 1 repas","Menus journaliers",8,"LWED02","Chips","Dimanche midi et soir","1 sachet pour 2 repas","Menus journaliers",1,null,null,null,null,null,0,"VS22","Saucisson","Lundi à dimanche soirs","1 morceau de 400 grammes (Leclerc) pour 3 repas","Menus journaliers",0.33000001311302185,null,null,"Menus journaliers février"]
["MJ56","2019-02-25","PC02","Février","DS01","Pomme","lundi à vendredi soirs","1 sachet de 2 kilogrammes. 1 pomme pour 1 repas","Menus journaliers",1,"LSLM08","Maïs","Lundi et mardi soirs","1 boîte pour 2 repas","Menus journaliers",0.5,null,null,null,null,null,0,"VS05","Boudin","Lundi à dimanche soirs","1 paquet pour 2 repas","Menus journaliers",0.5,null,null,"Menus journaliers février"]
["MJ57","2019-02-26","PC02","Février","DS01","Pomme","lundi à vendredi soirs","1 sachet de 2 kilogrammes. 1 pomme pour 1 repas","Menus journaliers",1,"LSLM08","Maïs","Lundi et mardi soirs","1 boîte pour 2 repas","Menus journaliers",0.5,null,null,null,null,null,0,"VS22","Saucisson","Lundi à dimanche soirs","1 morceau de 400 grammes (Leclerc) pour 3 repas","Menus journaliers",0.33000001311302185,null,null,"Menus journaliers février"]
["MJ58","2019-02-27","PC02","Février","DS01","Pomme","lundi à vendredi soirs","1 sachet de 2 kilogrammes. 1 pomme pour 1 repas","Menus journaliers",1,"LSMJ01","Macédoine de légumes","Mercredi et jeudi soirs","1 boîte pour 2 repas","Menus journaliers",0.5,null,null,null,null,null,0,"VS06","Cervelas","Lundi à dimanche soirs","1 paquet pour 2 repas","Menus journaliers",0.5,null,null,"Menus journaliers février"]
["MJ59","2019-02-28","PC02","Février","DS01","Pomme","lundi à vendredi soirs","1 sachet de 2 kilogrammes. 1 pomme pour 1 repas","Menus journaliers",1,"LSMJ01","Macédoine de légumes","Mercredi et jeudi soirs","1 boîte pour 2 repas","Menus journaliers",0.5,null,null,null,null,null,0,"VS22","Saucisson","Lundi à dimanche soirs","1 morceau de 400 grammes (Leclerc) pour 3 repas","Menus journaliers",0.34000000357627869,null,null,"Menus journaliers février"]
["MVWE09","2019-02-02","PC02","Février",null,null,null,null,null,0,null,null,null,null,null,0,null,null,null,null,null,0,"VWE04","Dinde","Samedi et dimanche midis","1 tranche pour 1 repas","Menus viandes week-end",1,null,null,"Menus viandes weekend premier semestre"]
["MVWE10","2019-02-03","PC02","Février",null,null,null,null,null,0,null,null,null,null,null,0,null,null,null,null,null,0,"VWE05","Poisson","Samedi et dimanche midis","Unité : 1 pour 1 repas","Menus viandes week-end",1,null,null,"Menus viandes weekend premier semestre"]
["MVWE11","2019-02-09","PC02","Février",null,null,null,null,null,0,null,null,null,null,null,0,null,null,null,null,null,0,"VWE06","Porc","Samedi et dimanche midis","1 tranche pour 1 repas","Menus viandes week-end",1,null,null,"Menus viandes weekend premier semestre"]
["MVWE12","2019-02-10","PC02","Février",null,null,null,null,null,0,null,null,null,null,null,0,null,null,null,null,null,0,"VWE07","Veau","Samedi et dimanche midis","1 tranche pour 1 repas","Menus viandes week-end",1,null,null,"Menus viandes weekend premier semestre"]
["MVWE13","2019-02-16","PC02","Février",null,null,null,null,null,0,null,null,null,null,null,0,null,null,null,null,null,0,"VWE01","Agneau","Samedi et dimanche midis","1 tranche pour 1 repas","Menus viandes week-end",1,null,null,"Menus viandes weekend premier semestre"]
["MVWE14","2019-02-17","PC02","Février",null,null,null,null,null,0,null,null,null,null,null,0,null,null,null,null,null,0,"VWE02","Bœuf","Samedi et dimanche midis","1 tranche pour 1 repas","Menus viandes week-end",1,null,null,"Menus viandes weekend premier semestre"]
["MVWE15","2019-02-23","PC02","Février",null,null,null,null,null,0,null,null,null,null,null,0,null,null,null,null,null,0,"VWE03","Cheval","Samedi et dimanche midis","1 tranche pour 1 repas","Menus viandes week-end",1,null,null,"Menus viandes weekend premier semestre"]
["MVWE16","2019-02-24","PC02","Février",null,null,null,null,null,0,null,null,null,null,null,0,null,null,null,null,null,0,"VWE04","Dinde","Samedi et dimanche midis","1 tranche pour 1 repas","Menus viandes week-end",1,null,null,"Menus viandes weekend premier semestre"]

{"sheet":"Mars","index":10,"n_rows":65,"n_cols":31,"rows_kept":65,"cut":false,"hidden":false,"merged":[[0,0,0,30]]}
["Menus du mois de mars  2018."]
[]
["Numéro du menu","Date du menu","Code période concernée","Période concernée","Code dessert","Dessert","Jour dessert","Conditionnement dessert","Destination dessert","Quantité dessert","Code légume","Légume","Jour légume","Conditionnement légume","Destination légume","Quantité légume","Code légume deux","Légume deux","Jour légume deux","Conditionnement légume deux","Destination légume deux","Quantité légume deux","Code viande","Viande","Jour viande","Conditionnement viande","Destination viande","Quantité viande","Code observation","Observation","Titre"]
["MMR44","2019-03-01","PC03","Mars","DMR01","Pomme","Lundi à vendredi midis","1 sachet de 2 kilogrammes. 1 pomme pour 1 repas","Menus midi retraite",1,"LMR04","Céleri","Lundi à vendredi midis","Unité : 1 branche pour 1 repas","Menus midi retraite",2,null,null,null,null,null,0,"VMR01","Rôti d'agneau","Lundi à vendredi midis","1 morceau de 500 grammes pour 5 repas","Menus midi retraite",100,null,null,"Menus midi retraite mars"]
["MMR45","2019-03-04","PC03","Mars","DMR01","Pomme","Lundi à vendredi midis","1 sachet de 2 kilogrammes. 1 pomme pour 1 repas","Menus midi retraite",1,"LMR05","Champignons","Lundi à vendredi midis","1 boîte pour 1 repas","Menus midi retraite",1,null,null,null,null,null,0,"VMR02","Rôti de bœuf","Lundi à vendredi midis","1 morceau de 500 grammes pour 5 repas","Menus midi retraite",100,null,null,"Menus midi retraite mars"]
["MMR46","2019-03-05","PC03","Mars","DMR01","Pomme","Lundi à vendredi midis","1 sachet de 2 kilogrammes. 1 pomme pour 1 repas","Menus midi retraite",1,"LMR06","Concombre","Lundi à vendredi midis","Unité : 1 pour 1 repas","Menus midi retraite",1,null,null,null,null,null,0,"VMR02","Rôti de bœuf","Lundi à vendredi midis","1 morceau de 500 grammes pour 5 repas","Menus midi retraite",100,null,null,"Menus midi retraite mars"]
["MMR47","2019-03-06","PC03","Mars","DMR01","Pomme","Lundi à vendredi midis","1 sachet de 2 kilogrammes. 1 pomme pour 1 repas","Menus midi retraite",1,"LMR07","Couscous","Lundi à vendredi midis","25 grammes pour 1 repas","Menus midi retraite",1,null,null,null,null,null,0,"VMR02","Rôti de bœuf","Lundi à vendredi midis","1 morceau de 500 grammes pour 5 repas","Menus midi retraite",100,null,null,"Menus midi retraite mars"]
["MMR48","2019-03-07","PC03","Mars","DMR01","Pomme","Lundi à vendredi midis","1 sachet de 2 kilogrammes. 1 pomme pour 1 repas","Menus midi retraite",1,"LMR08","Maïs","Lundi à vendredi midis","1 boîte pour 2 repas","Menus midi retraite",0.5,null,null,null,null,null,0,"VMR02","Rôti de bœuf","Lundi à vendredi midis","1 morceau de 500 grammes pour 5 repas","Menus midi retraite",100,null,null,"Menus midi retraite mars"]
["MMR49","2019-03-08","PC03","Mars","DMR01","Pomme","Lundi à vendredi midis","1 sachet de 2 kilogrammes. 1 pomme pour 1 repas","Menus midi retraite",1,"LMR08","Maïs","Lundi à vendredi midis","1 boîte pour 2 repas","Menus midi retraite",0.5,null,null,null,null,null,0,"VMR02","Rôti de bœuf","Lundi à vendredi midis","1 morceau de 500 grammes pour 5 repas","Menus midi retraite",100,null,null,"Menus midi retraite mars"]
["MMR50","2019-03-11","PC03","Mars","DMR01","Pomme","Lundi à vendredi midis","1 sachet de 2 kilogrammes. 1 pomme pour 1 repas","Menus midi retraite",1,"LMR09","Pâtes à la sauce tomates","Lundi à vendredi midis","5 cuillères pour 1 repas","Menus midi retraite",5,null,null,null,null,null,0,"VMR03","Rôti de cheval","Lundi à vendredi midis","1 morceau de 500 grammes pour 5 repas","Menus midi retraite",100,null,null,"Menus midi retraite mars"]
["MMR51","2019-03-12","PC03","Mars","DMR01","Pomme","Lundi à vendredi midis","1 sachet de 2 kilogrammes. 1 pomme pour 1 repas","Menus midi retraite",1,"LMR10","Pâtes au beurre","Lundi à vendredi midis","5 cuillères pour 1 repas","Menus midi retraite",5,null,null,null,null,null,0,"VMR03","Rôti de cheval","Lundi à vendredi midis","1 morceau de 500 grammes pour 5 repas","Menus midi retraite",100,null,null,"Menus midi retraite mars"]
["MMR52","2019-03-13","PC03","Mars","DMR01","Pomme","Lundi à vendredi midis","1 sachet de 2 kilogrammes. 1 pomme pour 1 repas","Menus midi retraite",1,"LMR11","Poireau","Lundi à vendredi midis","Unité : 1 pour 1 repas","Menus midi retraite",1,null,null,null,null,null,0,"VMR03","Rôti de cheval","Lundi à vendredi midis","1 morceau de 500 grammes pour 5 repas","Menus midi retraite",100,null,null,"Menus midi retraite mars"]
["MMR53","2019-03-14","PC03","Mars","DMR01","Pomme","Lundi à vendredi midis","1 sachet de 2 kilogrammes. 1 pomme pour 1 repas","Menus midi retraite",1,"LMR12","Pomme de terre","Lundi à vendredi midis","Unité : 1 pour 1 repas","Menus midi retraite",1,null,null,null,null,null,0,"VMR03","Rôti de cheval","Lundi à vendredi midis","1 morceau de 500 grammes pour 5 repas","Menus midi retraite",100,null,null,"Menus midi retraite mars"]
["MMR54","2019-03-15","PC03","Mars","DMR01","Pomme","Lundi à vendredi midis","1 sachet de 2 kilogrammes. 1 pomme pour 1 repas","Menus midi retraite",1,"LMR13","Purée","Lundi à vendredi midis","25 grammes pour 1 repas","Menus midi retraite",25,null,null,null,null,null,0,"VMR03","Rôti de cheval","Lundi à vendredi midis","1 morceau de 500 grammes pour 5 repas","Menus midi retraite",100,null,null,"Menus midi retraite mars"]
["MMR55","2019-03-18","PC03","Mars","DMR01","Pomme","Lundi à vendredi midis","1 sachet de 2 kilogrammes. 1 pomme pour 1 repas","Menus midi retraite",1,"LMR14","Radis","Lundi à vendredi midis","1 botte ou 1 sachet pour 2 repas","Menus midi retraite",0.5,null,null,null,null,null,0,"VMR04","Rôti de porc","Lundi à vendredi midis","1 morceau de 500 grammes pour 5 repas","Menus midi retraite",100,null,null,"Menus midi retraite mars"]
["MMR56","2019-03-19","PC03","Mars","DMR01","Pomme","Lundi à vendredi midis","1 sachet de 2 kilogrammes. 1 pomme pour 1 repas","Menus midi retraite",1,"LMR14","Radis","Lundi à vendredi midis","1 botte ou 1 sachet pour 2 repas","Menus midi retraite",0.5,null,null,null,null,null,0,"VMR04","Rôti de porc","Lundi à vendredi midis","1 morceau de 500 grammes pour 5 repas","Menus midi retraite",100,null,null,"Menus midi retraite mars"]
["MMR57","2019-03-20","PC03","Mars","DMR01","Pomme","Lundi à vendredi midis","1 sachet de 2 kilogrammes. 1 pomme pour 1 repas","Menus midi retraite",1,"LMR15","Riz","Lundi à vendredi midis","25 grammes pour 1 repas","Menus midi retraite",25,null,null,null,null,null,0,"VMR04","Rôti de porc","Lundi à vendredi midis","1 morceau de 500 grammes pour 5 repas","Menus midi retraite",100,null,null,"Menus midi retraite mars"]
["MMR58","2019-03-21","PC03","Mars","DMR01","Pomme","Lundi à vendredi midis","1 sachet de 2 kilogrammes. 1 pomme pour 1 repas","Menus midi retraite",1,"LMR16","Salade","Lundi à vendredi midis","Unité : 1 tête pour 1 repas","Menus midi retraite",1,null,null,null,null,null,0,"VMR04","Rôti de porc","Lundi à vendredi midis","1 morceau de 500 grammes pour 5 repas","Menus midi retraite",100,null,null,"Menus midi retraite mars"]
["MMR59","2019-03-22","PC03","Mars","DMR01","Pomme","Lundi à vendredi midis","1 sachet de 2 kilogrammes. 1 pomme pour 1 repas","Menus midi retraite",1,"LMR17","Tomates","Lundi à vendredi midis","Unité : 2 pour 1 repas","Menus midi retraite",2,null,null,null,null,null,0,"VMR04","Rôti de porc","Lundi à vendredi midis","1 morceau de 500 grammes pour 5 repas","Menus midi retraite",100,null,null,"Menus midi retraite mars"]
["MMR60","2019-03-25","PC03","Mars","DMR01","Pomme","Lundi à vendredi midis","1 sachet de 2 kilogrammes. 1 pomme pour 1 repas","Menus midi retraite",1,"LMR01","Asperges","Lundi à vendredi midis","1 boîte pour 1 repas","Menus midi retraite",1,null,null,null,null,null,0,"VMR05","Rôti de veau","Lundi à vendredi midis","1 morceau de 500 grammes pour 5 repas","Menus midi retraite",100,null,null,"Menus midi retraite mars"]
["MMR61","2019-03-26","PC03","Mars","DMR01","Pomme","Lundi à vendredi midis","1 sachet de 2 kilogrammes. 1 pomme pour 1 repas","Menus midi retraite",1,"LMR02","Avocat","Lundi à vendredi midis","Unité : 1 pour 1 repas","Menus midi retraite",1,null,null,null,null,null,0,"VMR05","Rôti de veau","Lundi à vendredi midis","1 morceau de 500 grammes pour 5 repas","Menus midi retraite",100,null,null,"Menus midi retraite mars"]
["MMR62","2019-03-27","PC03","Mars","DMR01","Pomme","Lundi à vendredi midis","1 sachet de 2 kilogrammes. 1 pomme pour 1 repas","Menus midi retraite",1,"LMR03","Carottes","Lundi à vendredi midis","Unité : 2 pour 1 repas","Menus midi retraite",2,null,null,null,null,null,0,"VMR05","Rôti de veau","Lundi à vendredi midis","1 morceau de 500 grammes pour 5 repas","Menus midi retraite",100,null,null,"Menus midi retraite mars"]
["MMR63","2019-03-28","PC03","Mars","DMR01","Pomme","Lundi à vendredi midis","1 sachet de 2 kilogrammes. 1 pomme pour 1 repas","Menus midi retraite",1,"LMR04","Céleri","Lundi à vendredi midis","Unité : 1 branche pour 1 repas","Menus midi retraite",1,null,null,null,null,null,0,"VMR05","Rôti de veau","Lundi à vendredi midis","1 morceau de 500 grammes pour 5 repas","Menus midi retraite",100,null,null,"Menus midi retraite mars"]
["MMR64","2019-03-29","PC03","Mars","DMR01","Pomme","Lundi à vendredi midis","1 sachet de 2 kilogrammes. 1 pomme pour 1 repas","Menus midi retraite",1,"LMR05","Champignons","Lundi à vendredi midis","1 boîte pour 1 repas","Menus midi retraite",1,null,null,null,null,null,0,"VMR05","Rôti de veau","Lundi à vendredi midis","1 morceau de 500 grammes pour 5 repas","Menus midi retraite",100,null,null,"Menus midi retraite mars"]
["MJ60","2019-03-01","PC03","Mars","DS01","Pomme","lundi à vendredi soirs","1 sachet de 2 kilogrammes. 1 pomme pour 1 repas","Menus journaliers",1,"LSV01","Asperges","Vendredi soir","1 bocal ou 1 boîte pour 1 repas","Menus journaliers",1,null,null,null,null,null,0,"VS06","Cervelas","Lundi à dimanche soirs","1 paquet pour 2 repas","Menus journaliers",0.5,null,null,"Menus journaliers mars"]
["MJ61","2019-03-02","PC03","Mars","DWE03","Avocats","Samedi et dimanche midis et soirs","Unité : 1 pour 1 repas","Menus journaliers",2,"LWES03","Pâtes au fromage râpé","Samedi midi et soir","5 cuillères pour 1 repas","Menus journaliers",10,null,null,null,null,null,0,"VS22","Saucisson","Lundi à dimanche soirs","1 morceau de 400 grammes (Leclerc) pour 3 repas","Menus journaliers",0.33000001311302185,null,null,"Menus journaliers mars"]
["MJ62","2019-03-03","PC03","Mars","DWE03","Avocats","Samedi et dimanche midis et soirs","Unité : 1 pour 1 repas","Menus journaliers",2,"LWED03","Frites","Dimanche midi","20 frites pour 1 repas","Menus journaliers",20,"LWED01","Asperges","Dimanche soir","1 bocal ou 1 boîte pour 1 repas","Menus journaliers",1,"VS07","Cœur","Lundi à dimanche soirs","1 paquet pour 2 repas","Menus journaliers",1,null,null,"Menus journaliers mars"]
["MJ63","2019-03-04","PC03","Mars","DS01","Pomme","lundi à vendredi soirs","1 sachet de 2 kilogrammes. 1 pomme pour 1 repas","Menus journaliers",1,"LSLM09","Paella","Lundi et mardi soirs","1 boîte pour 2 repas","Menus journaliers",0.5,null,null,null,null,null,0,"VS28","Viande paella","Lundi et mardi soirs","1 boîte pour 2 repas","Menus journaliers",0.5,null,null,"Menus journaliers mars"]
["MJ64","2019-03-05","PC03","Mars","DS01","Pomme","lundi à vendredi soirs","1 sachet de 2 kilogrammes. 1 pomme pour 1 repas","Menus journaliers",1,"LSLM09","Paella","Lundi et mardi soirs","1 boîte pour 2 repas","Menus journaliers",0.5,null,null,null,null,null,0,"VS28","Viande paella","Lundi et mardi soirs","1 boîte pour 2 repas","Menus journaliers",0.5,null,null,"Menus journaliers mars"]
["MJ65","2019-03-06","PC03","Mars","DS01","Pomme","lundi à vendredi soirs","1 sachet de 2 kilogrammes. 1 pomme pour 1 repas","Menus journaliers",1,"LSMJ03","Petits pois et jeunes carottes","Mercredi et jeudi soirs","1 boîte pour 2 repas","Menus journaliers",0.5,null,null,null,null,null,0,"VS22","Saucisson","Lundi à dimanche soirs","1 morceau de 400 grammes (Leclerc) pour 3 repas","Menus journaliers",0.33000001311302185,null,null,"Menus journaliers mars"]
["MJ66","2019-03-07","PC03","Mars","DS01","Pomme","lundi à vendredi soirs","1 sachet de 2 kilogrammes. 1 pomme pour 1 repas","Menus journaliers",1,"LSMJ03","Petits pois et jeunes carottes","Mercredi et jeudi soirs","1 boîte pour 2 repas","Menus journaliers",0.5,null,null,null,null,null,0,"VS07","Cœur","Lundi à dimanche soirs","1 paquet pour 2 repas","Menus journaliers",1,null,null,"Menus journaliers mars"]
["MJ67","2019-03-08","PC03","Mars","DS01","Pomme","lundi à vendredi soirs","1 sachet de 2 kilogrammes. 1 pomme pour 1 repas","Menus journaliers",1,"LSV02","Avocat","Vendredi soir","Unité : 1 pour 1 repas","Menus journaliers",1,null,null,null,null,null,0,"VS22","Saucisson","Lundi à dimanche soirs","1 morceau de 400 grammes (Leclerc) pour 3 repas","Menus journaliers",0.34000000357627869,null,null,"Menus journaliers mars"]
["MJ68","2019-03-09","PC03","Mars","DWE04","Bananes","Samedi et dimanche midis et soirs","Unité : 1 pour 1 repas","Menus journaliers",2,"LWES01","Pâtes à la sauce tomates","Samedi midi et soir","5 cuillères pour 1 repas","Menus journaliers",10,null,null,null,null,null,0,"VS08","Croque-monsieur","Lundi à dimanche soirs","1 paquet pour 2 repas","Menus journaliers",1,null,null,"Menus journaliers mars"]
["MJ69","2019-03-10","PC03","Mars","DWE04","Bananes","Samedi et dimanche midis et soirs","Unité : 1 pour 1 repas","Menus journaliers",2,"LWED04","Haricots verts","Dimanche midi et soir","1 boîte pour 2 repas","Menus journaliers",1,null,null,null,null,null,0,"VS22","Saucisson","Lundi à dimanche soirs","1 morceau de 400 grammes (Leclerc) pour 3 repas","Menus journaliers",0.33000001311302185,null,null,"Menus journaliers mars"]
["MJ70","2019-03-11","PC03","Mars","DS01","Pomme","lundi à vendredi soirs","1 sachet de 2 kilogrammes. 1 pomme pour 1 repas","Menus journaliers",1,"LSLM10","Poireau","Lundi et mardi soirs","Unité : 1 pour 1 repas","Menus journaliers",1,null,null,null,null,null,0,"VS08","Croque-monsieur","Lundi à dimanche soirs","1 paquet pour 2 repas","Menus journaliers",1,null,null,"Menus journaliers mars"]
["MJ71","2019-03-12","PC03","Mars","DS01","Pomme","lundi à vendredi soirs","1 sachet de 2 kilogrammes. 1 pomme pour 1 repas","Menus journaliers",1,"LSLM10","Poireau","Lundi et mardi soirs","Unité : 1 pour 1 repas","Menus journaliers",1,null,null,null,null,null,0,"VS22","Saucisson","Lundi à dimanche soirs","1 morceau de 400 grammes (Leclerc) pour 3 repas","Menus journaliers",0.33000001311302185,null,null,"Menus journaliers mars"]
["MJ72","2019-03-13","PC03","Mars","DS01","Pomme","lundi à vendredi soirs","1 sachet de 2 kilogrammes. 1 pomme pour 1 repas","Menus journaliers",1,"LSMJ04","Ratatouille","Mercredi et jeudi soirs","1 boîte pour 2 repas","Menus journaliers",0.5,null,null,null,null,null,0,"VS09","Foie","Lundi à dimanche soirs","1 paquet pour 2 repas","Menus journaliers",1,null,null,"Menus journaliers mars"]
["MJ73","2019-03-14","PC03","Mars","DS01","Pomme","lundi à vendredi soirs","1 sachet de 2 kilogrammes. 1 pomme pour 1 repas","Menus journaliers",1,"LSMJ04","Ratatouille","Mercredi et jeudi soirs","1 boîte pour 2 repas","Menus journaliers",0.5,null,null,null,null,null,0,"VS22","Saucisson","Lundi à dimanche soirs","1 morceau de 400 grammes (Leclerc) pour 3 repas","Menus journaliers",0.34000000357627869,null,null,"Menus journaliers mars"]
["MJ74","2019-03-15","PC03","Mars","DS01","Pomme","lundi à vendredi soirs","1 sachet de 2 kilogrammes. 1 pomme pour 1 repas","Menus journaliers",1,"LSV03","Betterave rouge","Vendredi soir","Unité : 1 pour 1 repas","Menus journaliers",1,null,null,null,null,null,0,"VS09","Foie","Lundi à dimanche soirs","1 paquet pour 2 repas","Menus journaliers",1,null,null,"Menus journaliers mars"]
["MJ75","2019-03-16","PC03","Mars","DWE05","Clémentines","Samedi et dimanche midis et soirs","Unité : 2 à 4 pour 1 repas","Menus journaliers",4,"LWES02","Pâtes au beurre","Samedi midi et soir","5 cuillères pour 1 repas","Menus journaliers",10,null,null,null,null,null,0,"VS22","Saucisson","Lundi à dimanche soirs","1 morceau de 400 grammes (Leclerc) pour 3 repas","Menus journaliers",0.33000001311302185,null,null,"Menus journaliers mars"]
["MJ76","2019-03-17","PC03","Mars","DWE05","Clémentines","Samedi et dimanche midis et soirs","Unité : 2 à 4 pour 1 repas","Menus journaliers",4,"LWED02","Chips","Dimanche midi et soir","1 sachet pour 2 repas","Menus journaliers",1,null,null,null,null,null,0,"VS10","Fromage de tête","Lundi à dimanche soirs","1 tranche pour 2 repas","Menus journaliers",3,null,null,"Menus journaliers mars"]
["MJ77","2019-03-18","PC03","Mars","DS01","Pomme","lundi à vendredi soirs","1 sachet de 2 kilogrammes. 1 pomme pour 1 repas","Menus journaliers",1,"LSLM11","Pomme de terre","Lundi et mardi soirs","Unité : 1 pour 1 repas","Menus journaliers",1,null,null,null,null,null,0,"VS22","Saucisson","Lundi à dimanche soirs","1 morceau de 400 grammes (Leclerc) pour 3 repas","Menus journaliers",0.33000001311302185,null,null,"Menus journaliers mars"]
["MJ78","2019-03-19","PC03","Mars","DS01","Pomme","lundi à vendredi soirs","1 sachet de 2 kilogrammes. 1 pomme pour 1 repas","Menus journaliers",1,"LSLM11","Pomme de terre","Lundi et mardi soirs","Unité : 1 pour 1 repas","Menus journaliers",1,null,null,null,null,null,0,"VS10","Fromage de tête","Lundi à dimanche soirs","1 tranche pour 2 repas","Menus journaliers",3,null,null,"Menus journaliers mars"]
["MJ79","2019-03-20","PC03","Mars","DS01","Pomme","lundi à vendredi soirs","1 sachet de 2 kilogrammes. 1 pomme pour 1 repas","Menus journaliers",1,"LSMJ04","Ratatouille","Mercredi et jeudi soirs","1 boîte pour 2 repas","Menus journaliers",0.5,null,null,null,null,null,0,"VS22","Saucisson","Lundi à dimanche soirs","1 morceau de 400 grammes (Leclerc) pour 3 repas","Menus journaliers",0.34000000357627869,null,null,"Menus journaliers mars"]
["MJ80","2019-03-21","PC03","Mars","DS01","Pomme","lundi à vendredi soirs","1 sachet de 2 kilogrammes. 1 pomme pour 1 repas","Menus journaliers",1,"LSMJ04","Ratatouille","Mercredi et jeudi soirs","1 boîte pour 2 repas","Menus journaliers",0.5,null,null,null,null,null,0,"VS11","Jambon","Lundi à dimanche soirs","1 paquet pour 2 repas","Menus journaliers",0.5,null,null,"Menus journaliers mars"]
["MJ81","2019-03-22","PC03","Mars","DS01","Pomme","lundi à vendredi soirs","1 sachet de 2 kilogrammes. 1 pomme pour 1 repas","Menus journaliers",1,"LSV04","Carottes","Vendredi soir","Unité : 2 pour 1 repas","Menus journaliers",2,null,null,null,null,null,0,"VS22","Saucisson","Lundi à dimanche soirs","1 morceau de 400 grammes (Leclerc) pour 3 repas","Menus journaliers",0.33000001311302185,null,null,"Menus journaliers mars"]
["MJ82","2019-03-23","PC03","Mars","DWE06","Crème","Samedi et dimanche midis et soirs","1 pack de 4 pots pour le week-end. 1 pot pour 1 repas","Menus journaliers",2,"LWES03","Pâtes au fromage râpé","Samedi midi et soir","5 cuillères pour 1 repas","Menus journaliers",10,null,null,null,null,null,0,"VS11","Jambon","Lundi à dimanche soirs","1 paquet pour 2 repas","Menus journaliers",0.5,null,null,"Menus journaliers mars"]
["MJ83","2019-03-24","PC03","Mars","DWE06","Crème","Samedi et dimanche midis et soirs","1 pack de 4 pots pour le week-end. 1 pot pour 1 repas","Menus journaliers",2,"LWED03","Frites","Dimanche midi","20 frites pour 1 repas","Menus journaliers",20,"LWED01","Asperges","Dimanche soir","1 bocal ou 1 boîte pour 1 repas","Menus journaliers",1,"VS22","Saucisson","Lundi à dimanche soirs","1 morceau de 400 grammes (Leclerc) pour 3 repas","Menus journaliers",0.33000001311302185,null,null,"Menus journaliers mars"]
["MJ84","2019-03-25","PC03","Mars","DS01","Pomme","lundi à vendredi soirs","1 sachet de 2 kilogrammes. 1 pomme pour 1 repas","Menus journaliers",1,"LSLM12","Purée","Lundi et mardi soirs","25 grammes pour 1 repas","Menus journaliers",25,null,null,null,null,null,0,"VS12","Jambonneau","Lundi à dimanche soirs","1 paquet pour 2 repas","Menus journaliers",0.5,null,null,"Menus journaliers mars"]
["MJ85","2019-03-26","PC03","Mars","DS01","Pomme","lundi à vendredi soirs","1 sachet de 2 kilogrammes. 1 pomme pour 1 repas","Menus journaliers",1,"LSLM12","Purée","Lundi et mardi soirs","25 grammes pour 1 repas","Menus journaliers",25,null,null,null,null,null,0,"VS22","Saucisson","Lundi à dimanche soirs","1 morceau de 400 grammes (Leclerc) pour 3 repas","Menus journaliers",0.34000000357627869,null,null,"Menus journaliers mars"]
["MJ86","2019-03-27","PC03","Mars","DS01","Pomme","lundi à vendredi soirs","1 sachet de 2 kilogrammes. 1 pomme pour 1 repas","Menus journaliers",1,"LSMJ05","Raviolis","Mercredi et jeudi soirs","1 boîte pour 2 repas","Menus journaliers",0.5,null,null,null,null,null,0,"VS12","Jambonneau","Lundi à dimanche soirs","1 paquet pour 2 repas","Menus journaliers",0.5,null,null,"Menus journaliers mars"]
["MJ87","2019-03-28","PC03","Mars","DS01","Pomme","lundi à vendredi soirs","1 sachet de 2 kilogrammes. 1 pomme pour 1 repas","Menus journaliers",1,"LSMJ05","Raviolis","Mercredi et jeudi soirs","1 boîte pour 2 repas","Menus journaliers",0.5,null,null,null,null,null,0,"VS22","Saucisson","Lundi à dimanche soirs","1 morceau de 400 grammes (Leclerc) pour 3 repas","Menus journaliers",0.33000001311302185,null,null,"Menus journaliers mars"]
["MJ88","2019-03-29","PC03","Mars","DS01","Pomme","lundi à vendredi soirs","1 sachet de 2 kilogrammes. 1 pomme pour 1 repas","Menus journaliers",1,"LSV05","Céleri","Vendredi soir","Unité : 1 branche pour 1 repas","Menus journaliers",1,null,null,null,null,null,0,"VS13","Mortadelle","Lundi à dimanche soirs","1 paquet pour 2 repas","Menus journaliers",0.5,null,null,"Menus journaliers mars"]
["MJ89","2019-03-30","PC03","Mars","DWE07","Dattes","Samedi et dimanche midis et soirs","1 paquet pour 4 repas","Menus journaliers",0.5,"LWES01","Pâtes à la sauce tomates","Samedi midi et soir","5 cuillères pour 1 repas","Menus journaliers",10,null,null,null,null,null,0,"VS22","Saucisson","Lundi à dimanche soirs","1 morceau de 400 grammes (Leclerc) pour 3 repas","Menus journaliers",0.33000001311302185,null,null,"Menus journaliers mars"]
["MJ90","2019-03-31","PC03","Mars","DWE07","Dattes","Samedi et dimanche midis et soirs","1 paquet pour 4 repas","Menus journaliers",0.5,"LWED04","Haricots verts","Dimanche midi et soir","1 boîte pour 2 repas","Menus journaliers",1,null,null,null,null,null,0,"VS13","Mortadelle","Lundi à dimanche soirs","1 paquet pour 2 repas","Menus journaliers",0.5,null,null,"Menus journaliers mars"]
["MVWE17","2019-03-02","PC03","Mars",null,null,null,null,null,0,null,null,null,null,null,0,null,null,null,null,null,0,"VWE05","Poisson","Samedi et dimanche midis","Unité : 1 pour 1 repas","Menus viandes week-end",1,null,null,"Menus viandes weekend premier semestre"]
["MVWE18","2019-03-03","PC03","Mars",null,null,null,null,null,0,null,null,null,null,null,0,null,null,null,null,null,0,"VWE06","Porc","Samedi et dimanche midis","1 tranche pour 1 repas","Menus viandes week-end",1,null,null,"Menus viandes weekend premier semestre"]
["MVWE19","2019-03-09","PC03","Mars",null,null,null,null,null,0,null,null,null,null,null,0,null,null,null,null,null,0,"VWE07","Veau","Samedi et dimanche midis","1 tranche pour 1 repas","Menus viandes week-end",1,null,null,"Menus viandes weekend premier semestre"]
["MVWE20","2019-03-10","PC03","Mars",null,null,null,null,null,0,null,null,null,null,null,0,null,null,null,null,null,0,"VWE01","Agneau","Samedi et dimanche midis","1 tranche pour 1 repas","Menus viandes week-end",1,null,null,"Menus viandes weekend premier semestre"]
["MVWE21","2019-03-16","PC03","Mars",null,null,null,null,null,0,null,null,null,null,null,0,null,null,null,null,null,0,"VWE02","Bœuf","Samedi et dimanche midis","1 tranche pour 1 repas","Menus viandes week-end",1,null,null,"Menus viandes weekend premier semestre"]
["MVWE22","2019-03-17","PC03","Mars",null,null,null,null,null,0,null,null,null,null,null,0,null,null,null,null,null,0,"VWE03","Cheval","Samedi et dimanche midis","1 tranche pour 1 repas","Menus viandes week-end",1,null,null,"Menus viandes weekend premier semestre"]
["MVWE23","2019-03-23","PC03","Mars",null,null,null,null,null,0,null,null,null,null,null,0,null,null,null,null,null,0,"VWE04","Dinde","Samedi et dimanche midis","1 tranche pour 1 repas","Menus viandes week-end",1,null,null,"Menus viandes weekend premier semestre"]
["MVWE24","2019-03-24","PC03","Mars",null,null,null,null,null,0,null,null,null,null,null,0,null,null,null,null,null,0,"VWE05","Poisson","Samedi et dimanche midis","Unité : 1 pour 1 repas","Menus viandes week-end",1,null,null,"Menus viandes weekend premier semestre"]
["MVWE25","2019-03-30","PC03","Mars",null,null,null,null,null,0,null,null,null,null,null,0,null,null,null,null,null,0,"VWE06","Porc","Samedi et dimanche midis","1 tranche pour 1 repas","Menus viandes week-end",1,null,null,"Menus viandes weekend premier semestre"]
["MVWE26","2019-03-31","PC03","Mars",null,null,null,null,null,0,null,null,null,null,null,0,null,null,null,null,null,0,"VWE07","Veau","Samedi et dimanche midis","1 tranche pour 1 repas","Menus viandes week-end",1,null,null,"Menus viandes weekend premier semestre"]

{"sheet":"Avril","index":11,"n_rows":62,"n_cols":31,"rows_kept":62,"cut":false,"hidden":false,"merged":[[0,0,0,30]]}
["Menus du mois d'avril  2018."]
[]
["Numéro du menu","Date du menu","Code période concernée","Période concernée","Code dessert","Dessert","Jour dessert","Conditionnement dessert","Destination dessert","Quantité dessert","Code légume","Légume","Jour légume","Conditionnement légume","Destination légume","Quantité légume","Code légume deux","Légume deux","Jour légume deux","Conditionnement légume deux","Destination légume deux","Quantité légume deux","Code viande","Viande","Jour viande","Conditionnement viande","Destination viande","Quantité viande","Code observation","Observation","Titre"]
["MMR65","2019-04-01","PC04","Avril","DMR01","Pomme","Lundi à vendredi midis","1 sachet de 2 kilogrammes. 1 pomme pour 1 repas","Menus midi retraite",1,"LMR06","Concombre","Lundi à vendredi midis","Unité : 1 pour 1 repas","Menus midi retraite",1,null,null,null,null,null,0,"VMR01","Rôti d'agneau","Lundi à vendredi midis","1 morceau de 500 grammes pour 5 repas","Menus midi retraite",100,null,null,"Menus midi retraite avril"]
["MMR66","2019-04-02","PC04","Avril","DMR01","Pomme","Lundi à vendredi midis","1 sachet de 2 kilogrammes. 1 pomme pour 1 repas","Menus midi retraite",1,"LMR07","Couscous","Lundi à vendredi midis","25 grammes pour 1 repas","Menus midi retraite",25,null,null,null,null,null,0,"VMR01","Rôti d'agneau","Lundi à vendredi midis","1 morceau de 500 grammes pour 5 repas","Menus midi retraite",100,null,null,"Menus midi retraite avril"]
["MMR67","2019-04-03","PC04","Avril","DMR01","Pomme","Lundi à vendredi midis","1 sachet de 2 kilogrammes. 1 pomme pour 1 repas","Menus midi retraite",1,"LMR08","Maïs","Lundi à vendredi midis","1 boîte pour 2 repas","Menus midi retraite",0.5,null,null,null,null,null,0,"VMR01","Rôti d'agneau","Lundi à vendredi midis","1 morceau de 500 grammes pour 5 repas","Menus midi retraite",100,null,null,"Menus midi retraite avril"]
["MMR68","2019-04-04","PC04","Avril","DMR01","Pomme","Lundi à vendredi midis","1 sachet de 2 kilogrammes. 1 pomme pour 1 repas","Menus midi retraite",1,"LMR08","Maïs","Lundi à vendredi midis","1 boîte pour 2 repas","Menus midi retraite",0.5,null,null,null,null,null,0,"VMR01","Rôti d'agneau","Lundi à vendredi midis","1 morceau de 500 grammes pour 5 repas","Menus midi retraite",100,null,null,"Menus midi retraite avril"]
["MMR69","2019-04-05","PC04","Avril","DMR01","Pomme","Lundi à vendredi midis","1 sachet de 2 kilogrammes. 1 pomme pour 1 repas","Menus midi retraite",1,"LMR09","Pâtes à la sauce tomates","Lundi à vendredi midis","5 cuillères pour 1 repas","Menus midi retraite",5,null,null,null,null,null,0,"VMR01","Rôti d'agneau","Lundi à vendredi midis","1 morceau de 500 grammes pour 5 repas","Menus midi retraite",100,null,null,"Menus midi retraite avril"]
["MMR70","2019-04-08","PC04","Avril","DMR01","Pomme","Lundi à vendredi midis","1 sachet de 2 kilogrammes. 1 pomme pour 1 repas","Menus midi retraite",1,"LMR10","Pâtes au beurre","Lundi à vendredi midis","5 cuillères pour 1 repas","Menus midi retraite",5,null,null,null,null,null,0,"VMR02","Rôti de bœuf","Lundi à vendredi midis","1 morceau de 500 grammes pour 5 repas","Menus midi retraite",100,null,null,"Menus midi retraite avril"]
["MMR71","2019-04-09","PC04","Avril","DMR01","Pomme","Lundi à vendredi midis","1 sachet de 2 kilogrammes. 1 pomme pour 1 repas","Menus midi retraite",1,"LMR11","Poireau","Lundi à vendredi midis","Unité : 1 pour 1 repas","Menus midi retraite",1,null,null,null,null,null,0,"VMR02","Rôti de bœuf","Lundi à vendredi midis","1 morceau de 500 grammes pour 5 repas","Menus midi retraite",100,null,null,"Menus midi retraite avril"]
["MMR72","2019-04-10","PC04","Avril","DMR01","Pomme","Lundi à vendredi midis","1 sachet de 2 kilogrammes. 1 pomme pour 1 repas","Menus midi retraite",1,"LMR12","Pomme de terre","Lundi à vendredi midis","Unité : 1 pour 1 repas","Menus midi retraite",1,null,null,null,null,null,0,"VMR02","Rôti de bœuf","Lundi à vendredi midis","1 morceau de 500 grammes pour 5 repas","Menus midi retraite",100,null,null,"Menus midi retraite avril"]
["MMR73","2019-04-11","PC04","Avril","DMR01","Pomme","Lundi à vendredi midis","1 sachet de 2 kilogrammes. 1 pomme pour 1 repas","Menus midi retraite",1,"LMR13","Purée","Lundi à vendredi midis","25 grammes pour 1 repas","Menus midi retraite",25,null,null,null,null,null,0,"VMR02","Rôti de bœuf","Lundi à vendredi midis","1 morceau de 500 grammes pour 5 repas","Menus midi retraite",100,null,null,"Menus midi retraite avril"]
["MMR74","2019-04-12","PC04","Avril","DMR01","Pomme","Lundi à vendredi midis","1 sachet de 2 kilogrammes. 1 pomme pour 1 repas","Menus midi retraite",1,"LMR14","Radis","Lundi à vendredi midis","1 botte ou 1 sachet pour 2 repas","Menus midi retraite",0.5,null,null,null,null,null,0,"VMR02","Rôti de bœuf","Lundi à vendredi midis","1 morceau de 500 grammes pour 5 repas","Menus midi retraite",100,null,null,"Menus midi retraite avril"]
["MMR75","2019-04-15","PC04","Avril","DMR01","Pomme","Lundi à vendredi midis","1 sachet de 2 kilogrammes. 1 pomme pour 1 repas","Menus midi retraite",1,"LMR14","Radis","Lundi à vendredi midis","1 botte ou 1 sachet pour 2 repas","Menus midi retraite",0.5,null,null,null,null,null,0,"VMR03","Rôti de cheval","Lundi à vendredi midis","1 morceau de 500 grammes pour 5 repas","Menus midi retraite",100,null,null,"Menus midi retraite avril"]
["MMR76","2019-04-16","PC04","Avril","DMR01","Pomme","Lundi à vendredi midis","1 sachet de 2 kilogrammes. 1 pomme pour 1 repas","Menus midi retraite",1,"LMR15","Riz","Lundi à vendredi midis","25 grammes pour 1 repas","Menus midi retraite",25,null,null,null,null,null,0,"VMR03","Rôti de cheval","Lundi à vendredi midis","1 morceau de 500 grammes pour 5 repas","Menus midi retraite",100,null,null,"Menus midi retraite avril"]
["MMR77","2019-04-17","PC04","Avril","DMR01","Pomme","Lundi à vendredi midis","1 sachet de 2 kilogrammes. 1 pomme pour 1 repas","Menus midi retraite",1,"LMR16","Salade","Lundi à vendredi midis","Unité : 1 tête pour 1 repas","Menus midi retraite",25,null,null,null,null,null,0,"VMR03","Rôti de cheval","Lundi à vendredi midis","1 morceau de 500 grammes pour 5 repas","Menus midi retraite",100,null,null,"Menus midi retraite avril"]
["MMR78","2019-04-18","PC04","Avril","DMR01","Pomme","Lundi à vendredi midis","1 sachet de 2 kilogrammes. 1 pomme pour 1 repas","Menus midi retraite",1,"LMR17","Tomates","Lundi à vendredi midis","Unité : 2 pour 1 repas","Menus midi retraite",2,null,null,null,null,null,0,"VMR03","Rôti de cheval","Lundi à vendredi midis","1 morceau de 500 grammes pour 5 repas","Menus midi retraite",100,null,null,"Menus midi retraite avril"]
["MMR79","2019-04-19","PC04","Avril","DMR01","Pomme","Lundi à vendredi midis","1 sachet de 2 kilogrammes. 1 pomme pour 1 repas","Menus midi retraite",1,"LMR01","Asperges","Lundi à vendredi midis","1 boîte pour 1 repas","Menus midi retraite",2,null,null,null,null,null,0,"VMR03","Rôti de cheval","Lundi à vendredi midis","1 morceau de 500 grammes pour 5 repas","Menus midi retraite",100,null,null,"Menus midi retraite avril"]
["MMR80","2019-04-22","PC04","Avril","DMR01","Pomme","Lundi à vendredi midis","1 sachet de 2 kilogrammes. 1 pomme pour 1 repas","Menus midi retraite",1,"LMR02","Avocat","Lundi à vendredi midis","Unité : 1 pour 1 repas","Menus midi retraite",1,null,null,null,null,null,0,"VMR04","Rôti de porc","Lundi à vendredi midis","1 morceau de 500 grammes pour 5 repas","Menus midi retraite",100,null,null,"Menus midi retraite avril"]
["MMR81","2019-04-23","PC04","Avril","DMR01","Pomme","Lundi à vendredi midis","1 sachet de 2 kilogrammes. 1 pomme pour 1 repas","Menus midi retraite",1,"LMR03","Carottes","Lundi à vendredi midis","Unité : 2 pour 1 repas","Menus midi retraite",2,null,null,null,null,null,0,"VMR04","Rôti de porc","Lundi à vendredi midis","1 morceau de 500 grammes pour 5 repas","Menus midi retraite",100,null,null,"Menus midi retraite avril"]
["MMR82","2019-04-24","PC04","Avril","DMR01","Pomme","Lundi à vendredi midis","1 sachet de 2 kilogrammes. 1 pomme pour 1 repas","Menus midi retraite",1,"LMR04","Céleri","Lundi à vendredi midis","Unité : 1 branche pour 1 repas","Menus midi retraite",1,null,null,null,null,null,0,"VMR04","Rôti de porc","Lundi à vendredi midis","1 morceau de 500 grammes pour 5 repas","Menus midi retraite",100,null,null,"Menus midi retraite avril"]
["MMR84","2019-04-26","PC04","Avril","DMR01","Pomme","Lundi à vendredi midis","1 sachet de 2 kilogrammes. 1 pomme pour 1 repas","Menus midi retraite",1,"LMR06","Concombre","Lundi à vendredi midis","Unité : 1 pour 1 repas","Menus midi retraite",1,null,null,null,null,null,0,"VMR04","Rôti de porc","Lundi à vendredi midis","1 morceau de 500 grammes pour 5 repas","Menus midi retraite",100,null,null,"Menus midi retraite avril"]
["MMR85","2019-04-29","PC04","Avril","DMR01","Pomme","Lundi à vendredi midis","1 sachet de 2 kilogrammes. 1 pomme pour 1 repas","Menus midi retraite",1,"LMR07","Couscous","Lundi à vendredi midis","25 grammes pour 1 repas","Menus midi retraite",25,null,null,null,null,null,0,"VMR05","Rôti de veau","Lundi à vendredi midis","1 morceau de 500 grammes pour 5 repas","Menus midi retraite",100,null,null,"Menus midi retraite avril"]
["MMR86","2019-04-30","PC04","Avril","DMR01","Pomme","Lundi à vendredi midis","1 sachet de 2 kilogrammes. 1 pomme pour 1 repas","Menus midi retraite",1,"LMR08","Maïs","Lundi à vendredi midis","1 boîte pour 2 repas","Menus midi retraite",0.5,null,null,null,null,null,0,"VMR05","Rôti de veau","Lundi à vendredi midis","1 morceau de 500 grammes pour 5 repas","Menus midi retraite",100,null,null,"Menus midi retraite avril"]
["MJ91","2019-04-01","PC04","Avril","DS01","Pomme","lundi à vendredi soirs","1 sachet de 2 kilogrammes. 1 pomme pour 1 repas","Menus journaliers",1,"LSLM13","Quenelles","Lundi et mardi soirs","1 boîte pour 2 repas","Menus journaliers",0.5,null,null,null,null,null,0,"VS22","Saucisson","Lundi à dimanche soirs","1 morceau de 400 grammes (Leclerc) pour 3 repas","Menus journaliers",0.34000000357627869,null,null,"Menus journaliers avril"]
["MJ92","2019-04-02","PC04","Avril","DS01","Pomme","lundi à vendredi soirs","1 sachet de 2 kilogrammes. 1 pomme pour 1 repas","Menus journaliers",1,"LSLM13","Quenelles","Lundi et mardi soirs","1 boîte pour 2 repas","Menus journaliers",0.5,null,null,null,null,null,0,"VS14","Œufs","Lundi à dimanche soirs","1 boîte de six œufs. 3 œufs pour 1 repas","Menus journaliers",3,null,null,"Menus journaliers avril"]
["MJ93","2019-04-03","PC04","Avril","DS01","Pomme","lundi à vendredi soirs","1 sachet de 2 kilogrammes. 1 pomme pour 1 repas","Menus journaliers",1,"LSMJ06","Tomates pelées","Mercredi et jeudi soirs","1 boîte pour 2 repas","Menus journaliers",0.5,null,null,null,null,null,0,"VS22","Saucisson","Lundi à dimanche soirs","1 morceau de 400 grammes (Leclerc) pour 3 repas","Menus journaliers",0.33000001311302185,null,null,"Menus journaliers avril"]
["MJ94","2019-04-04","PC04","Avril","DS01","Pomme","lundi à vendredi soirs","1 sachet de 2 kilogrammes. 1 pomme pour 1 repas","Menus journaliers",1,"LSMJ06","Tomates pelées","Mercredi et jeudi soirs","1 boîte pour 2 repas","Menus journaliers",0.5,null,null,null,null,null,0,"VS14","Œufs","Lundi à dimanche soirs","1 boîte de six œufs. 3 œufs pour 1 repas","Menus journaliers",3,null,null,"Menus journaliers avril"]
["MJ95","2019-04-05","PC04","Avril","DS01","Pomme","lundi à vendredi soirs","1 sachet de 2 kilogrammes. 1 pomme pour 1 repas","Menus journaliers",1,"LSV06","Champignons","Vendredi soir","1 boîte pour 1 repas","Menus journaliers",1,null,null,null,null,null,0,"VS22","Saucisson","Lundi à dimanche soirs","1 morceau de 400 grammes (Leclerc) pour 3 repas","Menus journaliers",0.33000001311302185,null,null,"Menus journaliers avril"]
["MJ96","2019-04-06","PC04","Avril","DWE08","Figues","Samedi et dimanche midis et soirs","1 paquet pour 4 repas","Menus journaliers",0.5,"LWES02","Pâtes au beurre","Samedi midi et soir","5 cuillères pour 1 repas","Menus journaliers",10,null,null,null,null,null,0,"VS15","Pizza","Lundi à dimanche soirs","1 paquet pour 2 repas","Menus journaliers",0.5,null,null,"Menus journaliers avril"]
["MJ97","2019-04-07","PC04","Avril","DWE08","Figues","Samedi et dimanche midis et soirs","1 paquet pour 4 repas","Menus journaliers",0.5,"LWED02","Chips","Dimanche midi et soir","1 sachet pour 2 repas","Menus journaliers",1,null,null,null,null,null,0,"VS22","Saucisson","Lundi à dimanche soirs","1 morceau de 400 grammes (Leclerc) pour 3 repas","Menus journaliers",0.34000000357627869,null,null,"Menus journaliers avril"]
["MJ98","2019-04-08","PC04","Avril","DS01","Pomme","lundi à vendredi soirs","1 sachet de 2 kilogrammes. 1 pomme pour 1 repas","Menus journaliers",1,"LSLM14","Riz","Lundi et mardi soirs","25 grammes pour 1 repas","Menus journaliers",25,null,null,null,null,null,0,"VS15","Pizza","Lundi à dimanche soirs","1 paquet pour 2 repas","Menus journaliers",0.5,null,null,"Menus journaliers avril"]
["MJ99","2019-04-09","PC04","Avril","DS01","Pomme","lundi à vendredi soirs","1 sachet de 2 kilogrammes. 1 pomme pour 1 repas","Menus journaliers",1,"LSLM14","Riz","Lundi et mardi soirs","25 grammes pour 1 repas","Menus journaliers",25,null,null,null,null,null,0,"VS22","Saucisson","Lundi à dimanche soirs","1 morceau de 400 grammes (Leclerc) pour 3 repas","Menus journaliers",0.33000001311302185,null,null,"Menus journaliers avril"]
["MJ100","2019-04-10","PC04","Avril","DS01","Pomme","lundi à vendredi soirs","1 sachet de 2 kilogrammes. 1 pomme pour 1 repas","Menus journaliers",1,"LSMJ01","Macédoine de légumes","Mercredi et jeudi soirs","1 boîte pour 2 repas","Menus journaliers",0.5,null,null,null,null,null,0,"VS16","Poisson","Lundi à dimanche soirs","Unité : 1 pour 1 repas","Menus journaliers",1,null,null,"Menus journaliers avril"]
["MJ101","2019-04-11","PC04","Avril","DS01","Pomme","lundi à vendredi soirs","1 sachet de 2 kilogrammes. 1 pomme pour 1 repas","Menus journaliers",1,"LSMJ01","Macédoine de légumes","Mercredi et jeudi soirs","1 boîte pour 2 repas","Menus journaliers",0.5,null,null,null,null,null,0,"VS22","Saucisson","Lundi à dimanche soirs","1 morceau de 400 grammes (Leclerc) pour 3 repas","Menus journaliers",0.33000001311302185,null,null,"Menus journaliers avril"]
["MJ102","2019-04-12","PC04","Avril","DS01","Pomme","lundi à vendredi soirs","1 sachet de 2 kilogrammes. 1 pomme pour 1 repas","Menus journaliers",1,"LSV07","Concombre","Vendredi soir","Unité : 1 pour 1 repas","Menus journaliers",1,null,null,null,null,null,0,"VS17","Quiche lorraine","Lundi à dimanche soirs","1 boîte pour 2 repas","Menus journaliers",1,null,null,"Menus journaliers avril"]
["MJ103","2019-04-13","PC04","Avril","DWE09","Fromage blanc","Samedi et dimanche midis et soirs","1 pack de 4 pots pour le week-end. 1 pot pour 1 repas","Menus journaliers",2,"LWES03","Pâtes au fromage râpé","Samedi midi et soir","5 cuillères pour 1 repas","Menus journaliers",10,null,null,null,null,null,0,"VS22","Saucisson","Lundi à dimanche soirs","1 morceau de 400 grammes (Leclerc) pour 3 repas","Menus journaliers",0.34000000357627869,null,null,"Menus journaliers avril"]
["MJ104","2019-04-14","PC04","Avril","DWE09","Fromage blanc","Samedi et dimanche midis et soirs","1 pack de 4 pots pour le week-end. 1 pot pour 1 repas","Menus journaliers",2,"LWED03","Frites","Dimanche midi","20 frites pour 1 repas","Menus journaliers",20,"LWED01","Asperges","Dimanche soir","1 bocal ou 1 boîte pour 1 repas","Menus journaliers",1,"VS17","Quiche lorraine","Lundi à dimanche soirs","1 boîte pour 2 repas","Menus journaliers",1,null,null,"Menus journaliers avril"]
["MJ105","2019-04-15","PC04","Avril","DS01","Pomme","lundi à vendredi soirs","1 sachet de 2 kilogrammes. 1 pomme pour 1 repas","Menus journaliers",1,"LSLM01","Cassoulet","Lundi et mardi soirs","1 boîte pour 2 repas","Menus journaliers",0.5,null,null,null,null,null,0,"VS26","Viande cassoulet","Lundi et mardi soirs","1 boîte pour 2 repas","Menus journaliers",0.5,null,null,"Menus journaliers avril"]
["MJ106","2019-04-16","PC04","Avril","DS01","Pomme","lundi à vendredi soirs","1 sachet de 2 kilogrammes. 1 pomme pour 1 repas","Menus journaliers",1,"LSLM01","Cassoulet","Lundi et mardi soirs","1 boîte pour 2 repas","Menus journaliers",0.5,null,null,null,null,null,1,"VS26","Viande cassoulet","Lundi et mardi soirs","1 boîte pour 2 repas","Menus journaliers",0.5,null,null,"Menus journaliers avril"]
["MJ107","2019-04-17","PC04","Avril","DS01","Pomme","lundi à vendredi soirs","1 sachet de 2 kilogrammes. 1 pomme pour 1 repas","Menus journaliers",1,"LSMJ02","Petits pois","Mercredi et jeudi soirs","1 boîte pour 2 repas","Menus journaliers",0.5,null,null,null,null,null,0,"VS22","Saucisson","Lundi à dimanche soirs","1 morceau de 400 grammes (Leclerc) pour 3 repas","Menus journaliers",0.33000001311302185,null,null,"Menus journaliers avril"]
["MJ108","2019-04-18","PC04","Avril","DS01","Pomme","lundi à vendredi soirs","1 sachet de 2 kilogrammes. 1 pomme pour 1 repas","Menus journaliers",1,"LSMJ02","Petits pois","Mercredi et jeudi soirs","1 boîte pour 2 repas","Menus journaliers",0.5,null,null,null,null,null,0,"VS18","Roulade à la pistache","Lundi à dimanche soirs","3 tranches pour 1 repas","Menus journaliers",3,null,null,"Menus journaliers avril"]
["MJ109","2019-04-19","PC04","Avril","DS01","Pomme","lundi à vendredi soirs","1 sachet de 2 kilogrammes. 1 pomme pour 1 repas","Menus journaliers",1,"LSV08","Radis","Vendredi soir","1 botte ou 1 sachet pour 1 repas","Menus journaliers",1,null,null,null,null,null,0,"VS22","Saucisson","Lundi à dimanche soirs","1 morceau de 400 grammes (Leclerc) pour 3 repas","Menus journaliers",0.33000001311302185,null,null,"Menus journaliers avril"]
["MJ110","2019-04-20","PC04","Avril","DWE10","Fruits au sirop","Samedi et dimanche midis et soirs","1 boîte pour 2 repas","Menus journaliers",1,"LWES01","Pâtes à la sauce tomates","Samedi midi et soir","5 cuillères pour 1 repas","Menus journaliers",10,null,null,null,null,null,0,"VS18","Roulade à la pistache","Lundi à dimanche soirs","3 tranches pour 1 repas","Menus journaliers",3,null,null,"Menus journaliers avril"]
["MJ111","2019-04-21","PC04","Avril","DWE10","Fruits au sirop","Samedi et dimanche midis et soirs","1 boîte pour 2 repas","Menus journaliers",1,"LWED04","Haricots verts","Dimanche midi et soir","1 boîte pour 2 repas","Menus journaliers",1,null,null,null,null,null,0,"VS22","Saucisson","Lundi à dimanche soirs","1 morceau de 400 grammes (Leclerc) pour 3 repas","Menus journaliers",0.34000000357627869,"O10","Pâques","Menus journaliers avril"]
["MJ112","2019-04-22","PC04","Avril","DS01","Pomme","lundi à vendredi soirs","1 sachet de 2 kilogrammes. 1 pomme pour 1 repas","Menus journaliers",1,"LSLM02","Choucroute","Lundi et mardi soirs","1 boîte pour 2 repas","Menus journaliers",0.5,null,null,null,null,null,0,"VS27","Viande choucroute","Lundi et mardi soirs","1 boîte pour 2 repas","Menus journaliers",0.5,"O07","Lundi de Pâques","Menus journaliers avril"]
["MJ113","2019-04-23","PC04","Avril","DS01","Pomme","lundi à vendredi soirs","1 sachet de 2 kilogrammes. 1 pomme pour 1 repas","Menus journaliers",1,"LSLM02","Choucroute","Lundi et mardi soirs","1 boîte pour 2 repas","Menus journaliers",0.5,null,null,null,null,null,0,"VS27","Viande choucroute","Lundi et mardi soirs","1 boîte pour 2 repas","Menus journaliers",0.5,null,null,"Menus journaliers avril"]
["MJ114","2019-04-24","PC04","Avril","DS01","Pomme","lundi à vendredi soirs","1 sachet de 2 kilogrammes. 1 pomme pour 1 repas","Menus journaliers",1,"LSMJ03","Petits pois et jeunes carottes","Mercredi et jeudi soirs","1 boîte pour 2 repas","Menus journaliers",0.5,null,null,null,null,null,0,"VS19","Roulé au fromage","Lundi à dimanche soirs","1 boîte pour 2 repas","Menus journaliers",1,null,null,"Menus journaliers avril"]
["MJ115","2019-04-25","PC04","Avril","DS01","Pomme","lundi à vendredi soirs","1 sachet de 2 kilogrammes. 1 pomme pour 1 repas","Menus journaliers",1,"LSMJ03","Petits pois et jeunes carottes","Mercredi et jeudi soirs","1 boîte pour 2 repas","Menus journaliers",0.5,null,null,null,null,null,0,"VS22","Saucisson","Lundi à dimanche soirs","1 morceau de 400 grammes (Leclerc) pour 3 repas","Menus journaliers",0.33000001311302185,null,null,"Menus journaliers avril"]
["MJ116","2019-04-26","PC04","Avril","DS01","Pomme","lundi à vendredi soirs","1 sachet de 2 kilogrammes. 1 pomme pour 1 repas","Menus journaliers",1,"LSV09","Salade","Vendredi soir","Unité : 1 tête pour 1 repas","Menus journaliers",1,null,null,null,null,null,0,"VS19","Roulé au fromage","Lundi à dimanche soirs","1 boîte pour 2 repas","Menus journaliers",1,null,null,"Menus journaliers avril"]
["MJ117","2019-04-27","PC04","Avril","DWE11","Fruits de saison","Samedi et dimanche midis et soirs","Unité : 2 à 4 pour 1 repas","Menus journaliers",4,"LWES02","Pâtes au beurre","Samedi midi et soir","5 cuillères pour 1 repas","Menus journaliers",10,null,null,null,null,null,0,"VS22","Saucisson","Lundi à dimanche soirs","1 morceau de 400 grammes (Leclerc) pour 3 repas","Menus journaliers",0.33000001311302185,null,null,"Menus journaliers avril"]
["MJ118","2019-04-28","PC04","Avril","DWE11","Fruits de saison","Samedi et dimanche midis et soirs","Unité : 2 à 4 pour 1 repas","Menus journaliers",4,"LWED02","Chips","Dimanche midi et soir","1 sachet pour 2 repas","Menus journaliers",1,null,null,null,null,null,0,"VS20","Salami","Lundi à dimanche soirs","1 paquet pour 2 repas","Menus journaliers",0.5,null,null,"Menus journaliers avril"]
["MJ119","2019-04-29","PC04","Avril","DS01","Pomme","lundi à vendredi soirs","1 sachet de 2 kilogrammes. 1 pomme pour 1 repas","Menus journaliers",1,"LSLM03","Chou-fleur","Lundi et mardi soirs","Unité : 1 pour 2 repas","Menus journaliers",0.5,null,null,null,null,null,0,"VS22","Saucisson","Lundi à dimanche soirs","1 morceau de 400 grammes (Leclerc) pour 3 repas","Menus journaliers",0.34000000357627869,null,null,"Menus journaliers avril"]
["MJ120","2019-04-30","PC04","Avril","DS01","Pomme","lundi à vendredi soirs","1 sachet de 2 kilogrammes. 1 pomme pour 1 repas","Menus journaliers",1,"LSLM03","Chou-fleur","Lundi et mardi soirs","Unité : 1 pour 2 repas","Menus journaliers",0.5,null,null,null,null,null,0,"VS20","Salami","Lundi à dimanche soirs","1 paquet pour 2 repas","Menus journaliers",0.5,null,null,"Menus journaliers avril"]
["MVWE27","2019-04-06","PC04","Avril",null,null,null,null,null,0,null,null,null,null,null,0,null,null,null,null,null,0,"VWE01","Agneau","Samedi et dimanche midis","1 tranche pour 1 repas","Menus viandes week-end",1,null,null,"Menus viandes weekend premier semestre"]
["MVWE28","2019-04-07","PC04","Avril",null,null,null,null,null,0,null,null,null,null,null,0,null,null,null,null,null,0,"VWE02","Bœuf","Samedi et dimanche midis","1 tranche pour 1 repas","Menus viandes week-end",1,null,null,"Menus viandes weekend premier semestre"]
["MVWE29","2019-04-13","PC04","Avril",null,null,null,null,null,0,null,null,null,null,null,0,null,null,null,null,null,0,"VWE03","Cheval","Samedi et dimanche midis","1 tranche pour 1 repas","Menus viandes week-end",1,null,null,"Menus viandes weekend premier semestre"]
["MVWE30","2019-04-14","PC04","Avril",null,null,null,null,null,0,null,null,null,null,null,0,null,null,null,null,null,0,"VWE04","Dinde","Samedi et dimanche midis","1 tranche pour 1 repas","Menus viandes week-end",1,null,null,"Menus viandes weekend premier semestre"]
["MVWE31","2019-04-20","PC04","Avril",null,null,null,null,null,0,null,null,null,null,null,0,null,null,null,null,null,0,"VWE05","Poisson","Samedi et dimanche midis","Unité : 1 pour 1 repas","Menus viandes week-end",1,null,null,"Menus viandes weekend premier semestre"]
["MVWE32","2019-04-21","PC04","Avril",null,null,null,null,null,0,null,null,null,null,null,0,null,null,null,null,null,0,"VWE06","Porc","Samedi et dimanche midis","1 tranche pour 1 repas","Menus viandes week-end",1,"O10","Pâques","Menus viandes weekend premier semestre"]
["MVWE33","2019-04-27","PC04","Avril",null,null,null,null,null,0,null,null,null,null,null,0,null,null,null,null,null,0,"VWE07","Veau","Samedi et dimanche midis","1 tranche pour 1 repas","Menus viandes week-end",1,null,null,"Menus viandes weekend premier semestre"]
["MVWE34","2019-04-28","PC04","Avril",null,null,null,null,null,0,null,null,null,null,null,0,null,null,null,null,null,0,"VWE01","Agneau","Samedi et dimanche midis","1 tranche pour 1 repas","Menus viandes week-end",1,null,null,"Menus viandes weekend premier semestre"]

{"sheet":"Mai","index":12,"n_rows":65,"n_cols":31,"rows_kept":65,"cut":false,"hidden":false,"merged":[[0,0,0,30]]}
["Menus du mois de mai  201.."]
[]
["Numéro du menu","Date du menu","Code période concernée","Période concernée","Code dessert","Dessert","Jour dessert","Conditionnement dessert","Destination dessert","Quantité dessert","Code légume","Légume","Jour légume","Conditionnement légume","Destination légume","Quantité légume","Code légume deux","Légume deux","Jour légume deux","Conditionnement légume deux","Destination légume deux","Quantité légume deux","Code viande","Viande","Jour viande","Conditionnement viande","Destination viande","Quantité viande","Code observation","Observation","Titre"]
["MMR87","2019-05-01","PC05","Mai","DMR01","Pomme","Lundi à vendredi midis","1 sachet de 2 kilogrammes. 1 pomme pour 1 repas","Menus midi retraite",1,"LMR08","Maïs","Lundi à vendredi midis","1 boîte pour 2 repas","Menus midi retraite",0.5,null,null,null,null,null,0,"VMR05","Rôti de veau","Lundi à vendredi midis","1 morceau de 500 grammes pour 5 repas","Menus midi retraite",100,"O04","Fête du travail","Menus midi retraite mai"]
["MMR88","2019-05-02","PC05","Mai","DMR01","Pomme","Lundi à vendredi midis","1 sachet de 2 kilogrammes. 1 pomme pour 1 repas","Menus midi retraite",1,"LMR09","Pâtes à la sauce tomates","Lundi à vendredi midis","5 cuillères pour 1 repas","Menus midi retraite",5,null,null,null,null,null,0,"VMR05","Rôti de veau","Lundi à vendredi midis","1 morceau de 500 grammes pour 5 repas","Menus midi retraite",100,null,null,"Menus midi retraite mai"]
["MMR89","2019-05-03","PC05","Mai","DMR01","Pomme","Lundi à vendredi midis","1 sachet de 2 kilogrammes. 1 pomme pour 1 repas","Menus midi retraite",1,"LMR10","Pâtes au beurre","Lundi à vendredi midis","5 cuillères pour 1 repas","Menus midi retraite",5,null,null,null,null,null,0,"VMR05","Rôti de veau","Lundi à vendredi midis","1 morceau de 500 grammes pour 5 repas","Menus midi retraite",100,null,null,"Menus midi retraite mai"]
["MMR90","2019-05-06","PC05","Mai","DMR01","Pomme","Lundi à vendredi midis","1 sachet de 2 kilogrammes. 1 pomme pour 1 repas","Menus midi retraite",1,"LMR11","Poireau","Lundi à vendredi midis","Unité : 1 pour 1 repas","Menus midi retraite",5,null,null,null,null,null,0,"VMR01","Rôti d'agneau","Lundi à vendredi midis","1 morceau de 500 grammes pour 5 repas","Menus midi retraite",100,null,null,"Menus midi retraite mai"]
["MMR91","2019-05-07","PC05","Mai","DMR01","Pomme","Lundi à vendredi midis","1 sachet de 2 kilogrammes. 1 pomme pour 1 repas","Menus midi retraite",1,"LMR12","Pomme de terre","Lundi à vendredi midis","Unité : 1 pour 1 repas","Menus midi retraite",1,null,null,null,null,null,0,"VMR01","Rôti d'agneau","Lundi à vendredi midis","1 morceau de 500 grammes pour 5 repas","Menus midi retraite",100,null,null,"Menus midi retraite mai"]
["MMR92","2019-05-08","PC05","Mai","DMR01","Pomme","Lundi à vendredi midis","1 sachet de 2 kilogrammes. 1 pomme pour 1 repas","Menus midi retraite",1,"LMR13","Purée","Lundi à vendredi midis","25 grammes pour 1 repas","Menus midi retraite",25,null,null,null,null,null,0,"VMR01","Rôti d'agneau","Lundi à vendredi midis","1 morceau de 500 grammes pour 5 repas","Menus midi retraite",100,"O13","Victoire du 08 mai 1945","Menus midi retraite mai"]
["MMR93","2019-05-09","PC05","Mai","DMR01","Pomme","Lundi à vendredi midis","1 sachet de 2 kilogrammes. 1 pomme pour 1 repas","Menus midi retraite",1,"LMR14","Radis","Lundi à vendredi midis","1 botte ou 1 sachet pour 2 repas","Menus midi retraite",0.5,null,null,null,null,null,0,"VMR01","Rôti d'agneau","Lundi à vendredi midis","1 morceau de 500 grammes pour 5 repas","Menus midi retraite",100,null,null,"Menus midi retraite mai"]
["MMR94","2019-05-10","PC05","Mai","DMR01","Pomme","Lundi à vendredi midis","1 sachet de 2 kilogrammes. 1 pomme pour 1 repas","Menus midi retraite",1,"LMR14","Radis","Lundi à vendredi midis","1 botte ou 1 sachet pour 2 repas","Menus midi retraite",0.5,null,null,null,null,null,0,"VMR01","Rôti d'agneau","Lundi à vendredi midis","1 morceau de 500 grammes pour 5 repas","Menus midi retraite",100,null,null,"Menus midi retraite mai"]
["MMR95","2019-05-13","PC05","Mai","DMR01","Pomme","Lundi à vendredi midis","1 sachet de 2 kilogrammes. 1 pomme pour 1 repas","Menus midi retraite",1,"LMR15","Riz","Lundi à vendredi midis","25 grammes pour 1 repas","Menus midi retraite",25,null,null,null,null,null,0,"VMR02","Rôti de bœuf","Lundi à vendredi midis","1 morceau de 500 grammes pour 5 repas","Menus midi retraite",100,null,null,"Menus midi retraite mai"]
["MMR96","2019-05-14","PC05","Mai","DMR01","Pomme","Lundi à vendredi midis","1 sachet de 2 kilogrammes. 1 pomme pour 1 repas","Menus midi retraite",1,"LMR16","Salade","Lundi à vendredi midis","Unité : 1 tête pour 1 repas","Menus midi retraite",1,null,null,null,null,null,0,"VMR02","Rôti de bœuf","Lundi à vendredi midis","1 morceau de 500 grammes pour 5 repas","Menus midi retraite",100,null,null,"Menus midi retraite mai"]
["MMR97","2019-05-15","PC05","Mai","DMR01","Pomme","Lundi à vendredi midis","1 sachet de 2 kilogrammes. 1 pomme pour 1 repas","Menus midi retraite",1,"LMR17","Tomates","Lundi à vendredi midis","Unité : 2 pour 1 repas","Menus midi retraite",2,null,null,null,null,null,0,"VMR02","Rôti de bœuf","Lundi à vendredi midis","1 morceau de 500 grammes pour 5 repas","Menus midi retraite",100,null,null,"Menus midi retraite mai"]
["MMR98","2019-05-16","PC05","Mai","DMR01","Pomme","Lundi à vendredi midis","1 sachet de 2 kilogrammes. 1 pomme pour 1 repas","Menus midi retraite",1,"LMR01","Asperges","Lundi à vendredi midis","1 boîte pour 1 repas","Menus midi retraite",1,null,null,null,null,null,0,"VMR02","Rôti de bœuf","Lundi à vendredi midis","1 morceau de 500 grammes pour 5 repas","Menus midi retraite",100,null,null,"Menus midi retraite mai"]
["MMR99","2019-05-17","PC05","Mai","DMR01","Pomme","Lundi à vendredi midis","1 sachet de 2 kilogrammes. 1 pomme pour 1 repas","Menus midi retraite",1,"LMR02","Avocat","Lundi à vendredi midis","Unité : 1 pour 1 repas","Menus midi retraite",1,null,null,null,null,null,0,"VMR02","Rôti de bœuf","Lundi à vendredi midis","1 morceau de 500 grammes pour 5 repas","Menus midi retraite",100,null,null,"Menus midi retraite mai"]
["MMR100","2019-05-20","PC05","Mai","DMR01","Pomme","Lundi à vendredi midis","1 sachet de 2 kilogrammes. 1 pomme pour 1 repas","Menus midi retraite",1,"LMR03","Carottes","Lundi à vendredi midis","Unité : 2 pour 1 repas","Menus midi retraite",2,null,null,null,null,null,0,"VMR03","Rôti de cheval","Lundi à vendredi midis","1 morceau de 500 grammes pour 5 repas","Menus midi retraite",100,null,null,"Menus midi retraite mai"]
["MMR101","2019-05-21","PC05","Mai","DMR01","Pomme","Lundi à vendredi midis","1 sachet de 2 kilogrammes. 1 pomme pour 1 repas","Menus midi retraite",1,"LMR04","Céleri","Lundi à vendredi midis","Unité : 1 branche pour 1 repas","Menus midi retraite",1,null,null,null,null,null,0,"VMR03","Rôti de cheval","Lundi à vendredi midis","1 morceau de 500 grammes pour 5 repas","Menus midi retraite",100,null,null,"Menus midi retraite mai"]
["MMR102","2019-05-22","PC05","Mai","DMR01","Pomme","Lundi à vendredi midis","1 sachet de 2 kilogrammes. 1 pomme pour 1 repas","Menus midi retraite",1,"LMR05","Champignons","Lundi à vendredi midis","1 boîte pour 1 repas","Menus midi retraite",1,null,null,null,null,null,0,"VMR03","Rôti de cheval","Lundi à vendredi midis","1 morceau de 500 grammes pour 5 repas","Menus midi retraite",100,null,null,"Menus midi retraite mai"]
["MMR103","2019-05-23","PC05","Mai","DMR01","Pomme","Lundi à vendredi midis","1 sachet de 2 kilogrammes. 1 pomme pour 1 repas","Menus midi retraite",1,"LMR06","Concombre","Lundi à vendredi midis","Unité : 1 pour 1 repas","Menus midi retraite",1,null,null,null,null,null,0,"VMR03","Rôti de cheval","Lundi à vendredi midis","1 morceau de 500 grammes pour 5 repas","Menus midi retraite",100,null,null,"Menus midi retraite mai"]
["MMR104","2019-05-24","PC05","Mai","DMR01","Pomme","Lundi à vendredi midis","1 sachet de 2 kilogrammes. 1 pomme pour 1 repas","Menus midi retraite",1,"LMR07","Couscous","Lundi à vendredi midis","25 grammes pour 1 repas","Menus midi retraite",25,null,null,null,null,null,0,"VMR03","Rôti de cheval","Lundi à vendredi midis","1 morceau de 500 grammes pour 5 repas","Menus midi retraite",100,null,null,"Menus midi retraite mai"]
["MMR105","2019-05-27","PC05","Mai","DMR01","Pomme","Lundi à vendredi midis","1 sachet de 2 kilogrammes. 1 pomme pour 1 repas","Menus midi retraite",1,"LMR08","Maïs","Lundi à vendredi midis","1 boîte pour 2 repas","Menus midi retraite",0.5,null,null,null,null,null,0,"VMR04","Rôti de porc","Lundi à vendredi midis","1 morceau de 500 grammes pour 5 repas","Menus midi retraite",100,null,null,"Menus midi retraite mai"]
["MMR106","2019-05-28","PC05","Mai","DMR01","Pomme","Lundi à vendredi midis","1 sachet de 2 kilogrammes. 1 pomme pour 1 repas","Menus midi retraite",1,"LMR08","Maïs","Lundi à vendredi midis","1 boîte pour 2 repas","Menus midi retraite",0.5,null,null,null,null,null,0,"VMR04","Rôti de porc","Lundi à vendredi midis","1 morceau de 500 grammes pour 5 repas","Menus midi retraite",100,null,null,"Menus midi retraite mai"]
["MMR107","2019-05-29","PC05","Mai","DMR01","Pomme","Lundi à vendredi midis","1 sachet de 2 kilogrammes. 1 pomme pour 1 repas","Menus midi retraite",1,"LMR09","Pâtes à la sauce tomates","Lundi à vendredi midis","5 cuillères pour 1 repas","Menus midi retraite",5,null,null,null,null,null,0,"VMR04","Rôti de porc","Lundi à vendredi midis","1 morceau de 500 grammes pour 5 repas","Menus midi retraite",100,null,null,"Menus midi retraite mai"]
["MMR108","2019-05-30","PC05","Mai","DMR01","Pomme","Lundi à vendredi midis","1 sachet de 2 kilogrammes. 1 pomme pour 1 repas","Menus midi retraite",1,"LMR10","Pâtes au beurre","Lundi à vendredi midis","5 cuillères pour 1 repas","Menus midi retraite",5,null,null,null,null,null,0,"VMR04","Rôti de porc","Lundi à vendredi midis","1 morceau de 500 grammes pour 5 repas","Menus midi retraite",100,"O02","Ascension","Menus midi retraite mai"]
["MMR109","2019-05-31","PC05","Mai","DMR01","Pomme","Lundi à vendredi midis","1 sachet de 2 kilogrammes. 1 pomme pour 1 repas","Menus midi retraite",1,"LMR11","Poireau","Lundi à vendredi midis","Unité : 1 pour 1 repas","Menus midi retraite",1,null,null,null,null,null,0,"VMR04","Rôti de porc","Lundi à vendredi midis","1 morceau de 500 grammes pour 5 repas","Menus midi retraite",100,null,null,"Menus midi retraite mai"]
["MJ121","2019-05-01","PC05","Mai","DS01","Pomme","lundi à vendredi soirs","1 sachet de 2 kilogrammes. 1 pomme pour 1 repas","Menus journaliers",1,"LSMJ04","Ratatouille","Mercredi et jeudi soirs","1 boîte pour 2 repas","Menus journaliers",0.5,null,null,null,null,null,0,"VS22","Saucisson","Lundi à dimanche soirs","1 morceau de 400 grammes (Leclerc) pour 3 repas","Menus journaliers",0.33000001311302185,"O04","Fête du travail","Menus journaliers mai"]
["MJ122","2019-05-02","PC05","Mai","DS01","Pomme","lundi à vendredi soirs","1 sachet de 2 kilogrammes. 1 pomme pour 1 repas","Menus journaliers",1,"LSMJ04","Ratatouille","Mercredi et jeudi soirs","1 boîte pour 2 repas","Menus journaliers",0.5,null,null,null,null,null,0,"VS21","Saucisses","Lundi à dimanche soirs","1 paquet pour 2 repas. 1 ou 2 saucisses pour 1 repas","Menus journaliers",0.5,null,null,"Menus journaliers mai"]
["MJ123","2019-05-03","PC05","Mai","DS01","Pomme","lundi à vendredi soirs","1 sachet de 2 kilogrammes. 1 pomme pour 1 repas","Menus journaliers",1,"LSV10","Salsifis","Vendredi soir","1 boîte pour 1 repas","Menus journaliers",1,null,null,null,null,null,0,"VS22","Saucisson","Lundi à dimanche soirs","1 morceau de 400 grammes (Leclerc) pour 3 repas","Menus journaliers",0.33000001311302185,null,null,"Menus journaliers mai"]
["MJ124","2019-05-04","PC05","Mai","DWE12","Gâteau de riz","Samedi et dimanche midis et soirs","1 pack de 4 pots pour le week-end. 1 pot pour 1 repas","Menus journaliers",2,"LWES03","Pâtes au fromage râpé","Samedi midi et soir","5 cuillères pour 1 repas","Menus journaliers",10,null,null,null,null,null,0,"VS21","Saucisses","Lundi à dimanche soirs","1 paquet pour 2 repas. 1 ou 2 saucisses pour 1 repas","Menus journaliers",0.5,null,null,"Menus journaliers mai"]
["MJ125","2019-05-05","PC05","Mai","DWE12","Gâteau de riz","Samedi et dimanche midis et soirs","1 pack de 4 pots pour le week-end. 1 pot pour 1 repas","Menus journaliers",2,"LWED03","Frites","Dimanche midi","20 frites pour 1 repas","Menus journaliers",20,"LWED01","Asperges","Dimanche soir","1 bocal ou 1 boîte pour 1 repas","Menus journaliers",1,"VS22","Saucisson","Lundi à dimanche soirs","1 morceau de 400 grammes (Leclerc) pour 3 repas","Menus journaliers",0.34000000357627869,null,null,"Menus journaliers mai"]
["MJ126","2019-05-06","PC05","Mai","DS01","Pomme","lundi à vendredi soirs","1 sachet de 2 kilogrammes. 1 pomme pour 1 repas","Menus journaliers",1,"LSLM04","Choux de Bruxelles","Lundi et mardi soirs","1 boîte pour 2 repas","Menus journaliers",0.5,null,null,null,null,null,0,"VS23","Tête persillée","Lundi à dimanche soirs","1 tranche pour 2 repas","Menus journaliers",0.5,null,null,"Menus journaliers mai"]
["MJ127","2019-05-07","PC05","Mai","DS01","Pomme","lundi à vendredi soirs","1 sachet de 2 kilogrammes. 1 pomme pour 1 repas","Menus journaliers",1,"LSLM04","Choux de Bruxelles","Lundi et mardi soirs","1 boîte pour 2 repas","Menus journaliers",0.5,null,null,null,null,null,0,"VS22","Saucisson","Lundi à dimanche soirs","1 morceau de 400 grammes (Leclerc) pour 3 repas","Menus journaliers",0.33000001311302185,null,null,"Menus journaliers mai"]
["MJ128","2019-05-08","PC05","Mai","DS01","Pomme","lundi à vendredi soirs","1 sachet de 2 kilogrammes. 1 pomme pour 1 repas","Menus journaliers",1,"LSMJ05","Raviolis","Mercredi et jeudi soirs","1 boîte pour 2 repas","Menus journaliers",0.5,null,null,null,null,null,0,"VS23","Tête persillée","Lundi à dimanche soirs","1 tranche pour 2 repas","Menus journaliers",0.5,"O13","Victoire du 08 mai 1945","Menus journaliers mai"]
["MJ129","2019-05-09","PC05","Mai","DS01","Pomme","lundi à vendredi soirs","1 sachet de 2 kilogrammes. 1 pomme pour 1 repas","Menus journaliers",1,"LSMJ05","Raviolis","Mercredi et jeudi soirs","1 boîte pour 2 repas","Menus journaliers",0.5,null,null,null,null,null,0,"VS22","Saucisson","Lundi à dimanche soirs","1 morceau de 400 grammes (Leclerc) pour 3 repas","Menus journaliers",0.33000001311302185,null,null,"Menus journaliers mai"]
["MJ130","2019-05-10","PC05","Mai","DS01","Pomme","lundi à vendredi soirs","1 sachet de 2 kilogrammes. 1 pomme pour 1 repas","Menus journaliers",1,"LSV11","Tomates ","Vendredi soir","Unité : 2 pour 1 repas","Menus journaliers",2,null,null,null,null,null,0,"VS24","Tête roulée","Lundi à dimanche soirs","1 tranche pour 2 repas","Menus journaliers",3,null,null,"Menus journaliers mai"]
["MJ131","2019-05-11","PC05","Mai","DWE13","Gâteau de semoule","Samedi et dimanche midis et soirs","1 boîte pour 2 repas","Menus journaliers",2,"LWES01","Pâtes à la sauce tomates","Samedi midi et soir","5 cuillères pour 1 repas","Menus journaliers",10,null,null,null,null,null,0,"VS22","Saucisson","Lundi à dimanche soirs","1 morceau de 400 grammes (Leclerc) pour 3 repas","Menus journaliers",0.34000000357627869,null,null,"Menus journaliers mai"]
["MJ132","2019-05-12","PC05","Mai","DWE13","Gâteau de semoule","Samedi et dimanche midis et soirs","1 boîte pour 2 repas","Menus journaliers",2,"LWED04","Haricots verts","Dimanche midi et soir","1 boîte pour 2 repas","Menus journaliers",1,null,null,null,null,null,0,"VS24","Tête roulée","Lundi à dimanche soirs","1 tranche pour 2 repas","Menus journaliers",3,null,null,"Menus journaliers mai"]
["MJ133","2019-05-13","PC05","Mai","DS01","Pomme","lundi à vendredi soirs","1 sachet de 2 kilogrammes. 1 pomme pour 1 repas","Menus journaliers",1,"LSLM05","Couscous","Lundi et mardi soirs","25 grammes pour 1 repas","Menus journaliers",25,null,null,null,null,null,0,"VS22","Saucisson","Lundi à dimanche soirs","1 morceau de 400 grammes (Leclerc) pour 3 repas","Menus journaliers",0.33000001311302185,null,null,"Menus journaliers mai"]
["MJ134","2019-05-14","PC05","Mai","DS01","Pomme","lundi à vendredi soirs","1 sachet de 2 kilogrammes. 1 pomme pour 1 repas","Menus journaliers",1,"LSLM05","Couscous","Lundi et mardi soirs","25 grammes pour 1 repas","Menus journaliers",25,null,null,null,null,null,0,"VS25","Thon","Lundi à dimanche soirs","1 boîte pour 1 repas","Menus journaliers",1,null,null,"Menus journaliers mai"]
["MJ135","2019-05-15","PC05","Mai","DS01","Pomme","lundi à vendredi soirs","1 sachet de 2 kilogrammes. 1 pomme pour 1 repas","Menus journaliers",1,"LSMJ06","Tomates pelées","Mercredi et jeudi soirs","1 boîte pour 2 repas","Menus journaliers",0.5,null,null,null,null,null,0,"VS22","Saucisson","Lundi à dimanche soirs","1 morceau de 400 grammes (Leclerc) pour 3 repas","Menus journaliers",0.33000001311302185,null,null,"Menus journaliers mai"]
["MJ136","2019-05-16","PC05","Mai","DS01","Pomme","lundi à vendredi soirs","1 sachet de 2 kilogrammes. 1 pomme pour 1 repas","Menus journaliers",1,"LSMJ06","Tomates pelées","Mercredi et jeudi soirs","1 boîte pour 2 repas","Menus journaliers",0.5,null,null,null,null,null,0,"VS01","Bifteck haché de bœuf","Lundi à dimanche soirs","1 paquet pour 2 repas","Menus journaliers",1,null,null,"Menus journaliers mai"]
["MJ137","2019-05-17","PC05","Mai","DS01","Pomme","lundi à vendredi soirs","1 sachet de 2 kilogrammes. 1 pomme pour 1 repas","Menus journaliers",1,"LSV01","Asperges","Vendredi soir","1 bocal ou 1 boîte pour 1 repas","Menus journaliers",1,null,null,null,null,null,0,"VS22","Saucisson","Lundi à dimanche soirs","1 morceau de 400 grammes (Leclerc) pour 3 repas","Menus journaliers",0.34000000357627869,null,null,"Menus journaliers mai"]
["MJ138","2019-05-18","PC05","Mai","DWE14","Gâteaux samedi et dimanche","Samedi et dimanche midis et soirs","1 boîte pour 2 repas","Menus journaliers",2,"LWES02","Pâtes au beurre","Samedi midi et soir","5 cuillères pour 1 repas","Menus journaliers",10,null,null,null,null,null,0,"VS01","Bifteck haché de bœuf","Lundi à dimanche soirs","1 paquet pour 2 repas","Menus journaliers",1,null,null,"Menus journaliers mai"]
["MJ139","2019-05-19","PC05","Mai","DWE14","Gâteaux samedi et dimanche","Samedi et dimanche midis et soirs","1 boîte pour 2 repas","Menus journaliers",2,"LWED04","Haricots verts","Dimanche midi et soir","1 boîte pour 2 repas","Menus journaliers",1,null,null,null,null,null,0,"VS22","Saucisson","Lundi à dimanche soirs","1 morceau de 400 grammes (Leclerc) pour 3 repas","Menus journaliers",0.33000001311302185,null,null,"Menus journaliers mai"]
["MJ140","2019-05-20","PC05","Mai","DS01","Pomme","lundi à vendredi soirs","1 sachet de 2 kilogrammes. 1 pomme pour 1 repas","Menus journaliers",1,"LSLM06","Endives","Lundi et mardi soirs","1 boîte pour 2 repas","Menus journaliers",0.5,null,null,null,null,null,0,"VS02","Bifteck haché de cheval","Lundi à dimanche soirs","125 grammes pour 1 repas","Menus journaliers",125,null,null,"Menus journaliers mai"]
["MJ141","2019-05-21","PC05","Mai","DS01","Pomme","lundi à vendredi soirs","1 sachet de 2 kilogrammes. 1 pomme pour 1 repas","Menus journaliers",1,"LSLM06","Endives","Lundi et mardi soirs","1 boîte pour 2 repas","Menus journaliers",0.5,null,null,null,null,null,0,"VS22","Saucisson","Lundi à dimanche soirs","1 morceau de 400 grammes (Leclerc) pour 3 repas","Menus journaliers",0.33000001311302185,null,null,"Menus journaliers mai"]
["MJ142","2019-05-22","PC05","Mai","DS01","Pomme","lundi à vendredi soirs","1 sachet de 2 kilogrammes. 1 pomme pour 1 repas","Menus journaliers",1,"LSMJ01","Macédoine de légumes","Mercredi et jeudi soirs","1 boîte pour 2 repas","Menus journaliers",0.5,null,null,null,null,null,0,"VS03","Bifteck haché de veau","Lundi à dimanche soirs","1 paquet pour 2 repas","Menus journaliers",1,null,null,"Menus journaliers mai"]
["MJ143","2019-05-23","PC05","Mai","DS01","Pomme","lundi à vendredi soirs","1 sachet de 2 kilogrammes. 1 pomme pour 1 repas","Menus journaliers",1,"LSMJ01","Macédoine de légumes","Mercredi et jeudi soirs","1 boîte pour 2 repas","Menus journaliers",0.5,null,null,null,null,null,0,"VS22","Saucisson","Lundi à dimanche soirs","1 morceau de 400 grammes (Leclerc) pour 3 repas","Menus journaliers",0.34000000357627869,null,null,"Menus journaliers mai"]
["MJ144","2019-05-24","PC05","Mai","DS01","Pomme","lundi à vendredi soirs","1 sachet de 2 kilogrammes. 1 pomme pour 1 repas","Menus journaliers",1,"LSV02","Avocat","Vendredi soir","Unité : 1 pour 1 repas","Menus journaliers",1,null,null,null,null,null,0,"VS03","Bifteck haché de veau","Lundi à dimanche soirs","1 paquet pour 2 repas","Menus journaliers",1,null,null,"Menus journaliers mai"]
["MJ145","2019-05-25","PC05","Mai","DWE15","Mousse au chocolat","Samedi et dimanche midis et soirs","1 pack de 4 pots pour le week-end. 1 pot pour 1 repas","Menus journaliers",2,"LWES03","Pâtes au fromage râpé","Samedi midi et soir","5 cuillères pour 1 repas","Menus journaliers",10,null,null,null,null,null,0,"VS22","Saucisson","Lundi à dimanche soirs","1 morceau de 400 grammes (Leclerc) pour 3 repas","Menus journaliers",0.33000001311302185,null,null,"Menus journaliers mai"]
["MJ146","2019-05-26","PC05","Mai","DWE15","Mousse au chocolat","Samedi et dimanche midis et soirs","1 pack de 4 pots pour le week-end. 1 pot pour 1 repas","Menus journaliers",2,"LWED03","Frites","Dimanche midi","20 frites pour 1 repas","Menus journaliers",20,"LWED01","Asperges","Dimanche soir","1 bocal ou 1 boîte pour 1 repas","Menus journaliers",1,"VS04","Bouchée à la reine","Lundi à dimanche soirs","1 boîte pour 2 repas","Menus journaliers",1,null,null,"Menus journaliers mai"]
["MJ147","2019-05-27","PC05","Mai","DS01","Pomme","lundi à vendredi soirs","1 sachet de 2 kilogrammes. 1 pomme pour 1 repas","Menus journaliers",1,"LSLM07","Haricots verts","Lundi et mardi soirs","1 boîte pour 2 repas","Menus journaliers",0.5,null,null,null,null,null,0,"VS22","Saucisson","Lundi à dimanche soirs","1 morceau de 400 grammes (Leclerc) pour 3 repas","Menus journaliers",0.33000001311302185,null,null,"Menus journaliers mai"]
["MJ148","2019-05-28","PC05","Mai","DS01","Pomme","lundi à vendredi soirs","1 sachet de 2 kilogrammes. 1 pomme pour 1 repas","Menus journaliers",1,"LSLM07","Haricots verts","Lundi et mardi soirs","1 boîte pour 2 repas","Menus journaliers",0.5,null,null,null,null,null,0,"VS04","Bouchée à la reine","Lundi à dimanche soirs","1 boîte pour 2 repas","Menus journaliers",1,null,null,"Menus journaliers mai"]
["MJ149","2019-05-29","PC05","Mai","DS01","Pomme","lundi à vendredi soirs","1 sachet de 2 kilogrammes. 1 pomme pour 1 repas","Menus journaliers",1,"LSMJ02","Petits pois","Mercredi et jeudi soirs","1 boîte pour 2 repas","Menus journaliers",0.5,null,null,null,null,null,0,"VS22","Saucisson","Lundi à dimanche soirs","1 morceau de 400 grammes (Leclerc) pour 3 repas","Menus journaliers",0.34000000357627869,null,null,"Menus journaliers mai"]
["MJ150","2019-05-30","PC05","Mai","DS01","Pomme","lundi à vendredi soirs","1 sachet de 2 kilogrammes. 1 pomme pour 1 repas","Menus journaliers",1,"LSMJ02","Petits pois","Mercredi et jeudi soirs","1 boîte pour 2 repas","Menus journaliers",0.5,null,null,null,null,null,0,"VS05","Boudin","Lundi à dimanche soirs","1 paquet pour 2 repas","Menus journaliers",0.5,"O02","Ascension","Menus journaliers mai"]
["MJ151","2019-05-31","PC05","Mai","DS01","Pomme","lundi à vendredi soirs","1 sachet de 2 kilogrammes. 1 pomme pour 1 repas","Menus journaliers",1,"LSV03","Betterave rouge","Vendredi soir","Unité : 1 pour 1 repas","Menus journaliers",1,null,null,null,null,null,0,"VS22","Saucisson","Lundi à dimanche soirs","1 morceau de 400 grammes (Leclerc) pour 3 repas","Menus journaliers",0.33000001311302185,null,null,"Menus journaliers mai"]
["MVWE35","2019-05-04","PC05","Mai",null,null,null,null,null,0,null,null,null,null,null,0,null,null,null,null,null,0,"VWE02","Bœuf","Samedi et dimanche midis","1 tranche pour 1 repas","Menus viandes week-end",1,null,null,"Menus viandes weekend premier semestre"]
["MVWE36","2019-05-05","PC05","Mai",null,null,null,null,null,0,null,null,null,null,null,0,null,null,null,null,null,0,"VWE03","Cheval","Samedi et dimanche midis","1 tranche pour 1 repas","Menus viandes week-end",1,null,null,"Menus viandes weekend premier semestre"]
["MVWE37","2019-05-11","PC05","Mai",null,null,null,null,null,0,null,null,null,null,null,0,null,null,null,null,null,0,"VWE04","Dinde","Samedi et dimanche midis","1 tranche pour 1 repas","Menus viandes week-end",1,null,null,"Menus viandes weekend premier semestre"]
["MVWE38","2019-05-12","PC05","Mai",null,null,null,null,null,0,null,null,null,null,null,0,null,null,null,null,null,0,"VWE05","Poisson","Samedi et dimanche midis","Unité : 1 pour 1 repas","Menus viandes week-end",1,null,null,"Menus viandes weekend premier semestre"]
["MVWE39","2019-05-18","PC05","Mai",null,null,null,null,null,0,null,null,null,null,null,0,null,null,null,null,null,0,"VWE06","Porc","Samedi et dimanche midis","1 tranche pour 1 repas","Menus viandes week-end",1,null,null,"Menus viandes weekend premier semestre"]
["MVWE40","2019-05-19","PC05","Mai",null,null,null,null,null,0,null,null,null,null,null,0,null,null,null,null,null,0,"VWE07","Veau","Samedi et dimanche midis","1 tranche pour 1 repas","Menus viandes week-end",1,null,null,"Menus viandes weekend premier semestre"]
["MVWE41","2019-05-25","PC05","Mai",null,null,null,null,null,0,null,null,null,null,null,0,null,null,null,null,null,0,"VWE01","Agneau","Samedi et dimanche midis","1 tranche pour 1 repas","Menus viandes week-end",1,null,null,"Menus viandes weekend premier semestre"]
["MVWE42","2019-05-26","PC05","Mai",null,null,null,null,null,0,null,null,null,null,null,0,null,null,null,null,null,0,"VWE02","Bœuf","Samedi et dimanche midis","1 tranche pour 1 repas","Menus viandes week-end",1,null,null,"Menus viandes weekend premier semestre"]

{"sheet":"Juin","index":13,"n_rows":63,"n_cols":31,"rows_kept":63,"cut":false,"hidden":false,"merged":[[0,0,0,30]]}
["Menus du mois de juin  201.."]
[]
["Numéro du menu","Date du menu","Code période concernée","Période concernée","Code dessert","Dessert","Jour dessert","Conditionnement dessert","Destination dessert","Quantité dessert","Code légume","Légume","Jour légume","Conditionnement légume","Destination légume","Quantité légume","Code légume deux","Légume deux","Jour légume deux","Conditionnement légume deux","Destination légume deux","Quantité légume deux","Code viande","Viande","Jour viande","Conditionnement viande","Destination viande","Quantité viande","Code observation","Observation","Titre"]
["MMR110","2019-06-03","PC06","Juin","DMR01","Pomme","Lundi à vendredi midis","1 sachet de 2 kilogrammes. 1 pomme pour 1 repas","Menus midi retraite",1,"LMR12","Pomme de terre","Lundi à vendredi midis","Unité : 1 pour 1 repas","Menus midi retraite",1,null,null,null,null,null,0,"VMR05","Rôti de veau","Lundi à vendredi midis","1 morceau de 500 grammes pour 5 repas","Menus midi retraite",100,null,null,"Menus midi retraite juin"]
["MMR111","2019-06-04","PC06","Juin","DMR01","Pomme","Lundi à vendredi midis","1 sachet de 2 kilogrammes. 1 pomme pour 1 repas","Menus midi retraite",1,"LMR13","Purée","Lundi à vendredi midis","25 grammes pour 1 repas","Menus midi retraite",1,null,null,null,null,null,0,"VMR05","Rôti de veau","Lundi à vendredi midis","1 morceau de 500 grammes pour 5 repas","Menus midi retraite",100,null,null,"Menus midi retraite juin"]
["MMR112","2019-06-05","PC06","Juin","DMR01","Pomme","Lundi à vendredi midis","1 sachet de 2 kilogrammes. 1 pomme pour 1 repas","Menus midi retraite",1,"LMR14","Radis","Lundi à vendredi midis","1 botte ou 1 sachet pour 2 repas","Menus midi retraite",0.5,null,null,null,null,null,0,"VMR05","Rôti de veau","Lundi à vendredi midis","1 morceau de 500 grammes pour 5 repas","Menus midi retraite",100,null,null,"Menus midi retraite juin"]
["MMR113","2019-06-06","PC06","Juin","DMR01","Pomme","Lundi à vendredi midis","1 sachet de 2 kilogrammes. 1 pomme pour 1 repas","Menus midi retraite",1,"LMR14","Radis","Lundi à vendredi midis","1 botte ou 1 sachet pour 2 repas","Menus midi retraite",0.5,null,null,null,null,null,0,"VMR05","Rôti de veau","Lundi à vendredi midis","1 morceau de 500 grammes pour 5 repas","Menus midi retraite",100,null,null,"Menus midi retraite juin"]
["MMR114","2019-06-07","PC06","Juin","DMR01","Pomme","Lundi à vendredi midis","1 sachet de 2 kilogrammes. 1 pomme pour 1 repas","Menus midi retraite",1,"LMR15","Riz","Lundi à vendredi midis","25 grammes pour 1 repas","Menus midi retraite",25,null,null,null,null,null,0,"VMR05","Rôti de veau","Lundi à vendredi midis","1 morceau de 500 grammes pour 5 repas","Menus midi retraite",100,null,null,"Menus midi retraite juin"]
["MMR115","2019-06-10","PC06","Juin","DMR01","Pomme","Lundi à vendredi midis","1 sachet de 2 kilogrammes. 1 pomme pour 1 repas","Menus midi retraite",1,"LMR16","Salade","Lundi à vendredi midis","Unité : 1 tête pour 1 repas","Menus midi retraite",1,null,null,null,null,null,0,"VMR01","Rôti d'agneau","Lundi à vendredi midis","1 morceau de 500 grammes pour 5 repas","Menus midi retraite",100,"O08","Lundi de Pentecôte","Menus midi retraite juin"]
["MMR116","2019-06-11","PC06","Juin","DMR01","Pomme","Lundi à vendredi midis","1 sachet de 2 kilogrammes. 1 pomme pour 1 repas","Menus midi retraite",1,"LMR17","Tomates","Lundi à vendredi midis","Unité : 2 pour 1 repas","Menus midi retraite",1,null,null,null,null,null,0,"VMR01","Rôti d'agneau","Lundi à vendredi midis","1 morceau de 500 grammes pour 5 repas","Menus midi retraite",100,null,null,"Menus midi retraite juin"]
["MMR117","2019-06-12","PC06","Juin","DMR01","Pomme","Lundi à vendredi midis","1 sachet de 2 kilogrammes. 1 pomme pour 1 repas","Menus midi retraite",1,"LMR01","Asperges","Lundi à vendredi midis","1 boîte pour 1 repas","Menus midi retraite",2,null,null,null,null,null,0,"VMR01","Rôti d'agneau","Lundi à vendredi midis","1 morceau de 500 grammes pour 5 repas","Menus midi retraite",100,null,null,"Menus midi retraite juin"]
["MMR118","2019-06-13","PC06","Juin","DMR01","Pomme","Lundi à vendredi midis","1 sachet de 2 kilogrammes. 1 pomme pour 1 repas","Menus midi retraite",1,"LMR02","Avocat","Lundi à vendredi midis","Unité : 1 pour 1 repas","Menus midi retraite",1,null,null,null,null,null,0,"VMR01","Rôti d'agneau","Lundi à vendredi midis","1 morceau de 500 grammes pour 5 repas","Menus midi retraite",100,null,null,"Menus midi retraite juin"]
["MMR119","2019-06-14","PC06","Juin","DMR01","Pomme","Lundi à vendredi midis","1 sachet de 2 kilogrammes. 1 pomme pour 1 repas","Menus midi retraite",1,"LMR03","Carottes","Lundi à vendredi midis","Unité : 2 pour 1 repas","Menus midi retraite",2,null,null,null,null,null,0,"VMR01","Rôti d'agneau","Lundi à vendredi midis","1 morceau de 500 grammes pour 5 repas","Menus midi retraite",100,null,null,"Menus midi retraite juin"]
["MMR120","2019-06-17","PC06","Juin","DMR01","Pomme","Lundi à vendredi midis","1 sachet de 2 kilogrammes. 1 pomme pour 1 repas","Menus midi retraite",1,"LMR04","Céleri","Lundi à vendredi midis","Unité : 1 branche pour 1 repas","Menus midi retraite",1,null,null,null,null,null,0,"VMR02","Rôti de bœuf","Lundi à vendredi midis","1 morceau de 500 grammes pour 5 repas","Menus midi retraite",100,null,null,"Menus midi retraite juin"]
["MMR121","2019-06-18","PC06","Juin","DMR01","Pomme","Lundi à vendredi midis","1 sachet de 2 kilogrammes. 1 pomme pour 1 repas","Menus midi retraite",1,"LMR05","Champignons","Lundi à vendredi midis","1 boîte pour 1 repas","Menus midi retraite",1,null,null,null,null,null,0,"VMR02","Rôti de bœuf","Lundi à vendredi midis","1 morceau de 500 grammes pour 5 repas","Menus midi retraite",100,null,null,"Menus midi retraite juin"]
["MMR122","2019-06-19","PC06","Juin","DMR01","Pomme","Lundi à vendredi midis","1 sachet de 2 kilogrammes. 1 pomme pour 1 repas","Menus midi retraite",1,"LMR06","Concombre","Lundi à vendredi midis","Unité : 1 pour 1 repas","Menus midi retraite",1,null,null,null,null,null,0,"VMR02","Rôti de bœuf","Lundi à vendredi midis","1 morceau de 500 grammes pour 5 repas","Menus midi retraite",100,null,null,"Menus midi retraite juin"]
["MMR123","2019-06-20","PC06","Juin","DMR01","Pomme","Lundi à vendredi midis","1 sachet de 2 kilogrammes. 1 pomme pour 1 repas","Menus midi retraite",1,"LMR07","Couscous","Lundi à vendredi midis","25 grammes pour 1 repas","Menus midi retraite",25,null,null,null,null,null,0,"VMR02","Rôti de bœuf","Lundi à vendredi midis","1 morceau de 500 grammes pour 5 repas","Menus midi retraite",100,null,null,"Menus midi retraite juin"]
["MMR124","2019-06-21","PC06","Juin","DMR01","Pomme","Lundi à vendredi midis","1 sachet de 2 kilogrammes. 1 pomme pour 1 repas","Menus midi retraite",1,"LMR08","Maïs","Lundi à vendredi midis","1 boîte pour 2 repas","Menus midi retraite",0.5,null,null,null,null,null,0,"VMR02","Rôti de bœuf","Lundi à vendredi midis","1 morceau de 500 grammes pour 5 repas","Menus midi retraite",100,null,null,"Menus midi retraite juin"]
["MMR125","2019-06-24","PC06","Juin","DMR01","Pomme","Lundi à vendredi midis","1 sachet de 2 kilogrammes. 1 pomme pour 1 repas","Menus midi retraite",1,"LMR08","Maïs","Lundi à vendredi midis","1 boîte pour 2 repas","Menus midi retraite",0.5,null,null,null,null,null,0,"VMR03","Rôti de cheval","Lundi à vendredi midis","1 morceau de 500 grammes pour 5 repas","Menus midi retraite",100,null,null,"Menus midi retraite juin"]
["MMR126","2019-06-25","PC06","Juin","DMR01","Pomme","Lundi à vendredi midis","1 sachet de 2 kilogrammes. 1 pomme pour 1 repas","Menus midi retraite",1,"LMR09","Pâtes à la sauce tomates","Lundi à vendredi midis","5 cuillères pour 1 repas","Menus midi retraite",5,null,null,null,null,null,0,"VMR03","Rôti de cheval","Lundi à vendredi midis","1 morceau de 500 grammes pour 5 repas","Menus midi retraite",100,null,null,"Menus midi retraite juin"]
["MMR127","2019-06-26","PC06","Juin","DMR01","Pomme","Lundi à vendredi midis","1 sachet de 2 kilogrammes. 1 pomme pour 1 repas","Menus midi retraite",1,"LMR10","Pâtes au beurre","Lundi à vendredi midis","5 cuillères pour 1 repas","Menus midi retraite",5,null,null,null,null,null,0,"VMR03","Rôti de cheval","Lundi à vendredi midis","1 morceau de 500 grammes pour 5 repas","Menus midi retraite",100,null,null,"Menus midi retraite juin"]
["MMR128","2019-06-27","PC06","Juin","DMR01","Pomme","Lundi à vendredi midis","1 sachet de 2 kilogrammes. 1 pomme pour 1 repas","Menus midi retraite",1,"LMR11","Poireau","Lundi à vendredi midis","Unité : 1 pour 1 repas","Menus midi retraite",1,null,null,null,null,null,0,"VMR03","Rôti de cheval","Lundi à vendredi midis","1 morceau de 500 grammes pour 5 repas","Menus midi retraite",100,null,null,"Menus midi retraite juin"]
["MMR129","2019-06-28","PC06","Juin","DMR01","Pomme","Lundi à vendredi midis","1 sachet de 2 kilogrammes. 1 pomme pour 1 repas","Menus midi retraite",1,"LMR12","Pomme de terre","Lundi à vendredi midis","Unité : 1 pour 1 repas","Menus midi retraite",1,null,null,null,null,null,0,"VMR03","Rôti de cheval","Lundi à vendredi midis","1 morceau de 500 grammes pour 5 repas","Menus midi retraite",100,null,null,"Menus midi retraite juin"]
["MJ152","2019-06-01","PC06","Juin","DWE16","Oranges","Samedi et dimanche midis et soirs","Unité : 1 pour 1 repas","Menus journaliers",2,"LWES01","Pâtes à la sauce tomates","Samedi midi et soir","5 cuillères pour 1 repas","Menus journaliers",10,null,null,null,null,null,0,"VS05","Boudin","Lundi à dimanche soirs","1 paquet pour 2 repas","Menus journaliers",0.5,null,null,"Menus journaliers mai"]
["MJ153","2019-06-02","PC06","Juin","DWE16","Oranges","Samedi et dimanche midis et soirs","Unité : 1 pour 1 repas","Menus journaliers",2,"LWED04","Haricots verts","Dimanche midi et soir","1 boîte pour 2 repas","Menus journaliers",1,null,null,null,null,null,0,"VS22","Saucisson","Lundi à dimanche soirs","1 morceau de 400 grammes (Leclerc) pour 3 repas","Menus journaliers",0.33000001311302185,null,null,"Menus journaliers juin"]
["MJ154","2019-06-03","PC06","Juin","DS01","Pomme","lundi à vendredi soirs","1 sachet de 2 kilogrammes. 1 pomme pour 1 repas","Menus journaliers",1,"LSLM08","Maïs","Lundi et mardi soirs","1 boîte pour 2 repas","Menus journaliers",0.5,null,null,null,null,null,0,"VS06","Cervelas","Lundi à dimanche soirs","1 paquet pour 2 repas","Menus journaliers",0.5,null,null,"Menus journaliers juin"]
["MJ155","2019-06-04","PC06","Juin","DS01","Pomme","lundi à vendredi soirs","1 sachet de 2 kilogrammes. 1 pomme pour 1 repas","Menus journaliers",1,"LSLM08","Maïs","Lundi et mardi soirs","1 boîte pour 2 repas","Menus journaliers",0.5,null,null,null,null,null,0,"VS22","Saucisson","Lundi à dimanche soirs","1 morceau de 400 grammes (Leclerc) pour 3 repas","Menus journaliers",0.34000000357627869,null,null,"Menus journaliers juin"]
["MJ156","2019-06-05","PC06","Juin","DS01","Pomme","lundi à vendredi soirs","1 sachet de 2 kilogrammes. 1 pomme pour 1 repas","Menus journaliers",1,"LSMJ03","Petits pois et jeunes carottes","Mercredi et jeudi soirs","1 boîte pour 2 repas","Menus journaliers",0.5,null,null,null,null,null,0,"VS06","Cervelas","Lundi à dimanche soirs","1 paquet pour 2 repas","Menus journaliers",0.5,null,null,"Menus journaliers juin"]
["MJ157","2019-06-06","PC06","Juin","DS01","Pomme","lundi à vendredi soirs","1 sachet de 2 kilogrammes. 1 pomme pour 1 repas","Menus journaliers",1,"LSMJ03","Petits pois et jeunes carottes","Mercredi et jeudi soirs","1 boîte pour 2 repas","Menus journaliers",0.5,null,null,null,null,null,0,"VS22","Saucisson","Lundi à dimanche soirs","1 morceau de 400 grammes (Leclerc) pour 3 repas","Menus journaliers",0.33000001311302185,null,null,"Menus journaliers juin"]
["MJ158","2019-06-07","PC06","Juin","DS01","Pomme","lundi à vendredi soirs","1 sachet de 2 kilogrammes. 1 pomme pour 1 repas","Menus journaliers",1,"LSV04","Carottes","Vendredi soir","Unité : 2 pour 1 repas","Menus journaliers",2,null,null,null,null,null,0,"VS07","Cœur","Lundi à dimanche soirs","1 paquet pour 2 repas","Menus journaliers",1,null,null,"Menus journaliers juin"]
["MJ159","2019-06-08","PC06","Juin","DWE17","Petits suisses","Samedi et dimanche midis et soirs","1 pack de 6 pots. 3 pots pour 1 repas","Menus journaliers",6,"LWES02","Pâtes au beurre","Samedi midi et soir","5 cuillères pour 1 repas","Menus journaliers",10,null,null,null,null,null,0,"VS22","Saucisson","Lundi à dimanche soirs","1 morceau de 400 grammes (Leclerc) pour 3 repas","Menus journaliers",0.33000001311302185,null,null,"Menus journaliers juin"]
["MJ160","2019-06-09","PC06","Juin","DWE17","Petits suisses","Samedi et dimanche midis et soirs","1 pack de 6 pots. 3 pots pour 1 repas","Menus journaliers",6,"LWED02","Chips","Dimanche midi et soir","1 sachet pour 2 repas","Menus journaliers",1,null,null,null,null,null,0,"VS07","Cœur","Lundi à dimanche soirs","1 paquet pour 2 repas","Menus journaliers",1,"O11","Pentecôte","Menus journaliers juin"]
["MJ161","2019-06-10","PC06","Juin","DS01","Pomme","lundi à vendredi soirs","1 sachet de 2 kilogrammes. 1 pomme pour 1 repas","Menus journaliers",1,"LSLM09","Paella","Lundi et mardi soirs","1 boîte pour 2 repas","Menus journaliers",0.5,null,null,null,null,null,0,"VS28","Viande paella","Lundi et mardi soirs","1 boîte pour 2 repas","Menus journaliers",0.5,"O08","Lundi de Pentecôte","Menus journaliers juin"]
["MJ162","2019-06-11","PC06","Juin","DS01","Pomme","lundi à vendredi soirs","1 sachet de 2 kilogrammes. 1 pomme pour 1 repas","Menus journaliers",1,"LSLM09","Paella","Lundi et mardi soirs","1 boîte pour 2 repas","Menus journaliers",0.5,null,null,null,null,null,0,"VS28","Viande paella","Lundi et mardi soirs","1 boîte pour 2 repas","Menus journaliers",0.5,null,null,"Menus journaliers juin"]
["MJ163","2019-06-12","PC06","Juin","DS01","Pomme","lundi à vendredi soirs","1 sachet de 2 kilogrammes. 1 pomme pour 1 repas","Menus journaliers",1,"LSMJ04","Ratatouille","Mercredi et jeudi soirs","1 boîte pour 2 repas","Menus journaliers",0.5,null,null,null,null,null,0,"VS22","Saucisson","Lundi à dimanche soirs","1 morceau de 400 grammes (Leclerc) pour 3 repas","Menus journaliers",0.34000000357627869,null,null,"Menus journaliers juin"]
["MJ164","2019-06-13","PC06","Juin","DS01","Pomme","lundi à vendredi soirs","1 sachet de 2 kilogrammes. 1 pomme pour 1 repas","Menus journaliers",1,"LSMJ04","Ratatouille","Mercredi et jeudi soirs","1 boîte pour 2 repas","Menus journaliers",0.5,null,null,null,null,null,0,"VS08","Croque-monsieur","Lundi à dimanche soirs","1 paquet pour 2 repas","Menus journaliers",1,null,null,"Menus journaliers juin"]
["MJ165","2019-06-14","PC06","Juin","DS01","Pomme","lundi à vendredi soirs","1 sachet de 2 kilogrammes. 1 pomme pour 1 repas","Menus journaliers",1,"LSV05","Céleri","Vendredi soir","Unité : 1 branche pour 1 repas","Menus journaliers",1,null,null,null,null,null,0,"VS22","Saucisson","Lundi à dimanche soirs","1 morceau de 400 grammes (Leclerc) pour 3 repas","Menus journaliers",0.33000001311302185,null,null,"Menus journaliers juin"]
["MJ166","2019-06-15","PC06","Juin","DWE18","Pruneaux","Samedi et dimanche midis et soirs","1 paquet pour 4 repas","Menus journaliers",0.5,"LWES03","Pâtes au fromage râpé","Samedi midi et soir","5 cuillères pour 1 repas","Menus journaliers",10,null,null,null,null,null,0,"VS08","Croque-monsieur","Lundi à dimanche soirs","1 paquet pour 2 repas","Menus journaliers",1,null,null,"Menus journaliers juin"]
["MJ167","2019-06-16","PC06","Juin","DWE18","Pruneaux","Samedi et dimanche midis et soirs","1 paquet pour 4 repas","Menus journaliers",0.5,"LWED03","Frites","Dimanche midi","20 frites pour 1 repas","Menus journaliers",20,"LWED01","Asperges","Dimanche soir","1 bocal ou 1 boîte pour 1 repas","Menus journaliers",1,"VS22","Saucisson","Lundi à dimanche soirs","1 morceau de 400 grammes (Leclerc) pour 3 repas","Menus journaliers",0.33000001311302185,null,null,"Menus journaliers juin"]
["MJ168","2019-06-17","PC06","Juin","DS01","Pomme","lundi à vendredi soirs","1 sachet de 2 kilogrammes. 1 pomme pour 1 repas","Menus journaliers",1,"LSLM10","Poireau","Lundi et mardi soirs","Unité : 1 pour 1 repas","Menus journaliers",1,null,null,null,null,null,0,"VS09","Foie","Lundi à dimanche soirs","1 paquet pour 2 repas","Menus journaliers",1,null,null,"Menus journaliers juin"]
["MJ169","2019-06-18","PC06","Juin","DS01","Pomme","lundi à vendredi soirs","1 sachet de 2 kilogrammes. 1 pomme pour 1 repas","Menus journaliers",1,"LSLM10","Poireau","Lundi et mardi soirs","Unité : 1 pour 1 repas","Menus journaliers",1,null,null,null,null,null,0,"VS22","Saucisson","Lundi à dimanche soirs","1 morceau de 400 grammes (Leclerc) pour 3 repas","Menus journaliers",0.34000000357627869,null,null,"Menus journaliers juin"]
["MJ170","2019-06-19","PC06","Juin","DS01","Pomme","lundi à vendredi soirs","1 sachet de 2 kilogrammes. 1 pomme pour 1 repas","Menus journaliers",1,"LSMJ05","Raviolis","Mercredi et jeudi soirs","1 boîte pour 2 repas","Menus journaliers",0.5,null,null,null,null,null,0,"VS09","Foie","Lundi à dimanche soirs","1 paquet pour 2 repas","Menus journaliers",1,null,null,"Menus journaliers juin"]
["MJ171","2019-06-20","PC06","Juin","DS01","Pomme","lundi à vendredi soirs","1 sachet de 2 kilogrammes. 1 pomme pour 1 repas","Menus journaliers",1,"LSMJ05","Raviolis","Mercredi et jeudi soirs","1 boîte pour 2 repas","Menus journaliers",0.5,null,null,null,null,null,0,"VS22","Saucisson","Lundi à dimanche soirs","1 morceau de 400 grammes (Leclerc) pour 3 repas","Menus journaliers",0.33000001311302185,null,null,"Menus journaliers juin"]
["MJ172","2019-06-21","PC06","Juin","DS01","Pomme","lundi à vendredi soirs","1 sachet de 2 kilogrammes. 1 pomme pour 1 repas","Menus journaliers",1,"LSV06","Champignons","Vendredi soir","1 boîte pour 1 repas","Menus journaliers",1,null,null,null,null,null,0,"VS10","Fromage de tête","Lundi à dimanche soirs","1 tranche pour 2 repas","Menus journaliers",3,null,null,"Menus journaliers juin"]
["MJ173","2019-06-22","PC06","Juin","DWE12","Gâteau de riz","Samedi et dimanche midis et soirs","1 pack de 4 pots pour le week-end. 1 pot pour 1 repas","Menus journaliers",2,"LWES01","Pâtes à la sauce tomates","Samedi midi et soir","5 cuillères pour 1 repas","Menus journaliers",10,null,null,null,null,null,0,"VS22","Saucisson","Lundi à dimanche soirs","1 morceau de 400 grammes (Leclerc) pour 3 repas","Menus journaliers",0.33000001311302185,null,null,"Menus journaliers juin"]
["MJ174","2019-06-23","PC06","Juin","DWE12","Gâteau de riz","Samedi et dimanche midis et soirs","1 pack de 4 pots pour le week-end. 1 pot pour 1 repas","Menus journaliers",2,"LWED04","Haricots verts","Dimanche midi et soir","1 boîte pour 2 repas","Menus journaliers",1,null,null,null,null,null,0,"VS10","Fromage de tête","Lundi à dimanche soirs","1 tranche pour 2 repas","Menus journaliers",3,null,null,"Menus journaliers juin"]
["MJ175","2019-06-24","PC06","Juin","DS01","Pomme","lundi à vendredi soirs","1 sachet de 2 kilogrammes. 1 pomme pour 1 repas","Menus journaliers",1,"LSLM11","Pomme de terre","Lundi et mardi soirs","Unité : 1 pour 1 repas","Menus journaliers",1,null,null,null,null,null,0,"VS22","Saucisson","Lundi à dimanche soirs","1 morceau de 400 grammes (Leclerc) pour 3 repas","Menus journaliers",0.34000000357627869,null,null,"Menus journaliers juin"]
["MJ176","2019-06-25","PC06","Juin","DS01","Pomme","lundi à vendredi soirs","1 sachet de 2 kilogrammes. 1 pomme pour 1 repas","Menus journaliers",1,"LSLM11","Pomme de terre","Lundi et mardi soirs","Unité : 1 pour 1 repas","Menus journaliers",1,null,null,null,null,null,0,"VS11","Jambon","Lundi à dimanche soirs","1 paquet pour 2 repas","Menus journaliers",0.5,null,null,"Menus journaliers juin"]
["MJ177","2019-06-26","PC06","Juin","DS01","Pomme","lundi à vendredi soirs","1 sachet de 2 kilogrammes. 1 pomme pour 1 repas","Menus journaliers",1,"LSMJ06","Tomates pelées","Mercredi et jeudi soirs","1 boîte pour 2 repas","Menus journaliers",0.5,null,null,null,null,null,0,"VS22","Saucisson","Lundi à dimanche soirs","1 morceau de 400 grammes (Leclerc) pour 3 repas","Menus journaliers",0.33000001311302185,null,null,"Menus journaliers juin"]
["MJ178","2019-06-27","PC06","Juin","DS01","Pomme","lundi à vendredi soirs","1 sachet de 2 kilogrammes. 1 pomme pour 1 repas","Menus journaliers",1,"LSMJ06","Tomates pelées","Mercredi et jeudi soirs","1 boîte pour 2 repas","Menus journaliers",0.5,null,null,null,null,null,0,"VS11","Jambon","Lundi à dimanche soirs","1 paquet pour 2 repas","Menus journaliers",0.5,null,null,"Menus journaliers juin"]
["MJ179","2019-06-28","PC06","Juin","DS01","Pomme","lundi à vendredi soirs","1 sachet de 2 kilogrammes. 1 pomme pour 1 repas","Menus journaliers",1,"LSV07","Concombre","Vendredi soir","Unité : 1 pour 1 repas","Menus journaliers",1,null,null,null,null,null,0,"VS22","Saucisson","Lundi à dimanche soirs","1 morceau de 400 grammes (Leclerc) pour 3 repas","Menus journaliers",0.33000001311302185,null,null,"Menus journaliers juin"]
["MJ180","2019-06-29","PC06","Juin","DWE19","Tapioca","Samedi et dimanche midis et soirs","25 grammes pour 1 repas","Menus journaliers",50,"LWES02","Pâtes au beurre","Samedi midi et soir","5 cuillères pour 1 repas","Menus journaliers",10,null,null,null,null,null,0,"VS12","Jambonneau","Lundi à dimanche soirs","1 paquet pour 2 repas","Menus journaliers",0.5,null,null,"Menus journaliers juin"]
["MJ181","2019-06-30","PC06","Juin","DWE19","Tapioca","Samedi et dimanche midis et soirs","25 grammes pour 1 repas","Menus journaliers",50,"LWED02","Chips","Dimanche midi et soir","1 sachet pour 2 repas","Menus journaliers",1,null,null,null,null,null,0,"VS22","Saucisson","Lundi à dimanche soirs","1 morceau de 400 grammes (Leclerc) pour 3 repas","Menus journaliers",0.34000000357627869,null,null,"Menus journaliers juin"]
["MVWE43","2019-06-01","PC06","Juin",null,null,null,null,null,0,null,null,null,null,null,0,null,null,null,null,null,0,"VWE03","Cheval","Samedi et dimanche midis","1 tranche pour 1 repas","Menus viandes week-end",1,null,null,"Menus viandes weekend premier semestre"]
["MVWE44","2019-06-02","PC06","Juin",null,null,null,null,null,0,null,null,null,null,null,0,null,null,null,null,null,0,"VWE04","Dinde","Samedi et dimanche midis","1 tranche pour 1 repas","Menus viandes week-end",1,null,null,"Menus viandes weekend premier semestre"]
["MVWE45","2019-06-08","PC06","Juin",null,null,null,null,null,0,null,null,null,null,null,0,null,null,null,null,null,0,"VWE05","Poisson","Samedi et dimanche midis","Unité : 1 pour 1 repas","Menus viandes week-end",1,null,null,"Menus viandes weekend premier semestre"]
["MVWE46","2019-06-09","PC06","Juin",null,null,null,null,null,0,null,null,null,null,null,0,null,null,null,null,null,0,"VWE06","Porc","Samedi et dimanche midis","1 tranche pour 1 repas","Menus viandes week-end",1,"O11","Pentecôte","Menus viandes weekend premier semestre"]
["MVWE47","2019-06-15","PC06","Juin",null,null,null,null,null,0,null,null,null,null,null,0,null,null,null,null,null,0,"VWE07","Veau","Samedi et dimanche midis","1 tranche pour 1 repas","Menus viandes week-end",1,null,null,"Menus viandes weekend premier semestre"]
["MVWE48","2019-06-16","PC06","Juin",null,null,null,null,null,0,null,null,null,null,null,0,null,null,null,null,null,0,"VWE01","Agneau","Samedi et dimanche midis","1 tranche pour 1 repas","Menus viandes week-end",1,null,null,"Menus viandes weekend premier semestre"]
["MVWE49","2019-06-22","PC06","Juin",null,null,null,null,null,0,null,null,null,null,null,0,null,null,null,null,null,0,"VWE02","Bœuf","Samedi et dimanche midis","1 tranche pour 1 repas","Menus viandes week-end",1,null,null,"Menus viandes weekend premier semestre"]
["MVWE50","2019-06-23","PC06","Juin",null,null,null,null,null,0,null,null,null,null,null,0,null,null,null,null,null,0,"VWE03","Cheval","Samedi et dimanche midis","1 tranche pour 1 repas","Menus viandes week-end",1,null,null,"Menus viandes weekend premier semestre"]
["MVWE51","2019-06-29","PC06","Juin",null,null,null,null,null,0,null,null,null,null,null,0,null,null,null,null,null,0,"VWE04","Dinde","Samedi et dimanche midis","1 tranche pour 1 repas","Menus viandes week-end",1,null,null,"Menus viandes weekend premier semestre"]
["MVWE52","2019-06-30","PC06","Juin",null,null,null,null,null,0,null,null,null,null,null,0,null,null,null,null,null,0,"VWE05","Poisson","Samedi et dimanche midis","Unité : 1 pour 1 repas","Menus viandes week-end",1,null,null,"Menus viandes weekend premier semestre"]

{"sheet":"Juillet","index":14,"n_rows":65,"n_cols":31,"rows_kept":65,"cut":false,"hidden":false,"merged":[[0,0,0,30]]}
["Menus du mois de juillet  2018."]
[]
["Numéro du menu","Date du menu","Code période concernée","Période concernée","Code dessert","Dessert","Jour dessert","Conditionnement dessert","Destination dessert","Quantité dessert","Code légume","Légume","Jour légume","Conditionnement légume","Destination légume","Quantité légume","Code légume deux","Légume deux","Jour légume deux","Conditionnement légume deux","Destination légume deux","Quantité légume deux","Code viande","Viande","Jour viande","Conditionnement viande","Destination viande","Quantité viande","Code observation","Observation","Titre"]
["MMR130","2019-07-01","PC07","Juillet","DMR01","Pomme","Lundi à vendredi midis","1 sachet de 2 kilogrammes. 1 pomme pour 1 repas","Menus midi retraite",1,"LMR13","Purée","Lundi à vendredi midis","25 grammes pour 1 repas","Menus midi retraite",25,null,null,null,null,null,0,"VMR04","Rôti de porc","Lundi à vendredi midis","1 morceau de 500 grammes pour 5 repas","Menus midi retraite",100,null,null,"Menus midi retraite juillet"]
["MMR131","2019-07-02","PC07","Juillet","DMR01","Pomme","Lundi à vendredi midis","1 sachet de 2 kilogrammes. 1 pomme pour 1 repas","Menus midi retraite",1,"LMR14","Radis","Lundi à vendredi midis","1 botte ou 1 sachet pour 2 repas","Menus midi retraite",0.5,null,null,null,null,null,0,"VMR04","Rôti de porc","Lundi à vendredi midis","1 morceau de 500 grammes pour 5 repas","Menus midi retraite",100,null,null,"Menus midi retraite juillet"]
["MMR132","2019-07-03","PC07","Juillet","DMR01","Pomme","Lundi à vendredi midis","1 sachet de 2 kilogrammes. 1 pomme pour 1 repas","Menus midi retraite",1,"LMR14","Radis","Lundi à vendredi midis","1 botte ou 1 sachet pour 2 repas","Menus midi retraite",0.5,null,null,null,null,null,0,"VMR04","Rôti de porc","Lundi à vendredi midis","1 morceau de 500 grammes pour 5 repas","Menus midi retraite",100,null,null,"Menus midi retraite juillet"]
["MMR133","2019-07-04","PC07","Juillet","DMR01","Pomme","Lundi à vendredi midis","1 sachet de 2 kilogrammes. 1 pomme pour 1 repas","Menus midi retraite",1,"LMR15","Riz","Lundi à vendredi midis","25 grammes pour 1 repas","Menus midi retraite",25,null,null,null,null,null,0,"VMR04","Rôti de porc","Lundi à vendredi midis","1 morceau de 500 grammes pour 5 repas","Menus midi retraite",100,null,null,"Menus midi retraite juillet"]
["MMR134","2019-07-05","PC07","Juillet","DMR01","Pomme","Lundi à vendredi midis","1 sachet de 2 kilogrammes. 1 pomme pour 1 repas","Menus midi retraite",1,"LMR16","Salade","Lundi à vendredi midis","Unité : 1 tête pour 1 repas","Menus midi retraite",1,null,null,null,null,null,0,"VMR04","Rôti de porc","Lundi à vendredi midis","1 morceau de 500 grammes pour 5 repas","Menus midi retraite",100,null,null,"Menus midi retraite juillet"]
["MMR135","2019-07-08","PC07","Juillet","DMR01","Pomme","Lundi à vendredi midis","1 sachet de 2 kilogrammes. 1 pomme pour 1 repas","Menus midi retraite",1,"LMR17","Tomates","Lundi à vendredi midis","Unité : 2 pour 1 repas","Menus midi retraite",2,null,null,null,null,null,0,"VMR05","Rôti de veau","Lundi à vendredi midis","1 morceau de 500 grammes pour 5 repas","Menus midi retraite",100,null,null,"Menus midi retraite juillet"]
["MMR136","2019-07-09","PC07","Juillet","DMR01","Pomme","Lundi à vendredi midis","1 sachet de 2 kilogrammes. 1 pomme pour 1 repas","Menus midi retraite",1,"LMR01","Asperges","Lundi à vendredi midis","1 boîte pour 1 repas","Menus midi retraite",1,null,null,null,null,null,0,"VMR05","Rôti de veau","Lundi à vendredi midis","1 morceau de 500 grammes pour 5 repas","Menus midi retraite",100,null,null,"Menus midi retraite juillet"]
["MMR137","2019-07-10","PC07","Juillet","DMR01","Pomme","Lundi à vendredi midis","1 sachet de 2 kilogrammes. 1 pomme pour 1 repas","Menus midi retraite",1,"LMR02","Avocat","Lundi à vendredi midis","Unité : 1 pour 1 repas","Menus midi retraite",1,null,null,null,null,null,0,"VMR05","Rôti de veau","Lundi à vendredi midis","1 morceau de 500 grammes pour 5 repas","Menus midi retraite",100,null,null,"Menus midi retraite juillet"]
["MMR138","2019-07-11","PC07","Juillet","DMR01","Pomme","Lundi à vendredi midis","1 sachet de 2 kilogrammes. 1 pomme pour 1 repas","Menus midi retraite",1,"LMR03","Carottes","Lundi à vendredi midis","Unité : 2 pour 1 repas","Menus midi retraite",2,null,null,null,null,null,0,"VMR05","Rôti de veau","Lundi à vendredi midis","1 morceau de 500 grammes pour 5 repas","Menus midi retraite",100,null,null,"Menus midi retraite juillet"]
["MMR139","2019-07-12","PC07","Juillet","DMR01","Pomme","Lundi à vendredi midis","1 sachet de 2 kilogrammes. 1 pomme pour 1 repas","Menus midi retraite",1,"LMR04","Céleri","Lundi à vendredi midis","Unité : 1 branche pour 1 repas","Menus midi retraite",1,null,null,null,null,null,0,"VMR05","Rôti de veau","Lundi à vendredi midis","1 morceau de 500 grammes pour 5 repas","Menus midi retraite",100,null,null,"Menus midi retraite juillet"]
["MMR140","2019-07-15","PC07","Juillet","DMR01","Pomme","Lundi à vendredi midis","1 sachet de 2 kilogrammes. 1 pomme pour 1 repas","Menus midi retraite",1,"LMR05","Champignons","Lundi à vendredi midis","1 boîte pour 1 repas","Menus midi retraite",1,null,null,null,null,null,0,"VMR01","Rôti d'agneau","Lundi à vendredi midis","1 morceau de 500 grammes pour 5 repas","Menus midi retraite",100,null,null,"Menus midi retraite juillet"]
["MMR141","2019-07-16","PC07","Juillet","DMR01","Pomme","Lundi à vendredi midis","1 sachet de 2 kilogrammes. 1 pomme pour 1 repas","Menus midi retraite",1,"LMR06","Concombre","Lundi à vendredi midis","Unité : 1 pour 1 repas","Menus midi retraite",1,null,null,null,null,null,0,"VMR01","Rôti d'agneau","Lundi à vendredi midis","1 morceau de 500 grammes pour 5 repas","Menus midi retraite",100,null,null,"Menus midi retraite juillet"]
["MMR142","2019-07-17","PC07","Juillet","DMR01","Pomme","Lundi à vendredi midis","1 sachet de 2 kilogrammes. 1 pomme pour 1 repas","Menus midi retraite",1,"LMR07","Couscous","Lundi à vendredi midis","25 grammes pour 1 repas","Menus midi retraite",25,null,null,null,null,null,0,"VMR01","Rôti d'agneau","Lundi à vendredi midis","1 morceau de 500 grammes pour 5 repas","Menus midi retraite",100,null,null,"Menus midi retraite juillet"]
["MMR143","2019-07-18","PC07","Juillet","DMR01","Pomme","Lundi à vendredi midis","1 sachet de 2 kilogrammes. 1 pomme pour 1 repas","Menus midi retraite",1,"LMR08","Maïs","Lundi à vendredi midis","1 boîte pour 2 repas","Menus midi retraite",0.5,null,null,null,null,null,0,"VMR01","Rôti d'agneau","Lundi à vendredi midis","1 morceau de 500 grammes pour 5 repas","Menus midi retraite",100,null,null,"Menus midi retraite juillet"]
["MMR144","2019-07-19","PC07","Juillet","DMR01","Pomme","Lundi à vendredi midis","1 sachet de 2 kilogrammes. 1 pomme pour 1 repas","Menus midi retraite",1,"LMR08","Maïs","Lundi à vendredi midis","1 boîte pour 2 repas","Menus midi retraite",0.5,null,null,null,null,null,0,"VMR01","Rôti d'agneau","Lundi à vendredi midis","1 morceau de 500 grammes pour 5 repas","Menus midi retraite",100,null,null,"Menus midi retraite juillet"]
["MMR145","2019-07-22","PC07","Juillet","DMR01","Pomme","Lundi à vendredi midis","1 sachet de 2 kilogrammes. 1 pomme pour 1 repas","Menus midi retraite",1,"LMR09","Pâtes à la sauce tomates","Lundi à vendredi midis","5 cuillères pour 1 repas","Menus midi retraite",5,null,null,null,null,null,0,"VMR02","Rôti de bœuf","Lundi à vendredi midis","1 morceau de 500 grammes pour 5 repas","Menus midi retraite",100,null,null,"Menus midi retraite juillet"]
["MMR146","2019-07-23","PC07","Juillet","DMR01","Pomme","Lundi à vendredi midis","1 sachet de 2 kilogrammes. 1 pomme pour 1 repas","Menus midi retraite",1,"LMR10","Pâtes au beurre","Lundi à vendredi midis","5 cuillères pour 1 repas","Menus midi retraite",5,null,null,null,null,null,0,"VMR02","Rôti de bœuf","Lundi à vendredi midis","1 morceau de 500 grammes pour 5 repas","Menus midi retraite",100,null,null,"Menus midi retraite juillet"]
["MMR147","2019-07-24","PC07","Juillet","DMR01","Pomme","Lundi à vendredi midis","1 sachet de 2 kilogrammes. 1 pomme pour 1 repas","Menus midi retraite",1,"LMR11","Poireau","Lundi à vendredi midis","Unité : 1 pour 1 repas","Menus midi retraite",5,null,null,null,null,null,0,"VMR02","Rôti de bœuf","Lundi à vendredi midis","1 morceau de 500 grammes pour 5 repas","Menus midi retraite",100,null,null,"Menus midi retraite juillet"]
["MMR148","2019-07-25","PC07","Juillet","DMR01","Pomme","Lundi à vendredi midis","1 sachet de 2 kilogrammes. 1 pomme pour 1 repas","Menus midi retraite",1,"LMR12","Pomme de terre","Lundi à vendredi midis","Unité : 1 pour 1 repas","Menus midi retraite",5,null,null,null,null,null,0,"VMR02","Rôti de bœuf","Lundi à vendredi midis","1 morceau de 500 grammes pour 5 repas","Menus midi retraite",100,null,null,"Menus midi retraite juillet"]
["MMR149","2019-07-26","PC07","Juillet","DMR01","Pomme","Lundi à vendredi midis","1 sachet de 2 kilogrammes. 1 pomme pour 1 repas","Menus midi retraite",1,"LMR13","Purée","Lundi à vendredi midis","25 grammes pour 1 repas","Menus midi retraite",5,null,null,null,null,null,0,"VMR02","Rôti de bœuf","Lundi à vendredi midis","1 morceau de 500 grammes pour 5 repas","Menus midi retraite",100,null,null,"Menus midi retraite juillet"]
["MMR150","2019-07-29","PC07","Juillet","DMR01","Pomme","Lundi à vendredi midis","1 sachet de 2 kilogrammes. 1 pomme pour 1 repas","Menus midi retraite",1,"LMR14","Radis","Lundi à vendredi midis","1 botte ou 1 sachet pour 2 repas","Menus midi retraite",0.5,null,null,null,null,null,0,"VMR03","Rôti de cheval","Lundi à vendredi midis","1 morceau de 500 grammes pour 5 repas","Menus midi retraite",100,null,null,"Menus midi retraite juillet"]
["MMR151","2019-07-30","PC07","Juillet","DMR01","Pomme","Lundi à vendredi midis","1 sachet de 2 kilogrammes. 1 pomme pour 1 repas","Menus midi retraite",1,"LMR14","Radis","Lundi à vendredi midis","1 botte ou 1 sachet pour 2 repas","Menus midi retraite",0.5,null,null,null,null,null,0,"VMR03","Rôti de cheval","Lundi à vendredi midis","1 morceau de 500 grammes pour 5 repas","Menus midi retraite",100,null,null,"Menus midi retraite juillet"]
["MMR152","2019-07-31","PC07","Juillet","DMR01","Pomme","Lundi à vendredi midis","1 sachet de 2 kilogrammes. 1 pomme pour 1 repas","Menus midi retraite",1,"LMR15","Riz","Lundi à vendredi midis","25 grammes pour 1 repas","Menus midi retraite",0.5,null,null,null,null,null,0,"VMR03","Rôti de cheval","Lundi à vendredi midis","1 morceau de 500 grammes pour 5 repas","Menus midi retraite",100,null,null,"Menus midi retraite juillet"]
["MJ182","2019-07-01","PC07","Juillet","DS01","Pomme","lundi à vendredi soirs","1 sachet de 2 kilogrammes. 1 pomme pour 1 repas","Menus journaliers",1,"LSLM12","Purée","Lundi et mardi soirs","25 grammes pour 1 repas","Menus journaliers",25,null,null,null,null,null,0,"VS12","Jambonneau","Lundi à dimanche soirs","1 paquet pour 2 repas","Menus journaliers",0.5,null,null,"Menus journaliers juillet"]
["MJ183","2019-07-02","PC07","Juillet","DS01","Pomme","lundi à vendredi soirs","1 sachet de 2 kilogrammes. 1 pomme pour 1 repas","Menus journaliers",1,"LSLM12","Purée","Lundi et mardi soirs","25 grammes pour 1 repas","Menus journaliers",25,null,null,null,null,null,0,"VS22","Saucisson","Lundi à dimanche soirs","1 morceau de 400 grammes (Leclerc) pour 3 repas","Menus journaliers",0.33000001311302185,null,null,"Menus journaliers juillet"]
["MJ184","2019-07-03","PC07","Juillet","DS01","Pomme","lundi à vendredi soirs","1 sachet de 2 kilogrammes. 1 pomme pour 1 repas","Menus journaliers",1,"LSMJ01","Macédoine de légumes","Mercredi et jeudi soirs","1 boîte pour 2 repas","Menus journaliers",0.5,null,null,null,null,null,0,"VS13","Mortadelle","Lundi à dimanche soirs","1 paquet pour 2 repas","Menus journaliers",0.5,null,null,"Menus journaliers juillet"]
["MJ185","2019-07-04","PC07","Juillet","DS01","Pomme","lundi à vendredi soirs","1 sachet de 2 kilogrammes. 1 pomme pour 1 repas","Menus journaliers",1,"LSMJ01","Macédoine de légumes","Mercredi et jeudi soirs","1 boîte pour 2 repas","Menus journaliers",0.5,null,null,null,null,null,0,"VS22","Saucisson","Lundi à dimanche soirs","1 morceau de 400 grammes (Leclerc) pour 3 repas","Menus journaliers",0.33000001311302185,null,null,"Menus journaliers juillet"]
["MJ186","2019-07-05","PC07","Juillet","DS01","Pomme","lundi à vendredi soirs","1 sachet de 2 kilogrammes. 1 pomme pour 1 repas","Menus journaliers",1,"LSV08","Radis","Vendredi soir","1 botte ou 1 sachet pour 1 repas","Menus journaliers",1,null,null,null,null,null,0,"VS13","Mortadelle","Lundi à dimanche soirs","1 paquet pour 2 repas","Menus journaliers",0.5,null,null,"Menus journaliers juillet"]
["MJ187","2019-07-06","PC07","Juillet","DWE20","Yaourts","Samedi et dimanche midis et soirs","1 pack de 4 pots pour le week-end. 1 pot pour 1 repas","Menus journaliers",2,"LWES03","Pâtes au fromage râpé","Samedi midi et soir","5 cuillères pour 1 repas","Menus journaliers",10,null,null,null,null,null,0,"VS22","Saucisson","Lundi à dimanche soirs","1 morceau de 400 grammes (Leclerc) pour 3 repas","Menus journaliers",0.33000001311302185,null,null,"Menus journaliers juillet"]
["MJ188","2019-07-07","PC07","Juillet","DWE20","Yaourts","Samedi et dimanche midis et soirs","1 pack de 4 pots pour le week-end. 1 pot pour 1 repas","Menus journaliers",2,"LWED03","Frites","Dimanche midi","20 frites pour 1 repas","Menus journaliers",20,"LWED01","Asperges","Dimanche soir","1 bocal ou 1 boîte pour 1 repas","Menus journaliers",1,"VS14","Œufs","Lundi à dimanche soirs","1 boîte de six œufs. 3 œufs pour 1 repas","Menus journaliers",3,null,null,"Menus journaliers juillet"]
["MJ189","2019-07-08","PC07","Juillet","DS01","Pomme","lundi à vendredi soirs","1 sachet de 2 kilogrammes. 1 pomme pour 1 repas","Menus journaliers",1,"LSLM13","Quenelles","Lundi et mardi soirs","1 boîte pour 2 repas","Menus journaliers",0.5,null,null,null,null,null,0,"VS22","Saucisson","Lundi à dimanche soirs","1 morceau de 400 grammes (Leclerc) pour 3 repas","Menus journaliers",0.33000001311302185,null,null,"Menus journaliers juillet"]
["MJ190","2019-07-09","PC07","Juillet","DS01","Pomme","lundi à vendredi soirs","1 sachet de 2 kilogrammes. 1 pomme pour 1 repas","Menus journaliers",1,"LSLM13","Quenelles","Lundi et mardi soirs","1 boîte pour 2 repas","Menus journaliers",0.5,null,null,null,null,null,0,"VS14","Œufs","Lundi à dimanche soirs","1 boîte de six œufs. 3 œufs pour 1 repas","Menus journaliers",3,null,null,"Menus journaliers juillet"]
["MJ191","2019-07-10","PC07","Juillet","DS01","Pomme","lundi à vendredi soirs","1 sachet de 2 kilogrammes. 1 pomme pour 1 repas","Menus journaliers",1,"LSMJ02","Petits pois","Mercredi et jeudi soirs","1 boîte pour 2 repas","Menus journaliers",0.5,null,null,null,null,null,0,"VS22","Saucisson","Lundi à dimanche soirs","1 morceau de 400 grammes (Leclerc) pour 3 repas","Menus journaliers",0.34000000357627869,null,null,"Menus journaliers juillet"]
["MJ192","2019-07-11","PC07","Juillet","DS01","Pomme","lundi à vendredi soirs","1 sachet de 2 kilogrammes. 1 pomme pour 1 repas","Menus journaliers",1,"LSMJ02","Petits pois","Mercredi et jeudi soirs","1 boîte pour 2 repas","Menus journaliers",0.5,null,null,null,null,null,0,"VS15","Pizza","Lundi à dimanche soirs","1 paquet pour 2 repas","Menus journaliers",0.5,null,null,"Menus journaliers juillet"]
["MJ193","2019-07-12","PC07","Juillet","DS01","Pomme","lundi à vendredi soirs","1 sachet de 2 kilogrammes. 1 pomme pour 1 repas","Menus journaliers",1,"LSV09","Salade","Vendredi soir","Unité : 1 tête pour 1 repas","Menus journaliers",1,null,null,null,null,null,0,"VS22","Saucisson","Lundi à dimanche soirs","1 morceau de 400 grammes (Leclerc) pour 3 repas","Menus journaliers",0.33000001311302185,null,null,"Menus journaliers juillet"]
["MJ194","2019-07-13","PC07","Juillet","DWE01","Ananas","Samedi et dimanche midis et soirs","Unité : 1 pour 4 repas","Menus journaliers",0.5,"LWES01","Pâtes à la sauce tomates","Samedi midi et soir","5 cuillères pour 1 repas","Menus journaliers",10,null,null,null,null,null,0,"VS15","Pizza","Lundi à dimanche soirs","1 paquet pour 2 repas","Menus journaliers",0.5,null,null,"Menus journaliers juillet"]
["MJ195","2019-07-14","PC07","Juillet","DWE01","Ananas","Samedi et dimanche midis et soirs","Unité : 1 pour 4 repas","Menus journaliers",0.5,"LWED04","Haricots verts","Dimanche midi et soir","1 boîte pour 2 repas","Menus journaliers",1,null,null,null,null,null,0,"VS22","Saucisson","Lundi à dimanche soirs","1 morceau de 400 grammes (Leclerc) pour 3 repas","Menus journaliers",0.33000001311302185,"O05","Fête nationale","Menus journaliers juillet"]
["MJ196","2019-07-15","PC07","Juillet","DS01","Pomme","lundi à vendredi soirs","1 sachet de 2 kilogrammes. 1 pomme pour 1 repas","Menus journaliers",1,"LSLM14","Riz","Lundi et mardi soirs","25 grammes pour 1 repas","Menus journaliers",25,null,null,null,null,null,0,"VS16","Poisson","Lundi à dimanche soirs","Unité : 1 pour 1 repas","Menus journaliers",1,null,null,"Menus journaliers juillet"]
["MJ197","2019-07-16","PC07","Juillet","DS01","Pomme","lundi à vendredi soirs","1 sachet de 2 kilogrammes. 1 pomme pour 1 repas","Menus journaliers",1,"LSLM14","Riz","Lundi et mardi soirs","25 grammes pour 1 repas","Menus journaliers",25,null,null,null,null,null,0,"VS22","Saucisson","Lundi à dimanche soirs","1 morceau de 400 grammes (Leclerc) pour 3 repas","Menus journaliers",0.34000000357627869,null,null,"Menus journaliers juillet"]
["MJ198","2019-07-17","PC07","Juillet","DS01","Pomme","lundi à vendredi soirs","1 sachet de 2 kilogrammes. 1 pomme pour 1 repas","Menus journaliers",1,"LSMJ03","Petits pois et jeunes carottes","Mercredi et jeudi soirs","1 boîte pour 2 repas","Menus journaliers",0.5,null,null,null,null,null,0,"VS17","Quiche lorraine","Lundi à dimanche soirs","1 boîte pour 2 repas","Menus journaliers",1,null,null,"Menus journaliers juillet"]
["MJ199","2019-07-18","PC07","Juillet","DS01","Pomme","lundi à vendredi soirs","1 sachet de 2 kilogrammes. 1 pomme pour 1 repas","Menus journaliers",1,"LSMJ03","Petits pois et jeunes carottes","Mercredi et jeudi soirs","1 boîte pour 2 repas","Menus journaliers",0.5,null,null,null,null,null,0,"VS22","Saucisson","Lundi à dimanche soirs","1 morceau de 400 grammes (Leclerc) pour 3 repas","Menus journaliers",0.33000001311302185,null,null,"Menus journaliers juillet"]
["MJ200","2019-07-19","PC07","Juillet","DS01","Pomme","lundi à vendredi soirs","1 sachet de 2 kilogrammes. 1 pomme pour 1 repas","Menus journaliers",1,"LSV10","Salsifis","Vendredi soir","1 boîte pour 1 repas","Menus journaliers",1,null,null,null,null,null,0,"VS17","Quiche lorraine","Lundi à dimanche soirs","1 boîte pour 2 repas","Menus journaliers",1,null,null,"Menus journaliers juillet"]
["MJ201","2019-07-20","PC07","Juillet","DWE02","Autres fruits","Samedi et dimanche midis et soirs","Unité : 2 à 4 pour 1 repas","Menus journaliers",4,"LWES02","Pâtes au beurre","Samedi midi et soir","5 cuillères pour 1 repas","Menus journaliers",10,null,null,null,null,null,0,"VS22","Saucisson","Lundi à dimanche soirs","1 morceau de 400 grammes (Leclerc) pour 3 repas","Menus journaliers",0.33000001311302185,null,null,"Menus journaliers juillet"]
["MJ202","2019-07-21","PC07","Juillet","DWE02","Autres fruits","Samedi et dimanche midis et soirs","Unité : 2 à 4 pour 1 repas","Menus journaliers",4,"LWED02","Chips","Dimanche midi et soir","1 sachet pour 2 repas","Menus journaliers",1,null,null,null,null,null,0,"VS18","Roulade à la pistache","Lundi à dimanche soirs","3 tranches pour 1 repas","Menus journaliers",3,null,null,"Menus journaliers juillet"]
["MJ203","2019-07-22","PC07","Juillet","DS01","Pomme","lundi à vendredi soirs","1 sachet de 2 kilogrammes. 1 pomme pour 1 repas","Menus journaliers",1,"LSLM01","Cassoulet","Lundi et mardi soirs","1 boîte pour 2 repas","Menus journaliers",0.5,null,null,null,null,null,0,"VS26","Viande cassoulet","Lundi et mardi soirs","1 boîte pour 2 repas","Menus journaliers",0.5,null,null,"Menus journaliers juillet"]
["MJ204","2019-07-23","PC07","Juillet","DS01","Pomme","lundi à vendredi soirs","1 sachet de 2 kilogrammes. 1 pomme pour 1 repas","Menus journaliers",1,"LSLM01","Cassoulet","Lundi et mardi soirs","1 boîte pour 2 repas","Menus journaliers",0.5,null,null,null,null,null,0,"VS26","Viande cassoulet","Lundi et mardi soirs","1 boîte pour 2 repas","Menus journaliers",0.5,null,null,"Menus journaliers juillet"]
["MJ205","2019-07-24","PC07","Juillet","DS01","Pomme","lundi à vendredi soirs","1 sachet de 2 kilogrammes. 1 pomme pour 1 repas","Menus journaliers",1,"LSMJ04","Ratatouille","Mercredi et jeudi soirs","1 boîte pour 2 repas","Menus journaliers",0.5,null,null,null,null,null,0,"VS22","Saucisson","Lundi à dimanche soirs","1 morceau de 400 grammes (Leclerc) pour 3 repas","Menus journaliers",0.33000001311302185,null,null,"Menus journaliers juillet"]
["MJ206","2019-07-25","PC07","Juillet","DS01","Pomme","lundi à vendredi soirs","1 sachet de 2 kilogrammes. 1 pomme pour 1 repas","Menus journaliers",1,"LSMJ04","Ratatouille","Mercredi et jeudi soirs","1 boîte pour 2 repas","Menus journaliers",0.5,null,null,null,null,null,0,"VS18","Roulade à la pistache","Lundi à dimanche soirs","3 tranches pour 1 repas","Menus journaliers",3,null,null,"Menus journaliers juillet"]
["MJ207","2019-07-26","PC07","Juillet","DS01","Pomme","lundi à vendredi soirs","1 sachet de 2 kilogrammes. 1 pomme pour 1 repas","Menus journaliers",1,"LSV11","Tomates ","Vendredi soir","Unité : 2 pour 1 repas","Menus journaliers",2,null,null,null,null,null,0,"VS22","Saucisson","Lundi à dimanche soirs","1 morceau de 400 grammes (Leclerc) pour 3 repas","Menus journaliers",0.33000001311302185,null,null,"Menus journaliers juillet"]
["MJ208","2019-07-27","PC07","Juillet","DWE03","Avocats","Samedi et dimanche midis et soirs","Unité : 1 pour 1 repas","Menus journaliers",2,"LWES03","Pâtes au fromage râpé","Samedi midi et soir","5 cuillères pour 1 repas","Menus journaliers",10,null,null,null,null,null,0,"VS19","Roulé au fromage","Lundi à dimanche soirs","1 boîte pour 2 repas","Menus journaliers",1,null,null,"Menus journaliers juillet"]
["MJ209","2019-07-28","PC07","Juillet","DWE03","Avocats","Samedi et dimanche midis et soirs","Unité : 1 pour 1 repas","Menus journaliers",2,"LWED03","Frites","Dimanche midi","20 frites pour 1 repas","Menus journaliers",20,"LWED01","Asperges","Dimanche soir","1 bocal ou 1 boîte pour 1 repas","Menus journaliers",1,"VS22","Saucisson","Lundi à dimanche soirs","1 morceau de 400 grammes (Leclerc) pour 3 repas","Menus journaliers",0.33000001311302185,null,null,"Menus journaliers juillet"]
["MJ210","2019-07-29","PC07","Juillet","DS01","Pomme","lundi à vendredi soirs","1 sachet de 2 kilogrammes. 1 pomme pour 1 repas","Menus journaliers",1,"LSLM02","Choucroute","Lundi et mardi soirs","1 boîte pour 2 repas","Menus journaliers",0.5,null,null,null,null,null,0,"VS27","Viande choucroute","Lundi et mardi soirs","1 boîte pour 2 repas","Menus journaliers",0.5,null,null,"Menus journaliers juillet"]
["MJ211","2019-07-30","PC07","Juillet","DS01","Pomme","lundi à vendredi soirs","1 sachet de 2 kilogrammes. 1 pomme pour 1 repas","Menus journaliers",1,"LSLM02","Choucroute","Lundi et mardi soirs","1 boîte pour 2 repas","Menus journaliers",0.5,null,null,null,null,null,0,"VS27","Viande choucroute","Lundi et mardi soirs","1 boîte pour 2 repas","Menus journaliers",0.5,null,null,"Menus journaliers juillet"]
["MJ212","2019-07-31","PC07","Juillet","DS01","Pomme","lundi à vendredi soirs","1 sachet de 2 kilogrammes. 1 pomme pour 1 repas","Menus journaliers",1,"LSMJ05","Raviolis","Mercredi et jeudi soirs","1 boîte pour 2 repas","Menus journaliers",0.5,null,null,null,null,null,0,"VS19","Roulé au fromage","Lundi à dimanche soirs","1 boîte pour 2 repas","Menus journaliers",1,null,null,"Menus journaliers juillet"]
["MVWE53","2019-07-06","PC07","Juillet",null,null,null,null,null,0,null,null,null,null,null,0,null,null,null,null,null,0,"VWE06","Porc","Samedi et dimanche midis","1 tranche pour 1 repas","Menus viandes week-end",1,null,null,"Menus viandes weekend deuxième semestre"]
["MVWE54","2019-07-07","PC07","Juillet",null,null,null,null,null,0,null,null,null,null,null,0,null,null,null,null,null,0,"VWE07","Veau","Samedi et dimanche midis","1 tranche pour 1 repas","Menus viandes week-end",1,null,null,"Menus viandes weekend deuxième semestre"]
["MVWE55","2019-07-13","PC07","Juillet",null,null,null,null,null,0,null,null,null,null,null,0,null,null,null,null,null,0,"VWE01","Agneau","Samedi et dimanche midis","1 tranche pour 1 repas","Menus viandes week-end",1,null,null,"Menus viandes weekend deuxième semestre"]
["MVWE56","2019-07-14","PC07","Juillet",null,null,null,null,null,0,null,null,null,null,null,0,null,null,null,null,null,0,"VWE02","Bœuf","Samedi et dimanche midis","1 tranche pour 1 repas","Menus viandes week-end",1,"O05","Fête nationale","Menus viandes weekend deuxième semestre"]
["MVWE57","2019-07-20","PC07","Juillet",null,null,null,null,null,0,null,null,null,null,null,0,null,null,null,null,null,0,"VWE03","Cheval","Samedi et dimanche midis","1 tranche pour 1 repas","Menus viandes week-end",1,null,null,"Menus viandes weekend deuxième semestre"]
["MVWE58","2019-07-21","PC07","Juillet",null,null,null,null,null,0,null,null,null,null,null,0,null,null,null,null,null,0,"VWE04","Dinde","Samedi et dimanche midis","1 tranche pour 1 repas","Menus viandes week-end",1,null,null,"Menus viandes weekend deuxième semestre"]
["MVWE59","2019-07-27","PC07","Juillet",null,null,null,null,null,0,null,null,null,null,null,0,null,null,null,null,null,0,"VWE05","Poisson","Samedi et dimanche midis","Unité : 1 pour 1 repas","Menus viandes week-end",1,null,null,"Menus viandes weekend deuxième semestre"]
["MVWE60","2019-07-28","PC07","Juillet",null,null,null,null,null,0,null,null,null,null,null,0,null,null,null,null,null,0,"VWE06","Porc","Samedi et dimanche midis","1 tranche pour 1 repas","Menus viandes week-end",1,null,null,"Menus viandes weekend deuxième semestre"]

{"sheet":"Août","index":15,"n_rows":65,"n_cols":31,"rows_kept":65,"cut":false,"hidden":false,"merged":[[0,0,0,30]]}
["Menus du mois d'août  2018."]
[]
["Numéro du menu","Date du menu","Code période concernée","Période concernée","Code dessert","Dessert","Jour dessert","Conditionnement dessert","Destination dessert","Quantité dessert","Code légume","Légume","Jour légume","Conditionnement légume","Destination légume","Quantité légume","Code légume deux","Légume deux","Jour légume deux","Conditionnement légume deux","Destination légume deux","Quantité légume deux","Code viande","Viande","Jour viande","Conditionnement viande","Destination viande","Quantité viande","Code observation","Observation","Titre"]
["MMR153","2019-08-01","PC08","Août","DMR01","Pomme","Lundi à vendredi midis","1 sachet de 2 kilogrammes. 1 pomme pour 1 repas","Menus midi retraite",1,"LMR16","Salade","Lundi à vendredi midis","Unité : 1 tête pour 1 repas","Menus midi retraite",1,null,null,null,null,null,0,"VMR03","Rôti de cheval","Lundi à vendredi midis","1 morceau de 500 grammes pour 5 repas","Menus midi retraite",100,null,null,"Menus midi retraite août"]
["MMR154","2019-08-02","PC08","Août","DMR01","Pomme","Lundi à vendredi midis","1 sachet de 2 kilogrammes. 1 pomme pour 1 repas","Menus midi retraite",1,"LMR17","Tomates","Lundi à vendredi midis","Unité : 2 pour 1 repas","Menus midi retraite",2,null,null,null,null,null,0,"VMR03","Rôti de cheval","Lundi à vendredi midis","1 morceau de 500 grammes pour 5 repas","Menus midi retraite",100,null,null,"Menus midi retraite août"]
["MMR155","2019-08-05","PC08","Août","DMR01","Pomme","Lundi à vendredi midis","1 sachet de 2 kilogrammes. 1 pomme pour 1 repas","Menus midi retraite",1,"LMR01","Asperges","Lundi à vendredi midis","1 boîte pour 1 repas","Menus midi retraite",2,null,null,null,null,null,0,"VMR04","Rôti de porc","Lundi à vendredi midis","1 morceau de 500 grammes pour 5 repas","Menus midi retraite",100,null,null,"Menus midi retraite août"]
["MMR156","2019-08-06","PC08","Août","DMR01","Pomme","Lundi à vendredi midis","1 sachet de 2 kilogrammes. 1 pomme pour 1 repas","Menus midi retraite",1,"LMR02","Avocat","Lundi à vendredi midis","Unité : 1 pour 1 repas","Menus midi retraite",1,null,null,null,null,null,0,"VMR04","Rôti de porc","Lundi à vendredi midis","1 morceau de 500 grammes pour 5 repas","Menus midi retraite",100,null,null,"Menus midi retraite août"]
["MMR157","2019-08-07","PC08","Août","DMR01","Pomme","Lundi à vendredi midis","1 sachet de 2 kilogrammes. 1 pomme pour 1 repas","Menus midi retraite",1,"LMR03","Carottes","Lundi à vendredi midis","Unité : 2 pour 1 repas","Menus midi retraite",2,null,null,null,null,null,0,"VMR04","Rôti de porc","Lundi à vendredi midis","1 morceau de 500 grammes pour 5 repas","Menus midi retraite",100,null,null,"Menus midi retraite août"]
["MMR158","2019-08-08","PC08","Août","DMR01","Pomme","Lundi à vendredi midis","1 sachet de 2 kilogrammes. 1 pomme pour 1 repas","Menus midi retraite",1,"LMR04","Céleri","Lundi à vendredi midis","Unité : 1 branche pour 1 repas","Menus midi retraite",1,null,null,null,null,null,0,"VMR04","Rôti de porc","Lundi à vendredi midis","1 morceau de 500 grammes pour 5 repas","Menus midi retraite",100,null,null,"Menus midi retraite août"]
["MMR159","2019-08-09","PC08","Août","DMR01","Pomme","Lundi à vendredi midis","1 sachet de 2 kilogrammes. 1 pomme pour 1 repas","Menus midi retraite",1,"LMR05","Champignons","Lundi à vendredi midis","1 boîte pour 1 repas","Menus midi retraite",1,null,null,null,null,null,0,"VMR04","Rôti de porc","Lundi à vendredi midis","1 morceau de 500 grammes pour 5 repas","Menus midi retraite",100,null,null,"Menus midi retraite août"]
["MMR160","2019-08-12","PC08","Août","DMR01","Pomme","Lundi à vendredi midis","1 sachet de 2 kilogrammes. 1 pomme pour 1 repas","Menus midi retraite",1,"LMR06","Concombre","Lundi à vendredi midis","Unité : 1 pour 1 repas","Menus midi retraite",1,null,null,null,null,null,0,"VMR05","Rôti de veau","Lundi à vendredi midis","1 morceau de 500 grammes pour 5 repas","Menus midi retraite",100,null,null,"Menus midi retraite août"]
["MMR161","2019-08-13","PC08","Août","DMR01","Pomme","Lundi à vendredi midis","1 sachet de 2 kilogrammes. 1 pomme pour 1 repas","Menus midi retraite",1,"LMR07","Couscous","Lundi à vendredi midis","25 grammes pour 1 repas","Menus midi retraite",25,null,null,null,null,null,0,"VMR05","Rôti de veau","Lundi à vendredi midis","1 morceau de 500 grammes pour 5 repas","Menus midi retraite",100,null,null,"Menus midi retraite août"]
["MMR162","2019-08-14","PC08","Août","DMR01","Pomme","Lundi à vendredi midis","1 sachet de 2 kilogrammes. 1 pomme pour 1 repas","Menus midi retraite",1,"LMR08","Maïs","Lundi à vendredi midis","1 boîte pour 2 repas","Menus midi retraite",0.5,null,null,null,null,null,0,"VMR05","Rôti de veau","Lundi à vendredi midis","1 morceau de 500 grammes pour 5 repas","Menus midi retraite",100,null,null,"Menus midi retraite août"]
["MMR163","2019-08-15","PC08","Août","DMR01","Pomme","Lundi à vendredi midis","1 sachet de 2 kilogrammes. 1 pomme pour 1 repas","Menus midi retraite",1,"LMR08","Maïs","Lundi à vendredi midis","1 boîte pour 2 repas","Menus midi retraite",0.5,null,null,null,null,null,0,"VMR05","Rôti de veau","Lundi à vendredi midis","1 morceau de 500 grammes pour 5 repas","Menus midi retraite",100,"O03","Assomption","Menus midi retraite août"]
["MMR164","2019-08-16","PC08","Août","DMR01","Pomme","Lundi à vendredi midis","1 sachet de 2 kilogrammes. 1 pomme pour 1 repas","Menus midi retraite",1,"LMR09","Pâtes à la sauce tomates","Lundi à vendredi midis","5 cuillères pour 1 repas","Menus midi retraite",5,null,null,null,null,null,0,"VMR05","Rôti de veau","Lundi à vendredi midis","1 morceau de 500 grammes pour 5 repas","Menus midi retraite",100,null,null,"Menus midi retraite août"]
["MMR165","2019-08-19","PC08","Août","DMR01","Pomme","Lundi à vendredi midis","1 sachet de 2 kilogrammes. 1 pomme pour 1 repas","Menus midi retraite",1,"LMR10","Pâtes au beurre","Lundi à vendredi midis","5 cuillères pour 1 repas","Menus midi retraite",5,null,null,null,null,null,0,"VMR01","Rôti d'agneau","Lundi à vendredi midis","1 morceau de 500 grammes pour 5 repas","Menus midi retraite",100,null,null,"Menus midi retraite août"]
["MMR166","2019-08-20","PC08","Août","DMR01","Pomme","Lundi à vendredi midis","1 sachet de 2 kilogrammes. 1 pomme pour 1 repas","Menus midi retraite",1,"LMR11","Poireau","Lundi à vendredi midis","Unité : 1 pour 1 repas","Menus midi retraite",1,null,null,null,null,null,0,"VMR01","Rôti d'agneau","Lundi à vendredi midis","1 morceau de 500 grammes pour 5 repas","Menus midi retraite",100,null,null,"Menus midi retraite août"]
["MMR167","2019-08-21","PC08","Août","DMR01","Pomme","Lundi à vendredi midis","1 sachet de 2 kilogrammes. 1 pomme pour 1 repas","Menus midi retraite",1,"LMR12","Pomme de terre","Lundi à vendredi midis","Unité : 1 pour 1 repas","Menus midi retraite",1,null,null,null,null,null,0,"VMR01","Rôti d'agneau","Lundi à vendredi midis","1 morceau de 500 grammes pour 5 repas","Menus midi retraite",100,null,null,"Menus midi retraite août"]
["MMR168","2019-08-22","PC08","Août","DMR01","Pomme","Lundi à vendredi midis","1 sachet de 2 kilogrammes. 1 pomme pour 1 repas","Menus midi retraite",1,"LMR13","Purée","Lundi à vendredi midis","25 grammes pour 1 repas","Menus midi retraite",25,null,null,null,null,null,0,"VMR01","Rôti d'agneau","Lundi à vendredi midis","1 morceau de 500 grammes pour 5 repas","Menus midi retraite",100,null,null,"Menus midi retraite août"]
["MMR169","2019-08-23","PC08","Août","DMR01","Pomme","Lundi à vendredi midis","1 sachet de 2 kilogrammes. 1 pomme pour 1 repas","Menus midi retraite",1,"LMR14","Radis","Lundi à vendredi midis","1 botte ou 1 sachet pour 2 repas","Menus midi retraite",0.5,null,null,null,null,null,0,"VMR01","Rôti d'agneau","Lundi à vendredi midis","1 morceau de 500 grammes pour 5 repas","Menus midi retraite",100,null,null,"Menus midi retraite août"]
["MMR170","2019-08-26","PC08","Août","DMR01","Pomme","Lundi à vendredi midis","1 sachet de 2 kilogrammes. 1 pomme pour 1 repas","Menus midi retraite",1,"LMR14","Radis","Lundi à vendredi midis","1 botte ou 1 sachet pour 2 repas","Menus midi retraite",0.5,null,null,null,null,null,0,"VMR02","Rôti de bœuf","Lundi à vendredi midis","1 morceau de 500 grammes pour 5 repas","Menus midi retraite",100,null,null,"Menus midi retraite août"]
["MMR171","2019-08-27","PC08","Août","DMR01","Pomme","Lundi à vendredi midis","1 sachet de 2 kilogrammes. 1 pomme pour 1 repas","Menus midi retraite",1,"LMR15","Riz","Lundi à vendredi midis","25 grammes pour 1 repas","Menus midi retraite",25,null,null,null,null,null,0,"VMR02","Rôti de bœuf","Lundi à vendredi midis","1 morceau de 500 grammes pour 5 repas","Menus midi retraite",100,null,null,"Menus midi retraite août"]
["MMR172","2019-08-28","PC08","Août","DMR01","Pomme","Lundi à vendredi midis","1 sachet de 2 kilogrammes. 1 pomme pour 1 repas","Menus midi retraite",1,"LMR16","Salade","Lundi à vendredi midis","Unité : 1 tête pour 1 repas","Menus midi retraite",1,null,null,null,null,null,0,"VMR02","Rôti de bœuf","Lundi à vendredi midis","1 morceau de 500 grammes pour 5 repas","Menus midi retraite",100,null,null,"Menus midi retraite août"]
["MMR173","2019-08-29","PC08","Août","DMR01","Pomme","Lundi à vendredi midis","1 sachet de 2 kilogrammes. 1 pomme pour 1 repas","Menus midi retraite",1,"LMR17","Tomates","Lundi à vendredi midis","Unité : 2 pour 1 repas","Menus midi retraite",2,null,null,null,null,null,0,"VMR02","Rôti de bœuf","Lundi à vendredi midis","1 morceau de 500 grammes pour 5 repas","Menus midi retraite",100,null,null,"Menus midi retraite août"]
["MMR174","2019-08-30","PC08","Août","DMR01","Pomme","Lundi à vendredi midis","1 sachet de 2 kilogrammes. 1 pomme pour 1 repas","Menus midi retraite",1,"LMR01","Asperges","Lundi à vendredi midis","1 boîte pour 1 repas","Menus midi retraite",2,null,null,null,null,null,0,"VMR02","Rôti de bœuf","Lundi à vendredi midis","1 morceau de 500 grammes pour 5 repas","Menus midi retraite",100,null,null,"Menus midi retraite août"]
["MJ213","2019-08-01","PC08","Août","DS01","Pomme","lundi à vendredi soirs","1 sachet de 2 kilogrammes. 1 pomme pour 1 repas","Menus journaliers",1,"LSMJ05","Raviolis","Mercredi et jeudi soirs","1 boîte pour 2 repas","Menus journaliers",0.5,null,null,null,null,null,0,"VS22","Saucisson","Lundi à dimanche soirs","1 morceau de 400 grammes (Leclerc) pour 3 repas","Menus journaliers",0.34000000357627869,null,null,"Menus journaliers août"]
["MJ214","2019-08-02","PC08","Août","DS01","Pomme","lundi à vendredi soirs","1 sachet de 2 kilogrammes. 1 pomme pour 1 repas","Menus journaliers",1,"LSV01","Asperges","Vendredi soir","1 bocal ou 1 boîte pour 1 repas","Menus journaliers",1,null,null,null,null,null,0,"VS20","Salami","Lundi à dimanche soirs","1 paquet pour 2 repas","Menus journaliers",0.5,null,null,"Menus journaliers août"]
["MJ215","2019-08-03","PC08","Août","DWE04","Bananes","Samedi et dimanche midis et soirs","Unité : 1 pour 1 repas","Menus journaliers",2,"LWES01","Pâtes à la sauce tomates","Samedi midi et soir","5 cuillères pour 1 repas","Menus journaliers",10,null,null,null,null,null,0,"VS22","Saucisson","Lundi à dimanche soirs","1 morceau de 400 grammes (Leclerc) pour 3 repas","Menus journaliers",0.33000001311302185,null,null,"Menus journaliers août"]
["MJ216","2019-08-04","PC08","Août","DWE04","Bananes","Samedi et dimanche midis et soirs","Unité : 1 pour 1 repas","Menus journaliers",2,"LWED04","Haricots verts","Dimanche midi et soir","1 boîte pour 2 repas","Menus journaliers",1,null,null,null,null,null,0,"VS20","Salami","Lundi à dimanche soirs","1 paquet pour 2 repas","Menus journaliers",0.5,null,null,"Menus journaliers août"]
["MJ217","2019-08-05","PC08","Août","DS01","Pomme","lundi à vendredi soirs","1 sachet de 2 kilogrammes. 1 pomme pour 1 repas","Menus journaliers",1,"LSLM03","Chou-fleur","Lundi et mardi soirs","Unité : 1 pour 2 repas","Menus journaliers",0.5,null,null,null,null,null,0,"VS22","Saucisson","Lundi à dimanche soirs","1 morceau de 400 grammes (Leclerc) pour 3 repas","Menus journaliers",0.33000001311302185,null,null,"Menus journaliers août"]
["MJ218","2019-08-06","PC08","Août","DS01","Pomme","lundi à vendredi soirs","1 sachet de 2 kilogrammes. 1 pomme pour 1 repas","Menus journaliers",1,"LSLM03","Chou-fleur","Lundi et mardi soirs","Unité : 1 pour 2 repas","Menus journaliers",0.5,null,null,null,null,null,0,"VS21","Saucisses","Lundi à dimanche soirs","1 paquet pour 2 repas. 1 ou 2 saucisses pour 1 repas","Menus journaliers",0.5,null,null,"Menus journaliers août"]
["MJ219","2019-08-07","PC08","Août","DS01","Pomme","lundi à vendredi soirs","1 sachet de 2 kilogrammes. 1 pomme pour 1 repas","Menus journaliers",1,"LSMJ06","Tomates pelées","Mercredi et jeudi soirs","1 boîte pour 2 repas","Menus journaliers",0.5,null,null,null,null,null,0,"VS22","Saucisson","Lundi à dimanche soirs","1 morceau de 400 grammes (Leclerc) pour 3 repas","Menus journaliers",0.34000000357627869,null,null,"Menus journaliers août"]
["MJ220","2019-08-08","PC08","Août","DS01","Pomme","lundi à vendredi soirs","1 sachet de 2 kilogrammes. 1 pomme pour 1 repas","Menus journaliers",1,"LSMJ06","Tomates pelées","Mercredi et jeudi soirs","1 boîte pour 2 repas","Menus journaliers",0.5,null,null,null,null,null,0,"VS21","Saucisses","Lundi à dimanche soirs","1 paquet pour 2 repas. 1 ou 2 saucisses pour 1 repas","Menus journaliers",0.5,null,null,"Menus journaliers août"]
["MJ221","2019-08-09","PC08","Août","DS01","Pomme","lundi à vendredi soirs","1 sachet de 2 kilogrammes. 1 pomme pour 1 repas","Menus journaliers",1,"LSV02","Avocat","Vendredi soir","Unité : 1 pour 1 repas","Menus journaliers",1,null,null,null,null,null,0,"VS22","Saucisson","Lundi à dimanche soirs","1 morceau de 400 grammes (Leclerc) pour 3 repas","Menus journaliers",0.33000001311302185,null,null,"Menus journaliers août"]
["MJ222","2019-08-10","PC08","Août","DWE05","Clémentines","Samedi et dimanche midis et soirs","Unité : 2 à 4 pour 1 repas","Menus journaliers",8,"LWES02","Pâtes au beurre","Samedi midi et soir","5 cuillères pour 1 repas","Menus journaliers",10,null,null,null,null,null,0,"VS23","Tête persillée","Lundi à dimanche soirs","1 tranche pour 2 repas","Menus journaliers",0.5,null,null,"Menus journaliers août"]
["MJ223","2019-08-11","PC08","Août","DWE05","Clémentines","Samedi et dimanche midis et soirs","Unité : 2 à 4 pour 1 repas","Menus journaliers",8,"LWED02","Chips","Dimanche midi et soir","1 sachet pour 2 repas","Menus journaliers",1,null,null,null,null,null,0,"VS22","Saucisson","Lundi à dimanche soirs","1 morceau de 400 grammes (Leclerc) pour 3 repas","Menus journaliers",0.33000001311302185,null,null,"Menus journaliers août"]
["MJ224","2019-08-12","PC08","Août","DS01","Pomme","lundi à vendredi soirs","1 sachet de 2 kilogrammes. 1 pomme pour 1 repas","Menus journaliers",1,"LSLM04","Choux de Bruxelles","Lundi et mardi soirs","1 boîte pour 2 repas","Menus journaliers",0.5,null,null,null,null,null,0,"VS23","Tête persillée","Lundi à dimanche soirs","1 tranche pour 2 repas","Menus journaliers",0.5,null,null,"Menus journaliers août"]
["MJ225","2019-08-13","PC08","Août","DS01","Pomme","lundi à vendredi soirs","1 sachet de 2 kilogrammes. 1 pomme pour 1 repas","Menus journaliers",1,"LSLM04","Choux de Bruxelles","Lundi et mardi soirs","1 boîte pour 2 repas","Menus journaliers",0.5,null,null,null,null,null,0,"VS22","Saucisson","Lundi à dimanche soirs","1 morceau de 400 grammes (Leclerc) pour 3 repas","Menus journaliers",0.34000000357627869,null,null,"Menus journaliers août"]
["MJ226","2019-08-14","PC08","Août","DS01","Pomme","lundi à vendredi soirs","1 sachet de 2 kilogrammes. 1 pomme pour 1 repas","Menus journaliers",1,"LSMJ01","Macédoine de légumes","Mercredi et jeudi soirs","1 boîte pour 2 repas","Menus journaliers",0.5,null,null,null,null,null,0,"VS24","Tête roulée","Lundi à dimanche soirs","1 tranche pour 2 repas","Menus journaliers",3,null,null,"Menus journaliers août"]
["MJ227","2019-08-15","PC08","Août","DS01","Pomme","lundi à vendredi soirs","1 sachet de 2 kilogrammes. 1 pomme pour 1 repas","Menus journaliers",1,"LSMJ01","Macédoine de légumes","Mercredi et jeudi soirs","1 boîte pour 2 repas","Menus journaliers",0.5,null,null,null,null,null,0,"VS22","Saucisson","Lundi à dimanche soirs","1 morceau de 400 grammes (Leclerc) pour 3 repas","Menus journaliers",0.33000001311302185,"O03","Assomption","Menus journaliers août"]
["MJ228","2019-08-16","PC08","Août","DS01","Pomme","lundi à vendredi soirs","1 sachet de 2 kilogrammes. 1 pomme pour 1 repas","Menus journaliers",1,"LSV03","Betterave rouge","Vendredi soir","Unité : 1 pour 1 repas","Menus journaliers",1,null,null,null,null,null,0,"VS24","Tête roulée","Lundi à dimanche soirs","1 tranche pour 2 repas","Menus journaliers",3,null,null,"Menus journaliers août"]
["MJ229","2019-08-17","PC08","Août","DWE06","Crème","Samedi et dimanche midis et soirs","1 pack de 4 pots pour le week-end. 1 pot pour 1 repas","Menus journaliers",2,"LWES03","Pâtes au fromage râpé","Samedi midi et soir","5 cuillères pour 1 repas","Menus journaliers",10,null,null,null,null,null,0,"VS22","Saucisson","Lundi à dimanche soirs","1 morceau de 400 grammes (Leclerc) pour 3 repas","Menus journaliers",0.33000001311302185,null,null,"Menus journaliers août"]
["MJ230","2019-08-18","PC08","Août","DWE06","Crème","Samedi et dimanche midis et soirs","1 pack de 4 pots pour le week-end. 1 pot pour 1 repas","Menus journaliers",2,"LWED03","Frites","Dimanche midi","20 frites pour 1 repas","Menus journaliers",20,"LWED01","Asperges","Dimanche soir","1 bocal ou 1 boîte pour 1 repas","Menus journaliers",1,"VS25","Thon","Lundi à dimanche soirs","1 boîte pour 1 repas","Menus journaliers",1,null,null,"Menus journaliers août"]
["MJ231","2019-08-19","PC08","Août","DS01","Pomme","lundi à vendredi soirs","1 sachet de 2 kilogrammes. 1 pomme pour 1 repas","Menus journaliers",1,"LSLM05","Couscous","Lundi et mardi soirs","25 grammes pour 1 repas","Menus journaliers",25,null,null,null,null,null,0,"VS22","Saucisson","Lundi à dimanche soirs","1 morceau de 400 grammes (Leclerc) pour 3 repas","Menus journaliers",0.34000000357627869,null,null,"Menus journaliers août"]
["MJ232","2019-08-20","PC08","Août","DS01","Pomme","lundi à vendredi soirs","1 sachet de 2 kilogrammes. 1 pomme pour 1 repas","Menus journaliers",1,"LSLM05","Couscous","Lundi et mardi soirs","25 grammes pour 1 repas","Menus journaliers",25,null,null,null,null,null,0,"VS01","Bifteck haché de bœuf","Lundi à dimanche soirs","1 paquet pour 2 repas","Menus journaliers",1,null,null,"Menus journaliers août"]
["MJ233","2019-08-21","PC08","Août","DS01","Pomme","lundi à vendredi soirs","1 sachet de 2 kilogrammes. 1 pomme pour 1 repas","Menus journaliers",1,"LSMJ02","Petits pois","Mercredi et jeudi soirs","1 boîte pour 2 repas","Menus journaliers",0.5,null,null,null,null,null,0,"VS22","Saucisson","Lundi à dimanche soirs","1 morceau de 400 grammes (Leclerc) pour 3 repas","Menus journaliers",0.33000001311302185,null,null,"Menus journaliers août"]
["MJ234","2019-08-22","PC08","Août","DS01","Pomme","lundi à vendredi soirs","1 sachet de 2 kilogrammes. 1 pomme pour 1 repas","Menus journaliers",1,"LSMJ02","Petits pois","Mercredi et jeudi soirs","1 boîte pour 2 repas","Menus journaliers",0.5,null,null,null,null,null,0,"VS01","Bifteck haché de bœuf","Lundi à dimanche soirs","1 paquet pour 2 repas","Menus journaliers",1,null,null,"Menus journaliers août"]
["MJ235","2019-08-23","PC08","Août","DS01","Pomme","lundi à vendredi soirs","1 sachet de 2 kilogrammes. 1 pomme pour 1 repas","Menus journaliers",1,"LSV04","Carottes","Vendredi soir","Unité : 2 pour 1 repas","Menus journaliers",2,null,null,null,null,null,0,"VS22","Saucisson","Lundi à dimanche soirs","1 morceau de 400 grammes (Leclerc) pour 3 repas","Menus journaliers",0.33000001311302185,null,null,"Menus journaliers août"]
["MJ236","2019-08-24","PC08","Août","DWE07","Dattes","Samedi et dimanche midis et soirs","1 paquet pour 4 repas","Menus journaliers",0.5,"LWES01","Pâtes à la sauce tomates","Samedi midi et soir","5 cuillères pour 1 repas","Menus journaliers",10,null,null,null,null,null,0,"VS02","Bifteck haché de cheval","Lundi à dimanche soirs","125 grammes pour 1 repas","Menus journaliers",125,null,null,"Menus journaliers août"]
["MJ237","2019-08-25","PC08","Août","DWE07","Dattes","Samedi et dimanche midis et soirs","1 paquet pour 4 repas","Menus journaliers",0.5,"LWED04","Haricots verts","Dimanche midi et soir","1 boîte pour 2 repas","Menus journaliers",1,null,null,null,null,null,0,"VS22","Saucisson","Lundi à dimanche soirs","1 morceau de 400 grammes (Leclerc) pour 3 repas","Menus journaliers",0.34000000357627869,null,null,"Menus journaliers août"]
["MJ238","2019-08-26","PC08","Août","DS01","Pomme","lundi à vendredi soirs","1 sachet de 2 kilogrammes. 1 pomme pour 1 repas","Menus journaliers",1,"LSLM06","Endives","Lundi et mardi soirs","1 boîte pour 2 repas","Menus journaliers",0.5,null,null,null,null,null,0,"VS03","Bifteck haché de veau","Lundi à dimanche soirs","1 paquet pour 2 repas","Menus journaliers",1,null,null,"Menus journaliers août"]
["MJ239","2019-08-27","PC08","Août","DS01","Pomme","lundi à vendredi soirs","1 sachet de 2 kilogrammes. 1 pomme pour 1 repas","Menus journaliers",1,"LSLM06","Endives","Lundi et mardi soirs","1 boîte pour 2 repas","Menus journaliers",0.5,null,null,null,null,null,0,"VS22","Saucisson","Lundi à dimanche soirs","1 morceau de 400 grammes (Leclerc) pour 3 repas","Menus journaliers",0.33000001311302185,null,null,"Menus journaliers août"]
["MJ240","2019-08-28","PC08","Août","DS01","Pomme","lundi à vendredi soirs","1 sachet de 2 kilogrammes. 1 pomme pour 1 repas","Menus journaliers",1,"LSMJ03","Petits pois et jeunes carottes","Mercredi et jeudi soirs","1 boîte pour 2 repas","Menus journaliers",0.5,null,null,null,null,null,0,"VS03","Bifteck haché de veau","Lundi à dimanche soirs","1 paquet pour 2 repas","Menus journaliers",1,null,null,"Menus journaliers août"]
["MJ241","2019-08-29","PC08","Août","DS01","Pomme","lundi à vendredi soirs","1 sachet de 2 kilogrammes. 1 pomme pour 1 repas","Menus journaliers",1,"LSMJ03","Petits pois et jeunes carottes","Mercredi et jeudi soirs","1 boîte pour 2 repas","Menus journaliers",0.5,null,null,null,null,null,0,"VS22","Saucisson","Lundi à dimanche soirs","1 morceau de 400 grammes (Leclerc) pour 3 repas","Menus journaliers",0.33000001311302185,null,null,"Menus journaliers août"]
["MJ242","2019-08-30","PC08","Août","DS01","Pomme","lundi à vendredi soirs","1 sachet de 2 kilogrammes. 1 pomme pour 1 repas","Menus journaliers",1,"LSV05","Céleri","Vendredi soir","Unité : 1 branche pour 1 repas","Menus journaliers",1,null,null,null,null,null,0,"VS04","Bouchée à la reine","Lundi à dimanche soirs","1 boîte pour 2 repas","Menus journaliers",1,null,null,"Menus journaliers août"]
["MJ243","2019-08-31","PC08","Août","DWE08","Figues","Samedi et dimanche midis et soirs","1 paquet pour 4 repas","Menus journaliers",0.5,"LWES02","Pâtes au beurre","Samedi midi et soir","5 cuillères pour 1 repas","Menus journaliers",10,null,null,null,null,null,0,"VS22","Saucisson","Lundi à dimanche soirs","1 morceau de 400 grammes (Leclerc) pour 3 repas","Menus journaliers",0.34000000357627869,null,null,"Menus journaliers août"]
["MVWE61","2019-08-03","PC08","Août",null,null,null,null,null,0,null,null,null,null,null,0,null,null,null,null,null,0,"VWE07","Veau","Samedi et dimanche midis","1 tranche pour 1 repas","Menus viandes week-end",1,null,null,"Menus viandes weekend deuxième semestre"]
["MVWE62","2019-08-04","PC08","Août",null,null,null,null,null,0,null,null,null,null,null,0,null,null,null,null,null,0,"VWE01","Agneau","Samedi et dimanche midis","1 tranche pour 1 repas","Menus viandes week-end",1,null,null,"Menus viandes weekend deuxième semestre"]
["MVWE63","2019-08-10","PC08","Août",null,null,null,null,null,0,null,null,null,null,null,0,null,null,null,null,null,0,"VWE02","Bœuf","Samedi et dimanche midis","1 tranche pour 1 repas","Menus viandes week-end",1,null,null,"Menus viandes weekend deuxième semestre"]
["MVWE64","2019-08-11","PC08","Août",null,null,null,null,null,0,null,null,null,null,null,0,null,null,null,null,null,0,"VWE03","Cheval","Samedi et dimanche midis","1 tranche pour 1 repas","Menus viandes week-end",1,null,null,"Menus viandes weekend deuxième semestre"]
["MVWE65","2019-08-17","PC08","Août",null,null,null,null,null,0,null,null,null,null,null,0,null,null,null,null,null,0,"VWE04","Dinde","Samedi et dimanche midis","1 tranche pour 1 repas","Menus viandes week-end",1,null,null,"Menus viandes weekend deuxième semestre"]
["MVWE66","2019-08-18","PC08","Août",null,null,null,null,null,0,null,null,null,null,null,0,null,null,null,null,null,0,"VWE05","Poisson","Samedi et dimanche midis","Unité : 1 pour 1 repas","Menus viandes week-end",1,null,null,"Menus viandes weekend deuxième semestre"]
["MVWE67","2019-08-24","PC08","Août",null,null,null,null,null,0,null,null,null,null,null,0,null,null,null,null,null,0,"VWE06","Porc","Samedi et dimanche midis","1 tranche pour 1 repas","Menus viandes week-end",1,null,null,"Menus viandes weekend deuxième semestre"]
["MVWE68","2019-08-25","PC08","Août",null,null,null,null,null,0,null,null,null,null,null,0,null,null,null,null,null,0,"VWE07","Veau","Samedi et dimanche midis","1 tranche pour 1 repas","Menus viandes week-end",1,null,null,"Menus viandes weekend deuxième semestre"]
["MVWE69","2019-08-31","PC08","Août",null,null,null,null,null,0,null,null,null,null,null,0,null,null,null,null,null,0,"VWE01","Agneau","Samedi et dimanche midis","1 tranche pour 1 repas","Menus viandes week-end",1,null,null,"Menus viandes weekend deuxième semestre"]

{"sheet":"Septembre","index":16,"n_rows":63,"n_cols":31,"rows_kept":63,"cut":false,"hidden":false,"merged":[[0,0,0,30]]}
["Menus du mois de septembre  201.."]
[]
["Numéro du menu","Date du menu","Code période concernée","Période concernée","Code dessert","Dessert","Jour dessert","Conditionnement dessert","Destination dessert","Quantité dessert","Code légume","Légume","Jour légume","Conditionnement légume","Destination légume","Quantité légume","Code légume deux","Légume deux","Jour légume deux","Conditionnement légume deux","Destination légume deux","Quantité légume deux","Code viande","Viande","Jour viande","Conditionnement viande","Destination viande","Quantité viande","Code observation","Observation","Titre"]
["MMR175","2019-09-02","PC09","Septembre","DMR01","Pomme","Lundi à vendredi midis","1 sachet de 2 kilogrammes. 1 pomme pour 1 repas","Menus midi retraite",1,"LMR02","Avocat","Lundi à vendredi midis","Unité : 1 pour 1 repas","Menus midi retraite",1,null,null,null,null,null,0,"VMR03","Rôti de cheval","Lundi à vendredi midis","1 morceau de 500 grammes pour 5 repas","Menus midi retraite",100,null,null,"Menus midi retraite septembre"]
["MMR176","2019-09-03","PC09","Septembre","DMR01","Pomme","Lundi à vendredi midis","1 sachet de 2 kilogrammes. 1 pomme pour 1 repas","Menus midi retraite",1,"LMR03","Carottes","Lundi à vendredi midis","Unité : 2 pour 1 repas","Menus midi retraite",1,null,null,null,null,null,0,"VMR03","Rôti de cheval","Lundi à vendredi midis","1 morceau de 500 grammes pour 5 repas","Menus midi retraite",100,null,null,"Menus midi retraite septembre"]
["MMR177","2019-09-04","PC09","Septembre","DMR01","Pomme","Lundi à vendredi midis","1 sachet de 2 kilogrammes. 1 pomme pour 1 repas","Menus midi retraite",1,"LMR04","Céleri","Lundi à vendredi midis","Unité : 1 branche pour 1 repas","Menus midi retraite",1,null,null,null,null,null,0,"VMR03","Rôti de cheval","Lundi à vendredi midis","1 morceau de 500 grammes pour 5 repas","Menus midi retraite",100,null,null,"Menus midi retraite septembre"]
["MMR178","2019-09-05","PC09","Septembre","DMR01","Pomme","Lundi à vendredi midis","1 sachet de 2 kilogrammes. 1 pomme pour 1 repas","Menus midi retraite",1,"LMR05","Champignons","Lundi à vendredi midis","1 boîte pour 1 repas","Menus midi retraite",1,null,null,null,null,null,0,"VMR03","Rôti de cheval","Lundi à vendredi midis","1 morceau de 500 grammes pour 5 repas","Menus midi retraite",100,null,null,"Menus midi retraite septembre"]
["MMR179","2019-09-06","PC09","Septembre","DMR01","Pomme","Lundi à vendredi midis","1 sachet de 2 kilogrammes. 1 pomme pour 1 repas","Menus midi retraite",1,"LMR06","Concombre","Lundi à vendredi midis","Unité : 1 pour 1 repas","Menus midi retraite",1,null,null,null,null,null,0,"VMR03","Rôti de cheval","Lundi à vendredi midis","1 morceau de 500 grammes pour 5 repas","Menus midi retraite",100,null,null,"Menus midi retraite septembre"]
["MMR180","2019-09-09","PC09","Septembre","DMR01","Pomme","Lundi à vendredi midis","1 sachet de 2 kilogrammes. 1 pomme pour 1 repas","Menus midi retraite",1,"LMR07","Couscous","Lundi à vendredi midis","25 grammes pour 1 repas","Menus midi retraite",25,null,null,null,null,null,0,"VMR04","Rôti de porc","Lundi à vendredi midis","1 morceau de 500 grammes pour 5 repas","Menus midi retraite",100,null,null,"Menus midi retraite septembre"]
["MMR181","2019-09-10","PC09","Septembre","DMR01","Pomme","Lundi à vendredi midis","1 sachet de 2 kilogrammes. 1 pomme pour 1 repas","Menus midi retraite",1,"LMR08","Maïs","Lundi à vendredi midis","1 boîte pour 2 repas","Menus midi retraite",0.5,null,null,null,null,null,0,"VMR04","Rôti de porc","Lundi à vendredi midis","1 morceau de 500 grammes pour 5 repas","Menus midi retraite",100,null,null,"Menus midi retraite septembre"]
["MMR182","2019-09-11","PC09","Septembre","DMR01","Pomme","Lundi à vendredi midis","1 sachet de 2 kilogrammes. 1 pomme pour 1 repas","Menus midi retraite",1,"LMR08","Maïs","Lundi à vendredi midis","1 boîte pour 2 repas","Menus midi retraite",0.5,null,null,null,null,null,0,"VMR04","Rôti de porc","Lundi à vendredi midis","1 morceau de 500 grammes pour 5 repas","Menus midi retraite",100,null,null,"Menus midi retraite septembre"]
["MMR183","2019-09-12","PC09","Septembre","DMR01","Pomme","Lundi à vendredi midis","1 sachet de 2 kilogrammes. 1 pomme pour 1 repas","Menus midi retraite",1,"LMR09","Pâtes à la sauce tomates","Lundi à vendredi midis","5 cuillères pour 1 repas","Menus midi retraite",5,null,null,null,null,null,0,"VMR04","Rôti de porc","Lundi à vendredi midis","1 morceau de 500 grammes pour 5 repas","Menus midi retraite",100,null,null,"Menus midi retraite septembre"]
["MMR184","2019-09-13","PC09","Septembre","DMR01","Pomme","Lundi à vendredi midis","1 sachet de 2 kilogrammes. 1 pomme pour 1 repas","Menus midi retraite",1,"LMR10","Pâtes au beurre","Lundi à vendredi midis","5 cuillères pour 1 repas","Menus midi retraite",5,null,null,null,null,null,0,"VMR04","Rôti de porc","Lundi à vendredi midis","1 morceau de 500 grammes pour 5 repas","Menus midi retraite",100,null,null,"Menus midi retraite septembre"]
["MMR185","2019-09-16","PC09","Septembre","DMR01","Pomme","Lundi à vendredi midis","1 sachet de 2 kilogrammes. 1 pomme pour 1 repas","Menus midi retraite",1,"LMR11","Poireau","Lundi à vendredi midis","Unité : 1 pour 1 repas","Menus midi retraite",1,null,null,null,null,null,0,"VMR05","Rôti de veau","Lundi à vendredi midis","1 morceau de 500 grammes pour 5 repas","Menus midi retraite",100,null,null,"Menus midi retraite septembre"]
["MMR186","2019-09-17","PC09","Septembre","DMR01","Pomme","Lundi à vendredi midis","1 sachet de 2 kilogrammes. 1 pomme pour 1 repas","Menus midi retraite",1,"LMR12","Pomme de terre","Lundi à vendredi midis","Unité : 1 pour 1 repas","Menus midi retraite",1,null,null,null,null,null,0,"VMR05","Rôti de veau","Lundi à vendredi midis","1 morceau de 500 grammes pour 5 repas","Menus midi retraite",100,null,null,"Menus midi retraite septembre"]
["MMR187","2019-09-18","PC09","Septembre","DMR01","Pomme","Lundi à vendredi midis","1 sachet de 2 kilogrammes. 1 pomme pour 1 repas","Menus midi retraite",1,"LMR13","Purée","Lundi à vendredi midis","25 grammes pour 1 repas","Menus midi retraite",25,null,null,null,null,null,0,"VMR05","Rôti de veau","Lundi à vendredi midis","1 morceau de 500 grammes pour 5 repas","Menus midi retraite",100,null,null,"Menus midi retraite septembre"]
["MMR188","2019-09-19","PC09","Septembre","DMR01","Pomme","Lundi à vendredi midis","1 sachet de 2 kilogrammes. 1 pomme pour 1 repas","Menus midi retraite",1,"LMR14","Radis","Lundi à vendredi midis","1 botte ou 1 sachet pour 2 repas","Menus midi retraite",0.5,null,null,null,null,null,0,"VMR05","Rôti de veau","Lundi à vendredi midis","1 morceau de 500 grammes pour 5 repas","Menus midi retraite",100,null,null,"Menus midi retraite septembre"]
["MMR189","2019-09-20","PC09","Septembre","DMR01","Pomme","Lundi à vendredi midis","1 sachet de 2 kilogrammes. 1 pomme pour 1 repas","Menus midi retraite",1,"LMR14","Radis","Lundi à vendredi midis","1 botte ou 1 sachet pour 2 repas","Menus midi retraite",0.5,null,null,null,null,null,0,"VMR05","Rôti de veau","Lundi à vendredi midis","1 morceau de 500 grammes pour 5 repas","Menus midi retraite",100,null,null,"Menus midi retraite septembre"]
["MMR190","2019-09-23","PC09","Septembre","DMR01","Pomme","Lundi à vendredi midis","1 sachet de 2 kilogrammes. 1 pomme pour 1 repas","Menus midi retraite",1,"LMR15","Riz","Lundi à vendredi midis","25 grammes pour 1 repas","Menus midi retraite",0.5,null,null,null,null,null,0,"VMR01","Rôti d'agneau","Lundi à vendredi midis","1 morceau de 500 grammes pour 5 repas","Menus midi retraite",100,null,null,"Menus midi retraite septembre"]
["MMR191","2019-09-24","PC09","Septembre","DMR01","Pomme","Lundi à vendredi midis","1 sachet de 2 kilogrammes. 1 pomme pour 1 repas","Menus midi retraite",1,"LMR16","Salade","Lundi à vendredi midis","Unité : 1 tête pour 1 repas","Menus midi retraite",1,null,null,null,null,null,0,"VMR01","Rôti d'agneau","Lundi à vendredi midis","1 morceau de 500 grammes pour 5 repas","Menus midi retraite",100,null,null,"Menus midi retraite septembre"]
["MMR192","2019-09-25","PC09","Septembre","DMR01","Pomme","Lundi à vendredi midis","1 sachet de 2 kilogrammes. 1 pomme pour 1 repas","Menus midi retraite",1,"LMR17","Tomates","Lundi à vendredi midis","Unité : 2 pour 1 repas","Menus midi retraite",2,null,null,null,null,null,0,"VMR01","Rôti d'agneau","Lundi à vendredi midis","1 morceau de 500 grammes pour 5 repas","Menus midi retraite",100,null,null,"Menus midi retraite septembre"]
["MMR193","2019-09-26","PC09","Septembre","DMR01","Pomme","Lundi à vendredi midis","1 sachet de 2 kilogrammes. 1 pomme pour 1 repas","Menus midi retraite",1,"LMR01","Asperges","Lundi à vendredi midis","1 boîte pour 1 repas","Menus midi retraite",1,null,null,null,null,null,0,"VMR01","Rôti d'agneau","Lundi à vendredi midis","1 morceau de 500 grammes pour 5 repas","Menus midi retraite",100,null,null,"Menus midi retraite septembre"]
["MMR194","2019-09-27","PC09","Septembre","DMR01","Pomme","Lundi à vendredi midis","1 sachet de 2 kilogrammes. 1 pomme pour 1 repas","Menus midi retraite",1,"LMR02","Avocat","Lundi à vendredi midis","Unité : 1 pour 1 repas","Menus midi retraite",1,null,null,null,null,null,0,"VMR01","Rôti d'agneau","Lundi à vendredi midis","1 morceau de 500 grammes pour 5 repas","Menus midi retraite",100,null,null,"Menus midi retraite septembre"]
["MMR195","2019-09-30","PC09","Septembre","DMR01","Pomme","Lundi à vendredi midis","1 sachet de 2 kilogrammes. 1 pomme pour 1 repas","Menus midi retraite",1,"LMR03","Carottes","Lundi à vendredi midis","Unité : 2 pour 1 repas","Menus midi retraite",2,null,null,null,null,null,0,"VMR02","Rôti de bœuf","Lundi à vendredi midis","1 morceau de 500 grammes pour 5 repas","Menus midi retraite",100,null,null,"Menus midi retraite septembre"]
["MJ244","2019-09-01","PC09","Septembre","DWE08","Figues","Samedi et dimanche midis et soirs","1 paquet pour 4 repas","Menus journaliers",0.5,"LWED02","Chips","Dimanche midi et soir","1 sachet pour 2 repas","Menus journaliers",1,null,null,null,null,null,0,"VS04","Bouchée à la reine","Lundi à dimanche soirs","1 boîte pour 2 repas","Menus journaliers",1,null,null,"Menus journaliers septembre"]
["MJ245","2019-09-02","PC09","Septembre","DS01","Pomme","lundi à vendredi soirs","1 sachet de 2 kilogrammes. 1 pomme pour 1 repas","Menus journaliers",1,"LSLM07","Haricots verts","Lundi et mardi soirs","1 boîte pour 2 repas","Menus journaliers",0.5,null,null,null,null,null,0,"VS22","Saucisson","Lundi à dimanche soirs","1 morceau de 400 grammes (Leclerc) pour 3 repas","Menus journaliers",0.33000001311302185,null,null,"Menus journaliers septembre"]
["MJ246","2019-09-03","PC09","Septembre","DS01","Pomme","lundi à vendredi soirs","1 sachet de 2 kilogrammes. 1 pomme pour 1 repas","Menus journaliers",1,"LSLM07","Haricots verts","Lundi et mardi soirs","1 boîte pour 2 repas","Menus journaliers",0.5,null,null,null,null,null,0,"VS05","Boudin","Lundi à dimanche soirs","1 paquet pour 2 repas","Menus journaliers",0.5,null,null,"Menus journaliers septembre"]
["MJ247","2019-09-04","PC09","Septembre","DS01","Pomme","lundi à vendredi soirs","1 sachet de 2 kilogrammes. 1 pomme pour 1 repas","Menus journaliers",1,"LSMJ04","Ratatouille","Mercredi et jeudi soirs","1 boîte pour 2 repas","Menus journaliers",0.5,null,null,null,null,null,0,"VS22","Saucisson","Lundi à dimanche soirs","1 morceau de 400 grammes (Leclerc) pour 3 repas","Menus journaliers",0.33000001311302185,null,null,"Menus journaliers septembre"]
["MJ248","2019-09-05","PC09","Septembre","DS01","Pomme","lundi à vendredi soirs","1 sachet de 2 kilogrammes. 1 pomme pour 1 repas","Menus journaliers",1,"LSMJ04","Ratatouille","Mercredi et jeudi soirs","1 boîte pour 2 repas","Menus journaliers",0.5,null,null,null,null,null,0,"VS05","Boudin","Lundi à dimanche soirs","1 paquet pour 2 repas","Menus journaliers",0.5,null,null,"Menus journaliers septembre"]
["MJ249","2019-09-06","PC09","Septembre","DS01","Pomme","lundi à vendredi soirs","1 sachet de 2 kilogrammes. 1 pomme pour 1 repas","Menus journaliers",1,"LSV06","Champignons","Vendredi soir","1 boîte pour 1 repas","Menus journaliers",1,null,null,null,null,null,0,"VS22","Saucisson","Lundi à dimanche soirs","1 morceau de 400 grammes (Leclerc) pour 3 repas","Menus journaliers",0.34000000357627869,null,null,"Menus journaliers septembre"]
["MJ250","2019-09-07","PC09","Septembre","DWE09","Fromage blanc","Samedi et dimanche midis et soirs","1 pack de 4 pots pour le week-end. 1 pot pour 1 repas","Menus journaliers",2,"LWES03","Pâtes au fromage râpé","Samedi midi et soir","5 cuillères pour 1 repas","Menus journaliers",10,null,null,null,null,null,0,"VS06","Cervelas","Lundi à dimanche soirs","1 paquet pour 2 repas","Menus journaliers",0.5,null,null,"Menus journaliers septembre"]
["MJ251","2019-09-08","PC09","Septembre","DWE09","Fromage blanc","Samedi et dimanche midis et soirs","1 pack de 4 pots pour le week-end. 1 pot pour 1 repas","Menus journaliers",2,"LWED03","Frites","Dimanche midi","20 frites pour 1 repas","Menus journaliers",20,"LWED01","Asperges","Dimanche soir","1 bocal ou 1 boîte pour 1 repas","Menus journaliers",1,"VS22","Saucisson","Lundi à dimanche soirs","1 morceau de 400 grammes (Leclerc) pour 3 repas","Menus journaliers",0.33000001311302185,null,null,"Menus journaliers septembre"]
["MJ252","2019-09-09","PC09","Septembre","DS01","Pomme","lundi à vendredi soirs","1 sachet de 2 kilogrammes. 1 pomme pour 1 repas","Menus journaliers",1,"LSLM08","Maïs","Lundi et mardi soirs","1 boîte pour 2 repas","Menus journaliers",0.5,null,null,null,null,null,0,"VS06","Cervelas","Lundi à dimanche soirs","1 paquet pour 2 repas","Menus journaliers",0.5,null,null,"Menus journaliers septembre"]
["MJ253","2019-09-10","PC09","Septembre","DS01","Pomme","lundi à vendredi soirs","1 sachet de 2 kilogrammes. 1 pomme pour 1 repas","Menus journaliers",1,"LSLM08","Maïs","Lundi et mardi soirs","1 boîte pour 2 repas","Menus journaliers",0.5,null,null,null,null,null,0,"VS22","Saucisson","Lundi à dimanche soirs","1 morceau de 400 grammes (Leclerc) pour 3 repas","Menus journaliers",0.33000001311302185,null,null,"Menus journaliers septembre"]
["MJ254","2019-09-11","PC09","Septembre","DS01","Pomme","lundi à vendredi soirs","1 sachet de 2 kilogrammes. 1 pomme pour 1 repas","Menus journaliers",1,"LSMJ05","Raviolis","Mercredi et jeudi soirs","1 boîte pour 2 repas","Menus journaliers",0.5,null,null,null,null,null,0,"VS07","Cœur","Lundi à dimanche soirs","1 paquet pour 2 repas","Menus journaliers",1,null,null,"Menus journaliers septembre"]
["MJ255","2019-09-12","PC09","Septembre","DS01","Pomme","lundi à vendredi soirs","1 sachet de 2 kilogrammes. 1 pomme pour 1 repas","Menus journaliers",1,"LSMJ05","Raviolis","Mercredi et jeudi soirs","1 boîte pour 2 repas","Menus journaliers",0.5,null,null,null,null,null,0,"VS22","Saucisson","Lundi à dimanche soirs","1 morceau de 400 grammes (Leclerc) pour 3 repas","Menus journaliers",0.34000000357627869,null,null,"Menus journaliers septembre"]
["MJ256","2019-09-13","PC09","Septembre","DS01","Pomme","lundi à vendredi soirs","1 sachet de 2 kilogrammes. 1 pomme pour 1 repas","Menus journaliers",1,"LSV07","Concombre","Vendredi soir","Unité : 1 pour 1 repas","Menus journaliers",1,null,null,null,null,null,0,"VS07","Cœur","Lundi à dimanche soirs","1 paquet pour 2 repas","Menus journaliers",1,null,null,"Menus journaliers septembre"]
["MJ257","2019-09-14","PC09","Septembre","DWE10","Fruits au sirop","Samedi et dimanche midis et soirs","1 boîte pour 2 repas","Menus journaliers",1,"LWES01","Pâtes à la sauce tomates","Samedi midi et soir","5 cuillères pour 1 repas","Menus journaliers",10,null,null,null,null,null,0,"VS22","Saucisson","Lundi à dimanche soirs","1 morceau de 400 grammes (Leclerc) pour 3 repas","Menus journaliers",0.33000001311302185,null,null,"Menus journaliers septembre"]
["MJ258","2019-09-15","PC09","Septembre","DWE10","Fruits au sirop","Samedi et dimanche midis et soirs","1 boîte pour 2 repas","Menus journaliers",1,"LWED04","Haricots verts","Dimanche midi et soir","1 boîte pour 2 repas","Menus journaliers",1,null,null,null,null,null,0,"VS08","Croque-monsieur","Lundi à dimanche soirs","1 paquet pour 2 repas","Menus journaliers",1,null,null,"Menus journaliers septembre"]
["MJ259","2019-09-16","PC09","Septembre","DS01","Pomme","lundi à vendredi soirs","1 sachet de 2 kilogrammes. 1 pomme pour 1 repas","Menus journaliers",1,"LSLM09","Paella","Lundi et mardi soirs","1 boîte pour 2 repas","Menus journaliers",0.5,null,null,null,null,null,0,"VS28","Viande paella","Lundi et mardi soirs","1 boîte pour 2 repas","Menus journaliers",0.5,null,null,"Menus journaliers septembre"]
["MJ260","2019-09-17","PC09","Septembre","DS01","Pomme","lundi à vendredi soirs","1 sachet de 2 kilogrammes. 1 pomme pour 1 repas","Menus journaliers",1,"LSLM09","Paella","Lundi et mardi soirs","1 boîte pour 2 repas","Menus journaliers",0.5,null,null,null,null,null,0,"VS28","Viande paella","Lundi et mardi soirs","1 boîte pour 2 repas","Menus journaliers",0.5,null,null,"Menus journaliers septembre"]
["MJ261","2019-09-18","PC09","Septembre","DS01","Pomme","lundi à vendredi soirs","1 sachet de 2 kilogrammes. 1 pomme pour 1 repas","Menus journaliers",1,"LSMJ06","Tomates pelées","Mercredi et jeudi soirs","1 boîte pour 2 repas","Menus journaliers",0.5,null,null,null,null,null,0,"VS22","Saucisson","Lundi à dimanche soirs","1 morceau de 400 grammes (Leclerc) pour 3 repas","Menus journaliers",0.33000001311302185,null,null,"Menus journaliers septembre"]
["MJ262","2019-09-19","PC09","Septembre","DS01","Pomme","lundi à vendredi soirs","1 sachet de 2 kilogrammes. 1 pomme pour 1 repas","Menus journaliers",1,"LSMJ06","Tomates pelées","Mercredi et jeudi soirs","1 boîte pour 2 repas","Menus journaliers",0.5,null,null,null,null,null,0,"VS08","Croque-monsieur","Lundi à dimanche soirs","1 paquet pour 2 repas","Menus journaliers",1,null,null,"Menus journaliers septembre"]
["MJ263","2019-09-20","PC09","Septembre","DS01","Pomme","lundi à vendredi soirs","1 sachet de 2 kilogrammes. 1 pomme pour 1 repas","Menus journaliers",1,"LSV08","Radis","Vendredi soir","1 botte ou 1 sachet pour 1 repas","Menus journaliers",1,null,null,null,null,null,0,"VS22","Saucisson","Lundi à dimanche soirs","1 morceau de 400 grammes (Leclerc) pour 3 repas","Menus journaliers",0.34000000357627869,null,null,"Menus journaliers septembre"]
["MJ264","2019-09-21","PC09","Septembre","DWE11","Fruits de saison","Samedi et dimanche midis et soirs","Unité : 2 à 4 pour 1 repas","Menus journaliers",8,"LWES02","Pâtes au beurre","Samedi midi et soir","5 cuillères pour 1 repas","Menus journaliers",10,null,null,null,null,null,0,"VS09","Foie","Lundi à dimanche soirs","1 paquet pour 2 repas","Menus journaliers",1,null,null,"Menus journaliers septembre"]
["MJ265","2019-09-22","PC09","Septembre","DWE11","Fruits de saison","Samedi et dimanche midis et soirs","Unité : 2 à 4 pour 1 repas","Menus journaliers",8,"LWED02","Chips","Dimanche midi et soir","1 sachet pour 2 repas","Menus journaliers",1,null,null,null,null,null,0,"VS22","Saucisson","Lundi à dimanche soirs","1 morceau de 400 grammes (Leclerc) pour 3 repas","Menus journaliers",0.33000001311302185,null,null,"Menus journaliers septembre"]
["MJ266","2019-09-23","PC09","Septembre","DS01","Pomme","lundi à vendredi soirs","1 sachet de 2 kilogrammes. 1 pomme pour 1 repas","Menus journaliers",1,"LSLM10","Poireau","Lundi et mardi soirs","Unité : 1 pour 1 repas","Menus journaliers",1,null,null,null,null,null,0,"VS09","Foie","Lundi à dimanche soirs","1 paquet pour 2 repas","Menus journaliers",1,null,null,"Menus journaliers septembre"]
["MJ267","2019-09-24","PC09","Septembre","DS01","Pomme","lundi à vendredi soirs","1 sachet de 2 kilogrammes. 1 pomme pour 1 repas","Menus journaliers",1,"LSLM10","Poireau","Lundi et mardi soirs","Unité : 1 pour 1 repas","Menus journaliers",1,null,null,null,null,null,0,"VS22","Saucisson","Lundi à dimanche soirs","1 morceau de 400 grammes (Leclerc) pour 3 repas","Menus journaliers",0.33000001311302185,null,null,"Menus journaliers septembre"]
["MJ268","2019-09-25","PC09","Septembre","DS01","Pomme","lundi à vendredi soirs","1 sachet de 2 kilogrammes. 1 pomme pour 1 repas","Menus journaliers",1,"LSMJ01","Macédoine de légumes","Mercredi et jeudi soirs","1 boîte pour 2 repas","Menus journaliers",0.5,null,null,null,null,null,0,"VS10","Fromage de tête","Lundi à dimanche soirs","1 tranche pour 2 repas","Menus journaliers",3,null,null,"Menus journaliers septembre"]
["MJ269","2019-09-26","PC09","Septembre","DS01","Pomme","lundi à vendredi soirs","1 sachet de 2 kilogrammes. 1 pomme pour 1 repas","Menus journaliers",1,"LSMJ01","Macédoine de légumes","Mercredi et jeudi soirs","1 boîte pour 2 repas","Menus journaliers",0.5,null,null,null,null,null,0,"VS22","Saucisson","Lundi à dimanche soirs","1 morceau de 400 grammes (Leclerc) pour 3 repas","Menus journaliers",0.34000000357627869,null,null,"Menus journaliers septembre"]
["MJ270","2019-09-27","PC09","Septembre","DS01","Pomme","lundi à vendredi soirs","1 sachet de 2 kilogrammes. 1 pomme pour 1 repas","Menus journaliers",1,"LSV09","Salade","Vendredi soir","Unité : 1 tête pour 1 repas","Menus journaliers",1,null,null,null,null,null,0,"VS10","Fromage de tête","Lundi à dimanche soirs","1 tranche pour 2 repas","Menus journaliers",3,null,null,"Menus journaliers septembre"]
["MJ271","2019-09-28","PC09","Septembre","DWE12","Gâteau de riz","Samedi et dimanche midis et soirs","1 pack de 4 pots pour le week-end. 1 pot pour 1 repas","Menus journaliers",2,"LWES03","Pâtes au fromage râpé","Samedi midi et soir","5 cuillères pour 1 repas","Menus journaliers",10,null,null,null,null,null,0,"VS22","Saucisson","Lundi à dimanche soirs","1 morceau de 400 grammes (Leclerc) pour 3 repas","Menus journaliers",0.33000001311302185,null,null,"Menus journaliers septembre"]
["MJ272","2019-09-29","PC09","Septembre","DWE12","Gâteau de riz","Samedi et dimanche midis et soirs","1 pack de 4 pots pour le week-end. 1 pot pour 1 repas","Menus journaliers",2,"LWED03","Frites","Dimanche midi","20 frites pour 1 repas","Menus journaliers",20,"LWED01","Asperges","Dimanche soir","1 bocal ou 1 boîte pour 1 repas","Menus journaliers",1,"VS11","Jambon","Lundi à dimanche soirs","1 paquet pour 2 repas","Menus journaliers",0.5,null,null,"Menus journaliers septembre"]
["MJ273","2019-09-30","PC09","Septembre","DS01","Pomme","lundi à vendredi soirs","1 sachet de 2 kilogrammes. 1 pomme pour 1 repas","Menus journaliers",1,"LSLM11","Pomme de terre","Lundi et mardi soirs","Unité : 1 pour 1 repas","Menus journaliers",1,null,null,null,null,null,0,"VS22","Saucisson","Lundi à dimanche soirs","1 morceau de 400 grammes (Leclerc) pour 3 repas","Menus journaliers",0.33000001311302185,null,null,"Menus journaliers septembre"]
["MVWE70","2019-09-01","PC09","Septembre",null,null,null,null,null,0,null,null,null,null,null,0,null,null,null,null,null,0,"VWE02","Bœuf","Samedi et dimanche midis","1 tranche pour 1 repas","Menus viandes week-end",1,null,null,"Menus viandes weekend deuxième semestre"]
["MVWE71","2019-09-07","PC09","Septembre",null,null,null,null,null,0,null,null,null,null,null,0,null,null,null,null,null,0,"VWE03","Cheval","Samedi et dimanche midis","1 tranche pour 1 repas","Menus viandes week-end",1,null,null,"Menus viandes weekend deuxième semestre"]
["MVWE72","2019-09-08","PC09","Septembre",null,null,null,null,null,0,null,null,null,null,null,0,null,null,null,null,null,0,"VWE04","Dinde","Samedi et dimanche midis","1 tranche pour 1 repas","Menus viandes week-end",1,null,null,"Menus viandes weekend deuxième semestre"]
["MVWE73","2019-09-14","PC09","Septembre",null,null,null,null,null,0,null,null,null,null,null,0,null,null,null,null,null,0,"VWE05","Poisson","Samedi et dimanche midis","Unité : 1 pour 1 repas","Menus viandes week-end",1,null,null,"Menus viandes weekend deuxième semestre"]
["MVWE74","2019-09-15","PC09","Septembre",null,null,null,null,null,0,null,null,null,null,null,0,null,null,null,null,null,0,"VWE06","Porc","Samedi et dimanche midis","1 tranche pour 1 repas","Menus viandes week-end",1,null,null,"Menus viandes weekend deuxième semestre"]
["MVWE75","2019-09-21","PC09","Septembre",null,null,null,null,null,0,null,null,null,null,null,0,null,null,null,null,null,0,"VWE07","Veau","Samedi et dimanche midis","1 tranche pour 1 repas","Menus viandes week-end",1,null,null,"Menus viandes weekend deuxième semestre"]
["MVWE76","2019-09-22","PC09","Septembre",null,null,null,null,null,0,null,null,null,null,null,0,null,null,null,null,null,0,"VWE01","Agneau","Samedi et dimanche midis","1 tranche pour 1 repas","Menus viandes week-end",1,null,null,"Menus viandes weekend deuxième semestre"]
["MVWE77","2019-09-28","PC09","Septembre",null,null,null,null,null,0,null,null,null,null,null,0,null,null,null,null,null,0,"VWE02","Bœuf","Samedi et dimanche midis","1 tranche pour 1 repas","Menus viandes week-end",1,null,null,"Menus viandes weekend deuxième semestre"]
["MVWE78","2019-09-29","PC09","Septembre",null,null,null,null,null,0,null,null,null,null,null,0,null,null,null,null,null,0,"VWE03","Cheval","Samedi et dimanche midis","1 tranche pour 1 repas","Menus viandes week-end",1,null,null,"Menus viandes weekend deuxième semestre"]

{"sheet":"Octobre","index":17,"n_rows":65,"n_cols":31,"rows_kept":65,"cut":false,"hidden":false,"merged":[[0,0,0,30]]}
["Menus du mois d'octobre  201.."]
[]
["Numéro du menu","Date du menu","Code période concernée","Période concernée","Code dessert","Dessert","Jour dessert","Conditionnement dessert","Destination dessert","Quantité dessert","Code légume","Légume","Jour légume","Conditionnement légume","Destination légume","Quantité légume","Code légume deux","Légume deux","Jour légume deux","Conditionnement légume deux","Destination légume deux","Quantité légume deux","Code viande","Viande","Jour viande","Conditionnement viande","Destination viande","Quantité viande","Code observation","Observation","Titre"]
["MMR196","2019-10-01","PC10","Octobre","DMR01","Pomme","Lundi à vendredi midis","1 sachet de 2 kilogrammes. 1 pomme pour 1 repas","Menus midi retraite",1,"LMR04","Céleri","Lundi à vendredi midis","Unité : 1 branche pour 1 repas","Menus midi retraite",1,null,null,null,null,null,0,"VMR02","Rôti de bœuf","Lundi à vendredi midis","1 morceau de 500 grammes pour 5 repas","Menus midi retraite",100,null,null,"Menus midi retraite octobre"]
["MMR197","2019-10-02","PC10","Octobre","DMR01","Pomme","Lundi à vendredi midis","1 sachet de 2 kilogrammes. 1 pomme pour 1 repas","Menus midi retraite",1,"LMR05","Champignons","Lundi à vendredi midis","1 boîte pour 1 repas","Menus midi retraite",1,null,null,null,null,null,0,"VMR02","Rôti de bœuf","Lundi à vendredi midis","1 morceau de 500 grammes pour 5 repas","Menus midi retraite",100,null,null,"Menus midi retraite octobre"]
["MMR198","2019-10-03","PC10","Octobre","DMR01","Pomme","Lundi à vendredi midis","1 sachet de 2 kilogrammes. 1 pomme pour 1 repas","Menus midi retraite",1,"LMR06","Concombre","Lundi à vendredi midis","Unité : 1 pour 1 repas","Menus midi retraite",1,null,null,null,null,null,0,"VMR02","Rôti de bœuf","Lundi à vendredi midis","1 morceau de 500 grammes pour 5 repas","Menus midi retraite",100,null,null,"Menus midi retraite octobre"]
["MMR199","2019-10-04","PC10","Octobre","DMR01","Pomme","Lundi à vendredi midis","1 sachet de 2 kilogrammes. 1 pomme pour 1 repas","Menus midi retraite",1,"LMR07","Couscous","Lundi à vendredi midis","25 grammes pour 1 repas","Menus midi retraite",1,null,null,null,null,null,0,"VMR02","Rôti de bœuf","Lundi à vendredi midis","1 morceau de 500 grammes pour 5 repas","Menus midi retraite",100,null,null,"Menus midi retraite octobre"]
["MMR200","2019-10-07","PC10","Octobre","DMR01","Pomme","Lundi à vendredi midis","1 sachet de 2 kilogrammes. 1 pomme pour 1 repas","Menus midi retraite",1,"LMR08","Maïs","Lundi à vendredi midis","1 boîte pour 2 repas","Menus midi retraite",0.5,null,null,null,null,null,0,"VMR03","Rôti de cheval","Lundi à vendredi midis","1 morceau de 500 grammes pour 5 repas","Menus midi retraite",100,null,null,"Menus midi retraite octobre"]
["MMR201","2019-10-08","PC10","Octobre","DMR01","Pomme","Lundi à vendredi midis","1 sachet de 2 kilogrammes. 1 pomme pour 1 repas","Menus midi retraite",1,"LMR08","Maïs","Lundi à vendredi midis","1 boîte pour 2 repas","Menus midi retraite",0.5,null,null,null,null,null,0,"VMR03","Rôti de cheval","Lundi à vendredi midis","1 morceau de 500 grammes pour 5 repas","Menus midi retraite",100,null,null,"Menus midi retraite octobre"]
["MMR202","2019-10-09","PC10","Octobre","DMR01","Pomme","Lundi à vendredi midis","1 sachet de 2 kilogrammes. 1 pomme pour 1 repas","Menus midi retraite",1,"LMR09","Pâtes à la sauce tomates","Lundi à vendredi midis","5 cuillères pour 1 repas","Menus midi retraite",5,null,null,null,null,null,0,"VMR03","Rôti de cheval","Lundi à vendredi midis","1 morceau de 500 grammes pour 5 repas","Menus midi retraite",100,null,null,"Menus midi retraite octobre"]
["MMR203","2019-10-10","PC10","Octobre","DMR01","Pomme","Lundi à vendredi midis","1 sachet de 2 kilogrammes. 1 pomme pour 1 repas","Menus midi retraite",1,"LMR10","Pâtes au beurre","Lundi à vendredi midis","5 cuillères pour 1 repas","Menus midi retraite",5,null,null,null,null,null,0,"VMR03","Rôti de cheval","Lundi à vendredi midis","1 morceau de 500 grammes pour 5 repas","Menus midi retraite",100,null,null,"Menus midi retraite octobre"]
["MMR204","2019-10-11","PC10","Octobre","DMR01","Pomme","Lundi à vendredi midis","1 sachet de 2 kilogrammes. 1 pomme pour 1 repas","Menus midi retraite",1,"LMR11","Poireau","Lundi à vendredi midis","Unité : 1 pour 1 repas","Menus midi retraite",1,null,null,null,null,null,0,"VMR03","Rôti de cheval","Lundi à vendredi midis","1 morceau de 500 grammes pour 5 repas","Menus midi retraite",100,null,null,"Menus midi retraite octobre"]
["MMR205","2019-10-14","PC10","Octobre","DMR01","Pomme","Lundi à vendredi midis","1 sachet de 2 kilogrammes. 1 pomme pour 1 repas","Menus midi retraite",1,"LMR12","Pomme de terre","Lundi à vendredi midis","Unité : 1 pour 1 repas","Menus midi retraite",1,null,null,null,null,null,0,"VMR04","Rôti de porc","Lundi à vendredi midis","1 morceau de 500 grammes pour 5 repas","Menus midi retraite",100,null,null,"Menus midi retraite octobre"]
["MMR206","2019-10-15","PC10","Octobre","DMR01","Pomme","Lundi à vendredi midis","1 sachet de 2 kilogrammes. 1 pomme pour 1 repas","Menus midi retraite",1,"LMR13","Purée","Lundi à vendredi midis","25 grammes pour 1 repas","Menus midi retraite",25,null,null,null,null,null,0,"VMR04","Rôti de porc","Lundi à vendredi midis","1 morceau de 500 grammes pour 5 repas","Menus midi retraite",100,null,null,"Menus midi retraite octobre"]
["MMR207","2019-10-16","PC10","Octobre","DMR01","Pomme","Lundi à vendredi midis","1 sachet de 2 kilogrammes. 1 pomme pour 1 repas","Menus midi retraite",1,"LMR14","Radis","Lundi à vendredi midis","1 botte ou 1 sachet pour 2 repas","Menus midi retraite",0.5,null,null,null,null,null,0,"VMR04","Rôti de porc","Lundi à vendredi midis","1 morceau de 500 grammes pour 5 repas","Menus midi retraite",100,null,null,"Menus midi retraite octobre"]
["MMR208","2019-10-17","PC10","Octobre","DMR01","Pomme","Lundi à vendredi midis","1 sachet de 2 kilogrammes. 1 pomme pour 1 repas","Menus midi retraite",1,"LMR14","Radis","Lundi à vendredi midis","1 botte ou 1 sachet pour 2 repas","Menus midi retraite",0.5,null,null,null,null,null,0,"VMR04","Rôti de porc","Lundi à vendredi midis","1 morceau de 500 grammes pour 5 repas","Menus midi retraite",100,null,null,"Menus midi retraite octobre"]
["MMR209","2019-10-18","PC10","Octobre","DMR01","Pomme","Lundi à vendredi midis","1 sachet de 2 kilogrammes. 1 pomme pour 1 repas","Menus midi retraite",1,"LMR15","Riz","Lundi à vendredi midis","25 grammes pour 1 repas","Menus midi retraite",0.5,null,null,null,null,null,0,"VMR04","Rôti de porc","Lundi à vendredi midis","1 morceau de 500 grammes pour 5 repas","Menus midi retraite",100,null,null,"Menus midi retraite octobre"]
["MMR210","2019-10-21","PC10","Octobre","DMR01","Pomme","Lundi à vendredi midis","1 sachet de 2 kilogrammes. 1 pomme pour 1 repas","Menus midi retraite",1,"LMR16","Salade","Lundi à vendredi midis","Unité : 1 tête pour 1 repas","Menus midi retraite",1,null,null,null,null,null,0,"VMR05","Rôti de veau","Lundi à vendredi midis","1 morceau de 500 grammes pour 5 repas","Menus midi retraite",100,null,null,"Menus midi retraite octobre"]
["MMR211","2019-10-22","PC10","Octobre","DMR01","Pomme","Lundi à vendredi midis","1 sachet de 2 kilogrammes. 1 pomme pour 1 repas","Menus midi retraite",1,"LMR17","Tomates","Lundi à vendredi midis","Unité : 2 pour 1 repas","Menus midi retraite",2,null,null,null,null,null,0,"VMR05","Rôti de veau","Lundi à vendredi midis","1 morceau de 500 grammes pour 5 repas","Menus midi retraite",100,null,null,"Menus midi retraite octobre"]
["MMR212","2019-10-23","PC10","Octobre","DMR01","Pomme","Lundi à vendredi midis","1 sachet de 2 kilogrammes. 1 pomme pour 1 repas","Menus midi retraite",1,"LMR01","Asperges","Lundi à vendredi midis","1 boîte pour 1 repas","Menus midi retraite",2,null,null,null,null,null,0,"VMR05","Rôti de veau","Lundi à vendredi midis","1 morceau de 500 grammes pour 5 repas","Menus midi retraite",100,null,null,"Menus midi retraite octobre"]
["MMR213","2019-10-24","PC10","Octobre","DMR01","Pomme","Lundi à vendredi midis","1 sachet de 2 kilogrammes. 1 pomme pour 1 repas","Menus midi retraite",1,"LMR02","Avocat","Lundi à vendredi midis","Unité : 1 pour 1 repas","Menus midi retraite",1,null,null,null,null,null,0,"VMR05","Rôti de veau","Lundi à vendredi midis","1 morceau de 500 grammes pour 5 repas","Menus midi retraite",100,null,null,"Menus midi retraite octobre"]
["MMR214","2019-10-25","PC10","Octobre","DMR01","Pomme","Lundi à vendredi midis","1 sachet de 2 kilogrammes. 1 pomme pour 1 repas","Menus midi retraite",1,"LMR03","Carottes","Lundi à vendredi midis","Unité : 2 pour 1 repas","Menus midi retraite",1,null,null,null,null,null,0,"VMR05","Rôti de veau","Lundi à vendredi midis","1 morceau de 500 grammes pour 5 repas","Menus midi retraite",100,null,null,"Menus midi retraite octobre"]
["MMR215","2019-10-28","PC10","Octobre","DMR01","Pomme","Lundi à vendredi midis","1 sachet de 2 kilogrammes. 1 pomme pour 1 repas","Menus midi retraite",1,"LMR04","Céleri","Lundi à vendredi midis","Unité : 1 branche pour 1 repas","Menus midi retraite",1,null,null,null,null,null,0,"VMR01","Rôti d'agneau","Lundi à vendredi midis","1 morceau de 500 grammes pour 5 repas","Menus midi retraite",100,null,null,"Menus midi retraite octobre"]
["MMR216","2019-10-29","PC10","Octobre","DMR01","Pomme","Lundi à vendredi midis","1 sachet de 2 kilogrammes. 1 pomme pour 1 repas","Menus midi retraite",1,"LMR05","Champignons","Lundi à vendredi midis","1 boîte pour 1 repas","Menus midi retraite",1,null,null,null,null,null,0,"VMR01","Rôti d'agneau","Lundi à vendredi midis","1 morceau de 500 grammes pour 5 repas","Menus midi retraite",100,null,null,"Menus midi retraite octobre"]
["MMR217","2019-10-30","PC10","Octobre","DMR01","Pomme","Lundi à vendredi midis","1 sachet de 2 kilogrammes. 1 pomme pour 1 repas","Menus midi retraite",1,"LMR06","Concombre","Lundi à vendredi midis","Unité : 1 pour 1 repas","Menus midi retraite",1,null,null,null,null,null,0,"VMR01","Rôti d'agneau","Lundi à vendredi midis","1 morceau de 500 grammes pour 5 repas","Menus midi retraite",100,null,null,"Menus midi retraite octobre"]
["MMR218","2019-10-31","PC10","Octobre","DMR01","Pomme","Lundi à vendredi midis","1 sachet de 2 kilogrammes. 1 pomme pour 1 repas","Menus midi retraite",1,"LMR07","Couscous","Lundi à vendredi midis","25 grammes pour 1 repas","Menus midi retraite",25,null,null,null,null,null,0,"VMR01","Rôti d'agneau","Lundi à vendredi midis","1 morceau de 500 grammes pour 5 repas","Menus midi retraite",100,null,null,"Menus midi retraite octobre"]
["MJ274","2019-10-01","PC10","Octobre","DS01","Pomme","lundi à vendredi soirs","1 sachet de 2 kilogrammes. 1 pomme pour 1 repas","Menus journaliers",1,"LSLM11","Pomme de terre","Lundi et mardi soirs","Unité : 1 pour 1 repas","Menus journaliers",1,null,null,null,null,null,0,"VS11","Jambon","Lundi à dimanche soirs","1 paquet pour 2 repas","Menus journaliers",0.5,null,null,"Menus journaliers octobre"]
["MJ275","2019-10-02","PC10","Octobre","DS01","Pomme","lundi à vendredi soirs","1 sachet de 2 kilogrammes. 1 pomme pour 1 repas","Menus journaliers",1,"LSMJ02","Petits pois","Mercredi et jeudi soirs","1 boîte pour 2 repas","Menus journaliers",0.5,null,null,null,null,null,0,"VS22","Saucisson","Lundi à dimanche soirs","1 morceau de 400 grammes (Leclerc) pour 3 repas","Menus journaliers",0.34000000357627869,null,null,"Menus journaliers octobre"]
["MJ276","2019-10-03","PC10","Octobre","DS01","Pomme","lundi à vendredi soirs","1 sachet de 2 kilogrammes. 1 pomme pour 1 repas","Menus journaliers",1,"LSMJ02","Petits pois","Mercredi et jeudi soirs","1 boîte pour 2 repas","Menus journaliers",0.5,null,null,null,null,null,0,"VS12","Jambonneau","Lundi à dimanche soirs","1 paquet pour 2 repas","Menus journaliers",0.5,null,null,"Menus journaliers octobre"]
["MJ277","2019-10-04","PC10","Octobre","DS01","Pomme","lundi à vendredi soirs","1 sachet de 2 kilogrammes. 1 pomme pour 1 repas","Menus journaliers",1,"LSV10","Salsifis","Vendredi soir","1 boîte pour 1 repas","Menus journaliers",1,null,null,null,null,null,0,"VS22","Saucisson","Lundi à dimanche soirs","1 morceau de 400 grammes (Leclerc) pour 3 repas","Menus journaliers",0.33000001311302185,null,null,"Menus journaliers octobre"]
["MJ278","2019-10-05","PC10","Octobre","DWE13","Gâteau de semoule","Samedi et dimanche midis et soirs","1 boîte pour 2 repas","Menus journaliers",2,"LWES01","Pâtes à la sauce tomates","Samedi midi et soir","5 cuillères pour 1 repas","Menus journaliers",10,null,null,null,null,null,0,"VS12","Jambonneau","Lundi à dimanche soirs","1 paquet pour 2 repas","Menus journaliers",0.5,null,null,"Menus journaliers octobre"]
["MJ279","2019-10-06","PC10","Octobre","DWE13","Gâteau de semoule","Samedi et dimanche midis et soirs","1 boîte pour 2 repas","Menus journaliers",2,"LWED04","Haricots verts","Dimanche midi et soir","1 boîte pour 2 repas","Menus journaliers",1,null,null,null,null,null,0,"VS22","Saucisson","Lundi à dimanche soirs","1 morceau de 400 grammes (Leclerc) pour 3 repas","Menus journaliers",0.33000001311302185,null,null,"Menus journaliers octobre"]
["MJ280","2019-10-07","PC10","Octobre","DS01","Pomme","lundi à vendredi soirs","1 sachet de 2 kilogrammes. 1 pomme pour 1 repas","Menus journaliers",1,"LSLM12","Purée","Lundi et mardi soirs","25 grammes pour 1 repas","Menus journaliers",25,null,null,null,null,null,0,"VS13","Mortadelle","Lundi à dimanche soirs","1 paquet pour 2 repas","Menus journaliers",0.5,null,null,"Menus journaliers octobre"]
["MJ281","2019-10-08","PC10","Octobre","DS01","Pomme","lundi à vendredi soirs","1 sachet de 2 kilogrammes. 1 pomme pour 1 repas","Menus journaliers",1,"LSLM12","Purée","Lundi et mardi soirs","25 grammes pour 1 repas","Menus journaliers",25,null,null,null,null,null,0,"VS22","Saucisson","Lundi à dimanche soirs","1 morceau de 400 grammes (Leclerc) pour 3 repas","Menus journaliers",0.34000000357627869,null,null,"Menus journaliers octobre"]
["MJ282","2019-10-09","PC10","Octobre","DS01","Pomme","lundi à vendredi soirs","1 sachet de 2 kilogrammes. 1 pomme pour 1 repas","Menus journaliers",1,"LSMJ03","Petits pois et jeunes carottes","Mercredi et jeudi soirs","1 boîte pour 2 repas","Menus journaliers",0.5,null,null,null,null,null,0,"VS13","Mortadelle","Lundi à dimanche soirs","1 paquet pour 2 repas","Menus journaliers",0.5,null,null,"Menus journaliers octobre"]
["MJ283","2019-10-10","PC10","Octobre","DS01","Pomme","lundi à vendredi soirs","1 sachet de 2 kilogrammes. 1 pomme pour 1 repas","Menus journaliers",1,"LSMJ03","Petits pois et jeunes carottes","Mercredi et jeudi soirs","1 boîte pour 2 repas","Menus journaliers",0.5,null,null,null,null,null,0,"VS22","Saucisson","Lundi à dimanche soirs","1 morceau de 400 grammes (Leclerc) pour 3 repas","Menus journaliers",0.33000001311302185,null,null,"Menus journaliers octobre"]
["MJ284","2019-10-11","PC10","Octobre","DS01","Pomme","lundi à vendredi soirs","1 sachet de 2 kilogrammes. 1 pomme pour 1 repas","Menus journaliers",1,"LSV11","Tomates ","Vendredi soir","Unité : 2 pour 1 repas","Menus journaliers",2,null,null,null,null,null,0,"VS14","Œufs","Lundi à dimanche soirs","1 boîte de six œufs. 3 œufs pour 1 repas","Menus journaliers",3,null,null,"Menus journaliers octobre"]
["MJ285","2019-10-12","PC10","Octobre","DWE14","Gâteaux samedi et dimanche","Samedi et dimanche midis et soirs","1 boîte pour 2 repas","Menus journaliers",2,"LWES02","Pâtes au beurre","Samedi midi et soir","5 cuillères pour 1 repas","Menus journaliers",10,null,null,null,null,null,0,"VS22","Saucisson","Lundi à dimanche soirs","1 morceau de 400 grammes (Leclerc) pour 3 repas","Menus journaliers",0.33000001311302185,null,null,"Menus journaliers octobre"]
["MJ286","2019-10-13","PC10","Octobre","DWE14","Gâteaux samedi et dimanche","Samedi et dimanche midis et soirs","1 boîte pour 2 repas","Menus journaliers",2,"LWED02","Chips","Dimanche midi et soir","1 sachet pour 2 repas","Menus journaliers",1,null,null,null,null,null,0,"VS14","Œufs","Lundi à dimanche soirs","1 boîte de six œufs. 3 œufs pour 1 repas","Menus journaliers",3,null,null,"Menus journaliers octobre"]
["MJ287","2019-10-14","PC10","Octobre","DS01","Pomme","lundi à vendredi soirs","1 sachet de 2 kilogrammes. 1 pomme pour 1 repas","Menus journaliers",1,"LSLM13","Quenelles","Lundi et mardi soirs","1 boîte pour 2 repas","Menus journaliers",0.5,null,null,null,null,null,0,"VS22","Saucisson","Lundi à dimanche soirs","1 morceau de 400 grammes (Leclerc) pour 3 repas","Menus journaliers",0.34000000357627869,null,null,"Menus journaliers octobre"]
["MJ288","2019-10-15","PC10","Octobre","DS01","Pomme","lundi à vendredi soirs","1 sachet de 2 kilogrammes. 1 pomme pour 1 repas","Menus journaliers",1,"LSLM13","Quenelles","Lundi et mardi soirs","1 boîte pour 2 repas","Menus journaliers",0.5,null,null,null,null,null,0,"VS15","Pizza","Lundi à dimanche soirs","1 paquet pour 2 repas","Menus journaliers",0.5,null,null,"Menus journaliers octobre"]
["MJ289","2019-10-16","PC10","Octobre","DS01","Pomme","lundi à vendredi soirs","1 sachet de 2 kilogrammes. 1 pomme pour 1 repas","Menus journaliers",1,"LSMJ04","Ratatouille","Mercredi et jeudi soirs","1 boîte pour 2 repas","Menus journaliers",0.5,null,null,null,null,null,0,"VS22","Saucisson","Lundi à dimanche soirs","1 morceau de 400 grammes (Leclerc) pour 3 repas","Menus journaliers",0.33000001311302185,null,null,"Menus journaliers octobre"]
["MJ290","2019-10-17","PC10","Octobre","DS01","Pomme","lundi à vendredi soirs","1 sachet de 2 kilogrammes. 1 pomme pour 1 repas","Menus journaliers",1,"LSMJ04","Ratatouille","Mercredi et jeudi soirs","1 boîte pour 2 repas","Menus journaliers",0.5,null,null,null,null,null,0,"VS15","Pizza","Lundi à dimanche soirs","1 paquet pour 2 repas","Menus journaliers",0.5,null,null,"Menus journaliers octobre"]
["MJ291","2019-10-18","PC10","Octobre","DS01","Pomme","lundi à vendredi soirs","1 sachet de 2 kilogrammes. 1 pomme pour 1 repas","Menus journaliers",1,"LSV01","Asperges","Vendredi soir","1 bocal ou 1 boîte pour 1 repas","Menus journaliers",1,null,null,null,null,null,0,"VS22","Saucisson","Lundi à dimanche soirs","1 morceau de 400 grammes (Leclerc) pour 3 repas","Menus journaliers",0.33000001311302185,null,null,"Menus journaliers octobre"]
["MJ292","2019-10-19","PC10","Octobre","DWE15","Mousse au chocolat","Samedi et dimanche midis et soirs","1 pack de 4 pots pour le week-end. 1 pot pour 1 repas","Menus journaliers",2,"LWES03","Pâtes au fromage râpé","Samedi midi et soir","5 cuillères pour 1 repas","Menus journaliers",10,null,null,null,null,null,0,"VS16","Poisson","Lundi à dimanche soirs","Unité : 1 pour 1 repas","Menus journaliers",1,null,null,"Menus journaliers octobre"]
["MJ293","2019-10-20","PC10","Octobre","DWE15","Mousse au chocolat","Samedi et dimanche midis et soirs","1 pack de 4 pots pour le week-end. 1 pot pour 1 repas","Menus journaliers",2,"LWED03","Frites","Dimanche midi","20 frites pour 1 repas","Menus journaliers",20,"LWED01","Asperges","Dimanche soir","1 bocal ou 1 boîte pour 1 repas","Menus journaliers",1,"VS22","Saucisson","Lundi à dimanche soirs","1 morceau de 400 grammes (Leclerc) pour 3 repas","Menus journaliers",0.34000000357627869,null,null,"Menus journaliers octobre"]
["MJ294","2019-10-21","PC10","Octobre","DS01","Pomme","lundi à vendredi soirs","1 sachet de 2 kilogrammes. 1 pomme pour 1 repas","Menus journaliers",1,"LSLM14","Riz","Lundi et mardi soirs","25 grammes pour 1 repas","Menus journaliers",25,null,null,null,null,null,0,"VS17","Quiche lorraine","Lundi à dimanche soirs","1 boîte pour 2 repas","Menus journaliers",1,null,null,"Menus journaliers octobre"]
["MJ295","2019-10-22","PC10","Octobre","DS01","Pomme","lundi à vendredi soirs","1 sachet de 2 kilogrammes. 1 pomme pour 1 repas","Menus journaliers",1,"LSLM14","Riz","Lundi et mardi soirs","25 grammes pour 1 repas","Menus journaliers",25,null,null,null,null,null,0,"VS22","Saucisson","Lundi à dimanche soirs","1 morceau de 400 grammes (Leclerc) pour 3 repas","Menus journaliers",0.33000001311302185,null,null,"Menus journaliers octobre"]
["MJ296","2019-10-23","PC10","Octobre","DS01","Pomme","lundi à vendredi soirs","1 sachet de 2 kilogrammes. 1 pomme pour 1 repas","Menus journaliers",1,"LSMJ05","Raviolis","Mercredi et jeudi soirs","1 boîte pour 2 repas","Menus journaliers",0.5,null,null,null,null,null,0,"VS17","Quiche lorraine","Lundi à dimanche soirs","1 boîte pour 2 repas","Menus journaliers",1,null,null,"Menus journaliers octobre"]
["MJ297","2019-10-24","PC10","Octobre","DS01","Pomme","lundi à vendredi soirs","1 sachet de 2 kilogrammes. 1 pomme pour 1 repas","Menus journaliers",1,"LSMJ05","Raviolis","Mercredi et jeudi soirs","1 boîte pour 2 repas","Menus journaliers",0.5,null,null,null,null,null,0,"VS22","Saucisson","Lundi à dimanche soirs","1 morceau de 400 grammes (Leclerc) pour 3 repas","Menus journaliers",0.33000001311302185,null,null,"Menus journaliers octobre"]
["MJ298","2019-10-25","PC10","Octobre","DS01","Pomme","lundi à vendredi soirs","1 sachet de 2 kilogrammes. 1 pomme pour 1 repas","Menus journaliers",1,"LSV02","Avocat","Vendredi soir","Unité : 1 pour 1 repas","Menus journaliers",1,null,null,null,null,null,0,"VS18","Roulade à la pistache","Lundi à dimanche soirs","3 tranches pour 1 repas","Menus journaliers",3,null,null,"Menus journaliers octobre"]
["MJ299","2019-10-26","PC10","Octobre","DWE16","Oranges","Samedi et dimanche midis et soirs","Unité : 1 pour 1 repas","Menus journaliers",2,"LWES01","Pâtes à la sauce tomates","Samedi midi et soir","5 cuillères pour 1 repas","Menus journaliers",10,null,null,null,null,null,0,"VS22","Saucisson","Lundi à dimanche soirs","1 morceau de 400 grammes (Leclerc) pour 3 repas","Menus journaliers",0.34000000357627869,null,null,"Menus journaliers octobre"]
["MJ300","2019-10-27","PC10","Octobre","DWE16","Oranges","Samedi et dimanche midis et soirs","Unité : 1 pour 1 repas","Menus journaliers",2,"LWED04","Haricots verts","Dimanche midi et soir","1 boîte pour 2 repas","Menus journaliers",1,null,null,null,null,null,0,"VS18","Roulade à la pistache","Lundi à dimanche soirs","3 tranches pour 1 repas","Menus journaliers",3,null,null,"Menus journaliers octobre"]
["MJ301","2019-10-28","PC10","Octobre","DS01","Pomme","lundi à vendredi soirs","1 sachet de 2 kilogrammes. 1 pomme pour 1 repas","Menus journaliers",1,"LSLM01","Cassoulet","Lundi et mardi soirs","1 boîte pour 2 repas","Menus journaliers",0.5,null,null,null,null,null,0,"VS26","Viande cassoulet","Lundi et mardi soirs","1 boîte pour 2 repas","Menus journaliers",0.5,null,null,"Menus journaliers octobre"]
["MJ302","2019-10-29","PC10","Octobre","DS01","Pomme","lundi à vendredi soirs","1 sachet de 2 kilogrammes. 1 pomme pour 1 repas","Menus journaliers",1,"LSLM01","Cassoulet","Lundi et mardi soirs","1 boîte pour 2 repas","Menus journaliers",0.5,null,null,null,null,null,0,"VS26","Viande cassoulet","Lundi et mardi soirs","1 boîte pour 2 repas","Menus journaliers",0.5,null,null,"Menus journaliers octobre"]
["MJ303","2019-10-30","PC10","Octobre","DS01","Pomme","lundi à vendredi soirs","1 sachet de 2 kilogrammes. 1 pomme pour 1 repas","Menus journaliers",1,"LSMJ06","Tomates pelées","Mercredi et jeudi soirs","1 boîte pour 2 repas","Menus journaliers",0.5,null,null,null,null,null,0,"VS22","Saucisson","Lundi à dimanche soirs","1 morceau de 400 grammes (Leclerc) pour 3 repas","Menus journaliers",0.33000001311302185,null,null,"Menus journaliers octobre"]
["MJ304","2019-10-31","PC10","Octobre","DS01","Pomme","lundi à vendredi soirs","1 sachet de 2 kilogrammes. 1 pomme pour 1 repas","Menus journaliers",1,"LSMJ06","Tomates pelées","Mercredi et jeudi soirs","1 boîte pour 2 repas","Menus journaliers",0.5,null,null,null,null,null,0,"VS19","Roulé au fromage","Lundi à dimanche soirs","1 boîte pour 2 repas","Menus journaliers",1,null,null,"Menus journaliers octobre"]
["MVWE79","2019-10-05","PC10","Octobre",null,null,null,null,null,0,null,null,null,null,null,0,null,null,null,null,null,0,"VWE04","Dinde","Samedi et dimanche midis","1 tranche pour 1 repas","Menus viandes week-end",1,null,null,"Menus viandes weekend deuxième semestre"]
["MVWE80","2019-10-06","PC10","Octobre",null,null,null,null,null,0,null,null,null,null,null,0,null,null,null,null,null,0,"VWE05","Poisson","Samedi et dimanche midis","Unité : 1 pour 1 repas","Menus viandes week-end",1,null,null,"Menus viandes weekend deuxième semestre"]
["MVWE81","2019-10-12","PC10","Octobre",null,null,null,null,null,0,null,null,null,null,null,0,null,null,null,null,null,0,"VWE06","Porc","Samedi et dimanche midis","1 tranche pour 1 repas","Menus viandes week-end",1,null,null,"Menus viandes weekend deuxième semestre"]
["MVWE82","2019-10-13","PC10","Octobre",null,null,null,null,null,0,null,null,null,null,null,0,null,null,null,null,null,0,"VWE07","Veau","Samedi et dimanche midis","1 tranche pour 1 repas","Menus viandes week-end",1,null,null,"Menus viandes weekend deuxième semestre"]
["MVWE83","2019-10-19","PC10","Octobre",null,null,null,null,null,0,null,null,null,null,null,0,null,null,null,null,null,0,"VWE01","Agneau","Samedi et dimanche midis","1 tranche pour 1 repas","Menus viandes week-end",1,null,null,"Menus viandes weekend deuxième semestre"]
["MVWE84","2019-10-20","PC10","Octobre",null,null,null,null,null,0,null,null,null,null,null,0,null,null,null,null,null,0,"VWE02","Bœuf","Samedi et dimanche midis","1 tranche pour 1 repas","Menus viandes week-end",1,null,null,"Menus viandes weekend deuxième semestre"]
["MVWE85","2019-10-26","PC10","Octobre",null,null,null,null,null,0,null,null,null,null,null,0,null,null,null,null,null,0,"VWE03","Cheval","Samedi et dimanche midis","1 tranche pour 1 repas","Menus viandes week-end",1,null,null,"Menus viandes weekend deuxième semestre"]
["MVWE86","2019-10-27","PC10","Octobre",null,null,null,null,null,0,null,null,null,null,null,0,null,null,null,null,null,0,"VWE04","Dinde","Samedi et dimanche midis","1 tranche pour 1 repas","Menus viandes week-end",1,null,null,"Menus viandes weekend deuxième semestre"]

{"sheet":"Novembre","index":18,"n_rows":63,"n_cols":31,"rows_kept":63,"cut":false,"hidden":false,"merged":[[0,0,0,30]]}
["Menus du mois de novembre  201.."]
[null,null,null,null,null,null,null,null,null,null,null,null,null,null,null,null,null,null,null,null,null,null,null,null,null,null,0]
["Numéro du menu","Date du menu","Code période concernée","Période concernée","Code dessert","Dessert","Jour dessert","Conditionnement dessert","Destination dessert","Quantité dessert","Code légume","Légume","Jour légume","Conditionnement légume","Destination légume","Quantité légume","Code légume deux","Légume deux","Jour légume deux","Conditionnement légume deux","Destination légume deux","Quantité légume deux","Code viande","Viande","Jour viande","Conditionnement viande","Destination viande","Quantité viande","Code observation","Observation","Titre"]
["MMR219","2019-11-01","PC11","Novembre","DMR01","Pomme","Lundi à vendredi midis","1 sachet de 2 kilogrammes. 1 pomme pour 1 repas","Menus midi retraite",1,"LMR08","Maïs","Lundi à vendredi midis","1 boîte pour 2 repas","Menus midi retraite",0.5,null,null,null,null,null,0,"VMR01","Rôti d'agneau","Lundi à vendredi midis","1 morceau de 500 grammes pour 5 repas","Menus midi retraite",100,"O12","Toussaint","Menus midi retraite novembre"]
["MMR220","2019-11-04","PC11","Novembre","DMR01","Pomme","Lundi à vendredi midis","1 sachet de 2 kilogrammes. 1 pomme pour 1 repas","Menus midi retraite",1,"LMR08","Maïs","Lundi à vendredi midis","1 boîte pour 2 repas","Menus midi retraite",0.5,null,null,null,null,null,0,"VMR01","Rôti de bœuf","Lundi à vendredi midis","1 morceau de 500 grammes pour 5 repas","Menus midi retraite",100,null,null,"Menus midi retraite novembre"]
["MMR221","2019-11-05","PC11","Novembre","DMR01","Pomme","Lundi à vendredi midis","1 sachet de 2 kilogrammes. 1 pomme pour 1 repas","Menus midi retraite",1,"LMR09","Pâtes à la sauce tomates","Lundi à vendredi midis","5 cuillères pour 1 repas","Menus midi retraite",5,null,null,null,null,null,0,"VMR01","Rôti de bœuf","Lundi à vendredi midis","1 morceau de 500 grammes pour 5 repas","Menus midi retraite",100,null,null,"Menus midi retraite novembre"]
["MMR222","2019-11-06","PC11","Novembre","DMR01","Pomme","Lundi à vendredi midis","1 sachet de 2 kilogrammes. 1 pomme pour 1 repas","Menus midi retraite",1,"LMR10","Pâtes au beurre","Lundi à vendredi midis","5 cuillères pour 1 repas","Menus midi retraite",5,null,null,null,null,null,0,"VMR01","Rôti de bœuf","Lundi à vendredi midis","1 morceau de 500 grammes pour 5 repas","Menus midi retraite",100,null,null,"Menus midi retraite novembre"]
["MMR223","2019-11-07","PC11","Novembre","DMR01","Pomme","Lundi à vendredi midis","1 sachet de 2 kilogrammes. 1 pomme pour 1 repas","Menus midi retraite",1,"LMR11","Poireau","Lundi à vendredi midis","Unité : 1 pour 1 repas","Menus midi retraite",5,null,null,null,null,null,0,"VMR01","Rôti de bœuf","Lundi à vendredi midis","1 morceau de 500 grammes pour 5 repas","Menus midi retraite",100,null,null,"Menus midi retraite novembre"]
["MMR224","2019-11-08","PC11","Novembre","DMR01","Pomme","Lundi à vendredi midis","1 sachet de 2 kilogrammes. 1 pomme pour 1 repas","Menus midi retraite",1,"LMR12","Pomme de terre","Lundi à vendredi midis","Unité : 1 pour 1 repas","Menus midi retraite",5,null,null,null,null,null,0,"VMR01","Rôti de bœuf","Lundi à vendredi midis","1 morceau de 500 grammes pour 5 repas","Menus midi retraite",100,null,null,"Menus midi retraite novembre"]
["MMR225","2019-11-11","PC11","Novembre","DMR01","Pomme","Lundi à vendredi midis","1 sachet de 2 kilogrammes. 1 pomme pour 1 repas","Menus midi retraite",1,"LMR13","Purée","Lundi à vendredi midis","25 grammes pour 1 repas","Menus midi retraite",5,null,null,null,null,null,0,"VMR02","Rôti de cheval","Lundi à vendredi midis","1 morceau de 500 grammes pour 5 repas","Menus midi retraite",100,"O01","Armistice du 11 novembre 1918","Menus midi retraite novembre"]
["MMR226","2019-11-12","PC11","Novembre","DMR01","Pomme","Lundi à vendredi midis","1 sachet de 2 kilogrammes. 1 pomme pour 1 repas","Menus midi retraite",1,"LMR14","Radis","Lundi à vendredi midis","1 botte ou 1 sachet pour 2 repas","Menus midi retraite",0.5,null,null,null,null,null,0,"VMR02","Rôti de cheval","Lundi à vendredi midis","1 morceau de 500 grammes pour 5 repas","Menus midi retraite",100,null,null,"Menus midi retraite novembre"]
["MMR227","2019-11-13","PC11","Novembre","DMR01","Pomme","Lundi à vendredi midis","1 sachet de 2 kilogrammes. 1 pomme pour 1 repas","Menus midi retraite",1,"LMR14","Radis","Lundi à vendredi midis","1 botte ou 1 sachet pour 2 repas","Menus midi retraite",0.5,null,null,null,null,null,0,"VMR02","Rôti de cheval","Lundi à vendredi midis","1 morceau de 500 grammes pour 5 repas","Menus midi retraite",100,null,null,"Menus midi retraite novembre"]
["MMR228","2019-11-14","PC11","Novembre","DMR01","Pomme","Lundi à vendredi midis","1 sachet de 2 kilogrammes. 1 pomme pour 1 repas","Menus midi retraite",1,"LMR15","Riz","Lundi à vendredi midis","25 grammes pour 1 repas","Menus midi retraite",25,null,null,null,null,null,0,"VMR02","Rôti de cheval","Lundi à vendredi midis","1 morceau de 500 grammes pour 5 repas","Menus midi retraite",100,null,null,"Menus midi retraite novembre"]
["MMR229","2019-11-15","PC11","Novembre","DMR01","Pomme","Lundi à vendredi midis","1 sachet de 2 kilogrammes. 1 pomme pour 1 repas","Menus midi retraite",1,"LMR16","Salade","Lundi à vendredi midis","Unité : 1 tête pour 1 repas","Menus midi retraite",1,null,null,null,null,null,0,"VMR02","Rôti de cheval","Lundi à vendredi midis","1 morceau de 500 grammes pour 5 repas","Menus midi retraite",100,null,null,"Menus midi retraite novembre"]
["MMR230","2019-11-18","PC11","Novembre","DMR01","Pomme","Lundi à vendredi midis","1 sachet de 2 kilogrammes. 1 pomme pour 1 repas","Menus midi retraite",1,"LMR17","Tomates","Lundi à vendredi midis","Unité : 2 pour 1 repas","Menus midi retraite",2,null,null,null,null,null,0,"VMR04","Rôti de porc","Lundi à vendredi midis","1 morceau de 500 grammes pour 5 repas","Menus midi retraite",100,null,null,"Menus midi retraite novembre"]
["MMR231","2019-11-19","PC11","Novembre","DMR01","Pomme","Lundi à vendredi midis","1 sachet de 2 kilogrammes. 1 pomme pour 1 repas","Menus midi retraite",1,"LMR01","Asperges","Lundi à vendredi midis","1 boîte pour 1 repas","Menus midi retraite",2,null,null,null,null,null,0,"VMR04","Rôti de porc","Lundi à vendredi midis","1 morceau de 500 grammes pour 5 repas","Menus midi retraite",100,null,null,"Menus midi retraite novembre"]
["MMR232","2019-11-20","PC11","Novembre","DMR01","Pomme","Lundi à vendredi midis","1 sachet de 2 kilogrammes. 1 pomme pour 1 repas","Menus midi retraite",1,"LMR02","Avocat","Lundi à vendredi midis","Unité : 1 pour 1 repas","Menus midi retraite",1,null,null,null,null,null,0,"VMR04","Rôti de porc","Lundi à vendredi midis","1 morceau de 500 grammes pour 5 repas","Menus midi retraite",100,null,null,"Menus midi retraite novembre"]
["MMR233","2019-11-21","PC11","Novembre","DMR01","Pomme","Lundi à vendredi midis","1 sachet de 2 kilogrammes. 1 pomme pour 1 repas","Menus midi retraite",1,"LMR03","Carottes","Lundi à vendredi midis","Unité : 2 pour 1 repas","Menus midi retraite",2,null,null,null,null,null,0,"VMR04","Rôti de porc","Lundi à vendredi midis","1 morceau de 500 grammes pour 5 repas","Menus midi retraite",100,null,null,"Menus midi retraite novembre"]
["MMR234","2019-11-22","PC11","Novembre","DMR01","Pomme","Lundi à vendredi midis","1 sachet de 2 kilogrammes. 1 pomme pour 1 repas","Menus midi retraite",1,"LMR04","Céleri","Lundi à vendredi midis","Unité : 1 branche pour 1 repas","Menus midi retraite",1,null,null,null,null,null,0,"VMR04","Rôti de porc","Lundi à vendredi midis","1 morceau de 500 grammes pour 5 repas","Menus midi retraite",100,null,null,"Menus midi retraite novembre"]
["MMR235","2019-11-25","PC11","Novembre","DMR01","Pomme","Lundi à vendredi midis","1 sachet de 2 kilogrammes. 1 pomme pour 1 repas","Menus midi retraite",1,"LMR05","Champignons","Lundi à vendredi midis","1 boîte pour 1 repas","Menus midi retraite",1,null,null,null,null,null,0,"VMR05","Rôti de veau","Lundi à vendredi midis","1 morceau de 500 grammes pour 5 repas","Menus midi retraite",100,null,null,"Menus midi retraite novembre"]
["MMR236","2019-11-26","PC11","Novembre","DMR01","Pomme","Lundi à vendredi midis","1 sachet de 2 kilogrammes. 1 pomme pour 1 repas","Menus midi retraite",1,"LMR06","Concombre","Lundi à vendredi midis","Unité : 1 pour 1 repas","Menus midi retraite",1,null,null,null,null,null,0,"VMR05","Rôti de veau","Lundi à vendredi midis","1 morceau de 500 grammes pour 5 repas","Menus midi retraite",100,null,null,"Menus midi retraite novembre"]
["MMR237","2019-11-27","PC11","Novembre","DMR01","Pomme","Lundi à vendredi midis","1 sachet de 2 kilogrammes. 1 pomme pour 1 repas","Menus midi retraite",1,"LMR07","Couscous","Lundi à vendredi midis","25 grammes pour 1 repas","Menus midi retraite",25,null,null,null,null,null,0,"VMR05","Rôti de veau","Lundi à vendredi midis","1 morceau de 500 grammes pour 5 repas","Menus midi retraite",100,null,null,"Menus midi retraite novembre"]
["MMR238","2019-11-28","PC11","Novembre","DMR01","Pomme","Lundi à vendredi midis","1 sachet de 2 kilogrammes. 1 pomme pour 1 repas","Menus midi retraite",1,"LMR08","Maïs","Lundi à vendredi midis","1 boîte pour 2 repas","Menus midi retraite",0.5,null,null,null,null,null,0,"VMR05","Rôti de veau","Lundi à vendredi midis","1 morceau de 500 grammes pour 5 repas","Menus midi retraite",100,null,null,"Menus midi retraite novembre"]
["MMR239","2019-11-29","PC11","Novembre","DMR01","Pomme","Lundi à vendredi midis","1 sachet de 2 kilogrammes. 1 pomme pour 1 repas","Menus midi retraite",1,"LMR08","Maïs","Lundi à vendredi midis","1 boîte pour 2 repas","Menus midi retraite",0.5,null,null,null,null,null,0,"VMR05","Rôti de veau","Lundi à vendredi midis","1 morceau de 500 grammes pour 5 repas","Menus midi retraite",100,null,null,"Menus midi retraite novembre"]
["MJ305","2019-11-01","PC11","Novembre","DS01","Pomme","lundi à vendredi soirs","1 sachet de 2 kilogrammes. 1 pomme pour 1 repas","Menus journaliers",1,"LSV03","Betterave rouge","Vendredi soir","Unité : 1 pour 1 repas","Menus journaliers",1,null,null,null,null,null,0,"VS22","Saucisson","Lundi à dimanche soirs","1 morceau de 400 grammes (Leclerc) pour 3 repas","Menus journaliers",0.33000001311302185,"O12","Toussaint","Menus journaliers novembre"]
["MJ306","2019-11-02","PC11","Novembre","DWE17","Petits suisses","Samedi et dimanche midis et soirs","1 pack de 6 pots. 3 pots pour 1 repas","Menus journaliers",6,"LWES02","Pâtes au beurre","Samedi midi et soir","5 cuillères pour 1 repas","Menus journaliers",10,null,null,null,null,null,0,"VS19","Roulé au fromage","Lundi à dimanche soirs","1 boîte pour 2 repas","Menus journaliers",1,null,null,"Menus journaliers novembre"]
["MJ307","2019-11-03","PC11","Novembre","DWE17","Petits suisses","Samedi et dimanche midis et soirs","1 pack de 6 pots. 3 pots pour 1 repas","Menus journaliers",6,"LWED02","Chips","Dimanche midi et soir","1 sachet pour 2 repas","Menus journaliers",1,null,null,null,null,null,0,"VS22","Saucisson","Lundi à dimanche soirs","1 morceau de 400 grammes (Leclerc) pour 3 repas","Menus journaliers",0.34000000357627869,null,null,"Menus journaliers novembre"]
["MJ308","2019-11-04","PC11","Novembre","DS01","Pomme","lundi à vendredi soirs","1 sachet de 2 kilogrammes. 1 pomme pour 1 repas","Menus journaliers",1,"LSLM02","Choucroute","Lundi et mardi soirs","1 boîte pour 2 repas","Menus journaliers",0.5,null,null,null,null,null,0,"VS27","Viande choucroute","Lundi et mardi soirs","1 boîte pour 2 repas","Menus journaliers",0.5,null,null,"Menus journaliers novembre"]
["MJ309","2019-11-05","PC11","Novembre","DS01","Pomme","lundi à vendredi soirs","1 sachet de 2 kilogrammes. 1 pomme pour 1 repas","Menus journaliers",1,"LSLM02","Choucroute","Lundi et mardi soirs","1 boîte pour 2 repas","Menus journaliers",0.5,null,null,null,null,null,0,"VS27","Viande choucroute","Lundi et mardi soirs","1 boîte pour 2 repas","Menus journaliers",0.5,null,null,"Menus journaliers novembre"]
["MJ310","2019-11-06","PC11","Novembre","DS01","Pomme","lundi à vendredi soirs","1 sachet de 2 kilogrammes. 1 pomme pour 1 repas","Menus journaliers",1,"LSMJ01","Macédoine de légumes","Mercredi et jeudi soirs","1 boîte pour 2 repas","Menus journaliers",0.5,null,null,null,null,null,0,"VS20","Salami","Lundi à dimanche soirs","1 paquet pour 2 repas","Menus journaliers",0.5,null,null,"Menus journaliers novembre"]
["MJ311","2019-11-07","PC11","Novembre","DS01","Pomme","lundi à vendredi soirs","1 sachet de 2 kilogrammes. 1 pomme pour 1 repas","Menus journaliers",1,"LSMJ01","Macédoine de légumes","Mercredi et jeudi soirs","1 boîte pour 2 repas","Menus journaliers",0.5,null,null,null,null,null,0,"VS22","Saucisson","Lundi à dimanche soirs","1 morceau de 400 grammes (Leclerc) pour 3 repas","Menus journaliers",0.33000001311302185,null,null,"Menus journaliers novembre"]
["MJ312","2019-11-08","PC11","Novembre","DS01","Pomme","lundi à vendredi soirs","1 sachet de 2 kilogrammes. 1 pomme pour 1 repas","Menus journaliers",1,"LSV04","Carottes","Vendredi soir","Unité : 2 pour 1 repas","Menus journaliers",2,null,null,null,null,null,0,"VS20","Salami","Lundi à dimanche soirs","1 paquet pour 2 repas","Menus journaliers",0.5,null,null,"Menus journaliers novembre"]
["MJ313","2019-11-09","PC11","Novembre","DWE18","Pruneaux","Samedi et dimanche midis et soirs","1 paquet pour 4 repas","Menus journaliers",0.5,"LWES03","Pâtes au fromage râpé","Samedi midi et soir","5 cuillères pour 1 repas","Menus journaliers",10,null,null,null,null,null,0,"VS22","Saucisson","Lundi à dimanche soirs","1 morceau de 400 grammes (Leclerc) pour 3 repas","Menus journaliers",0.33000001311302185,null,null,"Menus journaliers novembre"]
["MJ314","2019-11-10","PC11","Novembre","DWE18","Pruneaux","Samedi et dimanche midis et soirs","1 paquet pour 4 repas","Menus journaliers",0.5,"LWED03","Frites","Dimanche midi","20 frites pour 1 repas","Menus journaliers",20,"LWED01","Asperges","Dimanche soir","1 bocal ou 1 boîte pour 1 repas","Menus journaliers",1,"VS21","Saucisses","Lundi à dimanche soirs","1 paquet pour 2 repas. 1 ou 2 saucisses pour 1 repas","Menus journaliers",0.5,null,null,"Menus journaliers novembre"]
["MJ315","2019-11-11","PC11","Novembre","DS01","Pomme","lundi à vendredi soirs","1 sachet de 2 kilogrammes. 1 pomme pour 1 repas","Menus journaliers",1,"LSLM03","Chou-fleur","Lundi et mardi soirs","Unité : 1 pour 2 repas","Menus journaliers",0.5,null,null,null,null,null,0,"VS22","Saucisson","Lundi à dimanche soirs","1 morceau de 400 grammes (Leclerc) pour 3 repas","Menus journaliers",0.34000000357627869,"O01","Armistice du 11 novembre 1918","Menus journaliers novembre"]
["MJ316","2019-11-12","PC11","Novembre","DS01","Pomme","lundi à vendredi soirs","1 sachet de 2 kilogrammes. 1 pomme pour 1 repas","Menus journaliers",1,"LSLM03","Chou-fleur","Lundi et mardi soirs","Unité : 1 pour 2 repas","Menus journaliers",0.5,null,null,null,null,null,0,"VS21","Saucisses","Lundi à dimanche soirs","1 paquet pour 2 repas. 1 ou 2 saucisses pour 1 repas","Menus journaliers",0.5,null,null,"Menus journaliers novembre"]
["MJ317","2019-11-13","PC11","Novembre","DS01","Pomme","lundi à vendredi soirs","1 sachet de 2 kilogrammes. 1 pomme pour 1 repas","Menus journaliers",1,"LSMJ02","Petits pois","Mercredi et jeudi soirs","1 boîte pour 2 repas","Menus journaliers",0.5,null,null,null,null,null,0,"VS22","Saucisson","Lundi à dimanche soirs","1 morceau de 400 grammes (Leclerc) pour 3 repas","Menus journaliers",0.33000001311302185,null,null,"Menus journaliers novembre"]
["MJ318","2019-11-14","PC11","Novembre","DS01","Pomme","lundi à vendredi soirs","1 sachet de 2 kilogrammes. 1 pomme pour 1 repas","Menus journaliers",1,"LSMJ02","Petits pois","Mercredi et jeudi soirs","1 boîte pour 2 repas","Menus journaliers",0.5,null,null,null,null,null,0,"VS23","Tête persillée","Lundi à dimanche soirs","1 tranche pour 2 repas","Menus journaliers",0.5,null,null,"Menus journaliers novembre"]
["MJ319","2019-11-15","PC11","Novembre","DS01","Pomme","lundi à vendredi soirs","1 sachet de 2 kilogrammes. 1 pomme pour 1 repas","Menus journaliers",1,"LSV05","Céleri","Vendredi soir","Unité : 1 branche pour 1 repas","Menus journaliers",1,null,null,null,null,null,0,"VS22","Saucisson","Lundi à dimanche soirs","1 morceau de 400 grammes (Leclerc) pour 3 repas","Menus journaliers",0.33000001311302185,null,null,"Menus journaliers novembre"]
["MJ320","2019-11-16","PC11","Novembre","DWE12","Gâteau de riz","Samedi et dimanche midis et soirs","1 pack de 4 pots pour le week-end. 1 pot pour 1 repas","Menus journaliers",2,"LWES01","Pâtes à la sauce tomates","Samedi midi et soir","5 cuillères pour 1 repas","Menus journaliers",10,null,null,null,null,null,0,"VS23","Tête persillée","Lundi à dimanche soirs","1 tranche pour 2 repas","Menus journaliers",0.5,null,null,"Menus journaliers novembre"]
["MJ321","2019-11-17","PC11","Novembre","DWE12","Gâteau de riz","Samedi et dimanche midis et soirs","1 pack de 4 pots pour le week-end. 1 pot pour 1 repas","Menus journaliers",2,"LWED04","Haricots verts","Dimanche midi et soir","1 boîte pour 2 repas","Menus journaliers",1,null,null,null,null,null,0,"VS22","Saucisson","Lundi à dimanche soirs","1 morceau de 400 grammes (Leclerc) pour 3 repas","Menus journaliers",0.34000000357627869,null,null,"Menus journaliers novembre"]
["MJ322","2019-11-18","PC11","Novembre","DS01","Pomme","lundi à vendredi soirs","1 sachet de 2 kilogrammes. 1 pomme pour 1 repas","Menus journaliers",1,"LSLM04","Choux de Bruxelles","Lundi et mardi soirs","1 boîte pour 2 repas","Menus journaliers",0.5,null,null,null,null,null,0,"VS24","Tête roulée","Lundi à dimanche soirs","1 tranche pour 2 repas","Menus journaliers",3,null,null,"Menus journaliers novembre"]
["MJ323","2019-11-19","PC11","Novembre","DS01","Pomme","lundi à vendredi soirs","1 sachet de 2 kilogrammes. 1 pomme pour 1 repas","Menus journaliers",1,"LSLM04","Choux de Bruxelles","Lundi et mardi soirs","1 boîte pour 2 repas","Menus journaliers",0.5,null,null,null,null,null,0,"VS22","Saucisson","Lundi à dimanche soirs","1 morceau de 400 grammes (Leclerc) pour 3 repas","Menus journaliers",0.33000001311302185,null,null,"Menus journaliers novembre"]
["MJ324","2019-11-20","PC11","Novembre","DS01","Pomme","lundi à vendredi soirs","1 sachet de 2 kilogrammes. 1 pomme pour 1 repas","Menus journaliers",1,"LSMJ03","Petits pois et jeunes carottes","Mercredi et jeudi soirs","1 boîte pour 2 repas","Menus journaliers",0.5,null,null,null,null,null,0,"VS24","Tête roulée","Lundi à dimanche soirs","1 tranche pour 2 repas","Menus journaliers",3,null,null,"Menus journaliers novembre"]
["MJ325","2019-11-21","PC11","Novembre","DS01","Pomme","lundi à vendredi soirs","1 sachet de 2 kilogrammes. 1 pomme pour 1 repas","Menus journaliers",1,"LSMJ03","Petits pois et jeunes carottes","Mercredi et jeudi soirs","1 boîte pour 2 repas","Menus journaliers",0.5,null,null,null,null,null,0,"VS22","Saucisson","Lundi à dimanche soirs","1 morceau de 400 grammes (Leclerc) pour 3 repas","Menus journaliers",0.33000001311302185,null,null,"Menus journaliers novembre"]
["MJ326","2019-11-22","PC11","Novembre","DS01","Pomme","lundi à vendredi soirs","1 sachet de 2 kilogrammes. 1 pomme pour 1 repas","Menus journaliers",1,"LSV06","Champignons","Vendredi soir","1 boîte pour 1 repas","Menus journaliers",1,null,null,null,null,null,0,"VS25","Thon","Lundi à dimanche soirs","1 boîte pour 1 repas","Menus journaliers",1,null,null,"Menus journaliers novembre"]
["MJ327","2019-11-23","PC11","Novembre","DWE19","Tapioca","Samedi et dimanche midis et soirs","25 grammes pour 1 repas","Menus journaliers",50,"LWES02","Pâtes au beurre","Samedi midi et soir","5 cuillères pour 1 repas","Menus journaliers",10,null,null,null,null,null,0,"VS22","Saucisson","Lundi à dimanche soirs","1 morceau de 400 grammes (Leclerc) pour 3 repas","Menus journaliers",0.34000000357627869,null,null,"Menus journaliers novembre"]
["MJ328","2019-11-24","PC11","Novembre","DWE19","Tapioca","Samedi et dimanche midis et soirs","25 grammes pour 1 repas","Menus journaliers",50,"LWED02","Chips","Dimanche midi et soir","1 sachet pour 2 repas","Menus journaliers",1,null,null,null,null,null,0,"VS01","Bifteck haché de bœuf","Lundi à dimanche soirs","1 paquet pour 2 repas","Menus journaliers",1,null,null,"Menus journaliers novembre"]
["MJ329","2019-11-25","PC11","Novembre","DS01","Pomme","lundi à vendredi soirs","1 sachet de 2 kilogrammes. 1 pomme pour 1 repas","Menus journaliers",1,"LSLM05","Couscous","Lundi et mardi soirs","25 grammes pour 1 repas","Menus journaliers",25,null,null,null,null,null,0,"VS22","Saucisson","Lundi à dimanche soirs","1 morceau de 400 grammes (Leclerc) pour 3 repas","Menus journaliers",0.33000001311302185,null,null,"Menus journaliers novembre"]
["MJ330","2019-11-26","PC11","Novembre","DS01","Pomme","lundi à vendredi soirs","1 sachet de 2 kilogrammes. 1 pomme pour 1 repas","Menus journaliers",1,"LSLM05","Couscous","Lundi et mardi soirs","25 grammes pour 1 repas","Menus journaliers",25,null,null,null,null,null,0,"VS01","Bifteck haché de bœuf","Lundi à dimanche soirs","1 paquet pour 2 repas","Menus journaliers",1,null,null,"Menus journaliers novembre"]
["MJ331","2019-11-27","PC11","Novembre","DS01","Pomme","lundi à vendredi soirs","1 sachet de 2 kilogrammes. 1 pomme pour 1 repas","Menus journaliers",1,"LSMJ04","Ratatouille","Mercredi et jeudi soirs","1 boîte pour 2 repas","Menus journaliers",0.5,null,null,null,null,null,0,"VS22","Saucisson","Lundi à dimanche soirs","1 morceau de 400 grammes (Leclerc) pour 3 repas","Menus journaliers",0.34000000357627869,null,null,"Menus journaliers novembre"]
["MJ332","2019-11-28","PC11","Novembre","DS01","Pomme","lundi à vendredi soirs","1 sachet de 2 kilogrammes. 1 pomme pour 1 repas","Menus journaliers",1,"LSMJ04","Ratatouille","Mercredi et jeudi soirs","1 boîte pour 2 repas","Menus journaliers",0.5,null,null,null,null,null,0,"VS02","Bifteck haché de cheval","Lundi à dimanche soirs","125 grammes pour 1 repas","Menus journaliers",125,null,null,"Menus journaliers novembre"]
["MJ333","2019-11-29","PC11","Novembre","DS01","Pomme","lundi à vendredi soirs","1 sachet de 2 kilogrammes. 1 pomme pour 1 repas","Menus journaliers",1,"LSV07","Concombre","Vendredi soir","Unité : 1 pour 1 repas","Menus journaliers",1,null,null,null,null,null,0,"VS22","Saucisson","Lundi à dimanche soirs","1 morceau de 400 grammes (Leclerc) pour 3 repas","Menus journaliers",0.33000001311302185,null,null,"Menus journaliers novembre"]
["MJ334","2019-11-30","PC11","Novembre","DWE20","Yaourts","Samedi et dimanche midis et soirs","1 pack de 4 pots pour le week-end. 1 pot pour 1 repas","Menus journaliers",2,"LWES03","Pâtes au fromage râpé","Samedi midi et soir","5 cuillères pour 1 repas","Menus journaliers",10,null,null,null,null,null,0,"VS03","Bifteck haché de veau","Lundi à dimanche soirs","1 paquet pour 2 repas","Menus journaliers",1,null,null,"Menus journaliers novembre"]
["MVWE87","2019-11-02","PC11","Novembre",null,null,null,null,null,0,null,null,null,null,null,0,null,null,null,null,null,0,"VWE05","Poisson","Samedi et dimanche midis","Unité : 1 pour 1 repas","Menus viandes week-end",1,null,null,"Menus viandes weekend deuxième semestre"]
["MVWE88","2019-11-03","PC11","Novembre",null,null,null,null,null,0,null,null,null,null,null,0,null,null,null,null,null,0,"VWE06","Porc","Samedi et dimanche midis","1 tranche pour 1 repas","Menus viandes week-end",1,null,null,"Menus viandes weekend deuxième semestre"]
["MVWE89","2019-11-09","PC11","Novembre",null,null,null,null,null,0,null,null,null,null,null,0,null,null,null,null,null,0,"VWE07","Veau","Samedi et dimanche midis","1 tranche pour 1 repas","Menus viandes week-end",1,null,null,"Menus viandes weekend deuxième semestre"]
["MVWE90","2019-11-10","PC11","Novembre",null,null,null,null,null,0,null,null,null,null,null,0,null,null,null,null,null,0,"VWE01","Agneau","Samedi et dimanche midis","1 tranche pour 1 repas","Menus viandes week-end",1,null,null,"Menus viandes weekend deuxième semestre"]
["MVWE91","2019-11-16","PC11","Novembre",null,null,null,null,null,0,null,null,null,null,null,0,null,null,null,null,null,0,"VWE02","Bœuf","Samedi et dimanche midis","1 tranche pour 1 repas","Menus viandes week-end",1,null,null,"Menus viandes weekend deuxième semestre"]
["MVWE92","2019-11-17","PC11","Novembre",null,null,null,null,null,0,null,null,null,null,null,0,null,null,null,null,null,0,"VWE03","Cheval","Samedi et dimanche midis","1 tranche pour 1 repas","Menus viandes week-end",1,null,null,"Menus viandes weekend deuxième semestre"]
["MVWE93","2019-11-23","PC11","Novembre",null,null,null,null,null,0,null,null,null,null,null,0,null,null,null,null,null,0,"VWE04","Dinde","Samedi et dimanche midis","1 tranche pour 1 repas","Menus viandes week-end",1,null,null,"Menus viandes weekend deuxième semestre"]
["MVWE94","2019-11-24","PC11","Novembre",null,null,null,null,null,0,null,null,null,null,null,0,null,null,null,null,null,0,"VWE05","Poisson","Samedi et dimanche midis","Unité : 1 pour 1 repas","Menus viandes week-end",1,null,null,"Menus viandes weekend deuxième semestre"]
["MVWE95","2019-11-30","PC11","Novembre",null,null,null,null,null,0,null,null,null,null,null,0,null,null,null,null,null,0,"VWE06","Porc","Samedi et dimanche midis","1 tranche pour 1 repas","Menus viandes week-end",1,null,null,"Menus viandes weekend deuxième semestre"]

{"sheet":"Décembre","index":19,"n_rows":70,"n_cols":31,"rows_kept":70,"cut":false,"hidden":false,"merged":[[0,0,0,30]]}
["Menus du mois de décembre  2018."]
[]
["Numéro du menu","Date du menu","Code période concernée","Période concernée","Code dessert","Dessert","Jour dessert","Conditionnement dessert","Destination dessert","Quantité dessert","Code légume","Légume","Jour légume","Conditionnement légume","Destination légume","Quantité légume","Code légume deux","Légume deux","Jour légume deux","Conditionnement légume deux","Destination légume deux","Quantité légume deux","Code viande","Viande","Jour viande","Conditionnement viande","Destination viande","Quantité viande","Code observation","Observation","Titre"]
["MMR240","2019-12-02","PC12","Décembre","DMR01","Pomme","Lundi à vendredi midis","1 sachet de 2 kilogrammes. 1 pomme pour 1 repas","Menus midi retraite",1,"LMR09","Pâtes à la sauce tomates","Lundi à vendredi midis","5 cuillères pour 1 repas","Menus midi retraite",5,null,null,null,null,null,0,"VMR01","Rôti d'agneau","Lundi à vendredi midis","1 morceau de 500 grammes pour 5 repas","Menus midi retraite",100,null,null,"Menus midi retraite décembre"]
["MMR241","2019-12-03","PC12","Décembre","DMR01","Pomme","Lundi à vendredi midis","1 sachet de 2 kilogrammes. 1 pomme pour 1 repas","Menus midi retraite",1,"LMR10","Pâtes au beurre","Lundi à vendredi midis","5 cuillères pour 1 repas","Menus midi retraite",5,null,null,null,null,null,0,"VMR01","Rôti d'agneau","Lundi à vendredi midis","1 morceau de 500 grammes pour 5 repas","Menus midi retraite",100,null,null,"Menus midi retraite décembre"]
["MMR242","2019-12-04","PC12","Décembre","DMR01","Pomme","Lundi à vendredi midis","1 sachet de 2 kilogrammes. 1 pomme pour 1 repas","Menus midi retraite",1,"LMR11","Poireau","Lundi à vendredi midis","Unité : 1 pour 1 repas","Menus midi retraite",1,null,null,null,null,null,0,"VMR01","Rôti d'agneau","Lundi à vendredi midis","1 morceau de 500 grammes pour 5 repas","Menus midi retraite",100,null,null,"Menus midi retraite décembre"]
["MMR243","2019-12-05","PC12","Décembre","DMR01","Pomme","Lundi à vendredi midis","1 sachet de 2 kilogrammes. 1 pomme pour 1 repas","Menus midi retraite",1,"LMR12","Pomme de terre","Lundi à vendredi midis","Unité : 1 pour 1 repas","Menus midi retraite",1,null,null,null,null,null,0,"VMR01","Rôti d'agneau","Lundi à vendredi midis","1 morceau de 500 grammes pour 5 repas","Menus midi retraite",100,null,null,"Menus midi retraite décembre"]
["MMR244","2019-12-06","PC12","Décembre","DMR01","Pomme","Lundi à vendredi midis","1 sachet de 2 kilogrammes. 1 pomme pour 1 repas","Menus midi retraite",1,"LMR13","Purée","Lundi à vendredi midis","25 grammes pour 1 repas","Menus midi retraite",25,null,null,null,null,null,0,"VMR01","Rôti d'agneau","Lundi à vendredi midis","1 morceau de 500 grammes pour 5 repas","Menus midi retraite",100,null,null,"Menus midi retraite décembre"]
["MMR245","2019-12-09","PC12","Décembre","DMR01","Pomme","Lundi à vendredi midis","1 sachet de 2 kilogrammes. 1 pomme pour 1 repas","Menus midi retraite",1,"LMR14","Radis","Lundi à vendredi midis","1 botte ou 1 sachet pour 2 repas","Menus midi retraite",0.5,null,null,null,null,null,0,"VMR02","Rôti de bœuf","Lundi à vendredi midis","1 morceau de 500 grammes pour 5 repas","Menus midi retraite",100,null,null,"Menus midi retraite décembre"]
["MMR246","2019-12-10","PC12","Décembre","DMR01","Pomme","Lundi à vendredi midis","1 sachet de 2 kilogrammes. 1 pomme pour 1 repas","Menus midi retraite",1,"LMR14","Radis","Lundi à vendredi midis","1 botte ou 1 sachet pour 2 repas","Menus midi retraite",0.5,null,null,null,null,null,0,"VMR02","Rôti de bœuf","Lundi à vendredi midis","1 morceau de 500 grammes pour 5 repas","Menus midi retraite",100,null,null,"Menus midi retraite décembre"]
["MMR247","2019-12-11","PC12","Décembre","DMR01","Pomme","Lundi à vendredi midis","1 sachet de 2 kilogrammes. 1 pomme pour 1 repas","Menus midi retraite",1,"LMR15","Riz","Lundi à vendredi midis","25 grammes pour 1 repas","Menus midi retraite",0.5,null,null,null,null,null,0,"VMR02","Rôti de bœuf","Lundi à vendredi midis","1 morceau de 500 grammes pour 5 repas","Menus midi retraite",100,null,null,"Menus midi retraite décembre"]
["MMR248","2019-12-12","PC12","Décembre","DMR01","Pomme","Lundi à vendredi midis","1 sachet de 2 kilogrammes. 1 pomme pour 1 repas","Menus midi retraite",1,"LMR16","Salade","Lundi à vendredi midis","Unité : 1 tête pour 1 repas","Menus midi retraite",1,null,null,null,null,null,0,"VMR02","Rôti de bœuf","Lundi à vendredi midis","1 morceau de 500 grammes pour 5 repas","Menus midi retraite",100,null,null,"Menus midi retraite décembre"]
["MMR249","2019-12-13","PC12","Décembre","DMR01","Pomme","Lundi à vendredi midis","1 sachet de 2 kilogrammes. 1 pomme pour 1 repas","Menus midi retraite",1,"LMR17","Tomates","Lundi à vendredi midis","Unité : 2 pour 1 repas","Menus midi retraite",2,null,null,null,null,null,0,"VMR02","Rôti de bœuf","Lundi à vendredi midis","1 morceau de 500 grammes pour 5 repas","Menus midi retraite",100,null,null,"Menus midi retraite décembre"]
["MMR250","2019-12-16","PC12","Décembre","DMR01","Pomme","Lundi à vendredi midis","1 sachet de 2 kilogrammes. 1 pomme pour 1 repas","Menus midi retraite",1,"LMR01","Asperges","Lundi à vendredi midis","1 boîte pour 1 repas","Menus midi retraite",1,null,null,null,null,null,0,"VMR03","Rôti de cheval","Lundi à vendredi midis","1 morceau de 500 grammes pour 5 repas","Menus midi retraite",100,null,null,"Menus midi retraite décembre"]
["MMR251","2019-12-17","PC12","Décembre","DMR01","Pomme","Lundi à vendredi midis","1 sachet de 2 kilogrammes. 1 pomme pour 1 repas","Menus midi retraite",1,"LMR02","Avocat","Lundi à vendredi midis","Unité : 1 pour 1 repas","Menus midi retraite",1,null,null,null,null,null,0,"VMR03","Rôti de cheval","Lundi à vendredi midis","1 morceau de 500 grammes pour 5 repas","Menus midi retraite",100,null,null,"Menus midi retraite décembre"]
["MMR252","2019-12-18","PC12","Décembre","DMR01","Pomme","Lundi à vendredi midis","1 sachet de 2 kilogrammes. 1 pomme pour 1 repas","Menus midi retraite",1,"LMR03","Carottes","Lundi à vendredi midis","Unité : 2 pour 1 repas","Menus midi retraite",2,null,null,null,null,null,0,"VMR03","Rôti de cheval","Lundi à vendredi midis","1 morceau de 500 grammes pour 5 repas","Menus midi retraite",100,null,null,"Menus midi retraite décembre"]
["MMR253","2019-12-19","PC12","Décembre","DMR01","Pomme","Lundi à vendredi midis","1 sachet de 2 kilogrammes. 1 pomme pour 1 repas","Menus midi retraite",1,"LMR04","Céleri","Lundi à vendredi midis","Unité : 1 branche pour 1 repas","Menus midi retraite",1,null,null,null,null,null,0,"VMR03","Rôti de cheval","Lundi à vendredi midis","1 morceau de 500 grammes pour 5 repas","Menus midi retraite",100,null,null,"Menus midi retraite décembre"]
["MMR254","2019-12-20","PC12","Décembre","DMR01","Pomme","Lundi à vendredi midis","1 sachet de 2 kilogrammes. 1 pomme pour 1 repas","Menus midi retraite",1,"LMR05","Champignons","Lundi à vendredi midis","1 boîte pour 1 repas","Menus midi retraite",1,null,null,null,null,null,0,"VMR03","Rôti de cheval","Lundi à vendredi midis","1 morceau de 500 grammes pour 5 repas","Menus midi retraite",100,null,null,"Menus midi retraite décembre"]
["MMR255","2019-12-23","PC12","Décembre","DMR01","Pomme","Lundi à vendredi midis","1 sachet de 2 kilogrammes. 1 pomme pour 1 repas","Menus midi retraite",1,"LMR06","Concombre","Lundi à vendredi midis","Unité : 1 pour 1 repas","Menus midi retraite",1,null,null,null,null,null,0,"VMR04","Rôti de porc","Lundi à vendredi midis","1 morceau de 500 grammes pour 5 repas","Menus midi retraite",100,null,null,"Menus midi retraite décembre"]
["MMR256","2019-12-24","PC12","Décembre","DMR01","Pomme","Lundi à vendredi midis","1 sachet de 2 kilogrammes. 1 pomme pour 1 repas","Menus midi retraite",1,"LMR07","Couscous","Lundi à vendredi midis","25 grammes pour 1 repas","Menus midi retraite",25,null,null,null,null,null,0,"VMR04","Rôti de porc","Lundi à vendredi midis","1 morceau de 500 grammes pour 5 repas","Menus midi retraite",100,null,null,"Menus midi retraite décembre"]
["MMR257","2019-12-25","PC12","Décembre","DMR01","Pomme","Lundi à vendredi midis","1 sachet de 2 kilogrammes. 1 pomme pour 1 repas","Menus midi retraite",1,"LMR08","Maïs","Lundi à vendredi midis","1 boîte pour 2 repas","Menus midi retraite",0.5,null,null,null,null,null,0,"VMR04","Rôti de porc","Lundi à vendredi midis","1 morceau de 500 grammes pour 5 repas","Menus midi retraite",100,"O09","Noël","Menus midi retraite décembre"]
["MMR258","2019-12-26","PC12","Décembre","DMR01","Pomme","Lundi à vendredi midis","1 sachet de 2 kilogrammes. 1 pomme pour 1 repas","Menus midi retraite",1,"LMR08","Maïs","Lundi à vendredi midis","1 boîte pour 2 repas","Menus midi retraite",0.5,null,null,null,null,null,0,"VMR04","Rôti de porc","Lundi à vendredi midis","1 morceau de 500 grammes pour 5 repas","Menus midi retraite",100,null,null,"Menus midi retraite décembre"]
["MMR259","2019-12-27","PC12","Décembre","DMR01","Pomme","Lundi à vendredi midis","1 sachet de 2 kilogrammes. 1 pomme pour 1 repas","Menus midi retraite",1,"LMR09","Pâtes à la sauce tomates","Lundi à vendredi midis","5 cuillères pour 1 repas","Menus midi retraite",5,null,null,null,null,null,0,"VMR04","Rôti de porc","Lundi à vendredi midis","1 morceau de 500 grammes pour 5 repas","Menus midi retraite",100,null,null,"Menus midi retraite décembre"]
["MMR260","2019-12-30","PC12","Décembre","DMR01","Pomme","Lundi à vendredi midis","1 sachet de 2 kilogrammes. 1 pomme pour 1 repas","Menus midi retraite",1,"LMR10","Pâtes au beurre","Lundi à vendredi midis","5 cuillères pour 1 repas","Menus midi retraite",5,null,null,null,null,null,0,"VMR05","Rôti de veau","Lundi à vendredi midis","1 morceau de 500 grammes pour 5 repas","Menus midi retraite",100,null,null,"Menus midi retraite décembre"]
["MMR261","2019-12-31","PC12","Décembre","DMR01","Pomme","Lundi à vendredi midis","1 sachet de 2 kilogrammes. 1 pomme pour 1 repas","Menus midi retraite",1,"LMR11","Poireau","Lundi à vendredi midis","Unité : 1 pour 1 repas","Menus midi retraite",1,null,null,null,null,null,0,"VMR05","Rôti de veau","Lundi à vendredi midis","1 morceau de 500 grammes pour 5 repas","Menus midi retraite",100,null,null,"Menus midi retraite décembre"]
["MJ335","2019-12-01","PC12","Décembre","DWE20","Yaourts","Samedi et dimanche midis et soirs","1 pack de 4 pots pour le week-end. 1 pot pour 1 repas","Menus journaliers",2,"LWED03","Frites","Dimanche midi","20 frites pour 1 repas","Menus journaliers",20,"LWED01","Asperges","Dimanche soir","1 bocal ou 1 boîte pour 1 repas","Menus journaliers",1,"VS22","Saucisson","Lundi à dimanche soirs","1 morceau de 400 grammes (Leclerc) pour 3 repas","Menus journaliers",0.33000001311302185,null,null,"Menus journaliers décembre"]
["MJ336","2019-12-02","PC12","Décembre","DS01","Pomme","lundi à vendredi soirs","1 sachet de 2 kilogrammes. 1 pomme pour 1 repas","Menus journaliers",1,"LSLM06","Endives","Lundi et mardi soirs","1 boîte pour 2 repas","Menus journaliers",0.5,null,null,null,null,null,0,"VS03","Bifteck haché de veau","Lundi à dimanche soirs","1 paquet pour 2 repas","Menus journaliers",1,null,null,"Menus journaliers décembre"]
["MJ337","2019-12-03","PC12","Décembre","DS01","Pomme","lundi à vendredi soirs","1 sachet de 2 kilogrammes. 1 pomme pour 1 repas","Menus journaliers",1,"LSLM06","Endives","Lundi et mardi soirs","1 boîte pour 2 repas","Menus journaliers",0.5,null,null,null,null,null,0,"VS22","Saucisson","Lundi à dimanche soirs","1 morceau de 400 grammes (Leclerc) pour 3 repas","Menus journaliers",0.34000000357627869,null,null,"Menus journaliers décembre"]
["MJ338","2019-12-04","PC12","Décembre","DS01","Pomme","lundi à vendredi soirs","1 sachet de 2 kilogrammes. 1 pomme pour 1 repas","Menus journaliers",1,"LSMJ05","Raviolis","Mercredi et jeudi soirs","1 boîte pour 2 repas","Menus journaliers",0.5,null,null,null,null,null,0,"VS04","Bouchée à la reine","Lundi à dimanche soirs","1 boîte pour 2 repas","Menus journaliers",1,null,null,"Menus journaliers décembre"]
["MJ339","2019-12-05","PC12","Décembre","DS01","Pomme","lundi à vendredi soirs","1 sachet de 2 kilogrammes. 1 pomme pour 1 repas","Menus journaliers",1,"LSMJ05","Raviolis","Mercredi et jeudi soirs","1 boîte pour 2 repas","Menus journaliers",0.5,null,null,null,null,null,0,"VS22","Saucisson","Lundi à dimanche soirs","1 morceau de 400 grammes (Leclerc) pour 3 repas","Menus journaliers",0.33000001311302185,null,null,"Menus journaliers décembre"]
["MJ340","2019-12-06","PC12","Décembre","DS01","Pomme","lundi à vendredi soirs","1 sachet de 2 kilogrammes. 1 pomme pour 1 repas","Menus journaliers",1,"LSV08","Radis","Vendredi soir","1 botte ou 1 sachet pour 1 repas","Menus journaliers",1,null,null,null,null,null,0,"VS04","Bouchée à la reine","Lundi à dimanche soirs","1 boîte pour 2 repas","Menus journaliers",1,null,null,"Menus journaliers décembre"]
["MJ341","2019-12-07","PC12","Décembre","DWE01","Ananas","Samedi et dimanche midis et soirs","Unité : 1 pour 4 repas","Menus journaliers",0.5,"LWES01","Pâtes à la sauce tomates","Samedi midi et soir","5 cuillères pour 1 repas","Menus journaliers",10,null,null,null,null,null,0,"VS22","Saucisson","Lundi à dimanche soirs","1 morceau de 400 grammes (Leclerc) pour 3 repas","Menus journaliers",0.33000001311302185,null,null,"Menus journaliers décembre"]
["MJ342","2019-12-08","PC12","Décembre","DWE01","Ananas","Samedi et dimanche midis et soirs","Unité : 1 pour 4 repas","Menus journaliers",0.5,"LWED04","Haricots verts","Dimanche midi et soir","1 boîte pour 2 repas","Menus journaliers",1,null,null,null,null,null,0,"VS05","Boudin","Lundi à dimanche soirs","1 paquet pour 2 repas","Menus journaliers",0.5,null,null,"Menus journaliers décembre"]
["MJ343","2019-12-09","PC12","Décembre","DS01","Pomme","lundi à vendredi soirs","1 sachet de 2 kilogrammes. 1 pomme pour 1 repas","Menus journaliers",1,"LSLM07","Haricots verts","Lundi et mardi soirs","1 boîte pour 2 repas","Menus journaliers",0.5,null,null,null,null,null,0,"VS22","Saucisson","Lundi à dimanche soirs","1 morceau de 400 grammes (Leclerc) pour 3 repas","Menus journaliers",0.34000000357627869,null,null,"Menus journaliers décembre"]
["MJ344","2019-12-10","PC12","Décembre","DS01","Pomme","lundi à vendredi soirs","1 sachet de 2 kilogrammes. 1 pomme pour 1 repas","Menus journaliers",1,"LSLM07","Haricots verts","Lundi et mardi soirs","1 boîte pour 2 repas","Menus journaliers",0.5,null,null,null,null,null,0,"VS05","Boudin","Lundi à dimanche soirs","1 paquet pour 2 repas","Menus journaliers",0.5,null,null,"Menus journaliers décembre"]
["MJ345","2019-12-11","PC12","Décembre","DS01","Pomme","lundi à vendredi soirs","1 sachet de 2 kilogrammes. 1 pomme pour 1 repas","Menus journaliers",1,"LSMJ06","Tomates pelées","Mercredi et jeudi soirs","1 boîte pour 2 repas","Menus journaliers",0.5,null,null,null,null,null,0,"VS22","Saucisson","Lundi à dimanche soirs","1 morceau de 400 grammes (Leclerc) pour 3 repas","Menus journaliers",0.33000001311302185,null,null,"Menus journaliers décembre"]
["MJ346","2019-12-12","PC12","Décembre","DS01","Pomme","lundi à vendredi soirs","1 sachet de 2 kilogrammes. 1 pomme pour 1 repas","Menus journaliers",1,"LSMJ06","Tomates pelées","Mercredi et jeudi soirs","1 boîte pour 2 repas","Menus journaliers",0.5,null,null,null,null,null,0,"VS06","Cervelas","Lundi à dimanche soirs","1 paquet pour 2 repas","Menus journaliers",0.5,null,null,"Menus journaliers décembre"]
["MJ347","2019-12-13","PC12","Décembre","DS01","Pomme","lundi à vendredi soirs","1 sachet de 2 kilogrammes. 1 pomme pour 1 repas","Menus journaliers",1,"LSV09","Salade","Vendredi soir","Unité : 1 tête pour 1 repas","Menus journaliers",1,null,null,null,null,null,0,"VS22","Saucisson","Lundi à dimanche soirs","1 morceau de 400 grammes (Leclerc) pour 3 repas","Menus journaliers",0.33000001311302185,null,null,"Menus journaliers décembre"]
["MJ348","2019-12-14","PC12","Décembre","DWE02","Autres fruits","Samedi et dimanche midis et soirs","Unité : 2 à 4 pour 1 repas","Menus journaliers",8,"LWES02","Pâtes au beurre","Samedi midi et soir","5 cuillères pour 1 repas","Menus journaliers",10,null,null,null,null,null,0,"VS06","Cervelas","Lundi à dimanche soirs","1 paquet pour 2 repas","Menus journaliers",0.5,null,null,"Menus journaliers décembre"]
["MJ349","2019-12-15","PC12","Décembre","DWE02","Autres fruits","Samedi et dimanche midis et soirs","Unité : 2 à 4 pour 1 repas","Menus journaliers",8,"LWED02","Chips","Dimanche midi et soir","1 sachet pour 2 repas","Menus journaliers",1,null,null,null,null,null,0,"VS22","Saucisson","Lundi à dimanche soirs","1 morceau de 400 grammes (Leclerc) pour 3 repas","Menus journaliers",0.34000000357627869,null,null,"Menus journaliers décembre"]
["MJ350","2019-12-16","PC12","Décembre","DS01","Pomme","lundi à vendredi soirs","1 sachet de 2 kilogrammes. 1 pomme pour 1 repas","Menus journaliers",1,"LSLM08","Maïs","Lundi et mardi soirs","1 boîte pour 2 repas","Menus journaliers",0.5,null,null,null,null,null,0,"VS07","Cœur","Lundi à dimanche soirs","1 paquet pour 2 repas","Menus journaliers",1,null,null,"Menus journaliers décembre"]
["MJ351","2019-12-17","PC12","Décembre","DS01","Pomme","lundi à vendredi soirs","1 sachet de 2 kilogrammes. 1 pomme pour 1 repas","Menus journaliers",1,"LSLM08","Maïs","Lundi et mardi soirs","1 boîte pour 2 repas","Menus journaliers",0.5,null,null,null,null,null,0,"VS22","Saucisson","Lundi à dimanche soirs","1 morceau de 400 grammes (Leclerc) pour 3 repas","Menus journaliers",0.33000001311302185,null,null,"Menus journaliers décembre"]
["MJ352","2019-12-18","PC12","Décembre","DS01","Pomme","lundi à vendredi soirs","1 sachet de 2 kilogrammes. 1 pomme pour 1 repas","Menus journaliers",1,"LSMJ01","Macédoine de légumes","Mercredi et jeudi soirs","1 boîte pour 2 repas","Menus journaliers",0.5,null,null,null,null,null,0,"VS07","Cœur","Lundi à dimanche soirs","1 paquet pour 2 repas","Menus journaliers",1,null,null,"Menus journaliers décembre"]
["MJ353","2019-12-19","PC12","Décembre","DS01","Pomme","lundi à vendredi soirs","1 sachet de 2 kilogrammes. 1 pomme pour 1 repas","Menus journaliers",1,"LSMJ01","Macédoine de légumes","Mercredi et jeudi soirs","1 boîte pour 2 repas","Menus journaliers",0.5,null,null,null,null,null,0,"VS22","Saucisson","Lundi à dimanche soirs","1 morceau de 400 grammes (Leclerc) pour 3 repas","Menus journaliers",0.33000001311302185,null,null,"Menus journaliers décembre"]
["MJ354","2019-12-20","PC12","Décembre","DS01","Pomme","lundi à vendredi soirs","1 sachet de 2 kilogrammes. 1 pomme pour 1 repas","Menus journaliers",1,"LSV10","Salsifis","Vendredi soir","1 boîte pour 1 repas","Menus journaliers",1,null,null,null,null,null,0,"VS08","Croque-monsieur","Lundi à dimanche soirs","1 paquet pour 2 repas","Menus journaliers",1,null,null,"Menus journaliers décembre"]
["MJ355","2019-12-21","PC12","Décembre","DWE03","Avocats","Samedi et dimanche midis et soirs","Unité : 1 pour 1 repas","Menus journaliers",2,"LWES03","Pâtes au fromage râpé","Samedi midi et soir","5 cuillères pour 1 repas","Menus journaliers",10,null,null,null,null,null,0,"VS22","Saucisson","Lundi à dimanche soirs","1 morceau de 400 grammes (Leclerc) pour 3 repas","Menus journaliers",0.34000000357627869,null,null,"Menus journaliers décembre"]
["MJ356","2019-12-22","PC12","Décembre","DWE03","Avocats","Samedi et dimanche midis et soirs","Unité : 1 pour 1 repas","Menus journaliers",2,"LWED03","Frites","Dimanche midi","20 frites pour 1 repas","Menus journaliers",20,"LWED01","Asperges","Dimanche soir","1 bocal ou 1 boîte pour 1 repas","Menus journaliers",1,"VS08","Croque-monsieur","Lundi à dimanche soirs","1 paquet pour 2 repas","Menus journaliers",1,null,null,"Menus journaliers décembre"]
["MJ357","2019-12-23","PC12","Décembre","DS01","Pomme","lundi à vendredi soirs","1 sachet de 2 kilogrammes. 1 pomme pour 1 repas","Menus journaliers",1,"LSLM09","Paella","Lundi et mardi soirs","1 boîte pour 2 repas","Menus journaliers",0.5,null,null,null,null,null,0,"VS28","Viande paella","Lundi et mardi soirs","1 boîte pour 2 repas","Menus journaliers",0.5,null,null,"Menus journaliers décembre"]
["MJ358","2019-12-24","PC12","Décembre","DS01","Pomme","lundi à vendredi soirs","1 sachet de 2 kilogrammes. 1 pomme pour 1 repas","Menus journaliers",1,"LSLM09","Paella","Lundi et mardi soirs","1 boîte pour 2 repas","Menus journaliers",0.5,null,null,null,null,null,0,"VS28","Viande paella","Lundi et mardi soirs","1 boîte pour 2 repas","Menus journaliers",0.5,null,null,"Menus journaliers décembre"]
["MJ359","2019-12-25","PC12","Décembre","DS01","Pomme","lundi à vendredi soirs","1 sachet de 2 kilogrammes. 1 pomme pour 1 repas","Menus journaliers",1,"LSMJ02","Petits pois","Mercredi et jeudi soirs","1 boîte pour 2 repas","Menus journaliers",0.5,null,null,null,null,null,0,"VS22","Saucisson","Lundi à dimanche soirs","1 morceau de 400 grammes (Leclerc) pour 3 repas","Menus journaliers",0.33000001311302185,"O09","Noël","Menus journaliers décembre"]
["MJ360","2019-12-26","PC12","Décembre","DS01","Pomme","lundi à vendredi soirs","1 sachet de 2 kilogrammes. 1 pomme pour 1 repas","Menus journaliers",1,"LSMJ02","Petits pois","Mercredi et jeudi soirs","1 boîte pour 2 repas","Menus journaliers",0.5,null,null,null,null,null,0,"VS09","Foie","Lundi à dimanche soirs","1 paquet pour 2 repas","Menus journaliers",1,null,null,"Menus journaliers décembre"]
["MJ361","2019-12-27","PC12","Décembre","DS01","Pomme","lundi à vendredi soirs","1 sachet de 2 kilogrammes. 1 pomme pour 1 repas","Menus journaliers",1,"LSV11","Tomates ","Vendredi soir","Unité : 2 pour 1 repas","Menus journaliers",2,null,null,null,null,null,0,"VS22","Saucisson","Lundi à dimanche soirs","1 morceau de 400 grammes (Leclerc) pour 3 repas","Menus journaliers",0.33000001311302185,null,null,"Menus journaliers décembre"]
["MJ362","2019-12-28","PC12","Décembre","DWE04","Bananes","Samedi et dimanche midis et soirs","Unité : 1 pour 1 repas","Menus journaliers",2,"LWES01","Pâtes à la sauce tomates","Samedi midi et soir","5 cuillères pour 1 repas","Menus journaliers",10,null,null,null,null,null,0,"VS09","Foie","Lundi à dimanche soirs","1 paquet pour 2 repas","Menus journaliers",1,null,null,"Menus journaliers décembre"]
["MJ363","2019-12-29","PC12","Décembre","DWE04","Bananes","Samedi et dimanche midis et soirs","Unité : 1 pour 1 repas","Menus journaliers",2,"LWED04","Haricots verts","Dimanche midi et soir","1 boîte pour 2 repas","Menus journaliers",1,null,null,null,null,null,0,"VS22","Saucisson","Lundi à dimanche soirs","1 morceau de 400 grammes (Leclerc) pour 3 repas","Menus journaliers",0.34000000357627869,null,null,"Menus journaliers décembre"]
["MJ364","2019-12-30","PC12","Décembre","DS01","Pomme","lundi à vendredi soirs","1 sachet de 2 kilogrammes. 1 pomme pour 1 repas","Menus journaliers",1,"LSLM10","Poireau","Lundi et mardi soirs","Unité : 1 pour 1 repas","Menus journaliers",1,null,null,null,null,null,0,"VS10","Fromage de tête","Lundi à dimanche soirs","1 tranche pour 2 repas","Menus journaliers",3,null,null,"Menus journaliers décembre"]
["MJ365","2019-12-31","PC12","Décembre","DS01","Pomme","lundi à vendredi soirs","1 sachet de 2 kilogrammes. 1 pomme pour 1 repas","Menus journaliers",1,"LSLM10","Poireau","Lundi et mardi soirs","Unité : 1 pour 1 repas","Menus journaliers",1,null,null,null,null,null,0,"VS22","Saucisson","Lundi à dimanche soirs","1 morceau de 400 grammes (Leclerc) pour 3 repas","Menus journaliers",0.33000001311302185,null,null,"Menus journaliers décembre"]
["MJ365","2019-12-31","PC12","Décembre","DS01","Pomme","lundi à vendredi soirs","1 sachet de 2 kilogrammes. 1 pomme pour 1 repas","Menus journaliers",1,"LSLM10","Poireau","Lundi et mardi soirs","Unité : 1 pour 1 repas","Menus journaliers",1,null,null,null,null,null,0,"VS22","Saucisson","Lundi à dimanche soirs","1 morceau de 400 grammes (Leclerc) pour 3 repas","Menus journaliers",0.33000001311302185,null,null,"Menus journaliers décembre"]
["MJ364","2019-12-30","PC12","Décembre","DS01","Pomme","lundi à vendredi soirs","1 sachet de 2 kilogrammes. 1 pomme pour 1 repas","Menus journaliers",1,"LSLM10","Poireau","Lundi et mardi soirs","Unité : 1 pour 1 repas","Menus journaliers",1,null,null,null,null,null,0,"VS10","Fromage de tête","Lundi à dimanche soirs","1 tranche pour 2 repas","Menus journaliers",3,null,null,"Menus journaliers décembre"]
["MVWE96","2019-12-01","PC12","Décembre",null,null,null,null,null,0,null,null,null,null,null,0,null,null,null,null,null,0,"VWE07","Veau","Samedi et dimanche midis","1 tranche pour 1 repas","Menus viandes week-end",1,null,null,"Menus viandes weekend deuxième semestre"]
["MVWE97","2019-12-07","PC12","Décembre",null,null,null,null,null,0,null,null,null,null,null,0,null,null,null,null,null,0,"VWE01","Agneau","Samedi et dimanche midis","1 tranche pour 1 repas","Menus viandes week-end",1,null,null,"Menus viandes weekend deuxième semestre"]
["MVWE98","2019-12-08","PC12","Décembre",null,null,null,null,null,0,null,null,null,null,null,0,null,null,null,null,null,0,"VWE02","Bœuf","Samedi et dimanche midis","1 tranche pour 1 repas","Menus viandes week-end",1,null,null,"Menus viandes weekend deuxième semestre"]
["MVWE99","2019-12-14","PC12","Décembre",null,null,null,null,null,0,null,null,null,null,null,0,null,null,null,null,null,0,"VWE03","Cheval","Samedi et dimanche midis","1 tranche pour 1 repas","Menus viandes week-end",1,null,null,"Menus viandes weekend deuxième semestre"]
["MVWE100","2019-12-15","PC12","Décembre",null,null,null,null,null,0,null,null,null,null,null,0,null,null,null,null,null,0,"VWE04","Dinde","Samedi et dimanche midis","1 tranche pour 1 repas","Menus viandes week-end",1,null,null,"Menus viandes weekend deuxième semestre"]
["MVWE101","2019-12-21","PC12","Décembre",null,null,null,null,null,0,null,null,null,null,null,0,null,null,null,null,null,0,"VWE05","Poisson","Samedi et dimanche midis","Unité : 1 pour 1 repas","Menus viandes week-end",1,null,null,"Menus viandes weekend deuxième semestre"]
["MVWE102","2019-12-22","PC12","Décembre",null,null,null,null,null,0,null,null,null,null,null,0,null,null,null,null,null,0,"VWE06","Porc","Samedi et dimanche midis","1 tranche pour 1 repas","Menus viandes week-end",1,null,null,"Menus viandes weekend deuxième semestre"]
["MVWE103","2019-12-28","PC12","Décembre",null,null,null,null,null,0,null,null,null,null,null,0,null,null,null,null,null,0,"VWE07","Veau","Samedi et dimanche midis","1 tranche pour 1 repas","Menus viandes week-end",1,null,null,"Menus viandes weekend deuxième semestre"]
["MVWE104","2019-12-29","PC12","Décembre",null,null,null,null,null,0,null,null,null,null,null,0,null,null,null,null,null,0,"VWE01","Agneau","Samedi et dimanche midis","1 tranche pour 1 repas","Menus viandes week-end",1,null,null,"Menus viandes weekend deuxième semestre"]
["MVWE104","2019-12-29","PC12","Décembre",null,null,null,null,null,0,null,null,null,null,null,0,null,null,null,null,null,0,"VWE01","Agneau","Samedi et dimanche midis","1 tranche pour 1 repas","Menus viandes week-end",1,null,null,"Menus viandes weekend deuxième semestre"]
["MVWE104","2019-12-29","PC12","Décembre",null,null,null,null,null,0,null,null,null,null,null,0,null,null,null,null,null,0,"VWE01","Agneau","Samedi et dimanche midis","1 tranche pour 1 repas","Menus viandes week-end",1,null,null,"Menus viandes weekend deuxième semestre"]
["MVWE104","2019-12-29","PC12","Décembre",null,null,null,null,null,0,null,null,null,null,null,0,null,null,null,null,null,0,"VWE01","Agneau","Samedi et dimanche midis","1 tranche pour 1 repas","Menus viandes week-end",1,null,null,"Menus viandes weekend deuxième semestre"]

{"sheet":"Quantité desserts","index":20,"n_rows":26,"n_cols":15,"rows_kept":26,"cut":false,"hidden":false,"merged":[[0,0,0,14],[25,0,25,14]]}
["Quantité des desserts par articles et par mois pour l'année 2019."]
[]
["Code dessert","Dessert","Janvier","Février","Mars","Avril","Mai","Juin","Juillet","Août","Septembre","Octobre","Novembre","Décembre","Totaux"]
["D01","Ananas",{"$f":"SUMIFS(Janvier!$J$4:$J$720,Janvier!$D$4:$D$720,\"Janvier\",Janvier!$F$4:$F$720,\"Ananas\")","v":0},{"$f":"SUMIFS(Février!$J$4:$J$722,Février!$D$4:$D$722,\"Février\",Février!$F$4:$F$722,\"Ananas\")","v":1},{"$f":"SUMIFS(Mars!$J$4:$J$719,Mars!$D$4:$D$719,\"Mars\",Mars!$F$4:$F$719,\"Ananas\")","v":0},{"$f":"SUMIFS(Avril!$J$4:$J$717,Avril!$D$4:$D$717,\"Avril\",Avril!$F$4:$F$717,\"Ananas\")","v":0},{"$f":"SUMIFS(Mai!$J$4:$J$738,Mai!$D$4:$D$738,\"Mai\",Mai!$F$4:$F$738,\"Ananas\")","v":0},{"$f":"SUMIFS(Juin!$J$4:$J$749,Juin!$D$4:$D$749,\"Juin\",Juin!$F$4:$F$749,\"Ananas\")","v":0},{"$f":"SUMIFS(Juillet!$J$4:$J$750,Juillet!$D$4:$D$750,\"Juillet\",Juillet!$F$4:$F$750,\"Ananas\")","v":1},{"$f":"SUMIFS(Août!$J$4:$J$751,Août!$D$4:$D$751,\"Août\",Août!$F$4:$F$751,\"Ananas\")","v":0},{"$f":"SUMIFS(Septembre!$J$4:$J$750,Septembre!$D$4:$D$750,\"Septembre\",Septembre!$F$4:$F$750,\"Ananas\")","v":0},{"$f":"SUMIFS(Octobre!$J$4:$J$750,Octobre!$D$4:$D$750,\"Octobre\",Octobre!$F$4:$F$750,\"Ananas\")","v":0},{"$f":"SUMIFS(Novembre!$J$4:$J$750,Novembre!$D$4:$D$750,\"Novembre\",Novembre!$F$4:$F$750,\"Ananas\")","v":0},{"$f":"SUMIFS(Décembre!$J$4:$J$750,Décembre!$D$4:$D$750,\"Décembre\",Décembre!$F$4:$F$750,\"Ananas\")","v":1},{"$f":"SUM($C4:$N4)","v":3}]
["D02","Autres fruits",{"$f":"SUMIFS(Janvier!$J$4:$J$720,Janvier!$D$4:$D$720,\"Janvier\",Janvier!$F$4:$F$720,\"Autres fruits\")","v":0},{"$f":"SUMIFS(Février!$J$4:$J$722,Février!$D$4:$D$722,\"Février\",Février!$F$4:$F$722,\"Autres fruits\")","v":16},{"$f":"SUMIFS(Mars!$J$4:$J$719,Mars!$D$4:$D$719,\"Mars\",Mars!$F$4:$F$719,\"Autres fruits\")","v":0},{"$f":"SUMIFS(Avril!$J$4:$J$717,Avril!$D$4:$D$717,\"Avril\",Avril!$F$4:$F$717,\"Autres fruits\")","v":0},{"$f":"SUMIFS(Mai!$J$4:$J$738,Mai!$D$4:$D$738,\"Mai\",Mai!$F$4:$F$738,\"Autres fruits\")","v":0},{"$f":"SUMIFS(Juin!$J$4:$J$749,Juin!$D$4:$D$749,\"Juin\",Juin!$F$4:$F$749,\"Autres fruits\")","v":0},{"$f":"SUMIFS(Juillet!$J$4:$J$750,Juillet!$D$4:$D$750,\"Juillet\",Juillet!$F$4:$F$750,\"Autres fruits\")","v":8},{"$f":"SUMIFS(Août!$J$4:$J$751,Août!$D$4:$D$751,\"Août\",Août!$F$4:$F$751,\"Autres fruits\")","v":0},{"$f":"SUMIFS(Septembre!$J$4:$J$750,Septembre!$D$4:$D$750,\"Septembre\",Septembre!$F$4:$F$750,\"Autres fruits\")","v":0},{"$f":"SUMIFS(Octobre!$J$4:$J$750,Octobre!$D$4:$D$750,\"Octobre\",Octobre!$F$4:$F$750,\"Autres fruits\")","v":0},{"$f":"SUMIFS(Novembre!$J$4:$J$750,Novembre!$D$4:$D$750,\"Novembre\",Novembre!$F$4:$F$750,\"Autres fruits\")","v":0},{"$f":"SUMIFS(Décembre!$J$4:$J$750,Décembre!$D$4:$D$750,\"Décembre\",Décembre!$F$4:$F$750,\"Autres fruits\")","v":16},{"$f":"SUM($C5:$N5)","v":40}]
["D03","Avocats",{"$f":"SUMIFS(Janvier!$J$4:$J$720,Janvier!$D$4:$D$720,\"Janvier\",Janvier!$F$4:$F$720,\"Avocats\")","v":0},{"$f":"SUMIFS(Février!$J$4:$J$722,Février!$D$4:$D$722,\"Février\",Février!$F$4:$F$722,\"Avocats\")","v":0},{"$f":"SUMIFS(Mars!$J$4:$J$719,Mars!$D$4:$D$719,\"Mars\",Mars!$F$4:$F$719,\"Avocats\")","v":4},{"$f":"SUMIFS(Avril!$J$4:$J$717,Avril!$D$4:$D$717,\"Avril\",Avril!$F$4:$F$717,\"Avocats\")","v":0},{"$f":"SUMIFS(Mai!$J$4:$J$738,Mai!$D$4:$D$738,\"Mai\",Mai!$F$4:$F$738,\"Avocats\")","v":0},{"$f":"SUMIFS(Juin!$J$4:$J$749,Juin!$D$4:$D$749,\"Juin\",Juin!$F$4:$F$749,\"Avocats\")","v":0},{"$f":"SUMIFS(Juillet!$J$4:$J$750,Juillet!$D$4:$D$750,\"Juillet\",Juillet!$F$4:$F$750,\"Avocats\")","v":4},{"$f":"SUMIFS(Août!$J$4:$J$751,Août!$D$4:$D$751,\"Août\",Août!$F$4:$F$751,\"Avocats\")","v":0},{"$f":"SUMIFS(Septembre!$J$4:$J$750,Septembre!$D$4:$D$750,\"Septembre\",Septembre!$F$4:$F$750,\"Avocats\")","v":0},{"$f":"SUMIFS(Octobre!$J$4:$J$750,Octobre!$D$4:$D$750,\"Octobre\",Octobre!$F$4:$F$750,\"Avocats\")","v":0},{"$f":"SUMIFS(Novembre!$J$4:$J$750,Novembre!$D$4:$D$750,\"Novembre\",Novembre!$F$4:$F$750,\"Avocats\")","v":0},{"$f":"SUMIFS(Décembre!$J$4:$J$750,Décembre!$D$4:$D$750,\"Décembre\",Décembre!$F$4:$F$750,\"Avocats\")","v":4},12]
["D04","Bananes",{"$f":"SUMIFS(Janvier!$J$4:$J$720,Janvier!$D$4:$D$720,\"Janvier\",Janvier!$F$4:$F$720,\"Bananes\")","v":0},{"$f":"SUMIFS(Février!$J$4:$J$722,Février!$D$4:$D$722,\"Février\",Février!$F$4:$F$722,\"Bananes\")","v":0},{"$f":"SUMIFS(Mars!$J$4:$J$719,Mars!$D$4:$D$719,\"Mars\",Mars!$F$4:$F$719,\"Bananes\")","v":4},{"$f":"SUMIFS(Avril!$J$4:$J$717,Avril!$D$4:$D$717,\"Avril\",Avril!$F$4:$F$717,\"Bananes\")","v":0},{"$f":"SUMIFS(Mai!$J$4:$J$738,Mai!$D$4:$D$738,\"Mai\",Mai!$F$4:$F$738,\"Bananes\")","v":0},{"$f":"SUMIFS(Juin!$J$4:$J$749,Juin!$D$4:$D$749,\"Juin\",Juin!$F$4:$F$749,\"Bananes\")","v":0},{"$f":"SUMIFS(Juillet!$J$4:$J$750,Juillet!$D$4:$D$750,\"Juillet\",Juillet!$F$4:$F$750,\"Bananes\")","v":0},{"$f":"SUMIFS(Août!$J$4:$J$751,Août!$D$4:$D$751,\"Août\",Août!$F$4:$F$751,\"Bananes\")","v":4},{"$f":"SUMIFS(Septembre!$J$4:$J$750,Septembre!$D$4:$D$750,\"Septembre\",Septembre!$F$4:$F$750,\"Bananes\")","v":0},{"$f":"SUMIFS(Octobre!$J$4:$J$750,Octobre!$D$4:$D$750,\"Octobre\",Octobre!$F$4:$F$750,\"Bananes\")","v":0},{"$f":"SUMIFS(Novembre!$J$4:$J$750,Novembre!$D$4:$D$750,\"Novembre\",Novembre!$F$4:$F$750,\"Bananes\")","v":0},{"$f":"SUMIFS(Décembre!$J$4:$J$750,Décembre!$D$4:$D$750,\"Décembre\",Décembre!$F$4:$F$750,\"Bananes\")","v":4},12]
["D05","Clémentines",{"$f":"SUMIFS(Janvier!$J$4:$J$720,Janvier!$D$4:$D$720,\"Janvier\",Janvier!$F$4:$F$720,\"Clémentines\")","v":0},{"$f":"SUMIFS(Février!$J$4:$J$722,Février!$D$4:$D$722,\"Février\",Février!$F$4:$F$722,\"Clémentines\")","v":0},{"$f":"SUMIFS(Mars!$J$4:$J$719,Mars!$D$4:$D$719,\"Mars\",Mars!$F$4:$F$719,\"Clémentines\")","v":8},{"$f":"SUMIFS(Avril!$J$4:$J$717,Avril!$D$4:$D$717,\"Avril\",Avril!$F$4:$F$717,\"Clémentines\")","v":0},{"$f":"SUMIFS(Mai!$J$4:$J$738,Mai!$D$4:$D$738,\"Mai\",Mai!$F$4:$F$738,\"Clémentines\")","v":0},{"$f":"SUMIFS(Juin!$J$4:$J$749,Juin!$D$4:$D$749,\"Juin\",Juin!$F$4:$F$749,\"Clémentines\")","v":0},{"$f":"SUMIFS(Juillet!$J$4:$J$750,Juillet!$D$4:$D$750,\"Juillet\",Juillet!$F$4:$F$750,\"Clémentines\")","v":0},{"$f":"SUMIFS(Août!$J$4:$J$751,Août!$D$4:$D$751,\"Août\",Août!$F$4:$F$751,\"Clémentines\")","v":16},{"$f":"SUMIFS(Septembre!$J$4:$J$750,Septembre!$D$4:$D$750,\"Septembre\",Septembre!$F$4:$F$750,\"Clémentines\")","v":0},{"$f":"SUMIFS(Octobre!$J$4:$J$750,Octobre!$D$4:$D$750,\"Octobre\",Octobre!$F$4:$F$750,\"Clémentines\")","v":0},{"$f":"SUMIFS(Novembre!$J$4:$J$750,Novembre!$D$4:$D$750,\"Novembre\",Novembre!$F$4:$F$750,\"Clémentines\")","v":0},{"$f":"SUMIFS(Décembre!$J$4:$J$750,Décembre!$D$4:$D$750,\"Décembre\",Décembre!$F$4:$F$750,\"Clémentines\")","v":0},24]
["D06","Crème",{"$f":"SUMIFS(Janvier!$J$4:$J$720,Janvier!$D$4:$D$720,\"Janvier\",Janvier!$F$4:$F$720,\"Crème\")","v":0},{"$f":"SUMIFS(Février!$J$4:$J$722,Février!$D$4:$D$722,\"Février\",Février!$F$4:$F$722,\"Crème\")","v":0},{"$f":"SUMIFS(Mars!$J$4:$J$719,Mars!$D$4:$D$719,\"Mars\",Mars!$F$4:$F$719,\"Crème\")","v":4},{"$f":"SUMIFS(Avril!$J$4:$J$717,Avril!$D$4:$D$717,\"Avril\",Avril!$F$4:$F$717,\"Crème\")","v":0},{"$f":"SUMIFS(Mai!$J$4:$J$738,Mai!$D$4:$D$738,\"Mai\",Mai!$F$4:$F$738,\"Crème\")","v":0},{"$f":"SUMIFS(Juin!$J$4:$J$749,Juin!$D$4:$D$749,\"Juin\",Juin!$F$4:$F$749,\"Crème\")","v":0},{"$f":"SUMIFS(Juillet!$J$4:$J$750,Juillet!$D$4:$D$750,\"Juillet\",Juillet!$F$4:$F$750,\"Crème\")","v":0},{"$f":"SUMIFS(Août!$J$4:$J$751,Août!$D$4:$D$751,\"Août\",Août!$F$4:$F$751,\"Crème\")","v":4},{"$f":"SUMIFS(Septembre!$J$4:$J$750,Septembre!$D$4:$D$750,\"Septembre\",Septembre!$F$4:$F$750,\"Crème\")","v":0},{"$f":"SUMIFS(Octobre!$J$4:$J$750,Octobre!$D$4:$D$750,\"Octobre\",Octobre!$F$4:$F$750,\"Crème\")","v":0},{"$f":"SUMIFS(Novembre!$J$4:$J$750,Novembre!$D$4:$D$750,\"Novembre\",Novembre!$F$4:$F$750,\"Crème\")","v":0},{"$f":"SUMIFS(Décembre!$J$4:$J$750,Décembre!$D$4:$D$750,\"Décembre\",Décembre!$F$4:$F$750,\"Crème\")","v":0},8]
["D07","Dattes",{"$f":"SUMIFS(Janvier!$J$4:$J$720,Janvier!$D$4:$D$720,\"Janvier\",Janvier!$F$4:$F$720,\"Dattes\")","v":0},{"$f":"SUMIFS(Février!$J$4:$J$722,Février!$D$4:$D$722,\"Février\",Février!$F$4:$F$722,\"Dattes\")","v":0},{"$f":"SUMIFS(Mars!$J$4:$J$719,Mars!$D$4:$D$719,\"Mars\",Mars!$F$4:$F$719,\"Dattes\")","v":1},{"$f":"SUMIFS(Avril!$J$4:$J$717,Avril!$D$4:$D$717,\"Avril\",Avril!$F$4:$F$717,\"Dattes\")","v":0},{"$f":"SUMIFS(Mai!$J$4:$J$738,Mai!$D$4:$D$738,\"Mai\",Mai!$F$4:$F$738,\"Dattes\")","v":0},{"$f":"SUMIFS(Juin!$J$4:$J$749,Juin!$D$4:$D$749,\"Juin\",Juin!$F$4:$F$749,\"Dattes\")","v":0},{"$f":"SUMIFS(Juillet!$J$4:$J$750,Juillet!$D$4:$D$750,\"Juillet\",Juillet!$F$4:$F$750,\"Dattes\")","v":0},{"$f":"SUMIFS(Août!$J$4:$J$751,Août!$D$4:$D$751,\"Août\",Août!$F$4:$F$751,\"Dattes\")","v":1},{"$f":"SUMIFS(Septembre!$J$4:$J$750,Septembre!$D$4:$D$750,\"Septembre\",Septembre!$F$4:$F$750,\"Dattes\")","v":0},{"$f":"SUMIFS(Octobre!$J$4:$J$750,Octobre!$D$4:$D$750,\"Octobre\",Octobre!$F$4:$F$750,\"Dattes\")","v":0},{"$f":"SUMIFS(Novembre!$J$4:$J$750,Novembre!$D$4:$D$750,\"Novembre\",Novembre!$F$4:$F$750,\"Dattes\")","v":0},{"$f":"SUMIFS(Décembre!$J$4:$J$750,Décembre!$D$4:$D$750,\"Décembre\",Décembre!$F$4:$F$750,\"Dattes\")","v":0},2]
["D08","Figues",{"$f":"SUMIFS(Janvier!$J$4:$J$720,Janvier!$D$4:$D$720,\"Janvier\",Janvier!$F$4:$F$720,\"Figues\")","v":0},{"$f":"SUMIFS(Février!$J$4:$J$722,Février!$D$4:$D$722,\"Février\",Février!$F$4:$F$722,\"Figues\")","v":0},{"$f":"SUMIFS(Mars!$J$4:$J$719,Mars!$D$4:$D$719,\"Mars\",Mars!$F$4:$F$719,\"Figues\")","v":0},{"$f":"SUMIFS(Avril!$J$4:$J$717,Avril!$D$4:$D$717,\"Avril\",Avril!$F$4:$F$717,\"Figues\")","v":1},{"$f":"SUMIFS(Mai!$J$4:$J$738,Mai!$D$4:$D$738,\"Mai\",Mai!$F$4:$F$738,\"Figues\")","v":0},{"$f":"SUMIFS(Juin!$J$4:$J$749,Juin!$D$4:$D$749,\"Juin\",Juin!$F$4:$F$749,\"Figues\")","v":0},{"$f":"SUMIFS(Juillet!$J$4:$J$750,Juillet!$D$4:$D$750,\"Juillet\",Juillet!$F$4:$F$750,\"Figues\")","v":0},{"$f":"SUMIFS(Août!$J$4:$J$751,Août!$D$4:$D$751,\"Août\",Août!$F$4:$F$751,\"Figues\")","v":0.5},{"$f":"SUMIFS(Septembre!$J$4:$J$750,Septembre!$D$4:$D$750,\"Septembre\",Septembre!$F$4:$F$750,\"Figues\")","v":0.5},{"$f":"SUMIFS(Octobre!$J$4:$J$750,Octobre!$D$4:$D$750,\"Octobre\",Octobre!$F$4:$F$750,\"Figues\")","v":0},{"$f":"SUMIFS(Novembre!$J$4:$J$750,Novembre!$D$4:$D$750,\"Novembre\",Novembre!$F$4:$F$750,\"Figues\")","v":0},{"$f":"SUMIFS(Décembre!$J$4:$J$750,Décembre!$D$4:$D$750,\"Décembre\",Décembre!$F$4:$F$750,\"Figues\")","v":0},2]
["D09","Fromage blanc",{"$f":"SUMIFS(Janvier!$J$4:$J$720,Janvier!$D$4:$D$720,\"Janvier\",Janvier!$F$4:$F$720,\"Fromage blanc\")","v":0},{"$f":"SUMIFS(Février!$J$4:$J$722,Février!$D$4:$D$722,\"Février\",Février!$F$4:$F$722,\"Fromage blanc\")","v":0},{"$f":"SUMIFS(Mars!$J$4:$J$719,Mars!$D$4:$D$719,\"Mars\",Mars!$F$4:$F$719,\"Fromage blanc\")","v":0},{"$f":"SUMIFS(Avril!$J$4:$J$717,Avril!$D$4:$D$717,\"Avril\",Avril!$F$4:$F$717,\"Fromage blanc\")","v":4},{"$f":"SUMIFS(Mai!$J$4:$J$738,Mai!$D$4:$D$738,\"Mai\",Mai!$F$4:$F$738,\"Fromage blanc\")","v":0},{"$f":"SUMIFS(Juin!$J$4:$J$749,Juin!$D$4:$D$749,\"Juin\",Juin!$F$4:$F$749,\"Fromage blanc\")","v":0},{"$f":"SUMIFS(Juillet!$J$4:$J$750,Juillet!$D$4:$D$750,\"Juillet\",Juillet!$F$4:$F$750,\"Fromage blanc\")","v":0},{"$f":"SUMIFS(Août!$J$4:$J$751,Août!$D$4:$D$751,\"Août\",Août!$F$4:$F$751,\"Fromage blanc\")","v":0},{"$f":"SUMIFS(Septembre!$J$4:$J$750,Septembre!$D$4:$D$750,\"Septembre\",Septembre!$F$4:$F$750,\"Fromage blanc\")","v":4},{"$f":"SUMIFS(Octobre!$J$4:$J$750,Octobre!$D$4:$D$750,\"Octobre\",Octobre!$F$4:$F$750,\"Fromage blanc\")","v":0},{"$f":"SUMIFS(Novembre!$J$4:$J$750,Novembre!$D$4:$D$750,\"Novembre\",Novembre!$F$4:$F$750,\"Fromage blanc\")","v":0},{"$f":"SUMIFS(Décembre!$J$4:$J$750,Décembre!$D$4:$D$750,\"Décembre\",Décembre!$F$4:$F$750,\"Fromage blanc\")","v":0},8]
["D10","Fruits au sirop",{"$f":"SUMIFS(Janvier!$J$4:$J$720,Janvier!$D$4:$D$720,\"Janvier\",Janvier!$F$4:$F$720,\"Fruits au sirop\")","v":0},{"$f":"SUMIFS(Février!$J$4:$J$722,Février!$D$4:$D$722,\"Février\",Février!$F$4:$F$722,\"Fruits au sirop\")","v":0},{"$f":"SUMIFS(Mars!$J$4:$J$719,Mars!$D$4:$D$719,\"Mars\",Mars!$F$4:$F$719,\"Fruits au sirop\")","v":0},{"$f":"SUMIFS(Avril!$J$4:$J$717,Avril!$D$4:$D$717,\"Avril\",Avril!$F$4:$F$717,\"Fruits au sirop\")","v":2},{"$f":"SUMIFS(Mai!$J$4:$J$738,Mai!$D$4:$D$738,\"Mai\",Mai!$F$4:$F$738,\"Fruits au sirop\")","v":0},{"$f":"SUMIFS(Juin!$J$4:$J$749,Juin!$D$4:$D$749,\"Juin\",Juin!$F$4:$F$749,\"Fruits au sirop\")","v":0},{"$f":"SUMIFS(Juillet!$J$4:$J$750,Juillet!$D$4:$D$750,\"Juillet\",Juillet!$F$4:$F$750,\"Fruits au sirop\")","v":0},{"$f":"SUMIFS(Août!$J$4:$J$751,Août!$D$4:$D$751,\"Août\",Août!$F$4:$F$751,\"Fruits au sirop\")","v":0},{"$f":"SUMIFS(Septembre!$J$4:$J$750,Septembre!$D$4:$D$750,\"Septembre\",Septembre!$F$4:$F$750,\"Fruits au sirop\")","v":2},{"$f":"SUMIFS(Octobre!$J$4:$J$750,Octobre!$D$4:$D$750,\"Octobre\",Octobre!$F$4:$F$750,\"Fruits au sirop\")","v":0},{"$f":"SUMIFS(Novembre!$J$4:$J$750,Novembre!$D$4:$D$750,\"Novembre\",Novembre!$F$4:$F$750,\"Fruits au sirop\")","v":0},{"$f":"SUMIFS(Décembre!$J$4:$J$750,Décembre!$D$4:$D$750,\"Décembre\",Décembre!$F$4:$F$750,\"Fruits au sirop\")","v":0},4]
["D11","Fruits de saison",{"$f":"SUMIFS(Janvier!$J$4:$J$720,Janvier!$D$4:$D$720,\"Janvier\",Janvier!$F$4:$F$720,\"Fruits de saison\")","v":0},{"$f":"SUMIFS(Février!$J$4:$J$722,Février!$D$4:$D$722,\"Février\",Février!$F$4:$F$722,\"Fruits de saison\")","v":0},{"$f":"SUMIFS(Mars!$J$4:$J$719,Mars!$D$4:$D$719,\"Mars\",Mars!$F$4:$F$719,\"Fruits de saison\")","v":0},{"$f":"SUMIFS(Avril!$J$4:$J$717,Avril!$D$4:$D$717,\"Avril\",Avril!$F$4:$F$717,\"Fruits de saison\")","v":8},{"$f":"SUMIFS(Mai!$J$4:$J$738,Mai!$D$4:$D$738,\"Mai\",Mai!$F$4:$F$738,\"Fruits de saison\")","v":0},{"$f":"SUMIFS(Juin!$J$4:$J$749,Juin!$D$4:$D$749,\"Juin\",Juin!$F$4:$F$749,\"Fruits de saison\")","v":0},{"$f":"SUMIFS(Juillet!$J$4:$J$750,Juillet!$D$4:$D$750,\"Juillet\",Juillet!$F$4:$F$750,\"Fruits de saison\")","v":0},{"$f":"SUMIFS(Août!$J$4:$J$751,Août!$D$4:$D$751,\"Août\",Août!$F$4:$F$751,\"Fruits de saison\")","v":0},{"$f":"SUMIFS(Septembre!$J$4:$J$750,Septembre!$D$4:$D$750,\"Septembre\",Septembre!$F$4:$F$750,\"Fruits de saison\")","v":16},{"$f":"SUMIFS(Octobre!$J$4:$J$750,Octobre!$D$4:$D$750,\"Octobre\",Octobre!$F$4:$F$750,\"Fruits de saison\")","v":0},{"$f":"SUMIFS(Novembre!$J$4:$J$750,Novembre!$D$4:$D$750,\"Novembre\",Novembre!$F$4:$F$750,\"Fruits de saison\")","v":0},{"$f":"SUMIFS(Décembre!$J$4:$J$750,Décembre!$D$4:$D$750,\"Décembre\",Décembre!$F$4:$F$750,\"Fruits de saison\")","v":0},24]
["D12","Gâteau de riz",{"$f":"SUMIFS(Janvier!$J$4:$J$720,Janvier!$D$4:$D$720,\"Janvier\",Janvier!$F$4:$F$720,\"Gâteau de riz\")","v":4},{"$f":"SUMIFS(Février!$J$4:$J$722,Février!$D$4:$D$722,\"Février\",Février!$F$4:$F$722,\"Gâteau de riz\")","v":0},{"$f":"SUMIFS(Mars!$J$4:$J$719,Mars!$D$4:$D$719,\"Mars\",Mars!$F$4:$F$719,\"Gâteau de riz\")","v":0},{"$f":"SUMIFS(Avril!$J$4:$J$717,Avril!$D$4:$D$717,\"Avril\",Avril!$F$4:$F$717,\"Gâteau de riz\")","v":0},{"$f":"SUMIFS(Mai!$J$4:$J$738,Mai!$D$4:$D$738,\"Mai\",Mai!$F$4:$F$738,\"Gâteau de riz\")","v":4},{"$f":"SUMIFS(Juin!$J$4:$J$749,Juin!$D$4:$D$749,\"Juin\",Juin!$F$4:$F$749,\"Gâteau de riz\")","v":4},{"$f":"SUMIFS(Juillet!$J$4:$J$750,Juillet!$D$4:$D$750,\"Juillet\",Juillet!$F$4:$F$750,\"Gâteau de riz\")","v":0},{"$f":"SUMIFS(Août!$J$4:$J$751,Août!$D$4:$D$751,\"Août\",Août!$F$4:$F$751,\"Gâteau de riz\")","v":0},{"$f":"SUMIFS(Septembre!$J$4:$J$750,Septembre!$D$4:$D$750,\"Septembre\",Septembre!$F$4:$F$750,\"Gâteau de riz\")","v":4},{"$f":"SUMIFS(Octobre!$J$4:$J$750,Octobre!$D$4:$D$750,\"Octobre\",Octobre!$F$4:$F$750,\"Gâteau de riz\")","v":0},{"$f":"SUMIFS(Novembre!$J$4:$J$750,Novembre!$D$4:$D$750,\"Novembre\",Novembre!$F$4:$F$750,\"Gâteau de riz\")","v":4},{"$f":"SUMIFS(Décembre!$J$4:$J$750,Décembre!$D$4:$D$750,\"Décembre\",Décembre!$F$4:$F$750,\"Gâteau de riz\")","v":0},20]
["D13","Gâteaux samedi et dimanche",{"$f":"SUMIFS(Janvier!$J$4:$J$720,Janvier!$D$4:$D$720,\"Janvier\",Janvier!$F$4:$F$720,\"Gâteaux samedi et dimanche\")","v":0},{"$f":"SUMIFS(Février!$J$4:$J$722,Février!$D$4:$D$722,\"Février\",Février!$F$4:$F$722,\"Gâteaux samedi et dimanche\")","v":0},{"$f":"SUMIFS(Mars!$J$4:$J$719,Mars!$D$4:$D$719,\"Mars\",Mars!$F$4:$F$719,\"Gâteaux samedi et dimanche\")","v":0},{"$f":"SUMIFS(Avril!$J$4:$J$717,Avril!$D$4:$D$717,\"Avril\",Avril!$F$4:$F$717,\"Gâteaux samedi et dimanche\")","v":0},{"$f":"SUMIFS(Mai!$J$4:$J$738,Mai!$D$4:$D$738,\"Mai\",Mai!$F$4:$F$738,\"Gâteaux samedi et dimanche\")","v":4},{"$f":"SUMIFS(Juin!$J$4:$J$749,Juin!$D$4:$D$749,\"Juin\",Juin!$F$4:$F$749,\"Gâteaux samedi et dimanche\")","v":0},{"$f":"SUMIFS(Juillet!$J$4:$J$750,Juillet!$D$4:$D$750,\"Juillet\",Juillet!$F$4:$F$750,\"Gâteaux samedi et dimanche\")","v":0},{"$f":"SUMIFS(Août!$J$4:$J$751,Août!$D$4:$D$751,\"Août\",Août!$F$4:$F$751,\"Gâteaux samedi et dimanche\")","v":0},{"$f":"SUMIFS(Septembre!$J$4:$J$750,Septembre!$D$4:$D$750,\"Septembre\",Septembre!$F$4:$F$750,\"Gâteaux samedi et dimanche\")","v":0},{"$f":"SUMIFS(Octobre!$J$4:$J$750,Octobre!$D$4:$D$750,\"Octobre\",Octobre!$F$4:$F$750,\"Gâteaux samedi et dimanche\")","v":4},{"$f":"SUMIFS(Novembre!$J$4:$J$750,Novembre!$D$4:$D$750,\"Novembre\",Novembre!$F$4:$F$750,\"Gâteaux samedi et dimanche\")","v":0},{"$f":"SUMIFS(Décembre!$J$4:$J$750,Décembre!$D$4:$D$750,\"Décembre\",Décembre!$F$4:$F$750,\"Gâteaux samedi et dimanche\")","v":0},8]
["D14","Mousse au chocolat",{"$f":"SUMIFS(Janvier!$J$4:$J$720,Janvier!$D$4:$D$720,\"Janvier\",Janvier!$F$4:$F$720,\"Mousse au chocolat\")","v":0},{"$f":"SUMIFS(Février!$J$4:$J$722,Février!$D$4:$D$722,\"Février\",Février!$F$4:$F$722,\"Mousse au chocolat\")","v":0},{"$f":"SUMIFS(Mars!$J$4:$J$719,Mars!$D$4:$D$719,\"Mars\",Mars!$F$4:$F$719,\"Mousse au chocolat\")","v":0},{"$f":"SUMIFS(Avril!$J$4:$J$717,Avril!$D$4:$D$717,\"Avril\",Avril!$F$4:$F$717,\"Mousse au chocolat\")","v":0},{"$f":"SUMIFS(Mai!$J$4:$J$738,Mai!$D$4:$D$738,\"Mai\",Mai!$F$4:$F$738,\"Mousse au chocolat\")","v":4},{"$f":"SUMIFS(Juin!$J$4:$J$749,Juin!$D$4:$D$749,\"Juin\",Juin!$F$4:$F$749,\"Mousse au chocolat\")","v":0},{"$f":"SUMIFS(Juillet!$J$4:$J$750,Juillet!$D$4:$D$750,\"Juillet\",Juillet!$F$4:$F$750,\"Mousse au chocolat\")","v":0},{"$f":"SUMIFS(Août!$J$4:$J$751,Août!$D$4:$D$751,\"Août\",Août!$F$4:$F$751,\"Mousse au chocolat\")","v":0},{"$f":"SUMIFS(Septembre!$J$4:$J$750,Septembre!$D$4:$D$750,\"Septembre\",Septembre!$F$4:$F$750,\"Mousse au chocolat\")","v":0},{"$f":"SUMIFS(Octobre!$J$4:$J$750,Octobre!$D$4:$D$750,\"Octobre\",Octobre!$F$4:$F$750,\"Mousse au chocolat\")","v":4},{"$f":"SUMIFS(Novembre!$J$4:$J$750,Novembre!$D$4:$D$750,\"Novembre\",Novembre!$F$4:$F$750,\"Mousse au chocolat\")","v":0},{"$f":"SUMIFS(Décembre!$J$4:$J$750,Décembre!$D$4:$D$750,\"Décembre\",Décembre!$F$4:$F$750,\"Mousse au chocolat\")","v":0},8]
["D15","Oranges",{"$f":"SUMIFS(Janvier!$J$4:$J$720,Janvier!$D$4:$D$720,\"Janvier\",Janvier!$F$4:$F$720,\"Oranges\")","v":4},{"$f":"SUMIFS(Février!$J$4:$J$722,Février!$D$4:$D$722,\"Février\",Février!$F$4:$F$722,\"Oranges\")","v":0},{"$f":"SUMIFS(Mars!$J$4:$J$719,Mars!$D$4:$D$719,\"Mars\",Mars!$F$4:$F$719,\"Oranges\")","v":0},{"$f":"SUMIFS(Avril!$J$4:$J$717,Avril!$D$4:$D$717,\"Avril\",Avril!$F$4:$F$717,\"Oranges\")","v":0},{"$f":"SUMIFS(Mai!$J$4:$J$738,Mai!$D$4:$D$738,\"Mai\",Mai!$F$4:$F$738,\"Oranges\")","v":0},{"$f":"SUMIFS(Juin!$J$4:$J$749,Juin!$D$4:$D$749,\"Juin\",Juin!$F$4:$F$749,\"Oranges\")","v":4},{"$f":"SUMIFS(Juillet!$J$4:$J$750,Juillet!$D$4:$D$750,\"Juillet\",Juillet!$F$4:$F$750,\"Oranges\")","v":0},{"$f":"SUMIFS(Août!$J$4:$J$751,Août!$D$4:$D$751,\"Août\",Août!$F$4:$F$751,\"Oranges\")","v":0},{"$f":"SUMIFS(Septembre!$J$4:$J$750,Septembre!$D$4:$D$750,\"Septembre\",Septembre!$F$4:$F$750,\"Oranges\")","v":0},{"$f":"SUMIFS(Octobre!$J$4:$J$750,Octobre!$D$4:$D$750,\"Octobre\",Octobre!$F$4:$F$750,\"Oranges\")","v":4},{"$f":"SUMIFS(Novembre!$J$4:$J$750,Novembre!$D$4:$D$750,\"Novembre\",Novembre!$F$4:$F$750,\"Oranges\")","v":0},{"$f":"SUMIFS(Décembre!$J$4:$J$750,Décembre!$D$4:$D$750,\"Décembre\",Décembre!$F$4:$F$750,\"Oranges\")","v":0},12]
["D16","Petits suisses",{"$f":"SUMIFS(Janvier!$J$4:$J$720,Janvier!$D$4:$D$720,\"Janvier\",Janvier!$F$4:$F$720,\"Petits suisses\")","v":12},{"$f":"SUMIFS(Février!$J$4:$J$722,Février!$D$4:$D$722,\"Février\",Février!$F$4:$F$722,\"Petits suisses\")","v":0},{"$f":"SUMIFS(Mars!$J$4:$J$719,Mars!$D$4:$D$719,\"Mars\",Mars!$F$4:$F$719,\"Petits suisses\")","v":0},{"$f":"SUMIFS(Avril!$J$4:$J$717,Avril!$D$4:$D$717,\"Avril\",Avril!$F$4:$F$717,\"Petits suisses\")","v":0},{"$f":"SUMIFS(Mai!$J$4:$J$738,Mai!$D$4:$D$738,\"Mai\",Mai!$F$4:$F$738,\"Petits suisses\")","v":0},{"$f":"SUMIFS(Juin!$J$4:$J$749,Juin!$D$4:$D$749,\"Juin\",Juin!$F$4:$F$749,\"Petits suisses\")","v":12},{"$f":"SUMIFS(Juillet!$J$4:$J$750,Juillet!$D$4:$D$750,\"Juillet\",Juillet!$F$4:$F$750,\"Petits suisses\")","v":0},{"$f":"SUMIFS(Août!$J$4:$J$751,Août!$D$4:$D$751,\"Août\",Août!$F$4:$F$751,\"Petits suisses\")","v":0},{"$f":"SUMIFS(Septembre!$J$4:$J$750,Septembre!$D$4:$D$750,\"Septembre\",Septembre!$F$4:$F$750,\"Petits suisses\")","v":0},{"$f":"SUMIFS(Octobre!$J$4:$J$750,Octobre!$D$4:$D$750,\"Octobre\",Octobre!$F$4:$F$750,\"Petits suisses\")","v":0},{"$f":"SUMIFS(Novembre!$J$4:$J$750,Novembre!$D$4:$D$750,\"Novembre\",Novembre!$F$4:$F$750,\"Petits suisses\")","v":12},{"$f":"SUMIFS(Décembre!$J$4:$J$750,Décembre!$D$4:$D$750,\"Décembre\",Décembre!$F$4:$F$750,\"Petits suisses\")","v":0},36]
["D17","Pomme",{"$f":"SUMIFS(Janvier!$J$4:$J$720,Janvier!$D$4:$D$720,\"Janvier\",Janvier!$F$4:$F$720,\"Pomme\")","v":46},{"$f":"SUMIFS(Février!$J$4:$J$722,Février!$D$4:$D$722,\"Février\",Février!$F$4:$F$722,\"Pomme\")","v":40},{"$f":"SUMIFS(Mars!$J$4:$J$719,Mars!$D$4:$D$719,\"Mars\",Mars!$F$4:$F$719,\"Pomme\")","v":42},{"$f":"SUMIFS(Avril!$J$4:$J$717,Avril!$D$4:$D$717,\"Avril\",Avril!$F$4:$F$717,\"Pomme\")","v":43},{"$f":"SUMIFS(Mai!$J$4:$J$738,Mai!$D$4:$D$738,\"Mai\",Mai!$F$4:$F$738,\"Pomme\")","v":46},{"$f":"SUMIFS(Juin!$J$4:$J$749,Juin!$D$4:$D$749,\"Juin\",Juin!$F$4:$F$749,\"Pomme\")","v":40},{"$f":"SUMIFS(Juillet!$J$4:$J$750,Juillet!$D$4:$D$750,\"Juillet\",Juillet!$F$4:$F$750,\"Pomme\")","v":46},{"$f":"SUMIFS(Août!$J$4:$J$751,Août!$D$4:$D$751,\"Août\",Août!$F$4:$F$751,\"Pomme\")","v":44},{"$f":"SUMIFS(Septembre!$J$4:$J$750,Septembre!$D$4:$D$750,\"Septembre\",Septembre!$F$4:$F$750,\"Pomme\")","v":42},{"$f":"SUMIFS(Octobre!$J$4:$J$750,Octobre!$D$4:$D$750,\"Octobre\",Octobre!$F$4:$F$750,\"Pomme\")","v":46},{"$f":"SUMIFS(Novembre!$J$4:$J$750,Novembre!$D$4:$D$750,\"Novembre\",Novembre!$F$4:$F$750,\"Pomme\")","v":42},{"$f":"SUMIFS(Décembre!$J$4:$J$750,Décembre!$D$4:$D$750,\"Décembre\",Décembre!$F$4:$F$750,\"Pomme\")","v":46},523]
["D18","Pruneaux",{"$f":"SUMIFS(Janvier!$J$4:$J$720,Janvier!$D$4:$D$720,\"Janvier\",Janvier!$F$4:$F$720,\"Pruneaux\")","v":1},{"$f":"SUMIFS(Février!$J$4:$J$722,Février!$D$4:$D$722,\"Février\",Février!$F$4:$F$722,\"Pruneaux\")","v":0},{"$f":"SUMIFS(Mars!$J$4:$J$719,Mars!$D$4:$D$719,\"Mars\",Mars!$F$4:$F$719,\"Pruneaux\")","v":0},{"$f":"SUMIFS(Avril!$J$4:$J$717,Avril!$D$4:$D$717,\"Avril\",Avril!$F$4:$F$717,\"Pruneaux\")","v":0},{"$f":"SUMIFS(Mai!$J$4:$J$738,Mai!$D$4:$D$738,\"Mai\",Mai!$F$4:$F$738,\"Pruneaux\")","v":0},{"$f":"SUMIFS(Juin!$J$4:$J$749,Juin!$D$4:$D$749,\"Juin\",Juin!$F$4:$F$749,\"Pruneaux\")","v":1},{"$f":"SUMIFS(Juillet!$J$4:$J$750,Juillet!$D$4:$D$750,\"Juillet\",Juillet!$F$4:$F$750,\"Pruneaux\")","v":0},{"$f":"SUMIFS(Août!$J$4:$J$751,Août!$D$4:$D$751,\"Août\",Août!$F$4:$F$751,\"Pruneaux\")","v":0},{"$f":"SUMIFS(Septembre!$J$4:$J$750,Septembre!$D$4:$D$750,\"Septembre\",Septembre!$F$4:$F$750,\"Pruneaux\")","v":0},{"$f":"SUMIFS(Octobre!$J$4:$J$750,Octobre!$D$4:$D$750,\"Octobre\",Octobre!$F$4:$F$750,\"Pruneaux\")","v":0},{"$f":"SUMIFS(Novembre!$J$4:$J$750,Novembre!$D$4:$D$750,\"Novembre\",Novembre!$F$4:$F$750,\"Pruneaux\")","v":1},{"$f":"SUMIFS(Décembre!$J$4:$J$750,Décembre!$D$4:$D$750,\"Décembre\",Décembre!$F$4:$F$750,\"Pruneaux\")","v":0},3]
["D19","Riz",{"$f":"SUMIFS(Janvier!$J$4:$J$720,Janvier!$D$4:$D$720,\"Janvier\",Janvier!$F$4:$F$720,\"Riz\")","v":0},{"$f":"SUMIFS(Février!$J$4:$J$722,Février!$D$4:$D$722,\"Février\",Février!$F$4:$F$722,\"Riz\")","v":0},{"$f":"SUMIFS(Mars!$J$4:$J$719,Mars!$D$4:$D$719,\"Mars\",Mars!$F$4:$F$719,\"Riz\")","v":0},{"$f":"SUMIFS(Avril!$J$4:$J$717,Avril!$D$4:$D$717,\"Avril\",Avril!$F$4:$F$717,\"Riz\")","v":0},{"$f":"SUMIFS(Mai!$J$4:$J$738,Mai!$D$4:$D$738,\"Mai\",Mai!$F$4:$F$738,\"Riz\")","v":0},{"$f":"SUMIFS(Juin!$J$4:$J$749,Juin!$D$4:$D$749,\"Juin\",Juin!$F$4:$F$749,\"Riz\")","v":0},{"$f":"SUMIFS(Juillet!$J$4:$J$750,Juillet!$D$4:$D$750,\"Juillet\",Juillet!$F$4:$F$750,\"Riz\")","v":0},{"$f":"SUMIFS(Août!$J$4:$J$751,Août!$D$4:$D$751,\"Août\",Août!$F$4:$F$751,\"Riz\")","v":0},{"$f":"SUMIFS(Septembre!$J$4:$J$750,Septembre!$D$4:$D$750,\"Septembre\",Septembre!$F$4:$F$750,\"Riz\")","v":0},{"$f":"SUMIFS(Octobre!$J$4:$J$750,Octobre!$D$4:$D$750,\"Octobre\",Octobre!$F$4:$F$750,\"Riz\")","v":0},{"$f":"SUMIFS(Novembre!$J$4:$J$750,Novembre!$D$4:$D$750,\"Novembre\",Novembre!$F$4:$F$750,\"Riz\")","v":0},{"$f":"SUMIFS(Décembre!$J$4:$J$750,Décembre!$D$4:$D$750,\"Décembre\",Décembre!$F$4:$F$750,\"Riz\")","v":0},0]
["D20","Semoule de blé",{"$f":"SUMIFS(Janvier!$J$4:$J$720,Janvier!$D$4:$D$720,\"Janvier\",Janvier!$F$4:$F$720,\"Semoule de blé\")","v":0},{"$f":"SUMIFS(Février!$J$4:$J$722,Février!$D$4:$D$722,\"Février\",Février!$F$4:$F$722,\"Semoule de blé\")","v":0},{"$f":"SUMIFS(Mars!$J$4:$J$719,Mars!$D$4:$D$719,\"Mars\",Mars!$F$4:$F$719,\"Semoule de blé\")","v":0},{"$f":"SUMIFS(Avril!$J$4:$J$717,Avril!$D$4:$D$717,\"Avril\",Avril!$F$4:$F$717,\"Semoule de blé\")","v":0},{"$f":"SUMIFS(Mai!$J$4:$J$738,Mai!$D$4:$D$738,\"Mai\",Mai!$F$4:$F$738,\"Semoule de blé\")","v":0},{"$f":"SUMIFS(Juin!$J$4:$J$749,Juin!$D$4:$D$749,\"Juin\",Juin!$F$4:$F$749,\"Semoule de blé\")","v":0},{"$f":"SUMIFS(Juillet!$J$4:$J$750,Juillet!$D$4:$D$750,\"Juillet\",Juillet!$F$4:$F$750,\"Semoule de blé\")","v":0},{"$f":"SUMIFS(Août!$J$4:$J$751,Août!$D$4:$D$751,\"Août\",Août!$F$4:$F$751,\"Semoule de blé\")","v":0},{"$f":"SUMIFS(Septembre!$J$4:$J$750,Septembre!$D$4:$D$750,\"Septembre\",Septembre!$F$4:$F$750,\"Semoule de blé\")","v":0},{"$f":"SUMIFS(Octobre!$J$4:$J$750,Octobre!$D$4:$D$750,\"Octobre\",Octobre!$F$4:$F$750,\"Semoule de blé\")","v":0},{"$f":"SUMIFS(Novembre!$J$4:$J$750,Novembre!$D$4:$D$750,\"Novembre\",Novembre!$F$4:$F$750,\"Semoule de blé\")","v":0},{"$f":"SUMIFS(Décembre!$J$4:$J$750,Décembre!$D$4:$D$750,\"Décembre\",Décembre!$F$4:$F$750,\"Semoule de blé\")","v":0},0]
["D21","Tapioca",{"$f":"SUMIFS(Janvier!$J$4:$J$720,Janvier!$D$4:$D$720,\"Janvier\",Janvier!$F$4:$F$720,\"Tapioca\")","v":0},{"$f":"SUMIFS(Février!$J$4:$J$722,Février!$D$4:$D$722,\"Février\",Février!$F$4:$F$722,\"Tapioca\")","v":100},{"$f":"SUMIFS(Mars!$J$4:$J$719,Mars!$D$4:$D$719,\"Mars\",Mars!$F$4:$F$719,\"Tapioca\")","v":0},{"$f":"SUMIFS(Avril!$J$4:$J$717,Avril!$D$4:$D$717,\"Avril\",Avril!$F$4:$F$717,\"Tapioca\")","v":0},{"$f":"SUMIFS(Mai!$J$4:$J$738,Mai!$D$4:$D$738,\"Mai\",Mai!$F$4:$F$738,\"Tapioca\")","v":0},{"$f":"SUMIFS(Juin!$J$4:$J$749,Juin!$D$4:$D$749,\"Juin\",Juin!$F$4:$F$749,\"Tapioca\")","v":100},{"$f":"SUMIFS(Juillet!$J$4:$J$750,Juillet!$D$4:$D$750,\"Juillet\",Juillet!$F$4:$F$750,\"Tapioca\")","v":0},{"$f":"SUMIFS(Août!$J$4:$J$751,Août!$D$4:$D$751,\"Août\",Août!$F$4:$F$751,\"Tapioca\")","v":0},{"$f":"SUMIFS(Septembre!$J$4:$J$750,Septembre!$D$4:$D$750,\"Septembre\",Septembre!$F$4:$F$750,\"Tapioca\")","v":0},{"$f":"SUMIFS(Octobre!$J$4:$J$750,Octobre!$D$4:$D$750,\"Octobre\",Octobre!$F$4:$F$750,\"Tapioca\")","v":0},{"$f":"SUMIFS(Novembre!$J$4:$J$750,Novembre!$D$4:$D$750,\"Novembre\",Novembre!$F$4:$F$750,\"Tapioca\")","v":100},{"$f":"SUMIFS(Décembre!$J$4:$J$750,Décembre!$D$4:$D$750,\"Décembre\",Décembre!$F$4:$F$750,\"Tapioca\")","v":0},300]
["D22","Yaourts",{"$f":"SUMIFS(Janvier!$J$4:$J$720,Janvier!$D$4:$D$720,\"Janvier\",Janvier!$F$4:$F$720,\"Yaourts\")","v":0},{"$f":"SUMIFS(Février!$J$4:$J$722,Février!$D$4:$D$722,\"Février\",Février!$F$4:$F$722,\"Yaourts\")","v":4},{"$f":"SUMIFS(Mars!$J$4:$J$719,Mars!$D$4:$D$719,\"Mars\",Mars!$F$4:$F$719,\"Yaourts\")","v":0},{"$f":"SUMIFS(Avril!$J$4:$J$717,Avril!$D$4:$D$717,\"Avril\",Avril!$F$4:$F$717,\"Yaourts\")","v":0},{"$f":"SUMIFS(Mai!$J$4:$J$738,Mai!$D$4:$D$738,\"Mai\",Mai!$F$4:$F$738,\"Yaourts\")","v":0},{"$f":"SUMIFS(Juin!$J$4:$J$749,Juin!$D$4:$D$749,\"Juin\",Juin!$F$4:$F$749,\"Yaourts\")","v":0},{"$f":"SUMIFS(Juillet!$J$4:$J$750,Juillet!$D$4:$D$750,\"Juillet\",Juillet!$F$4:$F$750,\"Yaourts\")","v":4},{"$f":"SUMIFS(Août!$J$4:$J$751,Août!$D$4:$D$751,\"Août\",Août!$F$4:$F$751,\"Yaourts\")","v":0},{"$f":"SUMIFS(Septembre!$J$4:$J$750,Septembre!$D$4:$D$750,\"Septembre\",Septembre!$F$4:$F$750,\"Yaourts\")","v":0},{"$f":"SUMIFS(Octobre!$J$4:$J$750,Octobre!$D$4:$D$750,\"Octobre\",Octobre!$F$4:$F$750,\"Yaourts\")","v":0},{"$f":"SUMIFS(Novembre!$J$4:$J$750,Novembre!$D$4:$D$750,\"Novembre\",Novembre!$F$4:$F$750,\"Yaourts\")","v":2},{"$f":"SUMIFS(Décembre!$J$4:$J$750,Décembre!$D$4:$D$750,\"Décembre\",Décembre!$F$4:$F$750,\"Yaourts\")","v":2},12]
["Fini à Limeil-Brévannes, le mardi 22 janvier 2019."]

{"sheet":"Quantité légumes","index":21,"n_rows":42,"n_cols":15,"rows_kept":42,"cut":false,"hidden":false,"merged":[[0,0,0,14],[41,0,41,14]]}
["Quantité des légumes par articles et par mois pour l'année 2019."]
[]
["Code légume","Légume","Janvier","Février","Mars","Avril","Mai","Juin","Juillet","Août","Septembre","Octobre","Novembre","Décembre","Totaux"]
["LLM01","Cassoulet",{"$f":"SUMIFS(Janvier!$P$4:$P$720,Janvier!$D$4:$D$720,\"Janvier\",Janvier!$L$4:$L$720,\"Cassoulet\")","v":1},{"$f":"SUMIFS(Février!$P$4:$P$723,Février!$D$4:$D$723,\"Février\",Février!$L$4:$L$723,\"Cassoulet\")","v":0},{"$f":"SUMIFS(Mars!$P$4:$P$720,Mars!$D$4:$D$720,\"Mars\",Mars!$L$4:$L$720,\"Cassoulet\")","v":0},{"$f":"SUMIFS(Avril!$P$4:$P$717,Avril!$D$4:$D$717,\"Avril\",Avril!$L$4:$L$717,\"Cassoulet\")","v":1},{"$f":"SUMIFS(Mai!$P$4:$P$738,Mai!$D$4:$D$738,\"Mai\",Mai!$L$4:$L$738,\"Cassoulet\")","v":0},{"$f":"SUMIFS(Juin!$P$4:$P$749,Juin!$D$4:$D$749,\"Juin\",Juin!$L$4:$L$749,\"Cassoulet\")","v":0},{"$f":"SUMIFS(Juillet!$P$4:$P$750,Juillet!$D$4:$D$750,\"Juillet\",Juillet!$L$4:$L$750,\"Cassoulet\")","v":1},{"$f":"SUMIFS(Août!$P$4:$P$751,Août!$D$4:$D$751,\"Août\",Août!$L$4:$L$751,\"Cassoulet\")","v":0},{"$f":"SUMIFS(Septembre!$P$4:$P$750,Septembre!$D$4:$D$750,\"Septembre\",Septembre!$L$4:$L$750,\"Cassoulet\")","v":0},{"$f":"SUMIFS(Octobre!$P$4:$P$750,Octobre!$D$4:$D$750,\"Octobre\",Octobre!$L$4:$L$750,\"Cassoulet\")","v":1},{"$f":"SUMIFS(Novembre!$P$4:$P$750,Novembre!$D$4:$D$750,\"Novembre\",Novembre!$L$4:$L$750,\"Cassoulet\")","v":0},{"$f":"SUMIFS(Décembre!$P$4:$P$750,Décembre!$D$4:$D$750,\"Décembre\",Décembre!$L$4:$L$750,\"Cassoulet\")","v":0},{"$f":"SUM($C4:$N4)","v":4}]
["LLM02","Choucroute",{"$f":"SUMIFS(Janvier!$P$4:$P$720,Janvier!$D$4:$D$720,\"Janvier\",Janvier!$L$4:$L$720,\"Choucroute\")","v":1},{"$f":"SUMIFS(Février!$P$4:$P$723,Février!$D$4:$D$723,\"Février\",Février!$L$4:$L$723,\"Choucroute\")","v":0},{"$f":"SUMIFS(Mars!$P$4:$P$720,Mars!$D$4:$D$720,\"Mars\",Mars!$L$4:$L$720,\"Choucroute\")","v":0},{"$f":"SUMIFS(Avril!$P$4:$P$717,Avril!$D$4:$D$717,\"Avril\",Avril!$L$4:$L$717,\"Choucroute\")","v":1},{"$f":"SUMIFS(Mai!$P$4:$P$738,Mai!$D$4:$D$738,\"Mai\",Mai!$L$4:$L$738,\"Choucroute\")","v":0},{"$f":"SUMIFS(Juin!$P$4:$P$749,Juin!$D$4:$D$749,\"Juin\",Juin!$L$4:$L$749,\"Choucroute\")","v":0},{"$f":"SUMIFS(Juillet!$P$4:$P$750,Juillet!$D$4:$D$750,\"Juillet\",Juillet!$L$4:$L$750,\"Choucroute\")","v":1},{"$f":"SUMIFS(Août!$P$4:$P$751,Août!$D$4:$D$751,\"Août\",Août!$L$4:$L$751,\"Choucroute\")","v":0},{"$f":"SUMIFS(Septembre!$P$4:$P$750,Septembre!$D$4:$D$750,\"Septembre\",Septembre!$L$4:$L$750,\"Choucroute\")","v":0},{"$f":"SUMIFS(Octobre!$P$4:$P$750,Octobre!$D$4:$D$750,\"Octobre\",Octobre!$L$4:$L$750,\"Choucroute\")","v":0},{"$f":"SUMIFS(Novembre!$P$4:$P$750,Novembre!$D$4:$D$750,\"Novembre\",Novembre!$L$4:$L$750,\"Choucroute\")","v":1},{"$f":"SUMIFS(Décembre!$P$4:$P$750,Décembre!$D$4:$D$750,\"Décembre\",Décembre!$L$4:$L$750,\"Choucroute\")","v":0},{"$f":"SUM($C5:$N5)","v":4}]
["LLM03","Chou-fleur",{"$f":"SUMIFS(Janvier!$P$4:$P$720,Janvier!$D$4:$D$720,\"Janvier\",Janvier!$L$4:$L$720,\"Chou-fleur\")","v":1},{"$f":"SUMIFS(Février!$P$4:$P$723,Février!$D$4:$D$723,\"Février\",Février!$L$4:$L$723,\"Chou-fleur\")","v":0},{"$f":"SUMIFS(Mars!$P$4:$P$720,Mars!$D$4:$D$720,\"Mars\",Mars!$L$4:$L$720,\"Chou-fleur\")","v":0},{"$f":"SUMIFS(Avril!$P$4:$P$717,Avril!$D$4:$D$717,\"Avril\",Avril!$L$4:$L$717,\"Chou-fleur\")","v":1},{"$f":"SUMIFS(Mai!$P$4:$P$738,Mai!$D$4:$D$738,\"Mai\",Mai!$L$4:$L$738,\"Chou-fleur\")","v":0},{"$f":"SUMIFS(Juin!$P$4:$P$749,Juin!$D$4:$D$749,\"Juin\",Juin!$L$4:$L$749,\"Chou-fleur\")","v":0},{"$f":"SUMIFS(Juillet!$P$4:$P$750,Juillet!$D$4:$D$750,\"Juillet\",Juillet!$L$4:$L$750,\"Chou-fleur\")","v":0},{"$f":"SUMIFS(Août!$P$4:$P$751,Août!$D$4:$D$751,\"Août\",Août!$L$4:$L$751,\"Chou-fleur\")","v":1},{"$f":"SUMIFS(Septembre!$P$4:$P$750,Septembre!$D$4:$D$750,\"Septembre\",Septembre!$L$4:$L$750,\"Chou-fleur\")","v":0},{"$f":"SUMIFS(Octobre!$P$4:$P$750,Octobre!$D$4:$D$750,\"Octobre\",Octobre!$L$4:$L$750,\"Chou-fleur\")","v":0},{"$f":"SUMIFS(Novembre!$P$4:$P$750,Novembre!$D$4:$D$750,\"Novembre\",Novembre!$L$4:$L$750,\"Chou-fleur\")","v":1},{"$f":"SUMIFS(Décembre!$P$4:$P$750,Décembre!$D$4:$D$750,\"Décembre\",Décembre!$L$4:$L$750,\"Chou-fleur\")","v":0},4]
["LLM04","Choux de Bruxelles",{"$f":"SUMIFS(Janvier!$P$4:$P$720,Janvier!$D$4:$D$720,\"Janvier\",Janvier!$L$4:$L$720,\"Choux de Bruxelles\")","v":1},{"$f":"SUMIFS(Février!$P$4:$P$723,Février!$D$4:$D$723,\"Février\",Février!$L$4:$L$723,\"Choux de Bruxelles\")","v":0},{"$f":"SUMIFS(Mars!$P$4:$P$720,Mars!$D$4:$D$720,\"Mars\",Mars!$L$4:$L$720,\"Choux de Bruxelles\")","v":0},{"$f":"SUMIFS(Avril!$P$4:$P$717,Avril!$D$4:$D$717,\"Avril\",Avril!$L$4:$L$717,\"Choux de Bruxelles\")","v":0},{"$f":"SUMIFS(Mai!$P$4:$P$738,Mai!$D$4:$D$738,\"Mai\",Mai!$L$4:$L$738,\"Choux de Bruxelles\")","v":1},{"$f":"SUMIFS(Juin!$P$4:$P$749,Juin!$D$4:$D$749,\"Juin\",Juin!$L$4:$L$749,\"Choux de Bruxelles\")","v":0},{"$f":"SUMIFS(Juillet!$P$4:$P$750,Juillet!$D$4:$D$750,\"Juillet\",Juillet!$L$4:$L$750,\"Choux de Bruxelles\")","v":0},{"$f":"SUMIFS(Août!$P$4:$P$751,Août!$D$4:$D$751,\"Août\",Août!$L$4:$L$751,\"Choux de Bruxelles\")","v":1},{"$f":"SUMIFS(Septembre!$P$4:$P$750,Septembre!$D$4:$D$750,\"Septembre\",Septembre!$L$4:$L$750,\"Choux de Bruxelles\")","v":0},{"$f":"SUMIFS(Octobre!$P$4:$P$750,Octobre!$D$4:$D$750,\"Octobre\",Octobre!$L$4:$L$750,\"Choux de Bruxelles\")","v":0},{"$f":"SUMIFS(Novembre!$P$4:$P$750,Novembre!$D$4:$D$750,\"Novembre\",Novembre!$L$4:$L$750,\"Choux de Bruxelles\")","v":1},{"$f":"SUMIFS(Décembre!$P$4:$P$750,Décembre!$D$4:$D$750,\"Décembre\",Décembre!$L$4:$L$750,\"Choux de Bruxelles\")","v":0},4]
["LLM05","Couscous",{"$f":"SUMIFS(Janvier!$P$4:$P$720,Janvier!$D$4:$D$720,\"Janvier\",Janvier!$L$4:$L$720,\"Couscous\")","v":25},{"$f":"SUMIFS(Février!$P$4:$P$723,Février!$D$4:$D$723,\"Février\",Février!$L$4:$L$723,\"Couscous\")","v":75},{"$f":"SUMIFS(Mars!$P$4:$P$720,Mars!$D$4:$D$720,\"Mars\",Mars!$L$4:$L$720,\"Couscous\")","v":1},{"$f":"SUMIFS(Avril!$P$4:$P$717,Avril!$D$4:$D$717,\"Avril\",Avril!$L$4:$L$717,\"Couscous\")","v":50},{"$f":"SUMIFS(Mai!$P$4:$P$738,Mai!$D$4:$D$738,\"Mai\",Mai!$L$4:$L$738,\"Couscous\")","v":75},{"$f":"SUMIFS(Juin!$P$4:$P$749,Juin!$D$4:$D$749,\"Juin\",Juin!$L$4:$L$749,\"Couscous\")","v":25},{"$f":"SUMIFS(Juillet!$P$4:$P$750,Juillet!$D$4:$D$750,\"Juillet\",Juillet!$L$4:$L$750,\"Couscous\")","v":25},{"$f":"SUMIFS(Août!$P$4:$P$751,Août!$D$4:$D$751,\"Août\",Août!$L$4:$L$751,\"Couscous\")","v":75},{"$f":"SUMIFS(Septembre!$P$4:$P$750,Septembre!$D$4:$D$750,\"Septembre\",Septembre!$L$4:$L$750,\"Couscous\")","v":25},{"$f":"SUMIFS(Octobre!$P$4:$P$750,Octobre!$D$4:$D$750,\"Octobre\",Octobre!$L$4:$L$750,\"Couscous\")","v":26},{"$f":"SUMIFS(Novembre!$P$4:$P$750,Novembre!$D$4:$D$750,\"Novembre\",Novembre!$L$4:$L$750,\"Couscous\")","v":75},{"$f":"SUMIFS(Décembre!$P$4:$P$750,Décembre!$D$4:$D$750,\"Décembre\",Décembre!$L$4:$L$750,\"Couscous\")","v":25},502]
["LLM06","Endives",{"$f":"SUMIFS(Janvier!$P$4:$P$720,Janvier!$D$4:$D$720,\"Janvier\",Janvier!$L$4:$L$720,\"Endives\")","v":0},{"$f":"SUMIFS(Février!$P$4:$P$723,Février!$D$4:$D$723,\"Février\",Février!$L$4:$L$723,\"Endives\")","v":1},{"$f":"SUMIFS(Mars!$P$4:$P$720,Mars!$D$4:$D$720,\"Mars\",Mars!$L$4:$L$720,\"Endives\")","v":0},{"$f":"SUMIFS(Avril!$P$4:$P$717,Avril!$D$4:$D$717,\"Avril\",Avril!$L$4:$L$717,\"Endives\")","v":0},{"$f":"SUMIFS(Mai!$P$4:$P$738,Mai!$D$4:$D$738,\"Mai\",Mai!$L$4:$L$738,\"Endives\")","v":1},{"$f":"SUMIFS(Juin!$P$4:$P$749,Juin!$D$4:$D$749,\"Juin\",Juin!$L$4:$L$749,\"Endives\")","v":0},{"$f":"SUMIFS(Juillet!$P$4:$P$750,Juillet!$D$4:$D$750,\"Juillet\",Juillet!$L$4:$L$750,\"Endives\")","v":0},{"$f":"SUMIFS(Août!$P$4:$P$751,Août!$D$4:$D$751,\"Août\",Août!$L$4:$L$751,\"Endives\")","v":1},{"$f":"SUMIFS(Septembre!$P$4:$P$750,Septembre!$D$4:$D$750,\"Septembre\",Septembre!$L$4:$L$750,\"Endives\")","v":0},{"$f":"SUMIFS(Octobre!$P$4:$P$750,Octobre!$D$4:$D$750,\"Octobre\",Octobre!$L$4:$L$750,\"Endives\")","v":0},{"$f":"SUMIFS(Novembre!$P$4:$P$750,Novembre!$D$4:$D$750,\"Novembre\",Novembre!$L$4:$L$750,\"Endives\")","v":0},{"$f":"SUMIFS(Décembre!$P$4:$P$750,Décembre!$D$4:$D$750,\"Décembre\",Décembre!$L$4:$L$750,\"Endives\")","v":1},4]
["LLM07","Haricots verts",{"$f":"SUMIFS(Janvier!$P$4:$P$720,Janvier!$D$4:$D$720,\"Janvier\",Janvier!$L$4:$L$720,\"Haricots verts\")","v":2},{"$f":"SUMIFS(Février!$P$4:$P$723,Février!$D$4:$D$723,\"Février\",Février!$L$4:$L$723,\"Haricots verts\")","v":2},{"$f":"SUMIFS(Mars!$P$4:$P$720,Mars!$D$4:$D$720,\"Mars\",Mars!$L$4:$L$720,\"Haricots verts\")","v":2},{"$f":"SUMIFS(Avril!$P$4:$P$717,Avril!$D$4:$D$717,\"Avril\",Avril!$L$4:$L$717,\"Haricots verts\")","v":1},{"$f":"SUMIFS(Mai!$P$4:$P$738,Mai!$D$4:$D$738,\"Mai\",Mai!$L$4:$L$738,\"Haricots verts\")","v":3},{"$f":"SUMIFS(Juin!$P$4:$P$749,Juin!$D$4:$D$749,\"Juin\",Juin!$L$4:$L$749,\"Haricots verts\")","v":2},{"$f":"SUMIFS(Juillet!$P$4:$P$750,Juillet!$D$4:$D$750,\"Juillet\",Juillet!$L$4:$L$750,\"Haricots verts\")","v":1},{"$f":"SUMIFS(Août!$P$4:$P$751,Août!$D$4:$D$751,\"Août\",Août!$L$4:$L$751,\"Haricots verts\")","v":2},{"$f":"SUMIFS(Septembre!$P$4:$P$750,Septembre!$D$4:$D$750,\"Septembre\",Septembre!$L$4:$L$750,\"Haricots verts\")","v":2},{"$f":"SUMIFS(Octobre!$P$4:$P$750,Octobre!$D$4:$D$750,\"Octobre\",Octobre!$L$4:$L$750,\"Haricots verts\")","v":2},{"$f":"SUMIFS(Novembre!$P$4:$P$750,Novembre!$D$4:$D$750,\"Novembre\",Novembre!$L$4:$L$750,\"Haricots verts\")","v":1},{"$f":"SUMIFS(Décembre!$P$4:$P$750,Décembre!$D$4:$D$750,\"Décembre\",Décembre!$L$4:$L$750,\"Haricots verts\")","v":3},23]
["LLM08","Maïs",{"$f":"SUMIFS(Janvier!$P$4:$P$720,Janvier!$D$4:$D$720,\"Janvier\",Janvier!$L$4:$L$720,\"Maïs\")","v":1},{"$f":"SUMIFS(Février!$P$4:$P$723,Février!$D$4:$D$723,\"Février\",Février!$L$4:$L$723,\"Maïs\")","v":2},{"$f":"SUMIFS(Mars!$P$4:$P$720,Mars!$D$4:$D$720,\"Mars\",Mars!$L$4:$L$720,\"Maïs\")","v":1},{"$f":"SUMIFS(Avril!$P$4:$P$717,Avril!$D$4:$D$717,\"Avril\",Avril!$L$4:$L$717,\"Maïs\")","v":1.5},{"$f":"SUMIFS(Mai!$P$4:$P$738,Mai!$D$4:$D$738,\"Mai\",Mai!$L$4:$L$738,\"Maïs\")","v":1.5},{"$f":"SUMIFS(Juin!$P$4:$P$749,Juin!$D$4:$D$749,\"Juin\",Juin!$L$4:$L$749,\"Maïs\")","v":2},{"$f":"SUMIFS(Juillet!$P$4:$P$750,Juillet!$D$4:$D$750,\"Juillet\",Juillet!$L$4:$L$750,\"Maïs\")","v":1},{"$f":"SUMIFS(Août!$P$4:$P$751,Août!$D$4:$D$751,\"Août\",Août!$L$4:$L$751,\"Maïs\")","v":1},{"$f":"SUMIFS(Septembre!$P$4:$P$750,Septembre!$D$4:$D$750,\"Septembre\",Septembre!$L$4:$L$750,\"Maïs\")","v":2},{"$f":"SUMIFS(Octobre!$P$4:$P$750,Octobre!$D$4:$D$750,\"Octobre\",Octobre!$L$4:$L$750,\"Maïs\")","v":1},{"$f":"SUMIFS(Novembre!$P$4:$P$750,Novembre!$D$4:$D$750,\"Novembre\",Novembre!$L$4:$L$750,\"Maïs\")","v":2},{"$f":"SUMIFS(Décembre!$P$4:$P$750,Décembre!$D$4:$D$750,\"Décembre\",Décembre!$L$4:$L$750,\"Maïs\")","v":2},18]
["LLM09","Paella",{"$f":"SUMIFS(Janvier!$P$4:$P$720,Janvier!$D$4:$D$720,\"Janvier\",Janvier!$L$4:$L$720,\"Paella\")","v":0},{"$f":"SUMIFS(Février!$P$4:$P$723,Février!$D$4:$D$723,\"Février\",Février!$L$4:$L$723,\"Paella\")","v":0},{"$f":"SUMIFS(Mars!$P$4:$P$720,Mars!$D$4:$D$720,\"Mars\",Mars!$L$4:$L$720,\"Paella\")","v":1},{"$f":"SUMIFS(Avril!$P$4:$P$717,Avril!$D$4:$D$717,\"Avril\",Avril!$L$4:$L$717,\"Paella\")","v":0},{"$f":"SUMIFS(Mai!$P$4:$P$738,Mai!$D$4:$D$738,\"Mai\",Mai!$L$4:$L$738,\"Paella\")","v":0},{"$f":"SUMIFS(Juin!$P$4:$P$749,Juin!$D$4:$D$749,\"Juin\",Juin!$L$4:$L$749,\"Paella\")","v":1},{"$f":"SUMIFS(Juillet!$P$4:$P$750,Juillet!$D$4:$D$750,\"Juillet\",Juillet!$L$4:$L$750,\"Paella\")","v":0},{"$f":"SUMIFS(Août!$P$4:$P$751,Août!$D$4:$D$751,\"Août\",Août!$L$4:$L$751,\"Paella\")","v":0},{"$f":"SUMIFS(Septembre!$P$4:$P$750,Septembre!$D$4:$D$750,\"Septembre\",Septembre!$L$4:$L$750,\"Paella\")","v":1},{"$f":"SUMIFS(Octobre!$P$4:$P$750,Octobre!$D$4:$D$750,\"Octobre\",Octobre!$L$4:$L$750,\"Paella\")","v":0},{"$f":"SUMIFS(Novembre!$P$4:$P$750,Novembre!$D$4:$D$750,\"Novembre\",Novembre!$L$4:$L$750,\"Paella\")","v":0},{"$f":"SUMIFS(Décembre!$P$4:$P$750,Décembre!$D$4:$D$750,\"Décembre\",Décembre!$L$4:$L$750,\"Paella\")","v":1},4]
["LLM10","Poireau",{"$f":"SUMIFS(Janvier!$P$4:$P$720,Janvier!$D$4:$D$720,\"Janvier\",Janvier!$L$4:$L$720,\"Poireau\")","v":1},{"$f":"SUMIFS(Février!$P$4:$P$723,Février!$D$4:$D$723,\"Février\",Février!$L$4:$L$723,\"Poireau\")","v":1},{"$f":"SUMIFS(Mars!$P$4:$P$720,Mars!$D$4:$D$720,\"Mars\",Mars!$L$4:$L$720,\"Poireau\")","v":3},{"$f":"SUMIFS(Avril!$P$4:$P$717,Avril!$D$4:$D$717,\"Avril\",Avril!$L$4:$L$717,\"Poireau\")","v":1},{"$f":"SUMIFS(Mai!$P$4:$P$738,Mai!$D$4:$D$738,\"Mai\",Mai!$L$4:$L$738,\"Poireau\")","v":6},{"$f":"SUMIFS(Juin!$P$4:$P$749,Juin!$D$4:$D$749,\"Juin\",Juin!$L$4:$L$749,\"Poireau\")","v":3},{"$f":"SUMIFS(Juillet!$P$4:$P$750,Juillet!$D$4:$D$750,\"Juillet\",Juillet!$L$4:$L$750,\"Poireau\")","v":5},{"$f":"SUMIFS(Août!$P$4:$P$751,Août!$D$4:$D$751,\"Août\",Août!$L$4:$L$751,\"Poireau\")","v":1},{"$f":"SUMIFS(Septembre!$P$4:$P$750,Septembre!$D$4:$D$750,\"Septembre\",Septembre!$L$4:$L$750,\"Poireau\")","v":3},{"$f":"SUMIFS(Octobre!$P$4:$P$750,Octobre!$D$4:$D$750,\"Octobre\",Octobre!$L$4:$L$750,\"Poireau\")","v":1},{"$f":"SUMIFS(Novembre!$P$4:$P$750,Novembre!$D$4:$D$750,\"Novembre\",Novembre!$L$4:$L$750,\"Poireau\")","v":5},{"$f":"SUMIFS(Décembre!$P$4:$P$750,Décembre!$D$4:$D$750,\"Décembre\",Décembre!$L$4:$L$750,\"Poireau\")","v":6},36]
["LLM11","Pomme de terre",{"$f":"SUMIFS(Janvier!$P$4:$P$720,Janvier!$D$4:$D$720,\"Janvier\",Janvier!$L$4:$L$720,\"Pomme de terre\")","v":1},{"$f":"SUMIFS(Février!$P$4:$P$723,Février!$D$4:$D$723,\"Février\",Février!$L$4:$L$723,\"Pomme de terre\")","v":1},{"$f":"SUMIFS(Mars!$P$4:$P$720,Mars!$D$4:$D$720,\"Mars\",Mars!$L$4:$L$720,\"Pomme de terre\")","v":3},{"$f":"SUMIFS(Avril!$P$4:$P$717,Avril!$D$4:$D$717,\"Avril\",Avril!$L$4:$L$717,\"Pomme de terre\")","v":1},{"$f":"SUMIFS(Mai!$P$4:$P$738,Mai!$D$4:$D$738,\"Mai\",Mai!$L$4:$L$738,\"Pomme de terre\")","v":1},{"$f":"SUMIFS(Juin!$P$4:$P$749,Juin!$D$4:$D$749,\"Juin\",Juin!$L$4:$L$749,\"Pomme de terre\")","v":4},{"$f":"SUMIFS(Juillet!$P$4:$P$750,Juillet!$D$4:$D$750,\"Juillet\",Juillet!$L$4:$L$750,\"Pomme de terre\")","v":5},{"$f":"SUMIFS(Août!$P$4:$P$751,Août!$D$4:$D$751,\"Août\",Août!$L$4:$L$751,\"Pomme de terre\")","v":1},{"$f":"SUMIFS(Septembre!$P$4:$P$750,Septembre!$D$4:$D$750,\"Septembre\",Septembre!$L$4:$L$750,\"Pomme de terre\")","v":2},{"$f":"SUMIFS(Octobre!$P$4:$P$750,Octobre!$D$4:$D$750,\"Octobre\",Octobre!$L$4:$L$750,\"Pomme de terre\")","v":2},{"$f":"SUMIFS(Novembre!$P$4:$P$750,Novembre!$D$4:$D$750,\"Novembre\",Novembre!$L$4:$L$750,\"Pomme de terre\")","v":5},{"$f":"SUMIFS(Décembre!$P$4:$P$750,Décembre!$D$4:$D$750,\"Décembre\",Décembre!$L$4:$L$750,\"Pomme de terre\")","v":1},27]
["LLM12","Purée",{"$f":"SUMIFS(Janvier!$P$4:$P$720,Janvier!$D$4:$D$720,\"Janvier\",Janvier!$L$4:$L$720,\"Purée\")","v":25},{"$f":"SUMIFS(Février!$P$4:$P$723,Février!$D$4:$D$723,\"Février\",Février!$L$4:$L$723,\"Purée\")","v":25},{"$f":"SUMIFS(Mars!$P$4:$P$720,Mars!$D$4:$D$720,\"Mars\",Mars!$L$4:$L$720,\"Purée\")","v":75},{"$f":"SUMIFS(Avril!$P$4:$P$717,Avril!$D$4:$D$717,\"Avril\",Avril!$L$4:$L$717,\"Purée\")","v":25},{"$f":"SUMIFS(Mai!$P$4:$P$738,Mai!$D$4:$D$738,\"Mai\",Mai!$L$4:$L$738,\"Purée\")","v":25},{"$f":"SUMIFS(Juin!$P$4:$P$749,Juin!$D$4:$D$749,\"Juin\",Juin!$L$4:$L$749,\"Purée\")","v":1},{"$f":"SUMIFS(Juillet!$P$4:$P$750,Juillet!$D$4:$D$750,\"Juillet\",Juillet!$L$4:$L$750,\"Purée\")","v":80},{"$f":"SUMIFS(Août!$P$4:$P$751,Août!$D$4:$D$751,\"Août\",Août!$L$4:$L$751,\"Purée\")","v":25},{"$f":"SUMIFS(Septembre!$P$4:$P$750,Septembre!$D$4:$D$750,\"Septembre\",Septembre!$L$4:$L$750,\"Purée\")","v":25},{"$f":"SUMIFS(Octobre!$P$4:$P$750,Octobre!$D$4:$D$750,\"Octobre\",Octobre!$L$4:$L$750,\"Purée\")","v":75},{"$f":"SUMIFS(Novembre!$P$4:$P$750,Novembre!$D$4:$D$750,\"Novembre\",Novembre!$L$4:$L$750,\"Purée\")","v":5},{"$f":"SUMIFS(Décembre!$P$4:$P$750,Décembre!$D$4:$D$750,\"Décembre\",Décembre!$L$4:$L$750,\"Purée\")","v":25},411]
["LLM13","Quenelles",{"$f":"SUMIFS(Janvier!$P$4:$P$720,Janvier!$D$4:$D$720,\"Janvier\",Janvier!$L$4:$L$720,\"Quenelles\")","v":0},{"$f":"SUMIFS(Février!$P$4:$P$723,Février!$D$4:$D$723,\"Février\",Février!$L$4:$L$723,\"Quenelles\")","v":0},{"$f":"SUMIFS(Mars!$P$4:$P$720,Mars!$D$4:$D$720,\"Mars\",Mars!$L$4:$L$720,\"Quenelles\")","v":0},{"$f":"SUMIFS(Avril!$P$4:$P$717,Avril!$D$4:$D$717,\"Avril\",Avril!$L$4:$L$717,\"Quenelles\")","v":1},{"$f":"SUMIFS(Mai!$P$4:$P$738,Mai!$D$4:$D$738,\"Mai\",Mai!$L$4:$L$738,\"Quenelles\")","v":0},{"$f":"SUMIFS(Juin!$P$4:$P$749,Juin!$D$4:$D$749,\"Juin\",Juin!$L$4:$L$749,\"Quenelles\")","v":0},{"$f":"SUMIFS(Juillet!$P$4:$P$750,Juillet!$D$4:$D$750,\"Juillet\",Juillet!$L$4:$L$750,\"Quenelles\")","v":1},{"$f":"SUMIFS(Août!$P$4:$P$751,Août!$D$4:$D$751,\"Août\",Août!$L$4:$L$751,\"Quenelles\")","v":0},{"$f":"SUMIFS(Septembre!$P$4:$P$750,Septembre!$D$4:$D$750,\"Septembre\",Septembre!$L$4:$L$750,\"Quenelles\")","v":0},{"$f":"SUMIFS(Octobre!$P$4:$P$750,Octobre!$D$4:$D$750,\"Octobre\",Octobre!$L$4:$L$750,\"Quenelles\")","v":1},{"$f":"SUMIFS(Novembre!$P$4:$P$750,Novembre!$D$4:$D$750,\"Novembre\",Novembre!$L$4:$L$750,\"Quenelles\")","v":0},{"$f":"SUMIFS(Décembre!$P$4:$P$750,Décembre!$D$4:$D$750,\"Décembre\",Décembre!$L$4:$L$750,\"Quenelles\")","v":0},3]
["LLM14","Riz",{"$f":"SUMIFS(Janvier!$P$4:$P$720,Janvier!$D$4:$D$720,\"Janvier\",Janvier!$L$4:$L$720,\"Riz\")","v":50},{"$f":"SUMIFS(Février!$P$4:$P$723,Février!$D$4:$D$723,\"Février\",Février!$L$4:$L$723,\"Riz\")","v":25},{"$f":"SUMIFS(Mars!$P$4:$P$720,Mars!$D$4:$D$720,\"Mars\",Mars!$L$4:$L$720,\"Riz\")","v":25},{"$f":"SUMIFS(Avril!$P$4:$P$717,Avril!$D$4:$D$717,\"Avril\",Avril!$L$4:$L$717,\"Riz\")","v":75},{"$f":"SUMIFS(Mai!$P$4:$P$738,Mai!$D$4:$D$738,\"Mai\",Mai!$L$4:$L$738,\"Riz\")","v":25},{"$f":"SUMIFS(Juin!$P$4:$P$749,Juin!$D$4:$D$749,\"Juin\",Juin!$L$4:$L$749,\"Riz\")","v":25},{"$f":"SUMIFS(Juillet!$P$4:$P$750,Juillet!$D$4:$D$750,\"Juillet\",Juillet!$L$4:$L$750,\"Riz\")","v":75.5},{"$f":"SUMIFS(Août!$P$4:$P$751,Août!$D$4:$D$751,\"Août\",Août!$L$4:$L$751,\"Riz\")","v":25},{"$f":"SUMIFS(Septembre!$P$4:$P$750,Septembre!$D$4:$D$750,\"Septembre\",Septembre!$L$4:$L$750,\"Riz\")","v":0.5},{"$f":"SUMIFS(Octobre!$P$4:$P$750,Octobre!$D$4:$D$750,\"Octobre\",Octobre!$L$4:$L$750,\"Riz\")","v":50.5},{"$f":"SUMIFS(Novembre!$P$4:$P$750,Novembre!$D$4:$D$750,\"Novembre\",Novembre!$L$4:$L$750,\"Riz\")","v":25},{"$f":"SUMIFS(Décembre!$P$4:$P$750,Décembre!$D$4:$D$750,\"Décembre\",Décembre!$L$4:$L$750,\"Riz\")","v":0.5},402]
["LMJ01","Macédoine de légumes",{"$f":"SUMIFS(Janvier!$P$4:$P$720,Janvier!$D$4:$D$720,\"Janvier\",Janvier!$L$4:$L$720,\"Macédoine de légumes\")","v":1},{"$f":"SUMIFS(Février!$P$4:$P$723,Février!$D$4:$D$723,\"Février\",Février!$L$4:$L$723,\"Macédoine de légumes\")","v":1},{"$f":"SUMIFS(Mars!$P$4:$P$720,Mars!$D$4:$D$720,\"Mars\",Mars!$L$4:$L$720,\"Macédoine de légumes\")","v":0},{"$f":"SUMIFS(Avril!$P$4:$P$717,Avril!$D$4:$D$717,\"Avril\",Avril!$L$4:$L$717,\"Macédoine de légumes\")","v":1},{"$f":"SUMIFS(Mai!$P$4:$P$738,Mai!$D$4:$D$738,\"Mai\",Mai!$L$4:$L$738,\"Macédoine de légumes\")","v":1},{"$f":"SUMIFS(Juin!$P$4:$P$749,Juin!$D$4:$D$749,\"Juin\",Juin!$L$4:$L$749,\"Macédoine de légumes\")","v":0},{"$f":"SUMIFS(Juillet!$P$4:$P$750,Juillet!$D$4:$D$750,\"Juillet\",Juillet!$L$4:$L$750,\"Macédoine de légumes\")","v":1},{"$f":"SUMIFS(Août!$P$4:$P$751,Août!$D$4:$D$751,\"Août\",Août!$L$4:$L$751,\"Macédoine de légumes\")","v":1},{"$f":"SUMIFS(Septembre!$P$4:$P$750,Septembre!$D$4:$D$750,\"Septembre\",Septembre!$L$4:$L$750,\"Macédoine de légumes\")","v":1},{"$f":"SUMIFS(Octobre!$P$4:$P$750,Octobre!$D$4:$D$750,\"Octobre\",Octobre!$L$4:$L$750,\"Macédoine de légumes\")","v":0},{"$f":"SUMIFS(Novembre!$P$4:$P$750,Novembre!$D$4:$D$750,\"Novembre\",Novembre!$L$4:$L$750,\"Macédoine de légumes\")","v":1},{"$f":"SUMIFS(Décembre!$P$4:$P$750,Décembre!$D$4:$D$750,\"Décembre\",Décembre!$L$4:$L$750,\"Macédoine de légumes\")","v":1},9]
["LMJ02","Petits pois",{"$f":"SUMIFS(Janvier!$P$4:$P$720,Janvier!$D$4:$D$720,\"Janvier\",Janvier!$L$4:$L$720,\"Petits pois\")","v":1},{"$f":"SUMIFS(Février!$P$4:$P$723,Février!$D$4:$D$723,\"Février\",Février!$L$4:$L$723,\"Petits pois\")","v":0},{"$f":"SUMIFS(Mars!$P$4:$P$720,Mars!$D$4:$D$720,\"Mars\",Mars!$L$4:$L$720,\"Petits pois\")","v":0},{"$f":"SUMIFS(Avril!$P$4:$P$717,Avril!$D$4:$D$717,\"Avril\",Avril!$L$4:$L$717,\"Petits pois\")","v":1},{"$f":"SUMIFS(Mai!$P$4:$P$738,Mai!$D$4:$D$738,\"Mai\",Mai!$L$4:$L$738,\"Petits pois\")","v":1},{"$f":"SUMIFS(Juin!$P$4:$P$749,Juin!$D$4:$D$749,\"Juin\",Juin!$L$4:$L$749,\"Petits pois\")","v":0},{"$f":"SUMIFS(Juillet!$P$4:$P$750,Juillet!$D$4:$D$750,\"Juillet\",Juillet!$L$4:$L$750,\"Petits pois\")","v":1},{"$f":"SUMIFS(Août!$P$4:$P$751,Août!$D$4:$D$751,\"Août\",Août!$L$4:$L$751,\"Petits pois\")","v":1},{"$f":"SUMIFS(Septembre!$P$4:$P$750,Septembre!$D$4:$D$750,\"Septembre\",Septembre!$L$4:$L$750,\"Petits pois\")","v":0},{"$f":"SUMIFS(Octobre!$P$4:$P$750,Octobre!$D$4:$D$750,\"Octobre\",Octobre!$L$4:$L$750,\"Petits pois\")","v":1},{"$f":"SUMIFS(Novembre!$P$4:$P$750,Novembre!$D$4:$D$750,\"Novembre\",Novembre!$L$4:$L$750,\"Petits pois\")","v":1},{"$f":"SUMIFS(Décembre!$P$4:$P$750,Décembre!$D$4:$D$750,\"Décembre\",Décembre!$L$4:$L$750,\"Petits pois\")","v":1},8]
["LMJ03","Petits pois et jeunes carottes",{"$f":"SUMIFS(Janvier!$P$4:$P$720,Janvier!$D$4:$D$720,\"Janvier\",Janvier!$L$4:$L$720,\"Petits pois et jeunes carottes\")","v":1},{"$f":"SUMIFS(Février!$P$4:$P$723,Février!$D$4:$D$723,\"Février\",Février!$L$4:$L$723,\"Petits pois et jeunes carottes\")","v":0},{"$f":"SUMIFS(Mars!$P$4:$P$720,Mars!$D$4:$D$720,\"Mars\",Mars!$L$4:$L$720,\"Petits pois et jeunes carottes\")","v":1},{"$f":"SUMIFS(Avril!$P$4:$P$717,Avril!$D$4:$D$717,\"Avril\",Avril!$L$4:$L$717,\"Petits pois et jeunes carottes\")","v":1},{"$f":"SUMIFS(Mai!$P$4:$P$738,Mai!$D$4:$D$738,\"Mai\",Mai!$L$4:$L$738,\"Petits pois et jeunes carottes\")","v":0},{"$f":"SUMIFS(Juin!$P$4:$P$749,Juin!$D$4:$D$749,\"Juin\",Juin!$L$4:$L$749,\"Petits pois et jeunes carottes\")","v":1},{"$f":"SUMIFS(Juillet!$P$4:$P$750,Juillet!$D$4:$D$750,\"Juillet\",Juillet!$L$4:$L$750,\"Petits pois et jeunes carottes\")","v":1},{"$f":"SUMIFS(Août!$P$4:$P$751,Août!$D$4:$D$751,\"Août\",Août!$L$4:$L$751,\"Petits pois et jeunes carottes\")","v":1},{"$f":"SUMIFS(Septembre!$P$4:$P$750,Septembre!$D$4:$D$750,\"Septembre\",Septembre!$L$4:$L$750,\"Petits pois et jeunes carottes\")","v":0},{"$f":"SUMIFS(Octobre!$P$4:$P$750,Octobre!$D$4:$D$750,\"Octobre\",Octobre!$L$4:$L$750,\"Petits pois et jeunes carottes\")","v":1},{"$f":"SUMIFS(Novembre!$P$4:$P$750,Novembre!$D$4:$D$750,\"Novembre\",Novembre!$L$4:$L$750,\"Petits pois et jeunes carottes\")","v":1},{"$f":"SUMIFS(Décembre!$P$4:$P$750,Décembre!$D$4:$D$750,\"Décembre\",Décembre!$L$4:$L$750,\"Petits pois et jeunes carottes\")","v":0},8]
["LMJ04","Ratatouille",{"$f":"SUMIFS(Janvier!$P$4:$P$720,Janvier!$D$4:$D$720,\"Janvier\",Janvier!$L$4:$L$720,\"Ratatouille\")","v":0},{"$f":"SUMIFS(Février!$P$4:$P$723,Février!$D$4:$D$723,\"Février\",Février!$L$4:$L$723,\"Ratatouille\")","v":1},{"$f":"SUMIFS(Mars!$P$4:$P$720,Mars!$D$4:$D$720,\"Mars\",Mars!$L$4:$L$720,\"Ratatouille\")","v":2},{"$f":"SUMIFS(Avril!$P$4:$P$717,Avril!$D$4:$D$717,\"Avril\",Avril!$L$4:$L$717,\"Ratatouille\")","v":0},{"$f":"SUMIFS(Mai!$P$4:$P$738,Mai!$D$4:$D$738,\"Mai\",Mai!$L$4:$L$738,\"Ratatouille\")","v":1},{"$f":"SUMIFS(Juin!$P$4:$P$749,Juin!$D$4:$D$749,\"Juin\",Juin!$L$4:$L$749,\"Ratatouille\")","v":1},{"$f":"SUMIFS(Juillet!$P$4:$P$750,Juillet!$D$4:$D$750,\"Juillet\",Juillet!$L$4:$L$750,\"Ratatouille\")","v":1},{"$f":"SUMIFS(Août!$P$4:$P$751,Août!$D$4:$D$751,\"Août\",Août!$L$4:$L$751,\"Ratatouille\")","v":0},{"$f":"SUMIFS(Septembre!$P$4:$P$750,Septembre!$D$4:$D$750,\"Septembre\",Septembre!$L$4:$L$750,\"Ratatouille\")","v":1},{"$f":"SUMIFS(Octobre!$P$4:$P$750,Octobre!$D$4:$D$750,\"Octobre\",Octobre!$L$4:$L$750,\"Ratatouille\")","v":1},{"$f":"SUMIFS(Novembre!$P$4:$P$750,Novembre!$D$4:$D$750,\"Novembre\",Novembre!$L$4:$L$750,\"Ratatouille\")","v":1},{"$f":"SUMIFS(Décembre!$P$4:$P$750,Décembre!$D$4:$D$750,\"Décembre\",Décembre!$L$4:$L$750,\"Ratatouille\")","v":0},9]
["LMJ05","Raviolis",{"$f":"SUMIFS(Janvier!$P$4:$P$720,Janvier!$D$4:$D$720,\"Janvier\",Janvier!$L$4:$L$720,\"Raviolis\")","v":1},{"$f":"SUMIFS(Février!$P$4:$P$723,Février!$D$4:$D$723,\"Février\",Février!$L$4:$L$723,\"Raviolis\")","v":1},{"$f":"SUMIFS(Mars!$P$4:$P$720,Mars!$D$4:$D$720,\"Mars\",Mars!$L$4:$L$720,\"Raviolis\")","v":1},{"$f":"SUMIFS(Avril!$P$4:$P$717,Avril!$D$4:$D$717,\"Avril\",Avril!$L$4:$L$717,\"Raviolis\")","v":0},{"$f":"SUMIFS(Mai!$P$4:$P$738,Mai!$D$4:$D$738,\"Mai\",Mai!$L$4:$L$738,\"Raviolis\")","v":1},{"$f":"SUMIFS(Juin!$P$4:$P$749,Juin!$D$4:$D$749,\"Juin\",Juin!$L$4:$L$749,\"Raviolis\")","v":1},{"$f":"SUMIFS(Juillet!$P$4:$P$750,Juillet!$D$4:$D$750,\"Juillet\",Juillet!$L$4:$L$750,\"Raviolis\")","v":0.5},{"$f":"SUMIFS(Août!$P$4:$P$751,Août!$D$4:$D$751,\"Août\",Août!$L$4:$L$751,\"Raviolis\")","v":0.5},{"$f":"SUMIFS(Septembre!$P$4:$P$750,Septembre!$D$4:$D$750,\"Septembre\",Septembre!$L$4:$L$750,\"Raviolis\")","v":1},{"$f":"SUMIFS(Octobre!$P$4:$P$750,Octobre!$D$4:$D$750,\"Octobre\",Octobre!$L$4:$L$750,\"Raviolis\")","v":1},{"$f":"SUMIFS(Novembre!$P$4:$P$750,Novembre!$D$4:$D$750,\"Novembre\",Novembre!$L$4:$L$750,\"Raviolis\")","v":0},{"$f":"SUMIFS(Décembre!$P$4:$P$750,Décembre!$D$4:$D$750,\"Décembre\",Décembre!$L$4:$L$750,\"Raviolis\")","v":1},9]
["LMJ06","Tomates pelées",{"$f":"SUMIFS(Janvier!$P$4:$P$720,Janvier!$D$4:$D$720,\"Janvier\",Janvier!$L$4:$L$720,\"Tomates pelées\")","v":1},{"$f":"SUMIFS(Février!$P$4:$P$723,Février!$D$4:$D$723,\"Février\",Février!$L$4:$L$723,\"Tomates pelées\")","v":1},{"$f":"SUMIFS(Mars!$P$4:$P$720,Mars!$D$4:$D$720,\"Mars\",Mars!$L$4:$L$720,\"Tomates pelées\")","v":0},{"$f":"SUMIFS(Avril!$P$4:$P$717,Avril!$D$4:$D$717,\"Avril\",Avril!$L$4:$L$717,\"Tomates pelées\")","v":1},{"$f":"SUMIFS(Mai!$P$4:$P$738,Mai!$D$4:$D$738,\"Mai\",Mai!$L$4:$L$738,\"Tomates pelées\")","v":1},{"$f":"SUMIFS(Juin!$P$4:$P$749,Juin!$D$4:$D$749,\"Juin\",Juin!$L$4:$L$749,\"Tomates pelées\")","v":1},{"$f":"SUMIFS(Juillet!$P$4:$P$750,Juillet!$D$4:$D$750,\"Juillet\",Juillet!$L$4:$L$750,\"Tomates pelées\")","v":0},{"$f":"SUMIFS(Août!$P$4:$P$751,Août!$D$4:$D$751,\"Août\",Août!$L$4:$L$751,\"Tomates pelées\")","v":1},{"$f":"SUMIFS(Septembre!$P$4:$P$750,Septembre!$D$4:$D$750,\"Septembre\",Septembre!$L$4:$L$750,\"Tomates pelées\")","v":1},{"$f":"SUMIFS(Octobre!$P$4:$P$750,Octobre!$D$4:$D$750,\"Octobre\",Octobre!$L$4:$L$750,\"Tomates pelées\")","v":1},{"$f":"SUMIFS(Novembre!$P$4:$P$750,Novembre!$D$4:$D$750,\"Novembre\",Novembre!$L$4:$L$750,\"Tomates pelées\")","v":0},{"$f":"SUMIFS(Décembre!$P$4:$P$750,Décembre!$D$4:$D$750,\"Décembre\",Décembre!$L$4:$L$750,\"Tomates pelées\")","v":1},9]
["LV01","Asperges",{"$f":"SUMIFS(Janvier!$P$4:$P$720,Janvier!$D$4:$D$720,\"Janvier\",Janvier!$L$4:$L$720,\"Asperges\")","v":2},{"$f":"SUMIFS(Février!$P$4:$P$723,Février!$D$4:$D$723,\"Février\",Février!$L$4:$L$723,\"Asperges\")","v":1},{"$f":"SUMIFS(Mars!$P$4:$P$720,Mars!$D$4:$D$720,\"Mars\",Mars!$L$4:$L$720,\"Asperges\")","v":2},{"$f":"SUMIFS(Avril!$P$4:$P$717,Avril!$D$4:$D$717,\"Avril\",Avril!$L$4:$L$717,\"Asperges\")","v":2},{"$f":"SUMIFS(Mai!$P$4:$P$738,Mai!$D$4:$D$738,\"Mai\",Mai!$L$4:$L$738,\"Asperges\")","v":2},{"$f":"SUMIFS(Juin!$P$4:$P$749,Juin!$D$4:$D$749,\"Juin\",Juin!$L$4:$L$749,\"Asperges\")","v":2},{"$f":"SUMIFS(Juillet!$P$4:$P$750,Juillet!$D$4:$D$750,\"Juillet\",Juillet!$L$4:$L$750,\"Asperges\")","v":1},{"$f":"SUMIFS(Août!$P$4:$P$751,Août!$D$4:$D$751,\"Août\",Août!$L$4:$L$751,\"Asperges\")","v":5},{"$f":"SUMIFS(Septembre!$P$4:$P$750,Septembre!$D$4:$D$750,\"Septembre\",Septembre!$L$4:$L$750,\"Asperges\")","v":1},{"$f":"SUMIFS(Octobre!$P$4:$P$750,Octobre!$D$4:$D$750,\"Octobre\",Octobre!$L$4:$L$750,\"Asperges\")","v":3},{"$f":"SUMIFS(Novembre!$P$4:$P$750,Novembre!$D$4:$D$750,\"Novembre\",Novembre!$L$4:$L$750,\"Asperges\")","v":2},{"$f":"SUMIFS(Décembre!$P$4:$P$750,Décembre!$D$4:$D$750,\"Décembre\",Décembre!$L$4:$L$750,\"Asperges\")","v":1},24]
["LV02","Avocat",{"$f":"SUMIFS(Janvier!$P$4:$P$720,Janvier!$D$4:$D$720,\"Janvier\",Janvier!$L$4:$L$720,\"Avocat\")","v":2},{"$f":"SUMIFS(Février!$P$4:$P$723,Février!$D$4:$D$723,\"Février\",Février!$L$4:$L$723,\"Avocat\")","v":1},{"$f":"SUMIFS(Mars!$P$4:$P$720,Mars!$D$4:$D$720,\"Mars\",Mars!$L$4:$L$720,\"Avocat\")","v":2},{"$f":"SUMIFS(Avril!$P$4:$P$717,Avril!$D$4:$D$717,\"Avril\",Avril!$L$4:$L$717,\"Avocat\")","v":1},{"$f":"SUMIFS(Mai!$P$4:$P$738,Mai!$D$4:$D$738,\"Mai\",Mai!$L$4:$L$738,\"Avocat\")","v":2},{"$f":"SUMIFS(Juin!$P$4:$P$749,Juin!$D$4:$D$749,\"Juin\",Juin!$L$4:$L$749,\"Avocat\")","v":1},{"$f":"SUMIFS(Juillet!$P$4:$P$750,Juillet!$D$4:$D$750,\"Juillet\",Juillet!$L$4:$L$750,\"Avocat\")","v":1},{"$f":"SUMIFS(Août!$P$4:$P$751,Août!$D$4:$D$751,\"Août\",Août!$L$4:$L$751,\"Avocat\")","v":2},{"$f":"SUMIFS(Septembre!$P$4:$P$750,Septembre!$D$4:$D$750,\"Septembre\",Septembre!$L$4:$L$750,\"Avocat\")","v":2},{"$f":"SUMIFS(Octobre!$P$4:$P$750,Octobre!$D$4:$D$750,\"Octobre\",Octobre!$L$4:$L$750,\"Avocat\")","v":2},{"$f":"SUMIFS(Novembre!$P$4:$P$750,Novembre!$D$4:$D$750,\"Novembre\",Novembre!$L$4:$L$750,\"Avocat\")","v":1},{"$f":"SUMIFS(Décembre!$P$4:$P$750,Décembre!$D$4:$D$750,\"Décembre\",Décembre!$L$4:$L$750,\"Avocat\")","v":1},18]
["LV03","Betterave rouge",{"$f":"SUMIFS(Janvier!$P$4:$P$720,Janvier!$D$4:$D$720,\"Janvier\",Janvier!$L$4:$L$720,\"Betterave rouge\")","v":0},{"$f":"SUMIFS(Février!$P$4:$P$723,Février!$D$4:$D$723,\"Février\",Février!$L$4:$L$723,\"Betterave rouge\")","v":0},{"$f":"SUMIFS(Mars!$P$4:$P$720,Mars!$D$4:$D$720,\"Mars\",Mars!$L$4:$L$720,\"Betterave rouge\")","v":1},{"$f":"SUMIFS(Avril!$P$4:$P$717,Avril!$D$4:$D$717,\"Avril\",Avril!$L$4:$L$717,\"Betterave rouge\")","v":0},{"$f":"SUMIFS(Mai!$P$4:$P$738,Mai!$D$4:$D$738,\"Mai\",Mai!$L$4:$L$738,\"Betterave rouge\")","v":1},{"$f":"SUMIFS(Juin!$P$4:$P$749,Juin!$D$4:$D$749,\"Juin\",Juin!$L$4:$L$749,\"Betterave rouge\")","v":0},{"$f":"SUMIFS(Juillet!$P$4:$P$750,Juillet!$D$4:$D$750,\"Juillet\",Juillet!$L$4:$L$750,\"Betterave rouge\")","v":0},{"$f":"SUMIFS(Août!$P$4:$P$751,Août!$D$4:$D$751,\"Août\",Août!$L$4:$L$751,\"Betterave rouge\")","v":1},{"$f":"SUMIFS(Septembre!$P$4:$P$750,Septembre!$D$4:$D$750,\"Septembre\",Septembre!$L$4:$L$750,\"Betterave rouge\")","v":0},{"$f":"SUMIFS(Octobre!$P$4:$P$750,Octobre!$D$4:$D$750,\"Octobre\",Octobre!$L$4:$L$750,\"Betterave rouge\")","v":0},{"$f":"SUMIFS(Novembre!$P$4:$P$750,Novembre!$D$4:$D$750,\"Novembre\",Novembre!$L$4:$L$750,\"Betterave rouge\")","v":1},{"$f":"SUMIFS(Décembre!$P$4:$P$750,Décembre!$D$4:$D$750,\"Décembre\",Décembre!$L$4:$L$750,\"Betterave rouge\")","v":0},4]
["LV04","Carottes",{"$f":"SUMIFS(Janvier!$P$4:$P$720,Janvier!$D$4:$D$720,\"Janvier\",Janvier!$L$4:$L$720,\"Carottes\")","v":3},{"$f":"SUMIFS(Février!$P$4:$P$723,Février!$D$4:$D$723,\"Février\",Février!$L$4:$L$723,\"Carottes\")","v":4},{"$f":"SUMIFS(Mars!$P$4:$P$720,Mars!$D$4:$D$720,\"Mars\",Mars!$L$4:$L$720,\"Carottes\")","v":4},{"$f":"SUMIFS(Avril!$P$4:$P$717,Avril!$D$4:$D$717,\"Avril\",Avril!$L$4:$L$717,\"Carottes\")","v":2},{"$f":"SUMIFS(Mai!$P$4:$P$738,Mai!$D$4:$D$738,\"Mai\",Mai!$L$4:$L$738,\"Carottes\")","v":2},{"$f":"SUMIFS(Juin!$P$4:$P$749,Juin!$D$4:$D$749,\"Juin\",Juin!$L$4:$L$749,\"Carottes\")","v":4},{"$f":"SUMIFS(Juillet!$P$4:$P$750,Juillet!$D$4:$D$750,\"Juillet\",Juillet!$L$4:$L$750,\"Carottes\")","v":2},{"$f":"SUMIFS(Août!$P$4:$P$751,Août!$D$4:$D$751,\"Août\",Août!$L$4:$L$751,\"Carottes\")","v":4},{"$f":"SUMIFS(Septembre!$P$4:$P$750,Septembre!$D$4:$D$750,\"Septembre\",Septembre!$L$4:$L$750,\"Carottes\")","v":3},{"$f":"SUMIFS(Octobre!$P$4:$P$750,Octobre!$D$4:$D$750,\"Octobre\",Octobre!$L$4:$L$750,\"Carottes\")","v":1},{"$f":"SUMIFS(Novembre!$P$4:$P$750,Novembre!$D$4:$D$750,\"Novembre\",Novembre!$L$4:$L$750,\"Carottes\")","v":4},{"$f":"SUMIFS(Décembre!$P$4:$P$750,Décembre!$D$4:$D$750,\"Décembre\",Décembre!$L$4:$L$750,\"Carottes\")","v":2},35]
["LV05","Céleri",{"$f":"SUMIFS(Janvier!$P$4:$P$720,Janvier!$D$4:$D$720,\"Janvier\",Janvier!$L$4:$L$720,\"Céleri\")","v":2},{"$f":"SUMIFS(Février!$P$4:$P$723,Février!$D$4:$D$723,\"Février\",Février!$L$4:$L$723,\"Céleri\")","v":2},{"$f":"SUMIFS(Mars!$P$4:$P$720,Mars!$D$4:$D$720,\"Mars\",Mars!$L$4:$L$720,\"Céleri\")","v":4},{"$f":"SUMIFS(Avril!$P$4:$P$717,Avril!$D$4:$D$717,\"Avril\",Avril!$L$4:$L$717,\"Céleri\")","v":1},{"$f":"SUMIFS(Mai!$P$4:$P$738,Mai!$D$4:$D$738,\"Mai\",Mai!$L$4:$L$738,\"Céleri\")","v":1},{"$f":"SUMIFS(Juin!$P$4:$P$749,Juin!$D$4:$D$749,\"Juin\",Juin!$L$4:$L$749,\"Céleri\")","v":2},{"$f":"SUMIFS(Juillet!$P$4:$P$750,Juillet!$D$4:$D$750,\"Juillet\",Juillet!$L$4:$L$750,\"Céleri\")","v":1},{"$f":"SUMIFS(Août!$P$4:$P$751,Août!$D$4:$D$751,\"Août\",Août!$L$4:$L$751,\"Céleri\")","v":2},{"$f":"SUMIFS(Septembre!$P$4:$P$750,Septembre!$D$4:$D$750,\"Septembre\",Septembre!$L$4:$L$750,\"Céleri\")","v":1},{"$f":"SUMIFS(Octobre!$P$4:$P$750,Octobre!$D$4:$D$750,\"Octobre\",Octobre!$L$4:$L$750,\"Céleri\")","v":2},{"$f":"SUMIFS(Novembre!$P$4:$P$750,Novembre!$D$4:$D$750,\"Novembre\",Novembre!$L$4:$L$750,\"Céleri\")","v":2},{"$f":"SUMIFS(Décembre!$P$4:$P$750,Décembre!$D$4:$D$750,\"Décembre\",Décembre!$L$4:$L$750,\"Céleri\")","v":1},21]
["LV06","Champignons",{"$f":"SUMIFS(Janvier!$P$4:$P$720,Janvier!$D$4:$D$720,\"Janvier\",Janvier!$L$4:$L$720,\"Champignons\")","v":2},{"$f":"SUMIFS(Février!$P$4:$P$723,Février!$D$4:$D$723,\"Février\",Février!$L$4:$L$723,\"Champignons\")","v":1},{"$f":"SUMIFS(Mars!$P$4:$P$720,Mars!$D$4:$D$720,\"Mars\",Mars!$L$4:$L$720,\"Champignons\")","v":2},{"$f":"SUMIFS(Avril!$P$4:$P$717,Avril!$D$4:$D$717,\"Avril\",Avril!$L$4:$L$717,\"Champignons\")","v":1},{"$f":"SUMIFS(Mai!$P$4:$P$738,Mai!$D$4:$D$738,\"Mai\",Mai!$L$4:$L$738,\"Champignons\")","v":1},{"$f":"SUMIFS(Juin!$P$4:$P$749,Juin!$D$4:$D$749,\"Juin\",Juin!$L$4:$L$749,\"Champignons\")","v":2},{"$f":"SUMIFS(Juillet!$P$4:$P$750,Juillet!$D$4:$D$750,\"Juillet\",Juillet!$L$4:$L$750,\"Champignons\")","v":1},{"$f":"SUMIFS(Août!$P$4:$P$751,Août!$D$4:$D$751,\"Août\",Août!$L$4:$L$751,\"Champignons\")","v":1},{"$f":"SUMIFS(Septembre!$P$4:$P$750,Septembre!$D$4:$D$750,\"Septembre\",Septembre!$L$4:$L$750,\"Champignons\")","v":2},{"$f":"SUMIFS(Octobre!$P$4:$P$750,Octobre!$D$4:$D$750,\"Octobre\",Octobre!$L$4:$L$750,\"Champignons\")","v":2},{"$f":"SUMIFS(Novembre!$P$4:$P$750,Novembre!$D$4:$D$750,\"Novembre\",Novembre!$L$4:$L$750,\"Champignons\")","v":2},{"$f":"SUMIFS(Décembre!$P$4:$P$750,Décembre!$D$4:$D$750,\"Décembre\",Décembre!$L$4:$L$750,\"Champignons\")","v":1},18]
["LV07","Concombre",{"$f":"SUMIFS(Janvier!$P$4:$P$720,Janvier!$D$4:$D$720,\"Janvier\",Janvier!$L$4:$L$720,\"Concombre\")","v":2},{"$f":"SUMIFS(Février!$P$4:$P$723,Février!$D$4:$D$723,\"Février\",Février!$L$4:$L$723,\"Concombre\")","v":1},{"$f":"SUMIFS(Mars!$P$4:$P$720,Mars!$D$4:$D$720,\"Mars\",Mars!$L$4:$L$720,\"Concombre\")","v":1},{"$f":"SUMIFS(Avril!$P$4:$P$717,Avril!$D$4:$D$717,\"Avril\",Avril!$L$4:$L$717,\"Concombre\")","v":3},{"$f":"SUMIFS(Mai!$P$4:$P$738,Mai!$D$4:$D$738,\"Mai\",Mai!$L$4:$L$738,\"Concombre\")","v":1},{"$f":"SUMIFS(Juin!$P$4:$P$749,Juin!$D$4:$D$749,\"Juin\",Juin!$L$4:$L$749,\"Concombre\")","v":2},{"$f":"SUMIFS(Juillet!$P$4:$P$750,Juillet!$D$4:$D$750,\"Juillet\",Juillet!$L$4:$L$750,\"Concombre\")","v":1},{"$f":"SUMIFS(Août!$P$4:$P$751,Août!$D$4:$D$751,\"Août\",Août!$L$4:$L$751,\"Concombre\")","v":1},{"$f":"SUMIFS(Septembre!$P$4:$P$750,Septembre!$D$4:$D$750,\"Septembre\",Septembre!$L$4:$L$750,\"Concombre\")","v":2},{"$f":"SUMIFS(Octobre!$P$4:$P$750,Octobre!$D$4:$D$750,\"Octobre\",Octobre!$L$4:$L$750,\"Concombre\")","v":2},{"$f":"SUMIFS(Novembre!$P$4:$P$750,Novembre!$D$4:$D$750,\"Novembre\",Novembre!$L$4:$L$750,\"Concombre\")","v":2},{"$f":"SUMIFS(Décembre!$P$4:$P$750,Décembre!$D$4:$D$750,\"Décembre\",Décembre!$L$4:$L$750,\"Concombre\")","v":1},19]
["LV08","Radis",{"$f":"SUMIFS(Janvier!$P$4:$P$720,Janvier!$D$4:$D$720,\"Janvier\",Janvier!$L$4:$L$720,\"Radis\")","v":1},{"$f":"SUMIFS(Février!$P$4:$P$723,Février!$D$4:$D$723,\"Février\",Février!$L$4:$L$723,\"Radis\")","v":2},{"$f":"SUMIFS(Mars!$P$4:$P$720,Mars!$D$4:$D$720,\"Mars\",Mars!$L$4:$L$720,\"Radis\")","v":1},{"$f":"SUMIFS(Avril!$P$4:$P$717,Avril!$D$4:$D$717,\"Avril\",Avril!$L$4:$L$717,\"Radis\")","v":2},{"$f":"SUMIFS(Mai!$P$4:$P$738,Mai!$D$4:$D$738,\"Mai\",Mai!$L$4:$L$738,\"Radis\")","v":1},{"$f":"SUMIFS(Juin!$P$4:$P$749,Juin!$D$4:$D$749,\"Juin\",Juin!$L$4:$L$749,\"Radis\")","v":1},{"$f":"SUMIFS(Juillet!$P$4:$P$750,Juillet!$D$4:$D$750,\"Juillet\",Juillet!$L$4:$L$750,\"Radis\")","v":3},{"$f":"SUMIFS(Août!$P$4:$P$751,Août!$D$4:$D$751,\"Août\",Août!$L$4:$L$751,\"Radis\")","v":1},{"$f":"SUMIFS(Septembre!$P$4:$P$750,Septembre!$D$4:$D$750,\"Septembre\",Septembre!$L$4:$L$750,\"Radis\")","v":2},{"$f":"SUMIFS(Octobre!$P$4:$P$750,Octobre!$D$4:$D$750,\"Octobre\",Octobre!$L$4:$L$750,\"Radis\")","v":1},{"$f":"SUMIFS(Novembre!$P$4:$P$750,Novembre!$D$4:$D$750,\"Novembre\",Novembre!$L$4:$L$750,\"Radis\")","v":1},{"$f":"SUMIFS(Décembre!$P$4:$P$750,Décembre!$D$4:$D$750,\"Décembre\",Décembre!$L$4:$L$750,\"Radis\")","v":2},18]
["LV09","Salade",{"$f":"SUMIFS(Janvier!$P$4:$P$720,Janvier!$D$4:$D$720,\"Janvier\",Janvier!$L$4:$L$720,\"Salade\")","v":2},{"$f":"SUMIFS(Février!$P$4:$P$723,Février!$D$4:$D$723,\"Février\",Février!$L$4:$L$723,\"Salade\")","v":2},{"$f":"SUMIFS(Mars!$P$4:$P$720,Mars!$D$4:$D$720,\"Mars\",Mars!$L$4:$L$720,\"Salade\")","v":1},{"$f":"SUMIFS(Avril!$P$4:$P$717,Avril!$D$4:$D$717,\"Avril\",Avril!$L$4:$L$717,\"Salade\")","v":26},{"$f":"SUMIFS(Mai!$P$4:$P$738,Mai!$D$4:$D$738,\"Mai\",Mai!$L$4:$L$738,\"Salade\")","v":1},{"$f":"SUMIFS(Juin!$P$4:$P$749,Juin!$D$4:$D$749,\"Juin\",Juin!$L$4:$L$749,\"Salade\")","v":1},{"$f":"SUMIFS(Juillet!$P$4:$P$750,Juillet!$D$4:$D$750,\"Juillet\",Juillet!$L$4:$L$750,\"Salade\")","v":2},{"$f":"SUMIFS(Août!$P$4:$P$751,Août!$D$4:$D$751,\"Août\",Août!$L$4:$L$751,\"Salade\")","v":2},{"$f":"SUMIFS(Septembre!$P$4:$P$750,Septembre!$D$4:$D$750,\"Septembre\",Septembre!$L$4:$L$750,\"Salade\")","v":2},{"$f":"SUMIFS(Octobre!$P$4:$P$750,Octobre!$D$4:$D$750,\"Octobre\",Octobre!$L$4:$L$750,\"Salade\")","v":1},{"$f":"SUMIFS(Novembre!$P$4:$P$750,Novembre!$D$4:$D$750,\"Novembre\",Novembre!$L$4:$L$750,\"Salade\")","v":1},{"$f":"SUMIFS(Décembre!$P$4:$P$750,Décembre!$D$4:$D$750,\"Décembre\",Décembre!$L$4:$L$750,\"Salade\")","v":2},43]
["LV10","Salsifis",{"$f":"SUMIFS(Janvier!$P$4:$P$720,Janvier!$D$4:$D$720,\"Janvier\",Janvier!$L$4:$L$720,\"Salsifis\")","v":0},{"$f":"SUMIFS(Février!$P$4:$P$723,Février!$D$4:$D$723,\"Février\",Février!$L$4:$L$723,\"Salsifis\")","v":1},{"$f":"SUMIFS(Mars!$P$4:$P$720,Mars!$D$4:$D$720,\"Mars\",Mars!$L$4:$L$720,\"Salsifis\")","v":0},{"$f":"SUMIFS(Avril!$P$4:$P$717,Avril!$D$4:$D$717,\"Avril\",Avril!$L$4:$L$717,\"Salsifis\")","v":0},{"$f":"SUMIFS(Mai!$P$4:$P$738,Mai!$D$4:$D$738,\"Mai\",Mai!$L$4:$L$738,\"Salsifis\")","v":1},{"$f":"SUMIFS(Juin!$P$4:$P$749,Juin!$D$4:$D$749,\"Juin\",Juin!$L$4:$L$749,\"Salsifis\")","v":0},{"$f":"SUMIFS(Juillet!$P$4:$P$750,Juillet!$D$4:$D$750,\"Juillet\",Juillet!$L$4:$L$750,\"Salsifis\")","v":1},{"$f":"SUMIFS(Août!$P$4:$P$751,Août!$D$4:$D$751,\"Août\",Août!$L$4:$L$751,\"Salsifis\")","v":0},{"$f":"SUMIFS(Septembre!$P$4:$P$750,Septembre!$D$4:$D$750,\"Septembre\",Septembre!$L$4:$L$750,\"Salsifis\")","v":0},{"$f":"SUMIFS(Octobre!$P$4:$P$750,Octobre!$D$4:$D$750,\"Octobre\",Octobre!$L$4:$L$750,\"Salsifis\")","v":1},{"$f":"SUMIFS(Novembre!$P$4:$P$750,Novembre!$D$4:$D$750,\"Novembre\",Novembre!$L$4:$L$750,\"Salsifis\")","v":0},{"$f":"SUMIFS(Décembre!$P$4:$P$750,Décembre!$D$4:$D$750,\"Décembre\",Décembre!$L$4:$L$750,\"Salsifis\")","v":1},5]
["LV11","Tomates ",{"$f":"SUMIFS(Janvier!$P$4:$P$720,Janvier!$D$4:$D$720,\"Janvier\",Janvier!$L$4:$L$720,\"Tomates\")","v":4},{"$f":"SUMIFS(Février!$P$4:$P$723,Février!$D$4:$D$723,\"Février\",Février!$L$4:$L$723,\"Tomates\")","v":2},{"$f":"SUMIFS(Mars!$P$4:$P$720,Mars!$D$4:$D$720,\"Mars\",Mars!$L$4:$L$720,\"Tomates\")","v":2},{"$f":"SUMIFS(Avril!$P$4:$P$717,Avril!$D$4:$D$717,\"Avril\",Avril!$L$4:$L$717,\"Tomates\")","v":2},{"$f":"SUMIFS(Mai!$P$4:$P$738,Mai!$D$4:$D$738,\"Mai\",Mai!$L$4:$L$738,\"Tomates\")","v":2},{"$f":"SUMIFS(Juin!$P$4:$P$749,Juin!$D$4:$D$749,\"Juin\",Juin!$L$4:$L$749,\"Tomates\")","v":1},{"$f":"SUMIFS(Juillet!$P$4:$P$750,Juillet!$D$4:$D$750,\"Juillet\",Juillet!$L$4:$L$750,\"Tomates\")","v":2},{"$f":"SUMIFS(Août!$P$4:$P$751,Août!$D$4:$D$751,\"Août\",Août!$L$4:$L$751,\"Tomates\")","v":4},{"$f":"SUMIFS(Septembre!$P$4:$P$750,Septembre!$D$4:$D$750,\"Septembre\",Septembre!$L$4:$L$750,\"Tomates\")","v":2},{"$f":"SUMIFS(Octobre!$P$4:$P$750,Octobre!$D$4:$D$750,\"Octobre\",Octobre!$L$4:$L$750,\"Tomates\")","v":2},{"$f":"SUMIFS(Novembre!$P$4:$P$750,Novembre!$D$4:$D$750,\"Novembre\",Novembre!$L$4:$L$750,\"Tomates\")","v":2},{"$f":"SUMIFS(Décembre!$P$4:$P$750,Décembre!$D$4:$D$750,\"Décembre\",Décembre!$L$4:$L$750,\"Tomates\")","v":2},27]
["LS01","Pâtes à la sauce tomates",{"$f":"SUMIFS(Janvier!$P$4:$P$720,Janvier!$D$4:$D$720,\"Janvier\",Janvier!$L$4:$L$720,\"Pâtes à la sauce tomates\")","v":25},{"$f":"SUMIFS(Février!$P$4:$P$723,Février!$D$4:$D$723,\"Février\",Février!$L$4:$L$723,\"Pâtes à la sauce tomates\")","v":15},{"$f":"SUMIFS(Mars!$P$4:$P$720,Mars!$D$4:$D$720,\"Mars\",Mars!$L$4:$L$720,\"Pâtes à la sauce tomates\")","v":25},{"$f":"SUMIFS(Avril!$P$4:$P$717,Avril!$D$4:$D$717,\"Avril\",Avril!$L$4:$L$717,\"Pâtes à la sauce tomates\")","v":15},{"$f":"SUMIFS(Mai!$P$4:$P$738,Mai!$D$4:$D$738,\"Mai\",Mai!$L$4:$L$738,\"Pâtes à la sauce tomates\")","v":20},{"$f":"SUMIFS(Juin!$P$4:$P$749,Juin!$D$4:$D$749,\"Juin\",Juin!$L$4:$L$749,\"Pâtes à la sauce tomates\")","v":25},{"$f":"SUMIFS(Juillet!$P$4:$P$750,Juillet!$D$4:$D$750,\"Juillet\",Juillet!$L$4:$L$750,\"Pâtes à la sauce tomates\")","v":15},{"$f":"SUMIFS(Août!$P$4:$P$751,Août!$D$4:$D$751,\"Août\",Août!$L$4:$L$751,\"Pâtes à la sauce tomates\")","v":25},{"$f":"SUMIFS(Septembre!$P$4:$P$750,Septembre!$D$4:$D$750,\"Septembre\",Septembre!$L$4:$L$750,\"Pâtes à la sauce tomates\")","v":15},{"$f":"SUMIFS(Octobre!$P$4:$P$750,Octobre!$D$4:$D$750,\"Octobre\",Octobre!$L$4:$L$750,\"Pâtes à la sauce tomates\")","v":25},{"$f":"SUMIFS(Novembre!$P$4:$P$750,Novembre!$D$4:$D$750,\"Novembre\",Novembre!$L$4:$L$750,\"Pâtes à la sauce tomates\")","v":15},{"$f":"SUMIFS(Décembre!$P$4:$P$750,Décembre!$D$4:$D$750,\"Décembre\",Décembre!$L$4:$L$750,\"Pâtes à la sauce tomates\")","v":30},250]
["LS02","Pâtes au beurre",{"$f":"SUMIFS(Janvier!$P$4:$P$720,Janvier!$D$4:$D$720,\"Janvier\",Janvier!$L$4:$L$720,\"Pâtes au beurre\")","v":15},{"$f":"SUMIFS(Février!$P$4:$P$723,Février!$D$4:$D$723,\"Février\",Février!$L$4:$L$723,\"Pâtes au beurre\")","v":25},{"$f":"SUMIFS(Mars!$P$4:$P$720,Mars!$D$4:$D$720,\"Mars\",Mars!$L$4:$L$720,\"Pâtes au beurre\")","v":15},{"$f":"SUMIFS(Avril!$P$4:$P$717,Avril!$D$4:$D$717,\"Avril\",Avril!$L$4:$L$717,\"Pâtes au beurre\")","v":25},{"$f":"SUMIFS(Mai!$P$4:$P$738,Mai!$D$4:$D$738,\"Mai\",Mai!$L$4:$L$738,\"Pâtes au beurre\")","v":20},{"$f":"SUMIFS(Juin!$P$4:$P$749,Juin!$D$4:$D$749,\"Juin\",Juin!$L$4:$L$749,\"Pâtes au beurre\")","v":25},{"$f":"SUMIFS(Juillet!$P$4:$P$750,Juillet!$D$4:$D$750,\"Juillet\",Juillet!$L$4:$L$750,\"Pâtes au beurre\")","v":15},{"$f":"SUMIFS(Août!$P$4:$P$751,Août!$D$4:$D$751,\"Août\",Août!$L$4:$L$751,\"Pâtes au beurre\")","v":25},{"$f":"SUMIFS(Septembre!$P$4:$P$750,Septembre!$D$4:$D$750,\"Septembre\",Septembre!$L$4:$L$750,\"Pâtes au beurre\")","v":15},{"$f":"SUMIFS(Octobre!$P$4:$P$750,Octobre!$D$4:$D$750,\"Octobre\",Octobre!$L$4:$L$750,\"Pâtes au beurre\")","v":15},{"$f":"SUMIFS(Novembre!$P$4:$P$750,Novembre!$D$4:$D$750,\"Novembre\",Novembre!$L$4:$L$750,\"Pâtes au beurre\")","v":25},{"$f":"SUMIFS(Décembre!$P$4:$P$750,Décembre!$D$4:$D$750,\"Décembre\",Décembre!$L$4:$L$750,\"Pâtes au beurre\")","v":20},240]
["LS03","Pâtes au fromage râpé",{"$f":"SUMIFS(Janvier!$P$4:$P$720,Janvier!$D$4:$D$720,\"Janvier\",Janvier!$L$4:$L$720,\"Pâtes au fromage râpé\")","v":10},{"$f":"SUMIFS(Février!$P$4:$P$723,Février!$D$4:$D$723,\"Février\",Février!$L$4:$L$723,\"Pâtes au fromage râpé\")","v":10},{"$f":"SUMIFS(Mars!$P$4:$P$720,Mars!$D$4:$D$720,\"Mars\",Mars!$L$4:$L$720,\"Pâtes au fromage râpé\")","v":20},{"$f":"SUMIFS(Avril!$P$4:$P$717,Avril!$D$4:$D$717,\"Avril\",Avril!$L$4:$L$717,\"Pâtes au fromage râpé\")","v":10},{"$f":"SUMIFS(Mai!$P$4:$P$738,Mai!$D$4:$D$738,\"Mai\",Mai!$L$4:$L$738,\"Pâtes au fromage râpé\")","v":20},{"$f":"SUMIFS(Juin!$P$4:$P$749,Juin!$D$4:$D$749,\"Juin\",Juin!$L$4:$L$749,\"Pâtes au fromage râpé\")","v":10},{"$f":"SUMIFS(Juillet!$P$4:$P$750,Juillet!$D$4:$D$750,\"Juillet\",Juillet!$L$4:$L$750,\"Pâtes au fromage râpé\")","v":20},{"$f":"SUMIFS(Août!$P$4:$P$751,Août!$D$4:$D$751,\"Août\",Août!$L$4:$L$751,\"Pâtes au fromage râpé\")","v":10},{"$f":"SUMIFS(Septembre!$P$4:$P$750,Septembre!$D$4:$D$750,\"Septembre\",Septembre!$L$4:$L$750,\"Pâtes au fromage râpé\")","v":20},{"$f":"SUMIFS(Octobre!$P$4:$P$750,Octobre!$D$4:$D$750,\"Octobre\",Octobre!$L$4:$L$750,\"Pâtes au fromage râpé\")","v":10},{"$f":"SUMIFS(Novembre!$P$4:$P$750,Novembre!$D$4:$D$750,\"Novembre\",Novembre!$L$4:$L$750,\"Pâtes au fromage râpé\")","v":20},{"$f":"SUMIFS(Décembre!$P$4:$P$750,Décembre!$D$4:$D$750,\"Décembre\",Décembre!$L$4:$L$750,\"Pâtes au fromage râpé\")","v":10},170]
["LD02","Chips",{"$f":"SUMIFS(Janvier!$P$4:$P$720,Janvier!$D$4:$D$720,\"Janvier\",Janvier!$L$4:$L$720,\"Chips\")","v":1},{"$f":"SUMIFS(Février!$P$4:$P$723,Février!$D$4:$D$723,\"Février\",Février!$L$4:$L$723,\"Chips\")","v":2},{"$f":"SUMIFS(Mars!$P$4:$P$720,Mars!$D$4:$D$720,\"Mars\",Mars!$L$4:$L$720,\"Chips\")","v":1},{"$f":"SUMIFS(Avril!$P$4:$P$717,Avril!$D$4:$D$717,\"Avril\",Avril!$L$4:$L$717,\"Chips\")","v":2},{"$f":"SUMIFS(Mai!$P$4:$P$738,Mai!$D$4:$D$738,\"Mai\",Mai!$L$4:$L$738,\"Chips\")","v":0},{"$f":"SUMIFS(Juin!$P$4:$P$749,Juin!$D$4:$D$749,\"Juin\",Juin!$L$4:$L$749,\"Chips\")","v":2},{"$f":"SUMIFS(Juillet!$P$4:$P$750,Juillet!$D$4:$D$750,\"Juillet\",Juillet!$L$4:$L$750,\"Chips\")","v":1},{"$f":"SUMIFS(Août!$P$4:$P$751,Août!$D$4:$D$751,\"Août\",Août!$L$4:$L$751,\"Chips\")","v":1},{"$f":"SUMIFS(Septembre!$P$4:$P$750,Septembre!$D$4:$D$750,\"Septembre\",Septembre!$L$4:$L$750,\"Chips\")","v":2},{"$f":"SUMIFS(Octobre!$P$4:$P$750,Octobre!$D$4:$D$750,\"Octobre\",Octobre!$L$4:$L$750,\"Chips\")","v":1},{"$f":"SUMIFS(Novembre!$P$4:$P$750,Novembre!$D$4:$D$750,\"Novembre\",Novembre!$L$4:$L$750,\"Chips\")","v":2},{"$f":"SUMIFS(Décembre!$P$4:$P$750,Décembre!$D$4:$D$750,\"Décembre\",Décembre!$L$4:$L$750,\"Chips\")","v":1},16]
["LD03","Frites",{"$f":"SUMIFS(Janvier!$P$4:$P$720,Janvier!$D$4:$D$720,\"Janvier\",Janvier!$L$4:$L$720,\"Frites\")","v":20},{"$f":"SUMIFS(Février!$P$4:$P$723,Février!$D$4:$D$723,\"Février\",Février!$L$4:$L$723,\"Frites\")","v":20},{"$f":"SUMIFS(Mars!$P$4:$P$720,Mars!$D$4:$D$720,\"Mars\",Mars!$L$4:$L$720,\"Frites\")","v":40},{"$f":"SUMIFS(Avril!$P$4:$P$717,Avril!$D$4:$D$717,\"Avril\",Avril!$L$4:$L$717,\"Frites\")","v":20},{"$f":"SUMIFS(Mai!$P$4:$P$738,Mai!$D$4:$D$738,\"Mai\",Mai!$L$4:$L$738,\"Frites\")","v":40},{"$f":"SUMIFS(Juin!$P$4:$P$749,Juin!$D$4:$D$749,\"Juin\",Juin!$L$4:$L$749,\"Frites\")","v":20},{"$f":"SUMIFS(Juillet!$P$4:$P$750,Juillet!$D$4:$D$750,\"Juillet\",Juillet!$L$4:$L$750,\"Frites\")","v":40},{"$f":"SUMIFS(Août!$P$4:$P$751,Août!$D$4:$D$751,\"Août\",Août!$L$4:$L$751,\"Frites\")","v":20},{"$f":"SUMIFS(Septembre!$P$4:$P$750,Septembre!$D$4:$D$750,\"Septembre\",Septembre!$L$4:$L$750,\"Frites\")","v":40},{"$f":"SUMIFS(Octobre!$P$4:$P$750,Octobre!$D$4:$D$750,\"Octobre\",Octobre!$L$4:$L$750,\"Frites\")","v":20},{"$f":"SUMIFS(Novembre!$P$4:$P$750,Novembre!$D$4:$D$750,\"Novembre\",Novembre!$L$4:$L$750,\"Frites\")","v":20},{"$f":"SUMIFS(Décembre!$P$4:$P$750,Décembre!$D$4:$D$750,\"Décembre\",Décembre!$L$4:$L$750,\"Frites\")","v":40},340]
["LD01","Asperges",{"$f":"SUMIFS(Janvier!$V$4:$V$720,Janvier!$D$4:$D$720,\"Janvier\",Janvier!$R$4:$R$720,\"Asperges\")","v":1},{"$f":"SUMIFS(Février!$V$4:$V$723,Février!$D$4:$D$723,\"Février\",Février!$R$4:$R$723,\"Asperges\")","v":1},{"$f":"SUMIFS(Mars!$V$4:$V$720,Mars!$D$4:$D$720,\"Mars\",Mars!$R$4:$R$720,\"Asperges\")","v":2},{"$f":"SUMIFS(Avril!$V$4:$V$717,Avril!$D$4:$D$717,\"Avril\",Avril!$R$4:$R$717,\"Asperges\")","v":1},{"$f":"SUMIFS(Mai!$V$4:$V$738,Mai!$D$4:$D$738,\"Mai\",Mai!$R$4:$R$738,\"Asperges\")","v":2},{"$f":"SUMIFS(Juin!$V$4:$V$749,Juin!$D$4:$D$749,\"Juin\",Juin!$R$4:$R$749,\"Asperges\")","v":1},{"$f":"SUMIFS(Juillet!$V$4:$V$750,Juillet!$D$4:$D$750,\"Juillet\",Juillet!$R$4:$R$750,\"Asperges\")","v":2},{"$f":"SUMIFS(Août!$V$4:$V$751,Août!$D$4:$D$751,\"Août\",Août!$R$4:$R$751,\"Asperges\")","v":1},{"$f":"SUMIFS(Septembre!$V$4:$V$750,Septembre!$D$4:$D$750,\"Septembre\",Septembre!$R$4:$R$750,\"Asperges\")","v":2},{"$f":"SUMIFS(Octobre!$V$4:$V$750,Octobre!$D$4:$D$750,\"Octobre\",Octobre!$R$4:$R$750,\"Asperges\")","v":1},{"$f":"SUMIFS(Novembre!$V$4:$V$750,Novembre!$D$4:$D$750,\"Novembre\",Novembre!$R$4:$R$750,\"Asperges\")","v":1},{"$f":"SUMIFS(Décembre!$V$4:$V$750,Décembre!$D$4:$D$750,\"Décembre\",Décembre!$R$4:$R$750,\"Asperges\")","v":2},17]
["LD01+LV01","Asperges",{"$f":"$C$24+$C$40","v":3},{"$f":"$D$24+$D$40","v":2},{"$f":"$E$24+$E$40","v":4},{"$f":"$F$24+$F$40","v":3},{"$f":"$G$24+$G$40","v":4},{"$f":"$H$24+$H$40","v":3},{"$f":"$I$24+$I$40","v":3},{"$f":"$J$24+$J$40","v":6},{"$f":"$K$24+$K$40","v":3},{"$f":"$L$24+$L$40","v":4},{"$f":"$M$24+$M$40","v":3},{"$f":"$N$24+$N$40","v":3},{"$f":"$O$24+$O$40","v":41}]
["Fini à Limeil-Brévannes, le mardi 22 janvier 2019."]

{"sheet":"Quantité viandes","index":22,"n_rows":43,"n_cols":15,"rows_kept":43,"cut":false,"hidden":false,"merged":[[0,0,0,14],[42,0,42,14]]}
["Quantité des viandes par articles et par mois pour l'année 2019."]
[]
["Code viande","Viande","Janvier","Février","Mars","Avril","Mai","Juin","Juillet","Août","Septembre","Octobre","Novembre","Décembre","Totaux"]
["V01","Bifteck haché de bœuf",{"$f":"SUMIFS(Janvier!$AB$4:$AB$720,Janvier!$D$4:$D$720,\"Janvier\",Janvier!$X$4:$X$720,\"Bifteck haché de bœuf\")","v":0},{"$f":"SUMIFS(Février!$AB$4:$AB$723,Février!$D$4:$D$723,\"Février\",Février!$X$4:$X$723,\"Bifteck haché de bœuf\")","v":2},{"$f":"SUMIFS(Mars!$AB$4:$AB$720,Mars!$D$4:$D$720,\"Mars\",Mars!$X$4:$X$720,\"Bifteck haché de bœuf\")","v":0},{"$f":"SUMIFS(Avril!$AB$4:$AB$717,Avril!$D$4:$D$717,\"Avril\",Avril!$X$4:$X$717,\"Bifteck haché de bœuf\")","v":0},{"$f":"SUMIFS(Mai!$AB$4:$AB$738,Mai!$D$4:$D$738,\"Mai\",Mai!$X$4:$X$738,\"Bifteck haché de bœuf\")","v":2},{"$f":"SUMIFS(Juin!$AB$4:$AB$749,Juin!$D$4:$D$749,\"Juin\",Juin!$X$4:$X$749,\"Bifteck haché de bœuf\")","v":0},{"$f":"SUMIFS(Juillet!$AB$4:$AB$750,Juillet!$D$4:$D$750,\"Juillet\",Juillet!$X$4:$X$750,\"Bifteck haché de bœuf\")","v":0},{"$f":"SUMIFS(Août!$AB$4:$AB$751,Août!$D$4:$D$751,\"Août\",Août!$X$4:$X$751,\"Bifteck haché de bœuf\")","v":2},{"$f":"SUMIFS(Septembre!$AB$4:$AB$750,Septembre!$D$4:$D$750,\"Septembre\",Septembre!$X$4:$X$750,\"Bifteck haché de bœuf\")","v":0},{"$f":"SUMIFS(Octobre!$AB$4:$AB$750,Octobre!$D$4:$D$750,\"Octobre\",Octobre!$X$4:$X$750,\"Bifteck haché de bœuf\")","v":0},{"$f":"SUMIFS(Novembre!$AB$4:$AB$750,Novembre!$D$4:$D$750,\"Novembre\",Novembre!$X$4:$X$750,\"Bifteck haché de bœuf\")","v":2},{"$f":"SUMIFS(Décembre!$AB$4:$AB$750,Décembre!$D$4:$D$750,\"Décembre\",Décembre!$X$4:$X$750,\"Bifteck haché de bœuf\")","v":0},{"$f":"SUM($C4:$N4)","v":8}]
["V02","Bifteck haché de cheval",{"$f":"SUMIFS(Janvier!$AB$4:$AB$720,Janvier!$D$4:$D$720,\"Janvier\",Janvier!$X$4:$X$720,\"Bifteck haché de cheval\")","v":0},{"$f":"SUMIFS(Février!$AB$4:$AB$723,Février!$D$4:$D$723,\"Février\",Février!$X$4:$X$723,\"Bifteck haché de cheval\")","v":125},{"$f":"SUMIFS(Mars!$AB$4:$AB$720,Mars!$D$4:$D$720,\"Mars\",Mars!$X$4:$X$720,\"Bifteck haché de cheval\")","v":0},{"$f":"SUMIFS(Avril!$AB$4:$AB$717,Avril!$D$4:$D$717,\"Avril\",Avril!$X$4:$X$717,\"Bifteck haché de cheval\")","v":0},{"$f":"SUMIFS(Mai!$AB$4:$AB$738,Mai!$D$4:$D$738,\"Mai\",Mai!$X$4:$X$738,\"Bifteck haché de cheval\")","v":125},{"$f":"SUMIFS(Juin!$AB$4:$AB$749,Juin!$D$4:$D$749,\"Juin\",Juin!$X$4:$X$749,\"Bifteck haché de cheval\")","v":0},{"$f":"SUMIFS(Juillet!$AB$4:$AB$750,Juillet!$D$4:$D$750,\"Juillet\",Juillet!$X$4:$X$750,\"Bifteck haché de cheval\")","v":0},{"$f":"SUMIFS(Août!$AB$4:$AB$751,Août!$D$4:$D$751,\"Août\",Août!$X$4:$X$751,\"Bifteck haché de cheval\")","v":125},{"$f":"SUMIFS(Septembre!$AB$4:$AB$750,Septembre!$D$4:$D$750,\"Septembre\",Septembre!$X$4:$X$750,\"Bifteck haché de cheval\")","v":0},{"$f":"SUMIFS(Octobre!$AB$4:$AB$750,Octobre!$D$4:$D$750,\"Octobre\",Octobre!$X$4:$X$750,\"Bifteck haché de cheval\")","v":0},{"$f":"SUMIFS(Novembre!$AB$4:$AB$750,Novembre!$D$4:$D$750,\"Novembre\",Novembre!$X$4:$X$750,\"Bifteck haché de cheval\")","v":125},{"$f":"SUMIFS(Décembre!$AB$4:$AB$750,Décembre!$D$4:$D$750,\"Décembre\",Décembre!$X$4:$X$750,\"Bifteck haché de cheval\")","v":0},{"$f":"SUM($C5:$N5)","v":500}]
["V03","Bifteck haché de veau",{"$f":"SUMIFS(Janvier!$AB$4:$AB$720,Janvier!$D$4:$D$720,\"Janvier\",Janvier!$X$4:$X$720,\"Bifteck haché de veau\")","v":0},{"$f":"SUMIFS(Février!$AB$4:$AB$723,Février!$D$4:$D$723,\"Février\",Février!$X$4:$X$723,\"Bifteck haché de veau\")","v":2},{"$f":"SUMIFS(Mars!$AB$4:$AB$720,Mars!$D$4:$D$720,\"Mars\",Mars!$X$4:$X$720,\"Bifteck haché de veau\")","v":0},{"$f":"SUMIFS(Avril!$AB$4:$AB$717,Avril!$D$4:$D$717,\"Avril\",Avril!$X$4:$X$717,\"Bifteck haché de veau\")","v":0},{"$f":"SUMIFS(Mai!$AB$4:$AB$738,Mai!$D$4:$D$738,\"Mai\",Mai!$X$4:$X$738,\"Bifteck haché de veau\")","v":2},{"$f":"SUMIFS(Juin!$AB$4:$AB$749,Juin!$D$4:$D$749,\"Juin\",Juin!$X$4:$X$749,\"Bifteck haché de veau\")","v":0},{"$f":"SUMIFS(Juillet!$AB$4:$AB$750,Juillet!$D$4:$D$750,\"Juillet\",Juillet!$X$4:$X$750,\"Bifteck haché de veau\")","v":0},{"$f":"SUMIFS(Août!$AB$4:$AB$751,Août!$D$4:$D$751,\"Août\",Août!$X$4:$X$751,\"Bifteck haché de veau\")","v":2},{"$f":"SUMIFS(Septembre!$AB$4:$AB$750,Septembre!$D$4:$D$750,\"Septembre\",Septembre!$X$4:$X$750,\"Bifteck haché de veau\")","v":0},{"$f":"SUMIFS(Octobre!$AB$4:$AB$750,Octobre!$D$4:$D$750,\"Octobre\",Octobre!$X$4:$X$750,\"Bifteck haché de veau\")","v":0},{"$f":"SUMIFS(Novembre!$AB$4:$AB$750,Novembre!$D$4:$D$750,\"Novembre\",Novembre!$X$4:$X$750,\"Bifteck haché de veau\")","v":1},{"$f":"SUMIFS(Décembre!$AB$4:$AB$750,Décembre!$D$4:$D$750,\"Décembre\",Décembre!$X$4:$X$750,\"Bifteck haché de veau\")","v":1},8]
["V04","Bouchée à la reine",{"$f":"SUMIFS(Janvier!$AB$4:$AB$720,Janvier!$D$4:$D$720,\"Janvier\",Janvier!$X$4:$X$720,\"Bouchée à la reine\")","v":0},{"$f":"SUMIFS(Février!$AB$4:$AB$723,Février!$D$4:$D$723,\"Février\",Février!$X$4:$X$723,\"Bouchée à la reine\")","v":2},{"$f":"SUMIFS(Mars!$AB$4:$AB$720,Mars!$D$4:$D$720,\"Mars\",Mars!$X$4:$X$720,\"Bouchée à la reine\")","v":0},{"$f":"SUMIFS(Avril!$AB$4:$AB$717,Avril!$D$4:$D$717,\"Avril\",Avril!$X$4:$X$717,\"Bouchée à la reine\")","v":0},{"$f":"SUMIFS(Mai!$AB$4:$AB$738,Mai!$D$4:$D$738,\"Mai\",Mai!$X$4:$X$738,\"Bouchée à la reine\")","v":2},{"$f":"SUMIFS(Juin!$AB$4:$AB$749,Juin!$D$4:$D$749,\"Juin\",Juin!$X$4:$X$749,\"Bouchée à la reine\")","v":0},{"$f":"SUMIFS(Juillet!$AB$4:$AB$750,Juillet!$D$4:$D$750,\"Juillet\",Juillet!$X$4:$X$750,\"Bouchée à la reine\")","v":0},{"$f":"SUMIFS(Août!$AB$4:$AB$751,Août!$D$4:$D$751,\"Août\",Août!$X$4:$X$751,\"Bouchée à la reine\")","v":1},{"$f":"SUMIFS(Septembre!$AB$4:$AB$750,Septembre!$D$4:$D$750,\"Septembre\",Septembre!$X$4:$X$750,\"Bouchée à la reine\")","v":1},{"$f":"SUMIFS(Octobre!$AB$4:$AB$750,Octobre!$D$4:$D$750,\"Octobre\",Octobre!$X$4:$X$750,\"Bouchée à la reine\")","v":0},{"$f":"SUMIFS(Novembre!$AB$4:$AB$750,Novembre!$D$4:$D$750,\"Novembre\",Novembre!$X$4:$X$750,\"Bouchée à la reine\")","v":0},{"$f":"SUMIFS(Décembre!$AB$4:$AB$750,Décembre!$D$4:$D$750,\"Décembre\",Décembre!$X$4:$X$750,\"Bouchée à la reine\")","v":2},8]
["V05","Boudin",{"$f":"SUMIFS(Janvier!$AB$4:$AB$720,Janvier!$D$4:$D$720,\"Janvier\",Janvier!$X$4:$X$720,\"Boudin\")","v":0},{"$f":"SUMIFS(Février!$AB$4:$AB$723,Février!$D$4:$D$723,\"Février\",Février!$X$4:$X$723,\"Boudin\")","v":1},{"$f":"SUMIFS(Mars!$AB$4:$AB$720,Mars!$D$4:$D$720,\"Mars\",Mars!$X$4:$X$720,\"Boudin\")","v":0},{"$f":"SUMIFS(Avril!$AB$4:$AB$717,Avril!$D$4:$D$717,\"Avril\",Avril!$X$4:$X$717,\"Boudin\")","v":0},{"$f":"SUMIFS(Mai!$AB$4:$AB$738,Mai!$D$4:$D$738,\"Mai\",Mai!$X$4:$X$738,\"Boudin\")","v":0.5},{"$f":"SUMIFS(Juin!$AB$4:$AB$749,Juin!$D$4:$D$749,\"Juin\",Juin!$X$4:$X$749,\"Boudin\")","v":0.5},{"$f":"SUMIFS(Juillet!$AB$4:$AB$750,Juillet!$D$4:$D$750,\"Juillet\",Juillet!$X$4:$X$750,\"Boudin\")","v":0},{"$f":"SUMIFS(Août!$AB$4:$AB$751,Août!$D$4:$D$751,\"Août\",Août!$X$4:$X$751,\"Boudin\")","v":0},{"$f":"SUMIFS(Septembre!$AB$4:$AB$750,Septembre!$D$4:$D$750,\"Septembre\",Septembre!$X$4:$X$750,\"Boudin\")","v":1},{"$f":"SUMIFS(Octobre!$AB$4:$AB$750,Octobre!$D$4:$D$750,\"Octobre\",Octobre!$X$4:$X$750,\"Boudin\")","v":0},{"$f":"SUMIFS(Novembre!$AB$4:$AB$750,Novembre!$D$4:$D$750,\"Novembre\",Novembre!$X$4:$X$750,\"Boudin\")","v":0},{"$f":"SUMIFS(Décembre!$AB$4:$AB$750,Décembre!$D$4:$D$750,\"Décembre\",Décembre!$X$4:$X$750,\"Boudin\")","v":1},4]
["V06","Cervelas",{"$f":"SUMIFS(Janvier!$AB$4:$AB$720,Janvier!$D$4:$D$720,\"Janvier\",Janvier!$X$4:$X$720,\"Cervelas\")","v":0},{"$f":"SUMIFS(Février!$AB$4:$AB$723,Février!$D$4:$D$723,\"Février\",Février!$X$4:$X$723,\"Cervelas\")","v":0.5},{"$f":"SUMIFS(Mars!$AB$4:$AB$720,Mars!$D$4:$D$720,\"Mars\",Mars!$X$4:$X$720,\"Cervelas\")","v":0.5},{"$f":"SUMIFS(Avril!$AB$4:$AB$717,Avril!$D$4:$D$717,\"Avril\",Avril!$X$4:$X$717,\"Cervelas\")","v":0},{"$f":"SUMIFS(Mai!$AB$4:$AB$738,Mai!$D$4:$D$738,\"Mai\",Mai!$X$4:$X$738,\"Cervelas\")","v":0},{"$f":"SUMIFS(Juin!$AB$4:$AB$749,Juin!$D$4:$D$749,\"Juin\",Juin!$X$4:$X$749,\"Cervelas\")","v":1},{"$f":"SUMIFS(Juillet!$AB$4:$AB$750,Juillet!$D$4:$D$750,\"Juillet\",Juillet!$X$4:$X$750,\"Cervelas\")","v":0},{"$f":"SUMIFS(Août!$AB$4:$AB$751,Août!$D$4:$D$751,\"Août\",Août!$X$4:$X$751,\"Cervelas\")","v":0},{"$f":"SUMIFS(Septembre!$AB$4:$AB$750,Septembre!$D$4:$D$750,\"Septembre\",Septembre!$X$4:$X$750,\"Cervelas\")","v":1},{"$f":"SUMIFS(Octobre!$AB$4:$AB$750,Octobre!$D$4:$D$750,\"Octobre\",Octobre!$X$4:$X$750,\"Cervelas\")","v":0},{"$f":"SUMIFS(Novembre!$AB$4:$AB$750,Novembre!$D$4:$D$750,\"Novembre\",Novembre!$X$4:$X$750,\"Cervelas\")","v":0},{"$f":"SUMIFS(Décembre!$AB$4:$AB$750,Décembre!$D$4:$D$750,\"Décembre\",Décembre!$X$4:$X$750,\"Cervelas\")","v":1},4]
["V07","Cœur",{"$f":"SUMIFS(Janvier!$AB$4:$AB$720,Janvier!$D$4:$D$720,\"Janvier\",Janvier!$X$4:$X$720,\"Cœur\")","v":0},{"$f":"SUMIFS(Février!$AB$4:$AB$723,Février!$D$4:$D$723,\"Février\",Février!$X$4:$X$723,\"Cœur\")","v":0},{"$f":"SUMIFS(Mars!$AB$4:$AB$720,Mars!$D$4:$D$720,\"Mars\",Mars!$X$4:$X$720,\"Cœur\")","v":2},{"$f":"SUMIFS(Avril!$AB$4:$AB$717,Avril!$D$4:$D$717,\"Avril\",Avril!$X$4:$X$717,\"Cœur\")","v":0},{"$f":"SUMIFS(Mai!$AB$4:$AB$738,Mai!$D$4:$D$738,\"Mai\",Mai!$X$4:$X$738,\"Cœur\")","v":0},{"$f":"SUMIFS(Juin!$AB$4:$AB$749,Juin!$D$4:$D$749,\"Juin\",Juin!$X$4:$X$749,\"Cœur\")","v":2},{"$f":"SUMIFS(Juillet!$AB$4:$AB$750,Juillet!$D$4:$D$750,\"Juillet\",Juillet!$X$4:$X$750,\"Cœur\")","v":0},{"$f":"SUMIFS(Août!$AB$4:$AB$751,Août!$D$4:$D$751,\"Août\",Août!$X$4:$X$751,\"Cœur\")","v":0},{"$f":"SUMIFS(Septembre!$AB$4:$AB$750,Septembre!$D$4:$D$750,\"Septembre\",Septembre!$X$4:$X$750,\"Cœur\")","v":2},{"$f":"SUMIFS(Octobre!$AB$4:$AB$750,Octobre!$D$4:$D$750,\"Octobre\",Octobre!$X$4:$X$750,\"Cœur\")","v":0},{"$f":"SUMIFS(Novembre!$AB$4:$AB$750,Novembre!$D$4:$D$750,\"Novembre\",Novembre!$X$4:$X$750,\"Cœur\")","v":0},{"$f":"SUMIFS(Décembre!$AB$4:$AB$750,Décembre!$D$4:$D$750,\"Décembre\",Décembre!$X$4:$X$750,\"Cœur\")","v":2},8]
["V08","Croque-monsieur",{"$f":"SUMIFS(Janvier!$AB$4:$AB$720,Janvier!$D$4:$D$720,\"Janvier\",Janvier!$X$4:$X$720,\"Croque-monsieur\")","v":0},{"$f":"SUMIFS(Février!$AB$4:$AB$723,Février!$D$4:$D$723,\"Février\",Février!$X$4:$X$723,\"Croque-monsieur\")","v":0},{"$f":"SUMIFS(Mars!$AB$4:$AB$720,Mars!$D$4:$D$720,\"Mars\",Mars!$X$4:$X$720,\"Croque-monsieur\")","v":2},{"$f":"SUMIFS(Avril!$AB$4:$AB$717,Avril!$D$4:$D$717,\"Avril\",Avril!$X$4:$X$717,\"Croque-monsieur\")","v":0},{"$f":"SUMIFS(Mai!$AB$4:$AB$738,Mai!$D$4:$D$738,\"Mai\",Mai!$X$4:$X$738,\"Croque-monsieur\")","v":0},{"$f":"SUMIFS(Juin!$AB$4:$AB$749,Juin!$D$4:$D$749,\"Juin\",Juin!$X$4:$X$749,\"Croque-monsieur\")","v":2},{"$f":"SUMIFS(Juillet!$AB$4:$AB$750,Juillet!$D$4:$D$750,\"Juillet\",Juillet!$X$4:$X$750,\"Croque-monsieur\")","v":0},{"$f":"SUMIFS(Août!$AB$4:$AB$751,Août!$D$4:$D$751,\"Août\",Août!$X$4:$X$751,\"Croque-monsieur\")","v":0},{"$f":"SUMIFS(Septembre!$AB$4:$AB$750,Septembre!$D$4:$D$750,\"Septembre\",Septembre!$X$4:$X$750,\"Croque-monsieur\")","v":2},{"$f":"SUMIFS(Octobre!$AB$4:$AB$750,Octobre!$D$4:$D$750,\"Octobre\",Octobre!$X$4:$X$750,\"Croque-monsieur\")","v":0},{"$f":"SUMIFS(Novembre!$AB$4:$AB$750,Novembre!$D$4:$D$750,\"Novembre\",Novembre!$X$4:$X$750,\"Croque-monsieur\")","v":0},{"$f":"SUMIFS(Décembre!$AB$4:$AB$750,Décembre!$D$4:$D$750,\"Décembre\",Décembre!$X$4:$X$750,\"Croque-monsieur\")","v":2},8]
["V09","Foie",{"$f":"SUMIFS(Janvier!$AB$4:$AB$720,Janvier!$D$4:$D$720,\"Janvier\",Janvier!$X$4:$X$720,\"Foie\")","v":0},{"$f":"SUMIFS(Février!$AB$4:$AB$723,Février!$D$4:$D$723,\"Février\",Février!$X$4:$X$723,\"Foie\")","v":0},{"$f":"SUMIFS(Mars!$AB$4:$AB$720,Mars!$D$4:$D$720,\"Mars\",Mars!$X$4:$X$720,\"Foie\")","v":2},{"$f":"SUMIFS(Avril!$AB$4:$AB$717,Avril!$D$4:$D$717,\"Avril\",Avril!$X$4:$X$717,\"Foie\")","v":0},{"$f":"SUMIFS(Mai!$AB$4:$AB$738,Mai!$D$4:$D$738,\"Mai\",Mai!$X$4:$X$738,\"Foie\")","v":0},{"$f":"SUMIFS(Juin!$AB$4:$AB$749,Juin!$D$4:$D$749,\"Juin\",Juin!$X$4:$X$749,\"Foie\")","v":2},{"$f":"SUMIFS(Juillet!$AB$4:$AB$750,Juillet!$D$4:$D$750,\"Juillet\",Juillet!$X$4:$X$750,\"Foie\")","v":0},{"$f":"SUMIFS(Août!$AB$4:$AB$751,Août!$D$4:$D$751,\"Août\",Août!$X$4:$X$751,\"Foie\")","v":0},{"$f":"SUMIFS(Septembre!$AB$4:$AB$750,Septembre!$D$4:$D$750,\"Septembre\",Septembre!$X$4:$X$750,\"Foie\")","v":2},{"$f":"SUMIFS(Octobre!$AB$4:$AB$750,Octobre!$D$4:$D$750,\"Octobre\",Octobre!$X$4:$X$750,\"Foie\")","v":0},{"$f":"SUMIFS(Novembre!$AB$4:$AB$750,Novembre!$D$4:$D$750,\"Novembre\",Novembre!$X$4:$X$750,\"Foie\")","v":0},{"$f":"SUMIFS(Décembre!$AB$4:$AB$750,Décembre!$D$4:$D$750,\"Décembre\",Décembre!$X$4:$X$750,\"Foie\")","v":2},8]
["V10","Fromage de tête",{"$f":"SUMIFS(Janvier!$AB$4:$AB$720,Janvier!$D$4:$D$720,\"Janvier\",Janvier!$X$4:$X$720,\"Fromage de tête\")","v":0},{"$f":"SUMIFS(Février!$AB$4:$AB$723,Février!$D$4:$D$723,\"Février\",Février!$X$4:$X$723,\"Fromage de tête\")","v":0},{"$f":"SUMIFS(Mars!$AB$4:$AB$720,Mars!$D$4:$D$720,\"Mars\",Mars!$X$4:$X$720,\"Fromage de tête\")","v":6},{"$f":"SUMIFS(Avril!$AB$4:$AB$717,Avril!$D$4:$D$717,\"Avril\",Avril!$X$4:$X$717,\"Fromage de tête\")","v":0},{"$f":"SUMIFS(Mai!$AB$4:$AB$738,Mai!$D$4:$D$738,\"Mai\",Mai!$X$4:$X$738,\"Fromage de tête\")","v":0},{"$f":"SUMIFS(Juin!$AB$4:$AB$749,Juin!$D$4:$D$749,\"Juin\",Juin!$X$4:$X$749,\"Fromage de tête\")","v":6},{"$f":"SUMIFS(Juillet!$AB$4:$AB$750,Juillet!$D$4:$D$750,\"Juillet\",Juillet!$X$4:$X$750,\"Fromage de tête\")","v":0},{"$f":"SUMIFS(Août!$AB$4:$AB$751,Août!$D$4:$D$751,\"Août\",Août!$X$4:$X$751,\"Fromage de tête\")","v":0},{"$f":"SUMIFS(Septembre!$AB$4:$AB$750,Septembre!$D$4:$D$750,\"Septembre\",Septembre!$X$4:$X$750,\"Fromage de tête\")","v":6},{"$f":"SUMIFS(Octobre!$AB$4:$AB$750,Octobre!$D$4:$D$750,\"Octobre\",Octobre!$X$4:$X$750,\"Fromage de tête\")","v":0},{"$f":"SUMIFS(Novembre!$AB$4:$AB$750,Novembre!$D$4:$D$750,\"Novembre\",Novembre!$X$4:$X$750,\"Fromage de tête\")","v":0},{"$f":"SUMIFS(Décembre!$AB$4:$AB$750,Décembre!$D$4:$D$750,\"Décembre\",Décembre!$X$4:$X$750,\"Fromage de tête\")","v":6},24]
["V11","Jambon",{"$f":"SUMIFS(Janvier!$AB$4:$AB$720,Janvier!$D$4:$D$720,\"Janvier\",Janvier!$X$4:$X$720,\"Jambon\")","v":0},{"$f":"SUMIFS(Février!$AB$4:$AB$723,Février!$D$4:$D$723,\"Février\",Février!$X$4:$X$723,\"Jambon\")","v":0},{"$f":"SUMIFS(Mars!$AB$4:$AB$720,Mars!$D$4:$D$720,\"Mars\",Mars!$X$4:$X$720,\"Jambon\")","v":1},{"$f":"SUMIFS(Avril!$AB$4:$AB$717,Avril!$D$4:$D$717,\"Avril\",Avril!$X$4:$X$717,\"Jambon\")","v":0},{"$f":"SUMIFS(Mai!$AB$4:$AB$738,Mai!$D$4:$D$738,\"Mai\",Mai!$X$4:$X$738,\"Jambon\")","v":0},{"$f":"SUMIFS(Juin!$AB$4:$AB$749,Juin!$D$4:$D$749,\"Juin\",Juin!$X$4:$X$749,\"Jambon\")","v":1},{"$f":"SUMIFS(Juillet!$AB$4:$AB$750,Juillet!$D$4:$D$750,\"Juillet\",Juillet!$X$4:$X$750,\"Jambon\")","v":0},{"$f":"SUMIFS(Août!$AB$4:$AB$751,Août!$D$4:$D$751,\"Août\",Août!$X$4:$X$751,\"Jambon\")","v":0},{"$f":"SUMIFS(Septembre!$AB$4:$AB$750,Septembre!$D$4:$D$750,\"Septembre\",Septembre!$X$4:$X$750,\"Jambon\")","v":0.5},{"$f":"SUMIFS(Octobre!$AB$4:$AB$750,Octobre!$D$4:$D$750,\"Octobre\",Octobre!$X$4:$X$750,\"Jambon\")","v":0.5},{"$f":"SUMIFS(Novembre!$AB$4:$AB$750,Novembre!$D$4:$D$750,\"Novembre\",Novembre!$X$4:$X$750,\"Jambon\")","v":0},{"$f":"SUMIFS(Décembre!$AB$4:$AB$750,Décembre!$D$4:$D$750,\"Décembre\",Décembre!$X$4:$X$750,\"Jambon\")","v":0},3]
["V12","Jambonneau",{"$f":"SUMIFS(Janvier!$AB$4:$AB$720,Janvier!$D$4:$D$720,\"Janvier\",Janvier!$X$4:$X$720,\"Jambonneau\")","v":0},{"$f":"SUMIFS(Février!$AB$4:$AB$723,Février!$D$4:$D$723,\"Février\",Février!$X$4:$X$723,\"Jambonneau\")","v":0},{"$f":"SUMIFS(Mars!$AB$4:$AB$720,Mars!$D$4:$D$720,\"Mars\",Mars!$X$4:$X$720,\"Jambonneau\")","v":1},{"$f":"SUMIFS(Avril!$AB$4:$AB$717,Avril!$D$4:$D$717,\"Avril\",Avril!$X$4:$X$717,\"Jambonneau\")","v":0},{"$f":"SUMIFS(Mai!$AB$4:$AB$738,Mai!$D$4:$D$738,\"Mai\",Mai!$X$4:$X$738,\"Jambonneau\")","v":0},{"$f":"SUMIFS(Juin!$AB$4:$AB$749,Juin!$D$4:$D$749,\"Juin\",Juin!$X$4:$X$749,\"Jambonneau\")","v":0.5},{"$f":"SUMIFS(Juillet!$AB$4:$AB$750,Juillet!$D$4:$D$750,\"Juillet\",Juillet!$X$4:$X$750,\"Jambonneau\")","v":0.5},{"$f":"SUMIFS(Août!$AB$4:$AB$751,Août!$D$4:$D$751,\"Août\",Août!$X$4:$X$751,\"Jambonneau\")","v":0},{"$f":"SUMIFS(Septembre!$AB$4:$AB$750,Septembre!$D$4:$D$750,\"Septembre\",Septembre!$X$4:$X$750,\"Jambonneau\")","v":0},{"$f":"SUMIFS(Octobre!$AB$4:$AB$750,Octobre!$D$4:$D$750,\"Octobre\",Octobre!$X$4:$X$750,\"Jambonneau\")","v":1},{"$f":"SUMIFS(Novembre!$AB$4:$AB$750,Novembre!$D$4:$D$750,\"Novembre\",Novembre!$X$4:$X$750,\"Jambonneau\")","v":0},{"$f":"SUMIFS(Décembre!$AB$4:$AB$750,Décembre!$D$4:$D$750,\"Décembre\",Décembre!$X$4:$X$750,\"Jambonneau\")","v":0},3]
["V13","Mortadelle",{"$f":"SUMIFS(Janvier!$AB$4:$AB$720,Janvier!$D$4:$D$720,\"Janvier\",Janvier!$X$4:$X$720,\"Mortadelle\")","v":0},{"$f":"SUMIFS(Février!$AB$4:$AB$723,Février!$D$4:$D$723,\"Février\",Février!$X$4:$X$723,\"Mortadelle\")","v":0},{"$f":"SUMIFS(Mars!$AB$4:$AB$720,Mars!$D$4:$D$720,\"Mars\",Mars!$X$4:$X$720,\"Mortadelle\")","v":1},{"$f":"SUMIFS(Avril!$AB$4:$AB$717,Avril!$D$4:$D$717,\"Avril\",Avril!$X$4:$X$717,\"Mortadelle\")","v":0},{"$f":"SUMIFS(Mai!$AB$4:$AB$738,Mai!$D$4:$D$738,\"Mai\",Mai!$X$4:$X$738,\"Mortadelle\")","v":0},{"$f":"SUMIFS(Juin!$AB$4:$AB$749,Juin!$D$4:$D$749,\"Juin\",Juin!$X$4:$X$749,\"Mortadelle\")","v":0},{"$f":"SUMIFS(Juillet!$AB$4:$AB$750,Juillet!$D$4:$D$750,\"Juillet\",Juillet!$X$4:$X$750,\"Mortadelle\")","v":1},{"$f":"SUMIFS(Août!$AB$4:$AB$751,Août!$D$4:$D$751,\"Août\",Août!$X$4:$X$751,\"Mortadelle\")","v":0},{"$f":"SUMIFS(Septembre!$AB$4:$AB$750,Septembre!$D$4:$D$750,\"Septembre\",Septembre!$X$4:$X$750,\"Mortadelle\")","v":0},{"$f":"SUMIFS(Octobre!$AB$4:$AB$750,Octobre!$D$4:$D$750,\"Octobre\",Octobre!$X$4:$X$750,\"Mortadelle\")","v":1},{"$f":"SUMIFS(Novembre!$AB$4:$AB$750,Novembre!$D$4:$D$750,\"Novembre\",Novembre!$X$4:$X$750,\"Mortadelle\")","v":0},{"$f":"SUMIFS(Décembre!$AB$4:$AB$750,Décembre!$D$4:$D$750,\"Décembre\",Décembre!$X$4:$X$750,\"Mortadelle\")","v":0},3]
["V14","Œufs",{"$f":"SUMIFS(Janvier!$AB$4:$AB$720,Janvier!$D$4:$D$720,\"Janvier\",Janvier!$X$4:$X$720,\"Œufs\")","v":0},{"$f":"SUMIFS(Février!$AB$4:$AB$723,Février!$D$4:$D$723,\"Février\",Février!$X$4:$X$723,\"Œufs\")","v":0},{"$f":"SUMIFS(Mars!$AB$4:$AB$720,Mars!$D$4:$D$720,\"Mars\",Mars!$X$4:$X$720,\"Œufs\")","v":0},{"$f":"SUMIFS(Avril!$AB$4:$AB$717,Avril!$D$4:$D$717,\"Avril\",Avril!$X$4:$X$717,\"Œufs\")","v":6},{"$f":"SUMIFS(Mai!$AB$4:$AB$738,Mai!$D$4:$D$738,\"Mai\",Mai!$X$4:$X$738,\"Œufs\")","v":0},{"$f":"SUMIFS(Juin!$AB$4:$AB$749,Juin!$D$4:$D$749,\"Juin\",Juin!$X$4:$X$749,\"Œufs\")","v":0},{"$f":"SUMIFS(Juillet!$AB$4:$AB$750,Juillet!$D$4:$D$750,\"Juillet\",Juillet!$X$4:$X$750,\"Œufs\")","v":6},{"$f":"SUMIFS(Août!$AB$4:$AB$751,Août!$D$4:$D$751,\"Août\",Août!$X$4:$X$751,\"Œufs\")","v":0},{"$f":"SUMIFS(Septembre!$AB$4:$AB$750,Septembre!$D$4:$D$750,\"Septembre\",Septembre!$X$4:$X$750,\"Œufs\")","v":0},{"$f":"SUMIFS(Octobre!$AB$4:$AB$750,Octobre!$D$4:$D$750,\"Octobre\",Octobre!$X$4:$X$750,\"Œufs\")","v":6},{"$f":"SUMIFS(Novembre!$AB$4:$AB$750,Novembre!$D$4:$D$750,\"Novembre\",Novembre!$X$4:$X$750,\"Œufs\")","v":0},{"$f":"SUMIFS(Décembre!$AB$4:$AB$750,Décembre!$D$4:$D$750,\"Décembre\",Décembre!$X$4:$X$750,\"Œufs\")","v":0},18]
["V15","Pizza",{"$f":"SUMIFS(Janvier!$AB$4:$AB$720,Janvier!$D$4:$D$720,\"Janvier\",Janvier!$X$4:$X$720,\"Pizza\")","v":0.5},{"$f":"SUMIFS(Février!$AB$4:$AB$723,Février!$D$4:$D$723,\"Février\",Février!$X$4:$X$723,\"Pizza\")","v":0},{"$f":"SUMIFS(Mars!$AB$4:$AB$720,Mars!$D$4:$D$720,\"Mars\",Mars!$X$4:$X$720,\"Pizza\")","v":0},{"$f":"SUMIFS(Avril!$AB$4:$AB$717,Avril!$D$4:$D$717,\"Avril\",Avril!$X$4:$X$717,\"Pizza\")","v":1},{"$f":"SUMIFS(Mai!$AB$4:$AB$738,Mai!$D$4:$D$738,\"Mai\",Mai!$X$4:$X$738,\"Pizza\")","v":0},{"$f":"SUMIFS(Juin!$AB$4:$AB$749,Juin!$D$4:$D$749,\"Juin\",Juin!$X$4:$X$749,\"Pizza\")","v":0},{"$f":"SUMIFS(Juillet!$AB$4:$AB$750,Juillet!$D$4:$D$750,\"Juillet\",Juillet!$X$4:$X$750,\"Pizza\")","v":1},{"$f":"SUMIFS(Août!$AB$4:$AB$751,Août!$D$4:$D$751,\"Août\",Août!$X$4:$X$751,\"Pizza\")","v":0},{"$f":"SUMIFS(Septembre!$AB$4:$AB$750,Septembre!$D$4:$D$750,\"Septembre\",Septembre!$X$4:$X$750,\"Pizza\")","v":0},{"$f":"SUMIFS(Octobre!$AB$4:$AB$750,Octobre!$D$4:$D$750,\"Octobre\",Octobre!$X$4:$X$750,\"Pizza\")","v":1},{"$f":"SUMIFS(Novembre!$AB$4:$AB$750,Novembre!$D$4:$D$750,\"Novembre\",Novembre!$X$4:$X$750,\"Pizza\")","v":0},{"$f":"SUMIFS(Décembre!$AB$4:$AB$750,Décembre!$D$4:$D$750,\"Décembre\",Décembre!$X$4:$X$750,\"Pizza\")","v":0},3.5]
["V16","Poisson",{"$f":"SUMIFS(Janvier!$AB$4:$AB$720,Janvier!$D$4:$D$720,\"Janvier\",Janvier!$X$4:$X$720,\"Poisson\")","v":2},{"$f":"SUMIFS(Février!$AB$4:$AB$723,Février!$D$4:$D$723,\"Février\",Février!$X$4:$X$723,\"Poisson\")","v":1},{"$f":"SUMIFS(Mars!$AB$4:$AB$720,Mars!$D$4:$D$720,\"Mars\",Mars!$X$4:$X$720,\"Poisson\")","v":2},{"$f":"SUMIFS(Avril!$AB$4:$AB$717,Avril!$D$4:$D$717,\"Avril\",Avril!$X$4:$X$717,\"Poisson\")","v":2},{"$f":"SUMIFS(Mai!$AB$4:$AB$738,Mai!$D$4:$D$738,\"Mai\",Mai!$X$4:$X$738,\"Poisson\")","v":1},{"$f":"SUMIFS(Juin!$AB$4:$AB$749,Juin!$D$4:$D$749,\"Juin\",Juin!$X$4:$X$749,\"Poisson\")","v":2},{"$f":"SUMIFS(Juillet!$AB$4:$AB$750,Juillet!$D$4:$D$750,\"Juillet\",Juillet!$X$4:$X$750,\"Poisson\")","v":2},{"$f":"SUMIFS(Août!$AB$4:$AB$751,Août!$D$4:$D$751,\"Août\",Août!$X$4:$X$751,\"Poisson\")","v":1},{"$f":"SUMIFS(Septembre!$AB$4:$AB$750,Septembre!$D$4:$D$750,\"Septembre\",Septembre!$X$4:$X$750,\"Poisson\")","v":1},{"$f":"SUMIFS(Octobre!$AB$4:$AB$750,Octobre!$D$4:$D$750,\"Octobre\",Octobre!$X$4:$X$750,\"Poisson\")","v":2},{"$f":"SUMIFS(Novembre!$AB$4:$AB$750,Novembre!$D$4:$D$750,\"Novembre\",Novembre!$X$4:$X$750,\"Poisson\")","v":2},{"$f":"SUMIFS(Décembre!$AB$4:$AB$750,Décembre!$D$4:$D$750,\"Décembre\",Décembre!$X$4:$X$750,\"Poisson\")","v":1},19]
["V17","Quiche lorraine",{"$f":"SUMIFS(Janvier!$AB$4:$AB$720,Janvier!$D$4:$D$720,\"Janvier\",Janvier!$X$4:$X$720,\"Quiche lorraine\")","v":2},{"$f":"SUMIFS(Février!$AB$4:$AB$723,Février!$D$4:$D$723,\"Février\",Février!$X$4:$X$723,\"Quiche lorraine\")","v":0},{"$f":"SUMIFS(Mars!$AB$4:$AB$720,Mars!$D$4:$D$720,\"Mars\",Mars!$X$4:$X$720,\"Quiche lorraine\")","v":0},{"$f":"SUMIFS(Avril!$AB$4:$AB$717,Avril!$D$4:$D$717,\"Avril\",Avril!$X$4:$X$717,\"Quiche lorraine\")","v":2},{"$f":"SUMIFS(Mai!$AB$4:$AB$738,Mai!$D$4:$D$738,\"Mai\",Mai!$X$4:$X$738,\"Quiche lorraine\")","v":0},{"$f":"SUMIFS(Juin!$AB$4:$AB$749,Juin!$D$4:$D$749,\"Juin\",Juin!$X$4:$X$749,\"Quiche lorraine\")","v":0},{"$f":"SUMIFS(Juillet!$AB$4:$AB$750,Juillet!$D$4:$D$750,\"Juillet\",Juillet!$X$4:$X$750,\"Quiche lorraine\")","v":2},{"$f":"SUMIFS(Août!$AB$4:$AB$751,Août!$D$4:$D$751,\"Août\",Août!$X$4:$X$751,\"Quiche lorraine\")","v":0},{"$f":"SUMIFS(Septembre!$AB$4:$AB$750,Septembre!$D$4:$D$750,\"Septembre\",Septembre!$X$4:$X$750,\"Quiche lorraine\")","v":0},{"$f":"SUMIFS(Octobre!$AB$4:$AB$750,Octobre!$D$4:$D$750,\"Octobre\",Octobre!$X$4:$X$750,\"Quiche lorraine\")","v":2},{"$f":"SUMIFS(Novembre!$AB$4:$AB$750,Novembre!$D$4:$D$750,\"Novembre\",Novembre!$X$4:$X$750,\"Quiche lorraine\")","v":0},{"$f":"SUMIFS(Décembre!$AB$4:$AB$750,Décembre!$D$4:$D$750,\"Décembre\",Décembre!$X$4:$X$750,\"Quiche lorraine\")","v":0},8]
["V18","Roulade à la pistache",{"$f":"SUMIFS(Janvier!$AB$4:$AB$720,Janvier!$D$4:$D$720,\"Janvier\",Janvier!$X$4:$X$720,\"Roulade à la pistache\")","v":6},{"$f":"SUMIFS(Février!$AB$4:$AB$723,Février!$D$4:$D$723,\"Février\",Février!$X$4:$X$723,\"Roulade à la pistache\")","v":0},{"$f":"SUMIFS(Mars!$AB$4:$AB$720,Mars!$D$4:$D$720,\"Mars\",Mars!$X$4:$X$720,\"Roulade à la pistache\")","v":0},{"$f":"SUMIFS(Avril!$AB$4:$AB$717,Avril!$D$4:$D$717,\"Avril\",Avril!$X$4:$X$717,\"Roulade à la pistache\")","v":6},{"$f":"SUMIFS(Mai!$AB$4:$AB$738,Mai!$D$4:$D$738,\"Mai\",Mai!$X$4:$X$738,\"Roulade à la pistache\")","v":0},{"$f":"SUMIFS(Juin!$AB$4:$AB$749,Juin!$D$4:$D$749,\"Juin\",Juin!$X$4:$X$749,\"Roulade à la pistache\")","v":0},{"$f":"SUMIFS(Juillet!$AB$4:$AB$750,Juillet!$D$4:$D$750,\"Juillet\",Juillet!$X$4:$X$750,\"Roulade à la pistache\")","v":6},{"$f":"SUMIFS(Août!$AB$4:$AB$751,Août!$D$4:$D$751,\"Août\",Août!$X$4:$X$751,\"Roulade à la pistache\")","v":0},{"$f":"SUMIFS(Septembre!$AB$4:$AB$750,Septembre!$D$4:$D$750,\"Septembre\",Septembre!$X$4:$X$750,\"Roulade à la pistache\")","v":0},{"$f":"SUMIFS(Octobre!$AB$4:$AB$750,Octobre!$D$4:$D$750,\"Octobre\",Octobre!$X$4:$X$750,\"Roulade à la pistache\")","v":6},{"$f":"SUMIFS(Novembre!$AB$4:$AB$750,Novembre!$D$4:$D$750,\"Novembre\",Novembre!$X$4:$X$750,\"Roulade à la pistache\")","v":0},{"$f":"SUMIFS(Décembre!$AB$4:$AB$750,Décembre!$D$4:$D$750,\"Décembre\",Décembre!$X$4:$X$750,\"Roulade à la pistache\")","v":0},24]
["V19","Roulé au fromage",{"$f":"SUMIFS(Janvier!$AB$4:$AB$720,Janvier!$D$4:$D$720,\"Janvier\",Janvier!$X$4:$X$720,\"Roulé au fromage\")","v":2},{"$f":"SUMIFS(Février!$AB$4:$AB$723,Février!$D$4:$D$723,\"Février\",Février!$X$4:$X$723,\"Roulé au fromage\")","v":0},{"$f":"SUMIFS(Mars!$AB$4:$AB$720,Mars!$D$4:$D$720,\"Mars\",Mars!$X$4:$X$720,\"Roulé au fromage\")","v":0},{"$f":"SUMIFS(Avril!$AB$4:$AB$717,Avril!$D$4:$D$717,\"Avril\",Avril!$X$4:$X$717,\"Roulé au fromage\")","v":2},{"$f":"SUMIFS(Mai!$AB$4:$AB$738,Mai!$D$4:$D$738,\"Mai\",Mai!$X$4:$X$738,\"Roulé au fromage\")","v":0},{"$f":"SUMIFS(Juin!$AB$4:$AB$749,Juin!$D$4:$D$749,\"Juin\",Juin!$X$4:$X$749,\"Roulé au fromage\")","v":0},{"$f":"SUMIFS(Juillet!$AB$4:$AB$750,Juillet!$D$4:$D$750,\"Juillet\",Juillet!$X$4:$X$750,\"Roulé au fromage\")","v":2},{"$f":"SUMIFS(Août!$AB$4:$AB$751,Août!$D$4:$D$751,\"Août\",Août!$X$4:$X$751,\"Roulé au fromage\")","v":0},{"$f":"SUMIFS(Septembre!$AB$4:$AB$750,Septembre!$D$4:$D$750,\"Septembre\",Septembre!$X$4:$X$750,\"Roulé au fromage\")","v":0},{"$f":"SUMIFS(Octobre!$AB$4:$AB$750,Octobre!$D$4:$D$750,\"Octobre\",Octobre!$X$4:$X$750,\"Roulé au fromage\")","v":1},{"$f":"SUMIFS(Novembre!$AB$4:$AB$750,Novembre!$D$4:$D$750,\"Novembre\",Novembre!$X$4:$X$750,\"Roulé au fromage\")","v":1},{"$f":"SUMIFS(Décembre!$AB$4:$AB$750,Décembre!$D$4:$D$750,\"Décembre\",Décembre!$X$4:$X$750,\"Roulé au fromage\")","v":0},8]
["V20","Salami",{"$f":"SUMIFS(Janvier!$AB$4:$AB$720,Janvier!$D$4:$D$720,\"Janvier\",Janvier!$X$4:$X$720,\"Salami\")","v":1},{"$f":"SUMIFS(Février!$AB$4:$AB$723,Février!$D$4:$D$723,\"Février\",Février!$X$4:$X$723,\"Salami\")","v":0},{"$f":"SUMIFS(Mars!$AB$4:$AB$720,Mars!$D$4:$D$720,\"Mars\",Mars!$X$4:$X$720,\"Salami\")","v":0},{"$f":"SUMIFS(Avril!$AB$4:$AB$717,Avril!$D$4:$D$717,\"Avril\",Avril!$X$4:$X$717,\"Salami\")","v":1},{"$f":"SUMIFS(Mai!$AB$4:$AB$738,Mai!$D$4:$D$738,\"Mai\",Mai!$X$4:$X$738,\"Salami\")","v":0},{"$f":"SUMIFS(Juin!$AB$4:$AB$749,Juin!$D$4:$D$749,\"Juin\",Juin!$X$4:$X$749,\"Salami\")","v":0},{"$f":"SUMIFS(Juillet!$AB$4:$AB$750,Juillet!$D$4:$D$750,\"Juillet\",Juillet!$X$4:$X$750,\"Salami\")","v":0},{"$f":"SUMIFS(Août!$AB$4:$AB$751,Août!$D$4:$D$751,\"Août\",Août!$X$4:$X$751,\"Salami\")","v":1},{"$f":"SUMIFS(Septembre!$AB$4:$AB$750,Septembre!$D$4:$D$750,\"Septembre\",Septembre!$X$4:$X$750,\"Salami\")","v":0},{"$f":"SUMIFS(Octobre!$AB$4:$AB$750,Octobre!$D$4:$D$750,\"Octobre\",Octobre!$X$4:$X$750,\"Salami\")","v":0},{"$f":"SUMIFS(Novembre!$AB$4:$AB$750,Novembre!$D$4:$D$750,\"Novembre\",Novembre!$X$4:$X$750,\"Salami\")","v":1},{"$f":"SUMIFS(Décembre!$AB$4:$AB$750,Décembre!$D$4:$D$750,\"Décembre\",Décembre!$X$4:$X$750,\"Salami\")","v":0},4]
["V21","Saucisses",{"$f":"SUMIFS(Janvier!$AB$4:$AB$720,Janvier!$D$4:$D$720,\"Janvier\",Janvier!$X$4:$X$720,\"Saucisses\")","v":1},{"$f":"SUMIFS(Février!$AB$4:$AB$723,Février!$D$4:$D$723,\"Février\",Février!$X$4:$X$723,\"Saucisses\")","v":0},{"$f":"SUMIFS(Mars!$AB$4:$AB$720,Mars!$D$4:$D$720,\"Mars\",Mars!$X$4:$X$720,\"Saucisses\")","v":0},{"$f":"SUMIFS(Avril!$AB$4:$AB$717,Avril!$D$4:$D$717,\"Avril\",Avril!$X$4:$X$717,\"Saucisses\")","v":0},{"$f":"SUMIFS(Mai!$AB$4:$AB$738,Mai!$D$4:$D$738,\"Mai\",Mai!$X$4:$X$738,\"Saucisses\")","v":1},{"$f":"SUMIFS(Juin!$AB$4:$AB$749,Juin!$D$4:$D$749,\"Juin\",Juin!$X$4:$X$749,\"Saucisses\")","v":0},{"$f":"SUMIFS(Juillet!$AB$4:$AB$750,Juillet!$D$4:$D$750,\"Juillet\",Juillet!$X$4:$X$750,\"Saucisses\")","v":0},{"$f":"SUMIFS(Août!$AB$4:$AB$751,Août!$D$4:$D$751,\"Août\",Août!$X$4:$X$751,\"Saucisses\")","v":1},{"$f":"SUMIFS(Septembre!$AB$4:$AB$750,Septembre!$D$4:$D$750,\"Septembre\",Septembre!$X$4:$X$750,\"Saucisses\")","v":0},{"$f":"SUMIFS(Octobre!$AB$4:$AB$750,Octobre!$D$4:$D$750,\"Octobre\",Octobre!$X$4:$X$750,\"Saucisses\")","v":0},{"$f":"SUMIFS(Novembre!$AB$4:$AB$750,Novembre!$D$4:$D$750,\"Novembre\",Novembre!$X$4:$X$750,\"Saucisses\")","v":1},{"$f":"SUMIFS(Décembre!$AB$4:$AB$750,Décembre!$D$4:$D$750,\"Décembre\",Décembre!$X$4:$X$750,\"Saucisses\")","v":0},4]
["V22","Saucisson",{"$f":"SUMIFS(Janvier!$AB$4:$AB$720,Janvier!$D$4:$D$720,\"Janvier\",Janvier!$X$4:$X$720,\"Saucisson\")","v":4.6700001358985901},{"$f":"SUMIFS(Février!$AB$4:$AB$723,Février!$D$4:$D$723,\"Février\",Février!$X$4:$X$723,\"Saucisson\")","v":4.6700001358985901},{"$f":"SUMIFS(Mars!$AB$4:$AB$720,Mars!$D$4:$D$720,\"Mars\",Mars!$X$4:$X$720,\"Saucisson\")","v":4.6600001454353333},{"$f":"SUMIFS(Avril!$AB$4:$AB$717,Avril!$D$4:$D$717,\"Avril\",Avril!$X$4:$X$717,\"Saucisson\")","v":4.3400001227855682},{"$f":"SUMIFS(Mai!$AB$4:$AB$738,Mai!$D$4:$D$738,\"Mai\",Mai!$X$4:$X$738,\"Saucisson\")","v":5.3300001621246338},{"$f":"SUMIFS(Juin!$AB$4:$AB$749,Juin!$D$4:$D$749,\"Juin\",Juin!$X$4:$X$749,\"Saucisson\")","v":4.6700001358985901},{"$f":"SUMIFS(Juillet!$AB$4:$AB$750,Juillet!$D$4:$D$750,\"Juillet\",Juillet!$X$4:$X$750,\"Saucisson\")","v":4.3100001513957977},{"$f":"SUMIFS(Août!$AB$4:$AB$751,Août!$D$4:$D$751,\"Août\",Août!$X$4:$X$751,\"Saucisson\")","v":5.3400001525878906},{"$f":"SUMIFS(Septembre!$AB$4:$AB$750,Septembre!$D$4:$D$750,\"Septembre\",Septembre!$X$4:$X$750,\"Saucisson\")","v":4.6600001454353333},{"$f":"SUMIFS(Octobre!$AB$4:$AB$750,Octobre!$D$4:$D$750,\"Octobre\",Octobre!$X$4:$X$750,\"Saucisson\")","v":4.6700001358985901},{"$f":"SUMIFS(Novembre!$AB$4:$AB$750,Novembre!$D$4:$D$750,\"Novembre\",Novembre!$X$4:$X$750,\"Saucisson\")","v":4.6700001358985901},{"$f":"SUMIFS(Décembre!$AB$4:$AB$750,Décembre!$D$4:$D$750,\"Décembre\",Décembre!$X$4:$X$750,\"Saucisson\")","v":5.3300001621246338},57.320001721382141]
["V23","Tête persillée",{"$f":"SUMIFS(Janvier!$AB$4:$AB$720,Janvier!$D$4:$D$720,\"Janvier\",Janvier!$X$4:$X$720,\"Tête persillée\")","v":3},{"$f":"SUMIFS(Février!$AB$4:$AB$723,Février!$D$4:$D$723,\"Février\",Février!$X$4:$X$723,\"Tête persillée\")","v":3},{"$f":"SUMIFS(Mars!$AB$4:$AB$720,Mars!$D$4:$D$720,\"Mars\",Mars!$X$4:$X$720,\"Tête persillée\")","v":0},{"$f":"SUMIFS(Avril!$AB$4:$AB$717,Avril!$D$4:$D$717,\"Avril\",Avril!$X$4:$X$717,\"Tête persillée\")","v":0},{"$f":"SUMIFS(Mai!$AB$4:$AB$738,Mai!$D$4:$D$738,\"Mai\",Mai!$X$4:$X$738,\"Tête persillée\")","v":1},{"$f":"SUMIFS(Juin!$AB$4:$AB$749,Juin!$D$4:$D$749,\"Juin\",Juin!$X$4:$X$749,\"Tête persillée\")","v":0},{"$f":"SUMIFS(Juillet!$AB$4:$AB$750,Juillet!$D$4:$D$750,\"Juillet\",Juillet!$X$4:$X$750,\"Tête persillée\")","v":0},{"$f":"SUMIFS(Août!$AB$4:$AB$751,Août!$D$4:$D$751,\"Août\",Août!$X$4:$X$751,\"Tête persillée\")","v":1},{"$f":"SUMIFS(Septembre!$AB$4:$AB$750,Septembre!$D$4:$D$750,\"Septembre\",Septembre!$X$4:$X$750,\"Tête persillée\")","v":0},{"$f":"SUMIFS(Octobre!$AB$4:$AB$750,Octobre!$D$4:$D$750,\"Octobre\",Octobre!$X$4:$X$750,\"Tête persillée\")","v":0},{"$f":"SUMIFS(Novembre!$AB$4:$AB$750,Novembre!$D$4:$D$750,\"Novembre\",Novembre!$X$4:$X$750,\"Tête persillée\")","v":1},{"$f":"SUMIFS(Décembre!$AB$4:$AB$750,Décembre!$D$4:$D$750,\"Décembre\",Décembre!$X$4:$X$750,\"Tête persillée\")","v":0},9]
["V24","Tête roulée",{"$f":"SUMIFS(Janvier!$AB$4:$AB$720,Janvier!$D$4:$D$720,\"Janvier\",Janvier!$X$4:$X$720,\"Tête roulée\")","v":0},{"$f":"SUMIFS(Février!$AB$4:$AB$723,Février!$D$4:$D$723,\"Février\",Février!$X$4:$X$723,\"Tête roulée\")","v":1},{"$f":"SUMIFS(Mars!$AB$4:$AB$720,Mars!$D$4:$D$720,\"Mars\",Mars!$X$4:$X$720,\"Tête roulée\")","v":0},{"$f":"SUMIFS(Avril!$AB$4:$AB$717,Avril!$D$4:$D$717,\"Avril\",Avril!$X$4:$X$717,\"Tête roulée\")","v":0},{"$f":"SUMIFS(Mai!$AB$4:$AB$738,Mai!$D$4:$D$738,\"Mai\",Mai!$X$4:$X$738,\"Tête roulée\")","v":6},{"$f":"SUMIFS(Juin!$AB$4:$AB$749,Juin!$D$4:$D$749,\"Juin\",Juin!$X$4:$X$749,\"Tête roulée\")","v":0},{"$f":"SUMIFS(Juillet!$AB$4:$AB$750,Juillet!$D$4:$D$750,\"Juillet\",Juillet!$X$4:$X$750,\"Tête roulée\")","v":0},{"$f":"SUMIFS(Août!$AB$4:$AB$751,Août!$D$4:$D$751,\"Août\",Août!$X$4:$X$751,\"Tête roulée\")","v":6},{"$f":"SUMIFS(Septembre!$AB$4:$AB$750,Septembre!$D$4:$D$750,\"Septembre\",Septembre!$X$4:$X$750,\"Tête roulée\")","v":0},{"$f":"SUMIFS(Octobre!$AB$4:$AB$750,Octobre!$D$4:$D$750,\"Octobre\",Octobre!$X$4:$X$750,\"Tête roulée\")","v":0},{"$f":"SUMIFS(Novembre!$AB$4:$AB$750,Novembre!$D$4:$D$750,\"Novembre\",Novembre!$X$4:$X$750,\"Tête roulée\")","v":6},{"$f":"SUMIFS(Décembre!$AB$4:$AB$750,Décembre!$D$4:$D$750,\"Décembre\",Décembre!$X$4:$X$750,\"Tête roulée\")","v":0},19]
["V25","Thon",{"$f":"SUMIFS(Janvier!$AB$4:$AB$720,Janvier!$D$4:$D$720,\"Janvier\",Janvier!$X$4:$X$720,\"Thon\")","v":0},{"$f":"SUMIFS(Février!$AB$4:$AB$723,Février!$D$4:$D$723,\"Février\",Février!$X$4:$X$723,\"Thon\")","v":1},{"$f":"SUMIFS(Mars!$AB$4:$AB$720,Mars!$D$4:$D$720,\"Mars\",Mars!$X$4:$X$720,\"Thon\")","v":0},{"$f":"SUMIFS(Avril!$AB$4:$AB$717,Avril!$D$4:$D$717,\"Avril\",Avril!$X$4:$X$717,\"Thon\")","v":0},{"$f":"SUMIFS(Mai!$AB$4:$AB$738,Mai!$D$4:$D$738,\"Mai\",Mai!$X$4:$X$738,\"Thon\")","v":1},{"$f":"SUMIFS(Juin!$AB$4:$AB$749,Juin!$D$4:$D$749,\"Juin\",Juin!$X$4:$X$749,\"Thon\")","v":0},{"$f":"SUMIFS(Juillet!$AB$4:$AB$750,Juillet!$D$4:$D$750,\"Juillet\",Juillet!$X$4:$X$750,\"Thon\")","v":0},{"$f":"SUMIFS(Août!$AB$4:$AB$751,Août!$D$4:$D$751,\"Août\",Août!$X$4:$X$751,\"Thon\")","v":1},{"$f":"SUMIFS(Septembre!$AB$4:$AB$750,Septembre!$D$4:$D$750,\"Septembre\",Septembre!$X$4:$X$750,\"Thon\")","v":0},{"$f":"SUMIFS(Octobre!$AB$4:$AB$750,Octobre!$D$4:$D$750,\"Octobre\",Octobre!$X$4:$X$750,\"Thon\")","v":0},{"$f":"SUMIFS(Novembre!$AB$4:$AB$750,Novembre!$D$4:$D$750,\"Novembre\",Novembre!$X$4:$X$750,\"Thon\")","v":1},{"$f":"SUMIFS(Décembre!$AB$4:$AB$750,Décembre!$D$4:$D$750,\"Décembre\",Décembre!$X$4:$X$750,\"Thon\")","v":0},4]
["V26","Viande cassoulet",{"$f":"SUMIFS(Janvier!$AB$4:$AB$720,Janvier!$D$4:$D$720,\"Janvier\",Janvier!$X$4:$X$720,\"Viande cassoulet\")","v":1},{"$f":"SUMIFS(Février!$AB$4:$AB$723,Février!$D$4:$D$723,\"Février\",Février!$X$4:$X$723,\"Viande cassoulet\")","v":0},{"$f":"SUMIFS(Mars!$AB$4:$AB$720,Mars!$D$4:$D$720,\"Mars\",Mars!$X$4:$X$720,\"Viande cassoulet\")","v":0},{"$f":"SUMIFS(Avril!$AB$4:$AB$717,Avril!$D$4:$D$717,\"Avril\",Avril!$X$4:$X$717,\"Viande cassoulet\")","v":1},{"$f":"SUMIFS(Mai!$AB$4:$AB$738,Mai!$D$4:$D$738,\"Mai\",Mai!$X$4:$X$738,\"Viande cassoulet\")","v":0},{"$f":"SUMIFS(Juin!$AB$4:$AB$749,Juin!$D$4:$D$749,\"Juin\",Juin!$X$4:$X$749,\"Viande cassoulet\")","v":0},{"$f":"SUMIFS(Juillet!$AB$4:$AB$750,Juillet!$D$4:$D$750,\"Juillet\",Juillet!$X$4:$X$750,\"Viande cassoulet\")","v":1},{"$f":"SUMIFS(Août!$AB$4:$AB$751,Août!$D$4:$D$751,\"Août\",Août!$X$4:$X$751,\"Viande cassoulet\")","v":0},{"$f":"SUMIFS(Septembre!$AB$4:$AB$750,Septembre!$D$4:$D$750,\"Septembre\",Septembre!$X$4:$X$750,\"Viande cassoulet\")","v":0},{"$f":"SUMIFS(Octobre!$AB$4:$AB$750,Octobre!$D$4:$D$750,\"Octobre\",Octobre!$X$4:$X$750,\"Viande cassoulet\")","v":1},{"$f":"SUMIFS(Novembre!$AB$4:$AB$750,Novembre!$D$4:$D$750,\"Novembre\",Novembre!$X$4:$X$750,\"Viande cassoulet\")","v":0},{"$f":"SUMIFS(Décembre!$AB$4:$AB$750,Décembre!$D$4:$D$750,\"Décembre\",Décembre!$X$4:$X$750,\"Viande cassoulet\")","v":0},4]
["V27","Viande choucroute",{"$f":"SUMIFS(Janvier!$AB$4:$AB$720,Janvier!$D$4:$D$720,\"Janvier\",Janvier!$X$4:$X$720,\"Viande choucroute\")","v":1},{"$f":"SUMIFS(Février!$AB$4:$AB$723,Février!$D$4:$D$723,\"Février\",Février!$X$4:$X$723,\"Viande choucroute\")","v":0},{"$f":"SUMIFS(Mars!$AB$4:$AB$720,Mars!$D$4:$D$720,\"Mars\",Mars!$X$4:$X$720,\"Viande choucroute\")","v":0},{"$f":"SUMIFS(Avril!$AB$4:$AB$717,Avril!$D$4:$D$717,\"Avril\",Avril!$X$4:$X$717,\"Viande choucroute\")","v":1},{"$f":"SUMIFS(Mai!$AB$4:$AB$738,Mai!$D$4:$D$738,\"Mai\",Mai!$X$4:$X$738,\"Viande choucroute\")","v":0},{"$f":"SUMIFS(Juin!$AB$4:$AB$749,Juin!$D$4:$D$749,\"Juin\",Juin!$X$4:$X$749,\"Viande choucroute\")","v":0},{"$f":"SUMIFS(Juillet!$AB$4:$AB$750,Juillet!$D$4:$D$750,\"Juillet\",Juillet!$X$4:$X$750,\"Viande choucroute\")","v":1},{"$f":"SUMIFS(Août!$AB$4:$AB$751,Août!$D$4:$D$751,\"Août\",Août!$X$4:$X$751,\"Viande choucroute\")","v":0},{"$f":"SUMIFS(Septembre!$AB$4:$AB$750,Septembre!$D$4:$D$750,\"Septembre\",Septembre!$X$4:$X$750,\"Viande choucroute\")","v":0},{"$f":"SUMIFS(Octobre!$AB$4:$AB$750,Octobre!$D$4:$D$750,\"Octobre\",Octobre!$X$4:$X$750,\"Viande choucroute\")","v":0},{"$f":"SUMIFS(Novembre!$AB$4:$AB$750,Novembre!$D$4:$D$750,\"Novembre\",Novembre!$X$4:$X$750,\"Viande choucroute\")","v":1},{"$f":"SUMIFS(Décembre!$AB$4:$AB$750,Décembre!$D$4:$D$750,\"Décembre\",Décembre!$X$4:$X$750,\"Viande choucroute\")","v":0},4]
["V28","Viande paella",{"$f":"SUMIFS(Janvier!$AB$4:$AB$720,Janvier!$D$4:$D$720,\"Janvier\",Janvier!$X$4:$X$720,\"Viande paella\")","v":0},{"$f":"SUMIFS(Février!$AB$4:$AB$723,Février!$D$4:$D$723,\"Février\",Février!$X$4:$X$723,\"Viande paella\")","v":0},{"$f":"SUMIFS(Mars!$AB$4:$AB$720,Mars!$D$4:$D$720,\"Mars\",Mars!$X$4:$X$720,\"Viande paella\")","v":1},{"$f":"SUMIFS(Avril!$AB$4:$AB$717,Avril!$D$4:$D$717,\"Avril\",Avril!$X$4:$X$717,\"Viande paella\")","v":0},{"$f":"SUMIFS(Mai!$AB$4:$AB$738,Mai!$D$4:$D$738,\"Mai\",Mai!$X$4:$X$738,\"Viande paella\")","v":0},{"$f":"SUMIFS(Juin!$AB$4:$AB$749,Juin!$D$4:$D$749,\"Juin\",Juin!$X$4:$X$749,\"Viande paella\")","v":1},{"$f":"SUMIFS(Juillet!$AB$4:$AB$750,Juillet!$D$4:$D$750,\"Juillet\",Juillet!$X$4:$X$750,\"Viande paella\")","v":0},{"$f":"SUMIFS(Août!$AB$4:$AB$751,Août!$D$4:$D$751,\"Août\",Août!$X$4:$X$751,\"Viande paella\")","v":0},{"$f":"SUMIFS(Septembre!$AB$4:$AB$750,Septembre!$D$4:$D$750,\"Septembre\",Septembre!$X$4:$X$750,\"Viande paella\")","v":1},{"$f":"SUMIFS(Octobre!$AB$4:$AB$750,Octobre!$D$4:$D$750,\"Octobre\",Octobre!$X$4:$X$750,\"Viande paella\")","v":0},{"$f":"SUMIFS(Novembre!$AB$4:$AB$750,Novembre!$D$4:$D$750,\"Novembre\",Novembre!$X$4:$X$750,\"Viande paella\")","v":0},{"$f":"SUMIFS(Décembre!$AB$4:$AB$750,Décembre!$D$4:$D$750,\"Décembre\",Décembre!$X$4:$X$750,\"Viande paella\")","v":1},4]
["V29","Agneau",{"$f":"SUMIFS(Janvier!$AB$4:$AB$720,Janvier!$D$4:$D$720,\"Janvier\",Janvier!$X$4:$X$720,\"Agneau\")","v":1},{"$f":"SUMIFS(Février!$AB$4:$AB$723,Février!$D$4:$D$723,\"Février\",Février!$X$4:$X$723,\"Agneau\")","v":1},{"$f":"SUMIFS(Mars!$AB$4:$AB$720,Mars!$D$4:$D$720,\"Mars\",Mars!$X$4:$X$720,\"Agneau\")","v":1},{"$f":"SUMIFS(Avril!$AB$4:$AB$717,Avril!$D$4:$D$717,\"Avril\",Avril!$X$4:$X$717,\"Agneau\")","v":2},{"$f":"SUMIFS(Mai!$AB$4:$AB$738,Mai!$D$4:$D$738,\"Mai\",Mai!$X$4:$X$738,\"Agneau\")","v":1},{"$f":"SUMIFS(Juin!$AB$4:$AB$749,Juin!$D$4:$D$749,\"Juin\",Juin!$X$4:$X$749,\"Agneau\")","v":1},{"$f":"SUMIFS(Juillet!$AB$4:$AB$750,Juillet!$D$4:$D$750,\"Juillet\",Juillet!$X$4:$X$750,\"Agneau\")","v":1},{"$f":"SUMIFS(Août!$AB$4:$AB$751,Août!$D$4:$D$751,\"Août\",Août!$X$4:$X$751,\"Agneau\")","v":2},{"$f":"SUMIFS(Septembre!$AB$4:$AB$750,Septembre!$D$4:$D$750,\"Septembre\",Septembre!$X$4:$X$750,\"Agneau\")","v":1},{"$f":"SUMIFS(Octobre!$AB$4:$AB$750,Octobre!$D$4:$D$750,\"Octobre\",Octobre!$X$4:$X$750,\"Agneau\")","v":1},{"$f":"SUMIFS(Novembre!$AB$4:$AB$750,Novembre!$D$4:$D$750,\"Novembre\",Novembre!$X$4:$X$750,\"Agneau\")","v":1},{"$f":"SUMIFS(Décembre!$AB$4:$AB$750,Décembre!$D$4:$D$750,\"Décembre\",Décembre!$X$4:$X$750,\"Agneau\")","v":5},18]
["V30","Bœuf",{"$f":"SUMIFS(Janvier!$AB$4:$AB$720,Janvier!$D$4:$D$720,\"Janvier\",Janvier!$X$4:$X$720,\"Bœuf\")","v":1},{"$f":"SUMIFS(Février!$AB$4:$AB$723,Février!$D$4:$D$723,\"Février\",Février!$X$4:$X$723,\"Bœuf\")","v":1},{"$f":"SUMIFS(Mars!$AB$4:$AB$720,Mars!$D$4:$D$720,\"Mars\",Mars!$X$4:$X$720,\"Bœuf\")","v":1},{"$f":"SUMIFS(Avril!$AB$4:$AB$717,Avril!$D$4:$D$717,\"Avril\",Avril!$X$4:$X$717,\"Bœuf\")","v":1},{"$f":"SUMIFS(Mai!$AB$4:$AB$738,Mai!$D$4:$D$738,\"Mai\",Mai!$X$4:$X$738,\"Bœuf\")","v":2},{"$f":"SUMIFS(Juin!$AB$4:$AB$749,Juin!$D$4:$D$749,\"Juin\",Juin!$X$4:$X$749,\"Bœuf\")","v":1},{"$f":"SUMIFS(Juillet!$AB$4:$AB$750,Juillet!$D$4:$D$750,\"Juillet\",Juillet!$X$4:$X$750,\"Bœuf\")","v":1},{"$f":"SUMIFS(Août!$AB$4:$AB$751,Août!$D$4:$D$751,\"Août\",Août!$X$4:$X$751,\"Bœuf\")","v":1},{"$f":"SUMIFS(Septembre!$AB$4:$AB$750,Septembre!$D$4:$D$750,\"Septembre\",Septembre!$X$4:$X$750,\"Bœuf\")","v":2},{"$f":"SUMIFS(Octobre!$AB$4:$AB$750,Octobre!$D$4:$D$750,\"Octobre\",Octobre!$X$4:$X$750,\"Bœuf\")","v":1},{"$f":"SUMIFS(Novembre!$AB$4:$AB$750,Novembre!$D$4:$D$750,\"Novembre\",Novembre!$X$4:$X$750,\"Bœuf\")","v":1},{"$f":"SUMIFS(Décembre!$AB$4:$AB$750,Décembre!$D$4:$D$750,\"Décembre\",Décembre!$X$4:$X$750,\"Bœuf\")","v":1},14]
["V31","Cheval",{"$f":"SUMIFS(Janvier!$AB$4:$AB$720,Janvier!$D$4:$D$720,\"Janvier\",Janvier!$X$4:$X$720,\"Cheval\")","v":2},{"$f":"SUMIFS(Février!$AB$4:$AB$723,Février!$D$4:$D$723,\"Février\",Février!$X$4:$X$723,\"Cheval\")","v":1},{"$f":"SUMIFS(Mars!$AB$4:$AB$720,Mars!$D$4:$D$720,\"Mars\",Mars!$X$4:$X$720,\"Cheval\")","v":1},{"$f":"SUMIFS(Avril!$AB$4:$AB$717,Avril!$D$4:$D$717,\"Avril\",Avril!$X$4:$X$717,\"Cheval\")","v":1},{"$f":"SUMIFS(Mai!$AB$4:$AB$738,Mai!$D$4:$D$738,\"Mai\",Mai!$X$4:$X$738,\"Cheval\")","v":1},{"$f":"SUMIFS(Juin!$AB$4:$AB$749,Juin!$D$4:$D$749,\"Juin\",Juin!$X$4:$X$749,\"Cheval\")","v":2},{"$f":"SUMIFS(Juillet!$AB$4:$AB$750,Juillet!$D$4:$D$750,\"Juillet\",Juillet!$X$4:$X$750,\"Cheval\")","v":1},{"$f":"SUMIFS(Août!$AB$4:$AB$751,Août!$D$4:$D$751,\"Août\",Août!$X$4:$X$751,\"Cheval\")","v":1},{"$f":"SUMIFS(Septembre!$AB$4:$AB$750,Septembre!$D$4:$D$750,\"Septembre\",Septembre!$X$4:$X$750,\"Cheval\")","v":2},{"$f":"SUMIFS(Octobre!$AB$4:$AB$750,Octobre!$D$4:$D$750,\"Octobre\",Octobre!$X$4:$X$750,\"Cheval\")","v":1},{"$f":"SUMIFS(Novembre!$AB$4:$AB$750,Novembre!$D$4:$D$750,\"Novembre\",Novembre!$X$4:$X$750,\"Cheval\")","v":1},{"$f":"SUMIFS(Décembre!$AB$4:$AB$750,Décembre!$D$4:$D$750,\"Décembre\",Décembre!$X$4:$X$750,\"Cheval\")","v":1},15]
["V32","Dinde",{"$f":"SUMIFS(Janvier!$AB$4:$AB$720,Janvier!$D$4:$D$720,\"Janvier\",Janvier!$X$4:$X$720,\"Dinde\")","v":1},{"$f":"SUMIFS(Février!$AB$4:$AB$723,Février!$D$4:$D$723,\"Février\",Février!$X$4:$X$723,\"Dinde\")","v":2},{"$f":"SUMIFS(Mars!$AB$4:$AB$720,Mars!$D$4:$D$720,\"Mars\",Mars!$X$4:$X$720,\"Dinde\")","v":1},{"$f":"SUMIFS(Avril!$AB$4:$AB$717,Avril!$D$4:$D$717,\"Avril\",Avril!$X$4:$X$717,\"Dinde\")","v":1},{"$f":"SUMIFS(Mai!$AB$4:$AB$738,Mai!$D$4:$D$738,\"Mai\",Mai!$X$4:$X$738,\"Dinde\")","v":1},{"$f":"SUMIFS(Juin!$AB$4:$AB$749,Juin!$D$4:$D$749,\"Juin\",Juin!$X$4:$X$749,\"Dinde\")","v":2},{"$f":"SUMIFS(Juillet!$AB$4:$AB$750,Juillet!$D$4:$D$750,\"Juillet\",Juillet!$X$4:$X$750,\"Dinde\")","v":1},{"$f":"SUMIFS(Août!$AB$4:$AB$751,Août!$D$4:$D$751,\"Août\",Août!$X$4:$X$751,\"Dinde\")","v":1},{"$f":"SUMIFS(Septembre!$AB$4:$AB$750,Septembre!$D$4:$D$750,\"Septembre\",Septembre!$X$4:$X$750,\"Dinde\")","v":1},{"$f":"SUMIFS(Octobre!$AB$4:$AB$750,Octobre!$D$4:$D$750,\"Octobre\",Octobre!$X$4:$X$750,\"Dinde\")","v":2},{"$f":"SUMIFS(Novembre!$AB$4:$AB$750,Novembre!$D$4:$D$750,\"Novembre\",Novembre!$X$4:$X$750,\"Dinde\")","v":1},{"$f":"SUMIFS(Décembre!$AB$4:$AB$750,Décembre!$D$4:$D$750,\"Décembre\",Décembre!$X$4:$X$750,\"Dinde\")","v":1},15]
["V34","Porc",{"$f":"SUMIFS(Janvier!$AB$4:$AB$720,Janvier!$D$4:$D$720,\"Janvier\",Janvier!$X$4:$X$720,\"Porc\")","v":1},{"$f":"SUMIFS(Février!$AB$4:$AB$723,Février!$D$4:$D$723,\"Février\",Février!$X$4:$X$723,\"Porc\")","v":1},{"$f":"SUMIFS(Mars!$AB$4:$AB$720,Mars!$D$4:$D$720,\"Mars\",Mars!$X$4:$X$720,\"Porc\")","v":2},{"$f":"SUMIFS(Avril!$AB$4:$AB$717,Avril!$D$4:$D$717,\"Avril\",Avril!$X$4:$X$717,\"Porc\")","v":1},{"$f":"SUMIFS(Mai!$AB$4:$AB$738,Mai!$D$4:$D$738,\"Mai\",Mai!$X$4:$X$738,\"Porc\")","v":1},{"$f":"SUMIFS(Juin!$AB$4:$AB$749,Juin!$D$4:$D$749,\"Juin\",Juin!$X$4:$X$749,\"Porc\")","v":1},{"$f":"SUMIFS(Juillet!$AB$4:$AB$750,Juillet!$D$4:$D$750,\"Juillet\",Juillet!$X$4:$X$750,\"Porc\")","v":2},{"$f":"SUMIFS(Août!$AB$4:$AB$751,Août!$D$4:$D$751,\"Août\",Août!$X$4:$X$751,\"Porc\")","v":1},{"$f":"SUMIFS(Septembre!$AB$4:$AB$750,Septembre!$D$4:$D$750,\"Septembre\",Septembre!$X$4:$X$750,\"Porc\")","v":1},{"$f":"SUMIFS(Octobre!$AB$4:$AB$750,Octobre!$D$4:$D$750,\"Octobre\",Octobre!$X$4:$X$750,\"Porc\")","v":1},{"$f":"SUMIFS(Novembre!$AB$4:$AB$750,Novembre!$D$4:$D$750,\"Novembre\",Novembre!$X$4:$X$750,\"Porc\")","v":2},{"$f":"SUMIFS(Décembre!$AB$4:$AB$750,Décembre!$D$4:$D$750,\"Décembre\",Décembre!$X$4:$X$750,\"Porc\")","v":1},15]
["V35","Veau",{"$f":"SUMIFS(Janvier!$AB$4:$AB$720,Janvier!$D$4:$D$720,\"Janvier\",Janvier!$X$4:$X$720,\"Veau\")","v":1},{"$f":"SUMIFS(Février!$AB$4:$AB$723,Février!$D$4:$D$723,\"Février\",Février!$X$4:$X$723,\"Veau\")","v":1},{"$f":"SUMIFS(Mars!$AB$4:$AB$720,Mars!$D$4:$D$720,\"Mars\",Mars!$X$4:$X$720,\"Veau\")","v":2},{"$f":"SUMIFS(Avril!$AB$4:$AB$717,Avril!$D$4:$D$717,\"Avril\",Avril!$X$4:$X$717,\"Veau\")","v":1},{"$f":"SUMIFS(Mai!$AB$4:$AB$738,Mai!$D$4:$D$738,\"Mai\",Mai!$X$4:$X$738,\"Veau\")","v":1},{"$f":"SUMIFS(Juin!$AB$4:$AB$749,Juin!$D$4:$D$749,\"Juin\",Juin!$X$4:$X$749,\"Veau\")","v":1},{"$f":"SUMIFS(Juillet!$AB$4:$AB$750,Juillet!$D$4:$D$750,\"Juillet\",Juillet!$X$4:$X$750,\"Veau\")","v":1},{"$f":"SUMIFS(Août!$AB$4:$AB$751,Août!$D$4:$D$751,\"Août\",Août!$X$4:$X$751,\"Veau\")","v":2},{"$f":"SUMIFS(Septembre!$AB$4:$AB$750,Septembre!$D$4:$D$750,\"Septembre\",Septembre!$X$4:$X$750,\"Veau\")","v":1},{"$f":"SUMIFS(Octobre!$AB$4:$AB$750,Octobre!$D$4:$D$750,\"Octobre\",Octobre!$X$4:$X$750,\"Veau\")","v":1},{"$f":"SUMIFS(Novembre!$AB$4:$AB$750,Novembre!$D$4:$D$750,\"Novembre\",Novembre!$X$4:$X$750,\"Veau\")","v":1},{"$f":"SUMIFS(Décembre!$AB$4:$AB$750,Décembre!$D$4:$D$750,\"Décembre\",Décembre!$X$4:$X$750,\"Veau\")","v":2},15]
["VMR01","Rôti d'agneau",{"$f":"SUMIFS(Janvier!$AB$4:$AB$720,Janvier!$D$4:$D$720,\"Janvier\",Janvier!$X$4:$X$720,\"Rôti d'agneau\")","v":500},{"$f":"SUMIFS(Février!$AB$4:$AB$723,Février!$D$4:$D$723,\"Février\",Février!$X$4:$X$723,\"Rôti d'agneau\")","v":400},{"$f":"SUMIFS(Mars!$AB$4:$AB$720,Mars!$D$4:$D$720,\"Mars\",Mars!$X$4:$X$720,\"Rôti d'agneau\")","v":100},{"$f":"SUMIFS(Avril!$AB$4:$AB$717,Avril!$D$4:$D$717,\"Avril\",Avril!$X$4:$X$717,\"Rôti d'agneau\")","v":500},{"$f":"SUMIFS(Mai!$AB$4:$AB$738,Mai!$D$4:$D$738,\"Mai\",Mai!$X$4:$X$738,\"Rôti d'agneau\")","v":500},{"$f":"SUMIFS(Juin!$AB$4:$AB$749,Juin!$D$4:$D$749,\"Juin\",Juin!$X$4:$X$749,\"Rôti d'agneau\")","v":500},{"$f":"SUMIFS(Juillet!$AB$4:$AB$750,Juillet!$D$4:$D$750,\"Juillet\",Juillet!$X$4:$X$750,\"Rôti d'agneau\")","v":500},{"$f":"SUMIFS(Août!$AB$4:$AB$751,Août!$D$4:$D$751,\"Août\",Août!$X$4:$X$751,\"Rôti d'agneau\")","v":500},{"$f":"SUMIFS(Septembre!$AB$4:$AB$750,Septembre!$D$4:$D$750,\"Septembre\",Septembre!$X$4:$X$750,\"Rôti d'agneau\")","v":500},{"$f":"SUMIFS(Octobre!$AB$4:$AB$750,Octobre!$D$4:$D$750,\"Octobre\",Octobre!$X$4:$X$750,\"Rôti d'agneau\")","v":400},{"$f":"SUMIFS(Novembre!$AB$4:$AB$750,Novembre!$D$4:$D$750,\"Novembre\",Novembre!$X$4:$X$750,\"Rôti d'agneau\")","v":100},{"$f":"SUMIFS(Décembre!$AB$4:$AB$750,Décembre!$D$4:$D$750,\"Décembre\",Décembre!$X$4:$X$750,\"Rôti d'agneau\")","v":500},5000]
["VMR02","Rôti de bœuf",{"$f":"SUMIFS(Janvier!$AB$4:$AB$720,Janvier!$D$4:$D$720,\"Janvier\",Janvier!$X$4:$X$720,\"Rôti de bœuf\")","v":400},{"$f":"SUMIFS(Février!$AB$4:$AB$723,Février!$D$4:$D$723,\"Février\",Février!$X$4:$X$723,\"Rôti de bœuf\")","v":100},{"$f":"SUMIFS(Mars!$AB$4:$AB$720,Mars!$D$4:$D$720,\"Mars\",Mars!$X$4:$X$720,\"Rôti de bœuf\")","v":500},{"$f":"SUMIFS(Avril!$AB$4:$AB$717,Avril!$D$4:$D$717,\"Avril\",Avril!$X$4:$X$717,\"Rôti de bœuf\")","v":500},{"$f":"SUMIFS(Mai!$AB$4:$AB$738,Mai!$D$4:$D$738,\"Mai\",Mai!$X$4:$X$738,\"Rôti de bœuf\")","v":500},{"$f":"SUMIFS(Juin!$AB$4:$AB$749,Juin!$D$4:$D$749,\"Juin\",Juin!$X$4:$X$749,\"Rôti de bœuf\")","v":500},{"$f":"SUMIFS(Juillet!$AB$4:$AB$750,Juillet!$D$4:$D$750,\"Juillet\",Juillet!$X$4:$X$750,\"Rôti de bœuf\")","v":500},{"$f":"SUMIFS(Août!$AB$4:$AB$751,Août!$D$4:$D$751,\"Août\",Août!$X$4:$X$751,\"Rôti de bœuf\")","v":500},{"$f":"SUMIFS(Septembre!$AB$4:$AB$750,Septembre!$D$4:$D$750,\"Septembre\",Septembre!$X$4:$X$750,\"Rôti de bœuf\")","v":100},{"$f":"SUMIFS(Octobre!$AB$4:$AB$750,Octobre!$D$4:$D$750,\"Octobre\",Octobre!$X$4:$X$750,\"Rôti de bœuf\")","v":400},{"$f":"SUMIFS(Novembre!$AB$4:$AB$750,Novembre!$D$4:$D$750,\"Novembre\",Novembre!$X$4:$X$750,\"Rôti de bœuf\")","v":500},{"$f":"SUMIFS(Décembre!$AB$4:$AB$750,Décembre!$D$4:$D$750,\"Décembre\",Décembre!$X$4:$X$750,\"Rôti de bœuf\")","v":500},5000]
["VMR03","Rôti de cheval",{"$f":"SUMIFS(Janvier!$AB$4:$AB$720,Janvier!$D$4:$D$720,\"Janvier\",Janvier!$X$4:$X$720,\"Rôti de cheval\")","v":400},{"$f":"SUMIFS(Février!$AB$4:$AB$723,Février!$D$4:$D$723,\"Février\",Février!$X$4:$X$723,\"Rôti de cheval\")","v":500},{"$f":"SUMIFS(Mars!$AB$4:$AB$720,Mars!$D$4:$D$720,\"Mars\",Mars!$X$4:$X$720,\"Rôti de cheval\")","v":500},{"$f":"SUMIFS(Avril!$AB$4:$AB$717,Avril!$D$4:$D$717,\"Avril\",Avril!$X$4:$X$717,\"Rôti de cheval\")","v":500},{"$f":"SUMIFS(Mai!$AB$4:$AB$738,Mai!$D$4:$D$738,\"Mai\",Mai!$X$4:$X$738,\"Rôti de cheval\")","v":500},{"$f":"SUMIFS(Juin!$AB$4:$AB$749,Juin!$D$4:$D$749,\"Juin\",Juin!$X$4:$X$749,\"Rôti de cheval\")","v":500},{"$f":"SUMIFS(Juillet!$AB$4:$AB$750,Juillet!$D$4:$D$750,\"Juillet\",Juillet!$X$4:$X$750,\"Rôti de cheval\")","v":300},{"$f":"SUMIFS(Août!$AB$4:$AB$751,Août!$D$4:$D$751,\"Août\",Août!$X$4:$X$751,\"Rôti de cheval\")","v":200},{"$f":"SUMIFS(Septembre!$AB$4:$AB$750,Septembre!$D$4:$D$750,\"Septembre\",Septembre!$X$4:$X$750,\"Rôti de cheval\")","v":500},{"$f":"SUMIFS(Octobre!$AB$4:$AB$750,Octobre!$D$4:$D$750,\"Octobre\",Octobre!$X$4:$X$750,\"Rôti de cheval\")","v":500},{"$f":"SUMIFS(Novembre!$AB$4:$AB$750,Novembre!$D$4:$D$750,\"Novembre\",Novembre!$X$4:$X$750,\"Rôti de cheval\")","v":500},{"$f":"SUMIFS(Décembre!$AB$4:$AB$750,Décembre!$D$4:$D$750,\"Décembre\",Décembre!$X$4:$X$750,\"Rôti de cheval\")","v":500},5400]
["VMR04","Rôti de porc",{"$f":"SUMIFS(Janvier!$AB$4:$AB$720,Janvier!$D$4:$D$720,\"Janvier\",Janvier!$X$4:$X$720,\"Rôti de porc\")","v":500},{"$f":"SUMIFS(Février!$AB$4:$AB$723,Février!$D$4:$D$723,\"Février\",Février!$X$4:$X$723,\"Rôti de porc\")","v":500},{"$f":"SUMIFS(Mars!$AB$4:$AB$720,Mars!$D$4:$D$720,\"Mars\",Mars!$X$4:$X$720,\"Rôti de porc\")","v":500},{"$f":"SUMIFS(Avril!$AB$4:$AB$717,Avril!$D$4:$D$717,\"Avril\",Avril!$X$4:$X$717,\"Rôti de porc\")","v":400},{"$f":"SUMIFS(Mai!$AB$4:$AB$738,Mai!$D$4:$D$738,\"Mai\",Mai!$X$4:$X$738,\"Rôti de porc\")","v":500},{"$f":"SUMIFS(Juin!$AB$4:$AB$749,Juin!$D$4:$D$749,\"Juin\",Juin!$X$4:$X$749,\"Rôti de porc\")","v":0},{"$f":"SUMIFS(Juillet!$AB$4:$AB$750,Juillet!$D$4:$D$750,\"Juillet\",Juillet!$X$4:$X$750,\"Rôti de porc\")","v":500},{"$f":"SUMIFS(Août!$AB$4:$AB$751,Août!$D$4:$D$751,\"Août\",Août!$X$4:$X$751,\"Rôti de porc\")","v":500},{"$f":"SUMIFS(Septembre!$AB$4:$AB$750,Septembre!$D$4:$D$750,\"Septembre\",Septembre!$X$4:$X$750,\"Rôti de porc\")","v":500},{"$f":"SUMIFS(Octobre!$AB$4:$AB$750,Octobre!$D$4:$D$750,\"Octobre\",Octobre!$X$4:$X$750,\"Rôti de porc\")","v":500},{"$f":"SUMIFS(Novembre!$AB$4:$AB$750,Novembre!$D$4:$D$750,\"Novembre\",Novembre!$X$4:$X$750,\"Rôti de porc\")","v":500},{"$f":"SUMIFS(Décembre!$AB$4:$AB$750,Décembre!$D$4:$D$750,\"Décembre\",Décembre!$X$4:$X$750,\"Rôti de porc\")","v":500},5400]
["VMR05","Rôti de veau",{"$f":"SUMIFS(Janvier!$AB$4:$AB$720,Janvier!$D$4:$D$720,\"Janvier\",Janvier!$X$4:$X$720,\"Rôti de veau\")","v":500},{"$f":"SUMIFS(Février!$AB$4:$AB$723,Février!$D$4:$D$723,\"Février\",Février!$X$4:$X$723,\"Rôti de veau\")","v":500},{"$f":"SUMIFS(Mars!$AB$4:$AB$720,Mars!$D$4:$D$720,\"Mars\",Mars!$X$4:$X$720,\"Rôti de veau\")","v":500},{"$f":"SUMIFS(Avril!$AB$4:$AB$717,Avril!$D$4:$D$717,\"Avril\",Avril!$X$4:$X$717,\"Rôti de veau\")","v":200},{"$f":"SUMIFS(Mai!$AB$4:$AB$738,Mai!$D$4:$D$738,\"Mai\",Mai!$X$4:$X$738,\"Rôti de veau\")","v":300},{"$f":"SUMIFS(Juin!$AB$4:$AB$749,Juin!$D$4:$D$749,\"Juin\",Juin!$X$4:$X$749,\"Rôti de veau\")","v":500},{"$f":"SUMIFS(Juillet!$AB$4:$AB$750,Juillet!$D$4:$D$750,\"Juillet\",Juillet!$X$4:$X$750,\"Rôti de veau\")","v":500},{"$f":"SUMIFS(Août!$AB$4:$AB$751,Août!$D$4:$D$751,\"Août\",Août!$X$4:$X$751,\"Rôti de veau\")","v":500},{"$f":"SUMIFS(Septembre!$AB$4:$AB$750,Septembre!$D$4:$D$750,\"Septembre\",Septembre!$X$4:$X$750,\"Rôti de veau\")","v":500},{"$f":"SUMIFS(Octobre!$AB$4:$AB$750,Octobre!$D$4:$D$750,\"Octobre\",Octobre!$X$4:$X$750,\"Rôti de veau\")","v":500},{"$f":"SUMIFS(Novembre!$AB$4:$AB$750,Novembre!$D$4:$D$750,\"Novembre\",Novembre!$X$4:$X$750,\"Rôti de veau\")","v":500},{"$f":"SUMIFS(Décembre!$AB$4:$AB$750,Décembre!$D$4:$D$750,\"Décembre\",Décembre!$X$4:$X$750,\"Rôti de veau\")","v":200},5200]
["Fini à Limeil-Brévannes, le mardi 22 janvier 2019."]

{"sheet":"Propostion MMR","index":23,"n_rows":569,"n_cols":8,"rows_kept":569,"cut":false,"hidden":false,"merged":[[300,0,300,7],[360,0,360,7],[315,0,315,7],[330,0,330,7],[345,0,345,7],[240,0,240,7],[255,0,255,7],[270,0,270,7],[285,0,285,7],[60,0,60,7],[105,0,105,7],[180,0,180,7],[195,0,195,7],[210,0,210,7],[225,0,225,7],[0,0,0,7],[120,0,120,7],[135,0,135,7],[150,0,150,7],[165,0,165,7],[15,0,15,7],[30,0,30,7],[45,0,45,7],[75,0,75,7],[90,0,90,7],[375,0,375,7],[390,0,390,7],[405,0,405,7],[435,0,435,7],[450,0,450,7],[420,0,420,7],[555,0,555,4],[540,0,540,7],[465,0,465,7],[480,0,480,7],[495,0,495,7],[510,0,510,7],[525,0,525,7]]}
["☺"]
["Numéro du menu","1","2","3","4","5","6","7"]
["Date du menu","2018-01-01","2018-01-02","2018-01-03","2018-01-04","2018-01-05","2018-01-08","2018-01-09"]
["Référence légume"]
["Légume"]
["Quantité légume"]
["Référence viande"]
["Viande"]
["Quantité viande"]
["Référence dessert"]
["Dessert"]
["Quantité dessert"]
["Référence observation"]
["Observation"]
[]
["Proposition menus midi retraite."]
["Numéro du menu",{"$f":"B2+7","v":8},{"$f":"C2+7","v":9},10,11,12,13,14]
["Date du menu","2018-01-10","2018-01-11","2018-01-12","2018-01-14","2018-01-15","2018-01-16","2018-01-17"]
["Référence légume"]
["Légume"]
["Quantité légume"]
["Référence viande"]
["Viande"]
["Quantité viande"]
["Référence dessert"]
["Dessert"]
["Quantité dessert"]
["Référence observation"]
["Observation"]
[]
["Proposition menus midi retraite."]
["Numéro du menu",{"$f":"B17+7","v":15},{"$f":"C17+7","v":16},17,18,19,20,21]
["Date du menu","2018-01-18","2018-01-19","2018-01-22","2018-01-23","2018-01-24","2018-01-25","2018-01-26"]
["Référence légume"]
["Légume"]
["Quantité légume"]
["Référence viande"]
["Viande"]
["Quantité viande"]
["Référence dessert"]
["Dessert"]
["Quantité dessert"]
["Référence observation"]
["Observation"]
[]
["Proposition menus midi retraite."]
["Numéro du menu",{"$f":"B32+7","v":22},{"$f":"C32+7","v":23},24,25,26,27,28]
["Date du menu","2018-01-29","2018-01-30","2018-01-31","2018-02-01","2018-02-02","2018-02-05","2018-02-06"]
["Référence légume"]
["Légume"]
["Quantité légume"]
["Référence viande"]
["Viande"]
["Quantité viande"]
["Référence dessert"]
["Dessert"]
["Quantité dessert"]
["Référence observation"]
["Observation"]
[]
["Proposition menus midi retraite."]
["Numéro du menu",{"$f":"B47+7","v":29},{"$f":"C47+7","v":30},31,32,33,34,35]
["Date du menu","2018-02-07","2018-02-08","2018-02-09","2018-02-12","2018-02-13","2018-02-14","2018-02-15"]
["Référence légume"]
["Légume"]
["Quantité légume"]
["Référence viande"]
["Viande"]
["Quantité viande"]
["Référence dessert"]
["Dessert"]
["Quantité dessert"]
["Référence observation"]
["Observation"]
[]
["Proposition menus midi retraite."]
["Numéro du menu",{"$f":"B62+7","v":36},{"$f":"C62+7","v":37},38,39,40,41,42]
["Date du menu","2018-02-16","2018-02-19","2018-02-20","2018-02-21","2018-02-22","2018-02-23","2018-02-26"]
["Référence légume"]
["Légume"]
["Quantité légume"]
["Référence viande"]
["Viande"]
["Quantité viande"]
["Référence dessert"]
["Dessert"]
["Quantité dessert"]
["Référence observation"]
["Observation"]
[]
["Proposition menus midi retraite."]
["Numéro du menu",{"$f":"B77+7","v":43},{"$f":"C77+7","v":44},45,46,47,48,49]
["Date du menu","2018-02-27","2018-02-28","2018-03-01","2018-03-02","2018-03-05","2018-03-06","2018-03-07"]
["Référence légume"]
["Légume"]
["Quantité légume"]
["Référence viande"]
["Viande"]
["Quantité viande"]
["Référence dessert"]
["Dessert"]
["Quantité dessert"]
["Référence observation"]
["Observation"]
[]
["Proposition menus midi retraite."]
["Numéro du menu",{"$f":"B92+7","v":50},{"$f":"C92+7","v":51},52,53,54,55,56]
["Date du menu","2018-03-08","2018-03-09","2018-03-12","2018-03-13","2018-03-14","2018-03-15","2018-03-16"]
["Référence légume"]
["Légume"]
["Quantité légume"]
["Référence viande"]
["Viande"]
["Quantité viande"]
["Référence dessert"]
["Dessert"]
["Quantité dessert"]
["Référence observation"]
["Observation"]
[]
["Proposition menus midi retraite."]
["Numéro du menu",{"$f":"B107+7","v":57},{"$f":"C107+7","v":58},59,60,61,62,63]
["Date du menu","2018-03-19","2018-03-20","2018-03-21","2018-03-22","2018-03-23","2018-03-26","2018-03-27"]
["Référence légume"]
["Légume"]
["Quantité légume"]
["Référence viande"]
["Viande"]
["Quantité viande"]
["Référence dessert"]
["Dessert"]
["Quantité dessert"]
["Référence observation"]
["Observation"]
[]
["Proposition menus midi retraite."]
["Numéro du menu",{"$f":"B122+7","v":64},{"$f":"C122+7","v":65},66,67,68,69,70]
["Date du menu","2018-03-28","2018-03-29","2018-03-30","2018-04-02","2018-04-03","2018-04-04","2018-04-05"]
["Référence légume"]
["Légume"]
["Quantité légume"]
["Référence viande"]
["Viande"]
["Quantité viande"]
["Référence dessert"]
["Dessert"]
["Quantité dessert"]
["Référence observation"]
["Observation"]
[]
["Proposition menus midi retraite."]
["Numéro du menu",{"$f":"B137+7","v":71},{"$f":"C137+7","v":72},73,74,75,76,77]
["Date du menu","2018-04-06","2018-04-09","2018-04-10","2018-04-11","2018-04-12","2018-04-13","2018-04-16"]
["Référence légume"]
["Légume"]
["Quantité légume"]
["Référence viande"]
["Viande"]
["Quantité viande"]
["Référence dessert"]
["Dessert"]
["Quantité dessert"]
["Référence observation"]
["Observation"]
[]
["Proposition menus midi retraite."]
["Numéro du menu",{"$f":"B152+7","v":78},{"$f":"C152+7","v":79},80,81,82,83,84]
["Date du menu","2018-04-17","2018-04-18","2018-04-19","2018-04-20","2018-04-23","2018-04-24","2018-04-25"]
["Référence légume"]
["Légume"]
["Quantité légume"]
["Référence viande"]
["Viande"]
["Quantité viande"]
["Référence dessert"]
["Dessert"]
["Quantité dessert"]
["Référence observation"]
["Observation"]
[]
["Proposition menus midi retraite."]
["Numéro du menu",{"$f":"B167+7","v":85},{"$f":"C167+7","v":86},87,88,89,90,91]
["Date du menu","2018-04-26","2018-04-27","2018-04-30","2018-05-01","2018-05-02","2018-05-03","2018-05-04"]
["Référence légume"]
["Légume"]
["Quantité légume"]
["Référence viande"]
["Viande"]
["Quantité viande"]
["Référence dessert"]
["Dessert"]
["Quantité dessert"]
["Référence observation"]
["Observation"]
[]
["Proposition menus midi retraite."]
["Numéro du menu",{"$f":"B182+7","v":92},{"$f":"C182+7","v":93},94,95,96,97,98]
["Date du menu","2018-05-07","2018-05-08","2018-05-09","2018-05-10","2018-05-11","2018-05-14","2018-05-15"]
["Référence légume"]
["Légume"]
["Quantité légume"]
["Référence viande"]
["Viande"]
["Quantité viande"]
["Référence dessert"]
["Dessert"]
["Quantité dessert"]
["Référence observation"]
["Observation"]
[]
["Proposition menus midi retraite."]
["Numéro du menu",{"$f":"B197+7","v":99},{"$f":"C197+7","v":100},101,102,103,104,105]
["Date du menu","2018-05-16","2018-05-17","2018-05-18","2018-05-21","2018-05-22","2018-05-23","2018-05-24"]
["Référence légume"]
["Légume"]
["Quantité légume"]
["Référence viande"]
["Viande"]
["Quantité viande"]
["Référence dessert"]
["Dessert"]
["Quantité dessert"]
["Référence observation"]
["Observation"]
[]
["Proposition menus midi retraite."]
["Numéro du menu",{"$f":"B212+7","v":106},{"$f":"C212+7","v":107},108,109,110,111,112]
["Date du menu","2018-05-25","2018-05-28","2018-05-29","2018-05-30","2018-05-31","2018-06-01","2018-06-04"]
["Référence légume"]
["Légume"]
["Quantité légume"]
["Référence viande"]
["Viande"]
["Quantité viande"]
["Référence dessert"]
["Dessert"]
["Quantité dessert"]
["Référence observation"]
["Observation"]
[]
["Proposition menus midi retraite."]
["Numéro du menu",{"$f":"B227+7","v":113},{"$f":"C227+7","v":114},115,116,117,118,119]
["Date du menu","2018-06-05","2018-06-06","2018-06-07","2018-06-08","2018-06-11","2018-06-12","2018-06-13"]
["Référence légume"]
["Légume"]
["Quantité légume"]
["Référence viande"]
["Viande"]
["Quantité viande"]
["Référence dessert"]
["Dessert"]
["Quantité dessert"]
["Référence observation"]
["Observation"]
[]
["Proposition menus midi retraite."]
["Numéro du menu",{"$f":"B242+7","v":120},{"$f":"C242+7","v":121},122,123,124,125,126]
["Date du menu","2018-06-14","2018-06-15","2018-06-18","2018-06-19","2018-06-20","2018-06-21","2018-06-22"]
["Référence légume"]
["Légume"]
["Quantité légume"]
["Référence viande"]
["Viande"]
["Quantité viande"]
["Référence dessert"]
["Dessert"]
["Quantité dessert"]
["Référence observation"]
["Observation"]
[]
["Proposition menus midi retraite."]
["Numéro du menu",{"$f":"B257+7","v":127},{"$f":"C257+7","v":128},129,130,131,132,133]
["Date du menu","2018-06-25","2018-06-26","2018-06-27","2018-06-28","2018-06-29","2018-07-02","2018-07-03"]
["Référence légume"]
["Légume"]
["Quantité légume"]
["Référence viande"]
["Viande"]
["Quantité viande"]
["Référence dessert"]
["Dessert"]
["Quantité dessert"]
["Référence observation"]
["Observation"]
[]
["Proposition menus midi retraite."]
["Numéro du menu",{"$f":"B272+7","v":134},{"$f":"C272+7","v":135},136,137,138,139,140]
["Date du menu","2018-07-04","2018-07-05","2018-07-06","2018-07-09","2018-07-10","2018-07-11","2018-07-12"]
["Référence légume"]
["Légume"]
["Quantité légume"]
["Référence viande"]
["Viande"]
["Quantité viande"]
["Référence dessert"]
["Dessert"]
["Quantité dessert"]
["Référence observation"]
["Observation"]
[]
["Proposition menus midi retraite."]
["Numéro du menu",{"$f":"B287+7","v":141},{"$f":"C287+7","v":142},143,144,145,146,147]
["Date du menu","2018-07-13","2018-07-16","2018-07-17","2018-07-18","2018-07-19","2018-07-20","2018-07-23"]
["Référence légume"]
["Légume"]
["Quantité légume"]
["Référence viande"]
["Viande"]
["Quantité viande"]
["Référence dessert"]
["Dessert"]
["Quantité dessert"]
["Référence observation"]
["Observation"]
[]
["Proposition menus midi retraite."]
["Numéro du menu",{"$f":"B302+7","v":148},{"$f":"C302+7","v":149},150,151,152,153,154]
["Date du menu","2018-07-24","2018-07-25","2018-07-26","2018-07-27","2018-07-30","2018-07-31","2017-08-01"]
["Référence légume"]
["Légume"]
["Quantité légume"]
["Référence viande"]
["Viande"]
["Quantité viande"]
["Référence dessert"]
["Dessert"]
["Quantité dessert"]
["Référence observation"]
["Observation"]
[]
["Proposition menus midi retraite."]
["Numéro du menu",{"$f":"B317+7","v":155},{"$f":"C317+7","v":156},157,158,159,160,161]
["Date du menu","2018-08-02","2018-08-03","2018-08-06","2018-08-07","2018-08-08","2018-08-09","2018-08-10"]
["Référence légume"]
["Légume"]
["Quantité légume"]
["Référence viande"]
["Viande"]
["Quantité viande"]
["Référence dessert"]
["Dessert"]
["Quantité dessert"]
["Référence observation"]
["Observation"]
[]
["Proposition menus midi retraite."]
["Numéro du menu",{"$f":"B332+7","v":162},{"$f":"C332+7","v":163},164,165,166,167,168]
["Date du menu","2018-08-13","2018-08-14","2018-08-15","2018-08-16","2018-08-17","2018-08-20","2018-08-21"]
["Référence légume"]
["Légume"]
["Quantité légume"]
["Référence viande"]
["Viande"]
["Quantité viande"]
["Référence dessert"]
["Dessert"]
["Quantité dessert"]
["Référence observation"]
["Observation"]
[]
["Proposition menus midi retraite."]
["Numéro du menu",{"$f":"B347+7","v":169},{"$f":"C347+7","v":170},171,172,173,174,175]
["Date du menu","2018-08-22","2018-08-23","2018-08-24","2018-08-27","2018-08-28","2018-08-29","2018-08-30"]
["Référence légume"]
["Légume"]
["Quantité légume"]
["Référence viande"]
["Viande"]
["Quantité viande"]
["Référence dessert"]
["Dessert"]
["Quantité dessert"]
["Référence observation"]
["Observation"]
[]
["Proposition menus midi retraite."]
["Numéro du menu",{"$f":"B362+7","v":176},{"$f":"C362+7","v":177},178,179,180,181,182]
["Date du menu","2018-08-31","2018-09-03","2018-09-04","2018-09-05","2018-09-06","2018-09-07","2018-09-10"]
["Référence légume"]
["Légume"]
["Quantité légume"]
["Référence viande"]
["Viande"]
["Quantité viande"]
["Référence dessert"]
["Dessert"]
["Quantité dessert"]
["Référence observation"]
["Observation"]
[]
["Proposition menus midi retraite."]
["Numéro du menu",{"$f":"B377+7","v":183},{"$f":"C377+7","v":184},185,186,187,188,189]
["Date du menu","2018-09-11","2018-09-11","2018-09-12","2018-09-13","2018-09-14","2018-09-17","2018-09-18"]
["Référence légume"]
["Légume"]
["Quantité légume"]
["Référence viande"]
["Viande"]
["Quantité viande"]
["Référence dessert"]
["Dessert"]
["Quantité dessert"]
["Référence observation"]
["Observation"]
[]
["Proposition menus midi retraite."]
["Numéro du menu",{"$f":"B392+7","v":190},{"$f":"C392+7","v":191},192,193,194,195,196]
["Date du menu","2018-09-19","2018-09-20","2018-09-21","2018-09-24","2018-09-25","2018-09-26","2018-09-27"]
["Référence légume"]
["Légume"]
["Quantité légume"]
["Référence viande"]
["Viande"]
["Quantité viande"]
["Référence dessert"]
["Dessert"]
["Quantité dessert"]
["Référence observation"]
["Observation"]
[]
["Proposition menus midi retraite."]
["Numéro du menu",{"$f":"B407+7","v":197},{"$f":"C407+7","v":198},199,200,201,202,203]
["Date du menu","2018-09-28","2018-10-01","2018-10-02","2018-10-03","2018-10-04","2018-10-05","2018-10-08"]
["Référence légume"]
["Légume"]
["Quantité légume"]
["Référence viande"]
["Viande"]
["Quantité viande"]
["Référence dessert"]
["Dessert"]
["Quantité dessert"]
["Référence observation"]
["Observation"]
[]
["Proposition menus midi retraite."]
["Numéro du menu",{"$f":"B422+7","v":204},{"$f":"C422+7","v":205},206,207,208,209,210]
["Date du menu","2018-10-09","2018-10-10","2018-10-11","2018-10-12","2018-10-15","2018-10-16","2018-10-17"]
["Référence légume"]
["Légume"]
["Quantité légume"]
["Référence viande"]
["Viande"]
["Quantité viande"]
["Référence dessert"]
["Dessert"]
["Quantité dessert"]
["Référence observation"]
["Observation"]
[]
["Proposition menus midi retraite."]
["Numéro du menu",{"$f":"B437+7","v":211},{"$f":"C437+7","v":212},213,214,215,216,217]
["Date du menu","2018-10-18","2018-10-19","2018-10-22","2018-10-23","2018-10-24","2018-10-25","2018-10-26"]
["Référence légume"]
["Légume"]
["Quantité légume"]
["Référence viande"]
["Viande"]
["Quantité viande"]
["Référence dessert"]
["Dessert"]
["Quantité dessert"]
["Référence observation"]
["Observation"]
[]
["Proposition menus midi retraite."]
["Numéro du menu",{"$f":"B452+7","v":218},{"$f":"C452+7","v":219},220,221,222,223,224]
["Date du menu","2018-10-29","2018-10-30","2018-10-31","2018-11-01","2018-11-02","2018-11-05","2018-11-06"]
["Référence légume"]
["Légume"]
["Quantité légume"]
["Référence viande"]
["Viande"]
["Quantité viande"]
["Référence dessert"]
["Dessert"]
["Quantité dessert"]
["Référence observation"]
["Observation"]
[]
["Proposition menus midi retraite."]
["Numéro du menu",{"$f":"B467+7","v":225},{"$f":"C467+7","v":226},227,228,229,230,231]
["Date du menu","2018-11-07","2018-11-08","2018-11-09","2018-11-12","2018-11-13","2018-11-14","2018-11-15"]
["Référence légume"]
["Légume"]
["Quantité légume"]
["Référence viande"]
["Viande"]
["Quantité viande"]
["Référence dessert"]
["Dessert"]
["Quantité dessert"]
["Référence observation"]
["Observation"]
[]
["Proposition menus midi retraite."]
["Numéro du menu",{"$f":"B482+7","v":232},{"$f":"C482+7","v":233},234,235,236,237,238]
["Date du menu","2018-11-16","2018-11-19","2018-11-20","2018-11-21","2018-11-22","2018-11-23","2018-11-26"]
["Référence légume"]
["Légume"]
["Quantité légume"]
["Référence viande"]
["Viande"]
["Quantité viande"]
["Référence dessert"]
["Dessert"]
["Quantité dessert"]
["Référence observation"]
["Observation"]
[]
["Proposition menus midi retraite."]
["Numéro du menu",{"$f":"B497+7","v":239},{"$f":"C497+7","v":240},241,242,243,244,245]
["Date du menu","2018-11-27","2018-11-28","2018-11-29","2018-11-30","2018-12-03","2018-12-04","2018-12-05"]
["Référence légume"]
["Légume"]
["Quantité légume"]
["Référence viande"]
["Viande"]
["Quantité viande"]
["Référence dessert"]
["Dessert"]
["Quantité dessert"]
["Référence observation"]
["Observation"]
[]
["Proposition menus midi retraite."]
["Numéro du menu",{"$f":"B512+7","v":246},{"$f":"C512+7","v":247},248,249,250,251,252]
["Date du menu","2018-12-06","2018-12-07","2018-12-10","2018-12-11","2018-12-12","2018-12-13","2018-12-14"]
["Référence légume"]
["Légume"]
["Quantité légume"]
["Référence viande"]
["Viande"]
["Quantité viande"]
["Référence dessert"]
["Dessert"]
["Quantité dessert"]
["Référence observation"]
["Observation"]
[]
["Proposition menus midi retraite."]
["Numéro du menu",{"$f":"B527+7","v":253},{"$f":"C527+7","v":254},255,256,257,258,259]
["Date du menu","2018-12-17","2018-12-18","2018-12-19","2018-12-20","2018-12-21","2018-12-24","2018-12-25"]
["Référence légume"]
["Légume"]
["Quantité légume"]
["Référence viande"]
["Viande"]
["Quantité viande"]
["Référence dessert"]
["Dessert"]
["Quantité dessert"]
["Référence observation"]
["Observation"]
[]
["Proposition menus midi retraite."]
["Numéro du menu",{"$f":"B542+7","v":260},{"$f":"C542+7","v":261},262,{"$f":"E542+7","v":263}]
["Date du menu","2018-12-26","2018-12-27","2018-12-28","2018-12-31"]
["Référence légume"]
["Légume"]
["Quantité légume"]
["Référence viande"]
["Viande"]
["Quantité viande"]
["Référence dessert"]
["Dessert"]
["Quantité dessert"]
["Référence observation"]
["Observation"]

{"sheet":"Proposition MJ","index":24,"n_rows":953,"n_cols":8,"rows_kept":953,"cut":false,"hidden":false,"merged":[[918,0,918,7],[936,0,936,2],[828,0,828,7],[846,0,846,7],[864,0,864,7],[882,0,882,7],[900,0,900,7],[738,0,738,7],[756,0,756,7],[774,0,774,7],[792,0,792,7],[810,0,810,7],[648,0,648,7],[666,0,666,7],[684,0,684,7],[702,0,702,7],[720,0,720,7],[324,0,324,7],[342,0,342,7],[360,0,360,7],[396,0,396,7],[486,0,486,7],[144,0,144,7],[162,0,162,7],[180,0,180,7],[198,0,198,7],[306,0,306,7],[252,0,252,7],[216,0,216,7],[234,0,234,7],[270,0,270,7],[288,0,288,7],[630,0,630,7],[594,0,594,7],[612,0,612,7],[378,0,378,7],[414,0,414,7],[432,0,432,7],[450,0,450,7],[468,0,468,7],[522,0,522,7],[540,0,540,7],[558,0,558,7],[576,0,576,7],[504,0,504,7],[0,0,0,7],[126,0,126,7],[18,0,18,7],[36,0,36,7],[54,0,54,7],[72,0,72,7],[90,0,90,7],[108,0,108,7]]}
["Proposition menus journaliers."]
["Numéro du menu","1","2","3","4","5","6","7"]
["Date du menu","2018-01-01","2018-01-02","2018-01-03","2018-01-04","2018-01-05","2018-01-06","2018-01-07"]
["Référence légume"]
["Légume"]
["Quantité légume"]
["Code légume deux"]
["Légume deux"]
["Quantité légume deux"]
["Référence viande"]
["Viande"]
["Quantité viande"]
["Référence dessert"]
["Dessert"]
["Quantité dessert"]
["Référence observation"]
["Observation"]
[]
["Proposition menus journaliers."]
["Numéro du menu",{"$f":"B2+7","v":8},{"$f":"C2+7","v":9},10,11,12,13,14]
["Date du menu","2018-01-08","2018-01-09","2018-01-10","2018-01-11","2018-01-12","2018-01-13","2018-01-14"]
["Référence légume"]
["Légume"]
["Quantité légume"]
["Code légume deux"]
["Légume deux"]
["Quantité légume deux"]
["Référence viande"]
["Viande"]
["Quantité viande"]
["Référence dessert"]
["Dessert"]
["Quantité dessert"]
["Référence observation"]
["Observation"]
[]
["Proposition menus journaliers."]
["Numéro du menu",{"$f":"B20+7","v":15},{"$f":"C20+7","v":16},17,18,19,20,21]
["Date du menu","2018-01-15","2018-01-16","2018-01-17","2018-01-18","2018-01-19","2018-01-20","2018-01-21"]
["Référence légume"]
["Légume"]
["Quantité légume"]
["Code légume deux"]
["Légume deux"]
["Quantité légume deux"]
["Référence viande"]
["Viande"]
["Quantité viande"]
["Référence dessert"]
["Dessert"]
["Quantité dessert"]
["Référence observation"]
["Observation"]
[]
["Proposition menus journaliers."]
["Numéro du menu",{"$f":"B38+7","v":22},{"$f":"C38+7","v":23},24,25,26,27,28]
["Date du menu","2018-01-22","2018-01-23","2018-01-24","2018-01-25","2018-01-26","2018-01-27","2018-01-28"]
["Référence légume"]
["Légume"]
["Quantité légume"]
["Code légume deux"]
["Légume deux"]
["Quantité légume deux"]
["Référence viande"]
["Viande"]
["Quantité viande"]
["Référence dessert"]
["Dessert"]
["Quantité dessert"]
["Référence observation"]
["Observation"]
[]
["Proposition menus journaliers."]
["Numéro du menu",{"$f":"B56+7","v":29},{"$f":"C56+7","v":30},31,32,33,34,35]
["Date du menu","2018-01-29","2018-01-30","2018-01-31","2018-02-01","2018-02-02","2018-02-03","2018-02-04"]
["Référence légume"]
["Légume"]
["Quantité légume"]
["Code légume deux"]
["Légume deux"]
["Quantité légume deux"]
["Référence viande"]
["Viande"]
["Quantité viande"]
["Référence dessert"]
["Dessert"]
["Quantité dessert"]
["Référence observation"]
["Observation"]
[]
["Proposition menus journaliers."]
["Numéro du menu",{"$f":"B74+7","v":36},{"$f":"C74+7","v":37},38,39,40,41,42]
["Date du menu","2018-02-05","2018-02-06","2018-02-07","2018-02-08","2018-02-09","2018-02-10","2018-02-11"]
["Référence légume"]
["Légume"]
["Quantité légume"]
["Code légume deux"]
["Légume deux"]
["Quantité légume deux"]
["Référence viande"]
["Viande"]
["Quantité viande"]
["Référence dessert"]
["Dessert"]
["Quantité dessert"]
["Référence observation"]
["Observation"]
[]
["Proposition menus journaliers."]
["Numéro du menu",{"$f":"B92+7","v":43},{"$f":"C92+7","v":44},45,46,47,48,49]
["Date du menu","2018-02-12","2018-02-13","2018-02-14","2018-02-15","2018-02-16","2018-02-17","2018-02-18"]
["Référence légume"]
["Légume"]
["Quantité légume"]
["Code légume deux"]
["Légume deux"]
["Quantité légume deux"]
["Référence viande"]
["Viande"]
["Quantité viande"]
["Référence dessert"]
["Dessert"]
["Quantité dessert"]
["Référence observation"]
["Observation"]
[]
["Proposition menus journaliers."]
["Numéro du menu",{"$f":"B110+7","v":50},{"$f":"C110+7","v":51},52,53,54,55,56]
["Date du menu","2018-02-19","2018-02-20","2018-02-21","2018-02-22","2018-02-23","2018-02-24","2018-02-25"]
["Référence légume"]
["Légume"]
["Quantité légume"]
["Code légume deux"]
["Légume deux"]
["Quantité légume deux"]
["Référence viande"]
["Viande"]
["Quantité viande"]
["Référence dessert"]
["Dessert"]
["Quantité dessert"]
["Référence observation"]
["Observation"]
[]
["Proposition menus journaliers."]
["Numéro du menu",{"$f":"B128+7","v":57},{"$f":"C128+7","v":58},59,60,61,62,63]
["Date du menu","2018-02-26","2018-02-27","2018-02-28","2018-03-01","2018-03-02","2018-03-03","2018-03-04"]
["Référence légume"]
["Légume"]
["Quantité légume"]
["Code légume deux"]
["Légume deux"]
["Quantité légume deux"]
["Référence viande"]
["Viande"]
["Quantité viande"]
["Référence dessert"]
["Dessert"]
["Quantité dessert"]
["Référence observation"]
["Observation"]
[]
["Proposition menus journaliers."]
["Numéro du menu",{"$f":"B146+7","v":64},{"$f":"C146+7","v":65},66,67,68,69,70]
["Date du menu","2018-03-05","2018-03-06","2018-03-07","2018-03-08","2018-03-09","2018-03-10","2018-03-11"]
["Référence légume"]
["Légume"]
["Quantité légume"]
["Code légume deux"]
["Légume deux"]
["Quantité légume deux"]
["Référence viande"]
["Viande"]
["Quantité viande"]
["Référence dessert"]
["Dessert"]
["Quantité dessert"]
["Référence observation"]
["Observation"]
[]
["Proposition menus journaliers."]
["Numéro du menu",{"$f":"B164+7","v":71},{"$f":"C164+7","v":72},73,74,75,76,77]
["Date du menu","2018-03-12","2018-03-13","2018-03-14","2018-03-15","2018-03-16","2018-03-17","2018-03-18"]
["Référence légume"]
["Légume"]
["Quantité légume"]
["Code légume deux"]
["Légume deux"]
["Quantité légume deux"]
["Référence viande"]
["Viande"]
["Quantité viande"]
["Référence dessert"]
["Dessert"]
["Quantité dessert"]
["Référence observation"]
["Observation"]
[]
["Proposition menus journaliers."]
["Numéro du menu",{"$f":"B182+7","v":78},{"$f":"C182+7","v":79},80,81,82,83,84]
["Date du menu","2018-03-19","2018-03-20","2018-03-21","2018-03-22","2018-03-23","2018-03-24","2018-03-25"]
["Référence légume"]
["Légume"]
["Quantité légume"]
["Code légume deux"]
["Légume deux"]
["Quantité légume deux"]
["Référence viande"]
["Viande"]
["Quantité viande"]
["Référence dessert"]
["Dessert"]
["Quantité dessert"]
["Référence observation"]
["Observation"]
[]
["Proposition menus journaliers."]
["Numéro du menu",{"$f":"B200+7","v":85},{"$f":"C200+7","v":86},87,88,89,90,91]
["Date du menu","2018-03-26","2018-03-27","2018-03-28","2018-03-29","2018-03-30","2018-03-31","2018-04-01"]
["Référence légume"]
["Légume"]
["Quantité légume"]
["Code légume deux"]
["Légume deux"]
["Quantité légume deux"]
["Référence viande"]
["Viande"]
["Quantité viande"]
["Référence dessert"]
["Dessert"]
["Quantité dessert"]
["Référence observation"]
["Observation"]
[]
["Proposition menus journaliers."]
["Numéro du menu",{"$f":"B218+7","v":92},{"$f":"C218+7","v":93},94,95,96,97,98]
["Date du menu","2018-04-02","2018-04-03","2018-04-04","2018-04-05","2018-04-06","2018-04-07","2018-04-08"]
["Référence légume"]
["Légume"]
["Quantité légume"]
["Code légume deux"]
["Légume deux"]
["Quantité légume deux"]
["Référence viande"]
["Viande"]
["Quantité viande"]
["Référence dessert"]
["Dessert"]
["Quantité dessert"]
["Référence observation"]
["Observation"]
[]
["Proposition menus journaliers."]
["Numéro du menu",{"$f":"B236+7","v":99},{"$f":"C236+7","v":100},101,102,103,104,105]
["Date du menu","2018-04-09","2018-04-10","2018-04-11","2018-04-12","2018-04-13","2018-04-14","2018-04-15"]
["Référence légume"]
["Légume"]
["Quantité légume"]
["Code légume deux"]
["Légume deux"]
["Quantité légume deux"]
["Référence viande"]
["Viande"]
["Quantité viande"]
["Référence dessert"]
["Dessert"]
["Quantité dessert"]
["Référence observation"]
["Observation"]
[]
["Proposition menus journaliers."]
["Numéro du menu",{"$f":"B254+7","v":106},{"$f":"C254+7","v":107},108,109,110,111,112]
["Date du menu","2018-04-16","2018-04-17","2018-04-18","2018-04-19","2018-04-20","2018-04-21","2018-04-22"]
["Référence légume"]
["Légume"]
["Quantité légume"]
["Code légume deux"]
["Légume deux"]
["Quantité légume deux"]
["Référence viande"]
["Viande"]
["Quantité viande"]
["Référence dessert"]
["Dessert"]
["Quantité dessert"]
["Référence observation"]
["Observation"]
[]
["Proposition menus journaliers."]
["Numéro du menu",{"$f":"B272+7","v":113},{"$f":"C272+7","v":114},115,116,117,118,119]
["Date du menu","2018-04-23","2018-04-24","2018-04-25","2018-04-26","2018-04-27","2018-04-28","2018-04-29"]
["Référence légume"]
["Légume"]
["Quantité légume"]
["Code légume deux"]
["Légume deux"]
["Quantité légume deux"]
["Référence viande"]
["Viande"]
["Quantité viande"]
["Référence dessert"]
["Dessert"]
["Quantité dessert"]
["Référence observation"]
["Observation"]
[]
["Proposition menus journaliers."]
["Numéro du menu",{"$f":"B290+7","v":120},{"$f":"C290+7","v":121},122,123,124,125,126]
["Date du menu","2018-04-30","2018-05-01","2018-05-02","2018-05-03","2018-05-04","2018-05-05","2018-05-06"]
["Référence légume"]
["Légume"]
["Quantité légume"]
["Code légume deux"]
["Légume deux"]
["Quantité légume deux"]
["Référence viande"]
["Viande"]
["Quantité viande"]
["Référence dessert"]
["Dessert"]
["Quantité dessert"]
["Référence observation"]
["Observation"]
[]
["Proposition menus journaliers."]
["Numéro du menu",{"$f":"B308+7","v":127},{"$f":"C308+7","v":128},129,130,131,132,133]
["Date du menu","2018-05-07","2018-05-08","2018-05-09","2018-05-10","2018-05-11","2018-05-12","2018-05-13"]
["Référence légume"]
["Légume"]
["Quantité légume"]
["Code légume deux"]
["Légume deux"]
["Quantité légume deux"]
["Référence viande"]
["Viande"]
["Quantité viande"]
["Référence dessert"]
["Dessert"]
["Quantité dessert"]
["Référence observation"]
["Observation"]
[]
["Proposition menus journaliers."]
["Numéro du menu",{"$f":"B326+7","v":134},{"$f":"C326+7","v":135},136,137,138,139,140]
["Date du menu","2018-05-14","2018-05-15","2018-05-16","2018-05-17","2018-05-18","2018-05-19","2018-05-20"]
["Référence légume"]
["Légume"]
["Quantité légume"]
["Code légume deux"]
["Légume deux"]
["Quantité légume deux"]
["Référence viande"]
["Viande"]
["Quantité viande"]
["Référence dessert"]
["Dessert"]
["Quantité dessert"]
["Référence observation"]
["Observation"]
[]
["Proposition menus journaliers."]
["Numéro du menu",{"$f":"B344+7","v":141},{"$f":"C344+7","v":142},143,144,145,146,147]
["Date du menu","2018-05-21","2018-05-22","2018-05-23","2018-05-24","2018-05-25","2018-05-26","2018-05-27"]
["Référence légume"]
["Légume"]
["Quantité légume"]
["Code légume deux"]
["Légume deux"]
["Quantité légume deux"]
["Référence viande"]
["Viande"]
["Quantité viande"]
["Référence dessert"]
["Dessert"]
["Quantité dessert"]
["Référence observation"]
["Observation"]
[]
["Proposition menus journaliers."]
["Numéro du menu",{"$f":"B362+7","v":148},{"$f":"C362+7","v":149},150,151,152,153,154]
["Date du menu","2018-05-28","2018-05-29","2018-05-30","2018-05-31","2018-06-01","2018-06-02","2018-06-03"]
["Référence légume"]
["Légume"]
["Quantité légume"]
["Code légume deux"]
["Légume deux"]
["Quantité légume deux"]
["Référence viande"]
["Viande"]
["Quantité viande"]
["Référence dessert"]
["Dessert"]
["Quantité dessert"]
["Référence observation"]
["Observation"]
[]
["Proposition menus journaliers."]
["Numéro du menu",{"$f":"B380+7","v":155},{"$f":"C380+7","v":156},157,158,159,160,161]
["Date du menu","2018-06-04","2018-06-05","2018-06-06","2018-06-07","2018-06-08","2018-06-09","2018-06-10"]
["Référence légume"]
["Légume"]
["Quantité légume"]
["Code légume deux"]
["Légume deux"]
["Quantité légume deux"]
["Référence viande"]
["Viande"]
["Quantité viande"]
["Référence dessert"]
["Dessert"]
["Quantité dessert"]
["Référence observation"]
["Observation"]
[]
["Proposition menus journaliers."]
["Numéro du menu",{"$f":"B398+7","v":162},{"$f":"C398+7","v":163},164,165,166,167,168]
["Date du menu","2018-06-11","2018-06-12","2018-06-13","2018-06-14","2018-06-15","2018-06-16","2018-06-17"]
["Référence légume"]
["Légume"]
["Quantité légume"]
["Code légume deux"]
["Légume deux"]
["Quantité légume deux"]
["Référence viande"]
["Viande"]
["Quantité viande"]
["Référence dessert"]
["Dessert"]
["Quantité dessert"]
["Référence observation"]
["Observation"]
[]
["Proposition menus journaliers."]
["Numéro du menu",{"$f":"B416+7","v":169},{"$f":"C416+7","v":170},171,172,173,174,175]
["Date du menu","2018-06-18","2018-06-19","2018-06-20","2018-06-21","2018-06-22","2018-06-23","2018-06-24"]
["Référence légume"]
["Légume"]
["Quantité légume"]
["Code légume deux"]
["Légume deux"]
["Quantité légume deux"]
["Référence viande"]
["Viande"]
["Quantité viande"]
["Référence dessert"]
["Dessert"]
["Quantité dessert"]
["Référence observation"]
["Observation"]
[]
["Proposition menus journaliers."]
["Numéro du menu",{"$f":"B434+7","v":176},{"$f":"C434+7","v":177},178,179,180,181,182]
["Date du menu","2018-06-25","2018-06-26","2018-06-27","2018-06-28","2018-06-29","2018-06-30","2018-07-01"]
["Référence légume"]
["Légume"]
["Quantité légume"]
["Code légume deux"]
["Légume deux"]
["Quantité légume deux"]
["Référence viande"]
["Viande"]
["Quantité viande"]
["Référence dessert"]
["Dessert"]
["Quantité dessert"]
["Référence observation"]
["Observation"]
[]
["Proposition menus journaliers."]
["Numéro du menu",{"$f":"B452+7","v":183},{"$f":"C452+7","v":184},185,186,187,188,189]
["Date du menu","2018-07-02","2018-07-03","2018-07-04","2018-07-05","2018-07-06","2018-07-07","2018-07-08"]
["Référence légume"]
["Légume"]
["Quantité légume"]
["Code légume deux"]
["Légume deux"]
["Quantité légume deux"]
["Référence viande"]
["Viande"]
["Quantité viande"]
["Référence dessert"]
["Dessert"]
["Quantité dessert"]
["Référence observation"]
["Observation"]
[]
["Proposition menus journaliers."]
["Numéro du menu",{"$f":"B470+7","v":190},{"$f":"C470+7","v":191},192,193,194,195,196]
["Date du menu","2018-07-09","2018-07-10","2018-07-11","2018-07-12","2018-07-13","2018-07-14","2018-07-15"]
["Référence légume"]
["Légume"]
["Quantité légume"]
["Code légume deux"]
["Légume deux"]
["Quantité légume deux"]
["Référence viande"]
["Viande"]
["Quantité viande"]
["Référence dessert"]
["Dessert"]
["Quantité dessert"]
["Référence observation"]
["Observation"]
[]
["Proposition menus journaliers."]
["Numéro du menu",{"$f":"B488+7","v":197},{"$f":"C488+7","v":198},199,200,201,202,203]
["Date du menu","2018-07-16","2018-07-17","2018-07-18","2018-07-19","2018-07-20","2018-07-21","2018-07-22"]
["Référence légume"]
["Légume"]
["Quantité légume"]
["Code légume deux"]
["Légume deux"]
["Quantité légume deux"]
["Référence viande"]
["Viande"]
["Quantité viande"]
["Référence dessert"]
["Dessert"]
["Quantité dessert"]
["Référence observation"]
["Observation"]
[]
["Proposition menus journaliers."]
["Numéro du menu",{"$f":"B506+7","v":204},{"$f":"C506+7","v":205},206,207,208,209,210]
["Date du menu","2018-07-23","2018-07-24","2018-07-25","2018-07-26","2018-07-27","2018-07-28","2018-07-29"]
["Référence légume"]
["Légume"]
["Quantité légume"]
["Code légume deux"]
["Légume deux"]
["Quantité légume deux"]
["Référence viande"]
["Viande"]
["Quantité viande"]
["Référence dessert"]
["Dessert"]
["Quantité dessert"]
["Référence observation"]
["Observation"]
[]
["Proposition menus journaliers."]
["Numéro du menu",{"$f":"B524+7","v":211},{"$f":"C524+7","v":212},213,214,215,216,217]
["Date du menu","2018-07-30","2018-07-31","2018-08-01","2018-08-02","2018-08-03","2018-08-04","2018-08-05"]
["Référence légume"]
["Légume"]
["Quantité légume"]
["Code légume deux"]
["Légume deux"]
["Quantité légume deux"]
["Référence viande"]
["Viande"]
["Quantité viande"]
["Référence dessert"]
["Dessert"]
["Quantité dessert"]
["Référence observation"]
["Observation"]
[]
["Proposition menus journaliers."]
["Numéro du menu",{"$f":"B542+7","v":218},{"$f":"C542+7","v":219},220,221,222,223,224]
["Date du menu","2018-08-06","2018-08-07","2018-08-08","2018-08-09","2018-08-10","2018-08-11","2018-08-12"]
["Référence légume"]
["Légume"]
["Quantité légume"]
["Code légume deux"]
["Légume deux"]
["Quantité légume deux"]
["Référence viande"]
["Viande"]
["Quantité viande"]
["Référence dessert"]
["Dessert"]
["Quantité dessert"]
["Référence observation"]
["Observation"]
[]
["Proposition menus journaliers."]
["Numéro du menu",{"$f":"B560+7","v":225},{"$f":"C560+7","v":226},227,228,229,230,231]
["Date du menu","2018-08-13","2018-08-14","2018-08-15","2018-08-16","2018-08-17","2018-08-18","2018-08-19"]
["Référence légume"]
["Légume"]
["Quantité légume"]
["Code légume deux"]
["Légume deux"]
["Quantité légume deux"]
["Référence viande"]
["Viande"]
["Quantité viande"]
["Référence dessert"]
["Dessert"]
["Quantité dessert"]
["Référence observation"]
["Observation"]
[]
["Proposition menus journaliers."]
["Numéro du menu",{"$f":"B578+7","v":232},{"$f":"C578+7","v":233},234,235,236,237,238]
["Date du menu","2018-08-20","2018-08-21","2018-08-22","2018-08-23","2018-08-24","2018-08-25","2018-08-26"]
["Référence légume"]
["Légume"]
["Quantité légume"]
["Code légume deux"]
["Légume deux"]
["Quantité légume deux"]
["Référence viande"]
["Viande"]
["Quantité viande"]
["Référence dessert"]
["Dessert"]
["Quantité dessert"]
["Référence observation"]
["Observation"]
[]
["Proposition menus journaliers."]
["Numéro du menu",{"$f":"B596+7","v":239},{"$f":"C596+7","v":240},241,242,243,244,245]
["Date du menu","2018-08-27","2018-08-28","2018-08-29","2018-08-30","2018-08-31","2018-09-01","2018-09-02"]
["Référence légume"]
["Légume"]
["Quantité légume"]
["Code légume deux"]
["Légume deux"]
["Quantité légume deux"]
["Référence viande"]
["Viande"]
["Quantité viande"]
["Référence dessert"]
["Dessert"]
["Quantité dessert"]
["Référence observation"]
["Observation"]
[]
["Proposition menus journaliers."]
["Numéro du menu",{"$f":"B614+7","v":246},{"$f":"C614+7","v":247},248,249,250,251,252]
["Date du menu","2018-09-03","2018-09-04","2018-09-05","2018-09-06","2018-09-07","2018-09-08","2018-09-09"]
["Référence légume"]
["Légume"]
["Quantité légume"]
["Code légume deux"]
["Légume deux"]
["Quantité légume deux"]
["Référence viande"]
["Viande"]
["Quantité viande"]
["Référence dessert"]
["Dessert"]
["Quantité dessert"]
["Référence observation"]
["Observation"]
[]
["Proposition menus journaliers."]
["Numéro du menu",{"$f":"B632+7","v":253},{"$f":"C632+7","v":254},255,256,257,258,259]
["Date du menu","2018-09-10","2018-09-11","2018-09-12","2018-09-13","2018-09-14","2018-09-15","2018-09-16"]
["Référence légume"]
["Légume"]
["Quantité légume"]
["Code légume deux"]
["Légume deux"]
["Quantité légume deux"]
["Référence viande"]
["Viande"]
["Quantité viande"]
["Référence dessert"]
["Dessert"]
["Quantité dessert"]
["Référence observation"]
["Observation"]
[]
["Proposition menus journaliers."]
["Numéro du menu",{"$f":"B650+7","v":260},{"$f":"C650+7","v":261},262,263,264,265,266]
["Date du menu","2018-09-17","2018-09-18","2018-09-19","2018-09-20","2018-09-21","2018-09-22","2018-09-23"]
["Référence légume"]
["Légume"]
["Quantité légume"]
["Code légume deux"]
["Légume deux"]
["Quantité légume deux"]
["Référence viande"]
["Viande"]
["Quantité viande"]
["Référence dessert"]
["Dessert"]
["Quantité dessert"]
["Référence observation"]
["Observation"]
[]
["Proposition menus journaliers."]
["Numéro du menu",{"$f":"B668+7","v":267},{"$f":"C668+7","v":268},269,270,271,272,273]
["Date du menu","2018-09-24","2018-09-25","2018-09-26","2018-09-27","2018-09-28","2018-09-29","2018-09-30"]
["Référence légume"]
["Légume"]
["Quantité légume"]
["Code légume deux"]
["Légume deux"]
["Quantité légume deux"]
["Référence viande"]
["Viande"]
["Quantité viande"]
["Référence dessert"]
["Dessert"]
["Quantité dessert"]
["Référence observation"]
["Observation"]
[]
["Proposition menus journaliers."]
["Numéro du menu",{"$f":"B686+7","v":274},{"$f":"C686+7","v":275},276,277,278,279,280]
["Date du menu","2018-10-01","2018-10-02","2018-10-03","2018-10-04","2018-10-05","2018-10-06","2018-10-07"]
["Référence légume"]
["Légume"]
["Quantité légume"]
["Code légume deux"]
["Légume deux"]
["Quantité légume deux"]
["Référence viande"]
["Viande"]
["Quantité viande"]
["Référence dessert"]
["Dessert"]
["Quantité dessert"]
["Référence observation"]
["Observation"]
[]
["Proposition menus journaliers."]
["Numéro du menu",{"$f":"B704+7","v":281},{"$f":"C704+7","v":282},283,284,285,286,287]
["Date du menu","2018-10-08","2018-10-09","2018-10-10","2018-10-11","2018-10-12","2018-10-13","2018-10-14"]
["Référence légume"]
["Légume"]
["Quantité légume"]
["Code légume deux"]
["Légume deux"]
["Quantité légume deux"]
["Référence viande"]
["Viande"]
["Quantité viande"]
["Référence dessert"]
["Dessert"]
["Quantité dessert"]
["Référence observation"]
["Observation"]
[]
["Proposition menus journaliers."]
["Numéro du menu",{"$f":"B722+7","v":288},{"$f":"C722+7","v":289},290,291,292,293,294]
["Date du menu","2018-10-15","2018-10-16","2018-10-17","2018-10-18","2018-10-19","2018-10-20","2018-10-21"]
["Référence légume"]
["Légume"]
["Quantité légume"]
["Code légume deux"]
["Légume deux"]
["Quantité légume deux"]
["Référence viande"]
["Viande"]
["Quantité viande"]
["Référence dessert"]
["Dessert"]
["Quantité dessert"]
["Référence observation"]
["Observation"]
[]
["Proposition menus journaliers."]
["Numéro du menu",{"$f":"B740+7","v":295},{"$f":"C740+7","v":296},297,298,299,300,301]
["Date du menu","2018-10-22","2018-10-23","2018-10-24","2018-10-25","2018-10-26","2018-10-27","2018-10-28"]
["Référence légume"]
["Légume"]
["Quantité légume"]
["Code légume deux"]
["Légume deux"]
["Quantité légume deux"]
["Référence viande"]
["Viande"]
["Quantité viande"]
["Référence dessert"]
["Dessert"]
["Quantité dessert"]
["Référence observation"]
["Observation"]
[]
["Proposition menus journaliers."]
["Numéro du menu",{"$f":"B758+7","v":302},{"$f":"C758+7","v":303},304,305,306,307,308]
["Date du menu","2018-10-29","2018-10-30","2018-10-31","2018-11-01","2018-11-02","2018-11-03","2018-11-04"]
["Référence légume"]
["Légume"]
["Quantité légume"]
["Code légume deux"]
["Légume deux"]
["Quantité légume deux"]
["Référence viande"]
["Viande"]
["Quantité viande"]
["Référence dessert"]
["Dessert"]
["Quantité dessert"]
["Référence observation"]
["Observation"]
[]
["Proposition menus journaliers."]
["Numéro du menu",{"$f":"B776+7","v":309},{"$f":"C776+7","v":310},311,312,313,314,315]
["Date du menu","2018-11-05","2018-11-06","2018-11-07","2018-11-08","2018-11-09","2018-11-10","2018-11-11"]
["Référence légume"]
["Légume"]
["Quantité légume"]
["Code légume deux"]
["Légume deux"]
["Quantité légume deux"]
["Référence viande"]
["Viande"]
["Quantité viande"]
["Référence dessert"]
["Dessert"]
["Quantité dessert"]
["Référence observation"]
["Observation"]
[]
["Proposition menus journaliers."]
["Numéro du menu",{"$f":"B794+7","v":316},{"$f":"C794+7","v":317},318,319,320,321,322]
["Date du menu","2018-11-12","2018-11-13","2018-11-14","2018-11-15","2018-11-16","2018-11-17","2018-11-18"]
["Référence légume"]
["Légume"]
["Quantité légume"]
["Code légume deux"]
["Légume deux"]
["Quantité légume deux"]
["Référence viande"]
["Viande"]
["Quantité viande"]
["Référence dessert"]
["Dessert"]
["Quantité dessert"]
["Référence observation"]
["Observation"]
[]
["Proposition menus journaliers."]
["Numéro du menu",{"$f":"B812+7","v":323},{"$f":"C812+7","v":324},325,326,327,328,329]
["Date du menu","2018-11-19","2018-11-20","2018-11-21","2018-11-22","2018-11-23","2018-11-24","2018-11-25"]
["Référence légume"]
["Légume"]
["Quantité légume"]
["Code légume deux"]
["Légume deux"]
["Quantité légume deux"]
["Référence viande"]
["Viande"]
["Quantité viande"]
["Référence dessert"]
["Dessert"]
["Quantité dessert"]
["Référence observation"]
["Observation"]
[]
["Proposition menus journaliers."]
["Numéro du menu",{"$f":"B830+7","v":330},{"$f":"C830+7","v":331},332,333,334,335,336]
["Date du menu","2018-11-26","2018-11-27","2018-11-28","2018-11-29","2018-11-30","2018-12-01","2018-12-02"]
["Référence légume"]
["Légume"]
["Quantité légume"]
["Code légume deux"]
["Légume deux"]
["Quantité légume deux"]
["Référence viande"]
["Viande"]
["Quantité viande"]
["Référence dessert"]
["Dessert"]
["Quantité dessert"]
["Référence observation"]
["Observation"]
[]
["Proposition menus journaliers."]
["Numéro du menu",{"$f":"B848+7","v":337},{"$f":"C848+7","v":338},339,340,341,342,343]
["Date du menu","2018-12-03","2018-12-04","2018-12-05","2018-12-06","2018-12-07","2018-12-08","2018-12-09"]
["Référence légume"]
["Légume"]
["Quantité légume"]
["Code légume deux"]
["Légume deux"]
["Quantité légume deux"]
["Référence viande"]
["Viande"]
["Quantité viande"]
["Référence dessert"]
["Dessert"]
["Quantité dessert"]
["Référence observation"]
["Observation"]
[]
["Proposition menus journaliers."]
["Numéro du menu",{"$f":"B866+7","v":344},{"$f":"C866+7","v":345},346,347,348,349,350]
["Date du menu","2018-12-10","2018-12-11","2018-12-12","2018-12-13","2018-12-14","2018-12-15","2018-12-16"]
["Référence légume"]
["Légume"]
["Quantité légume"]
["Code légume deux"]
["Légume deux"]
["Quantité légume deux"]
["Référence viande"]
["Viande"]
["Quantité viande"]
["Référence dessert"]
["Dessert"]
["Quantité dessert"]
["Référence observation"]
["Observation"]
[]
["Proposition menus journaliers."]
["Numéro du menu",{"$f":"B884+7","v":351},{"$f":"C884+7","v":352},353,354,355,356,357]
["Date du menu","2018-12-17","2018-12-18","2018-12-19","2018-12-20","2018-12-21","2018-12-22","2018-12-23"]
["Référence légume"]
["Légume"]
["Quantité légume"]
["Code légume deux"]
["Légume deux"]
["Quantité légume deux"]
["Référence viande"]
["Viande"]
["Quantité viande"]
["Référence dessert"]
["Dessert"]
["Quantité dessert"]
["Référence observation"]
["Observation"]
[]
["Proposition menus journaliers."]
["Numéro du menu",{"$f":"B902+7","v":358},{"$f":"C902+7","v":359},360,361,362,363,364]
["Date du menu","2018-12-24","2018-12-25","2018-12-26","2018-12-27","2018-12-28","2018-12-29","2018-12-30"]
["Référence légume"]
["Légume"]
["Quantité légume"]
["Code légume deux"]
["Légume deux"]
["Quantité légume deux"]
["Référence viande"]
["Viande"]
["Quantité viande"]
["Référence dessert"]
["Dessert"]
["Quantité dessert"]
["Référence observation"]
["Observation"]
[]
["Proposition menus journaliers."]
["Numéro du menu",{"$f":"B920+7","v":365},{"$f":"C920+7","v":366}]
["Date du menu","2018-12-31"]
["Référence légume"]
["Légume"]
["Quantité légume"]
["Code légume deux"]
["Légume deux"]
["Quantité légume deux"]
["Référence viande"]
["Viande"]
["Quantité viande"]
["Référence dessert"]
["Dessert"]
["Quantité dessert"]
["Référence observation"]
["Observation"]

{"sheet":"Proposition MVWE","index":25,"n_rows":149,"n_cols":8,"rows_kept":149,"cut":false,"hidden":false,"merged":[[50,0,50,7],[0,0,0,7],[10,0,10,7],[20,0,20,7],[30,0,30,7],[40,0,40,7],[120,0,120,7],[130,0,130,7],[140,0,140,7],[150,0,150,7],[60,0,60,7],[70,0,70,7],[80,0,80,7],[90,0,90,7],[100,0,100,7],[110,0,110,7]]}
["Proposition menus viande weekend."]
[]
["Numéro du menu","1","2","3","4","5","6","7"]
["Date du menu","2018-01-06","2018-01-07","2018-01-13","2018-01-14","2018-01-20","2018-01-21","2018-01-27"]
["Référence viande"]
["Viande"]
["Quantité viande"]
["Référence observation"]
["Observation"]
[]
["Proposition menus viande weekend."]
[]
["Numéro du menu",{"$f":"B3+7","v":8},{"$f":"C3+7","v":9},10,11,12,13,14]
["Date du menu","2018-01-28","2018-02-03","2018-02-04","2018-02-10","2018-02-11","2018-02-17","2018-02-18"]
["Référence viande"]
["Viande"]
["Quantité viande"]
["Référence observation"]
["Observation"]
[]
["Proposition menus viande weekend."]
[]
["Numéro du menu",{"$f":"B13+7","v":15},{"$f":"C13+7","v":16},17,18,19,20,21]
["Date du menu","2018-02-24","2018-02-25","2018-03-03","2018-03-24","2018-03-10","2018-03-11","2018-03-17"]
["Référence viande"]
["Viande"]
["Quantité viande"]
["Référence observation"]
["Observation"]
[]
["Proposition menus viande weekend."]
[]
["Numéro du menu",{"$f":"B23+7","v":22},{"$f":"C23+7","v":23},24,25,26,27,28]
["Date du menu","2018-03-18","2018-03-24","2018-03-25","2018-03-31","2018-04-01","2018-04-07","2018-04-08"]
["Référence viande"]
["Viande"]
["Quantité viande"]
["Référence observation"]
["Observation"]
[]
["Proposition menus viande weekend."]
[]
["Numéro du menu",{"$f":"B33+7","v":29},{"$f":"C33+7","v":30},31,32,33,34,35]
["Date du menu","2018-04-14","2018-04-15","2018-04-21","2018-04-22","2018-04-28","2018-04-29","2018-05-05"]
["Référence viande"]
["Viande"]
["Quantité viande"]
["Référence observation"]
["Observation"]
[]
["Proposition menus viande weekend."]
[]
["Numéro du menu",{"$f":"B43+7","v":36},{"$f":"C43+7","v":37},38,39,40,41,42]
["Date du menu","2018-05-06","2018-05-12","2018-05-13","2018-05-19","2018-05-20","2018-05-26","2018-05-27"]
["Référence viande"]
["Viande"]
["Quantité viande"]
["Référence observation"]
["Observation"]
[]
["Proposition menus viande weekend."]
[]
["Numéro du menu",{"$f":"B53+7","v":43},{"$f":"C53+7","v":44},45,46,47,48,49]
["Date du menu","2018-06-02","2018-06-03","2018-06-09","2018-06-10","2018-06-16","2018-06-17","2018-06-23"]
["Référence viande"]
["Viande"]
["Quantité viande"]
["Référence observation"]
["Observation"]
[]
["Proposition menus viande weekend."]
[]
["Numéro du menu",{"$f":"B63+7","v":50},{"$f":"C63+7","v":51},52,53,54,55,56]
["Date du menu","2018-06-24","2018-06-30","2018-07-01","2018-07-07","2018-07-08","2018-07-14","2018-07-15"]
["Référence viande"]
["Viande"]
["Quantité viande"]
["Référence observation"]
["Observation"]
[]
["Proposition menus viande weekend."]
[]
["Numéro du menu",{"$f":"B73+7","v":57},{"$f":"C73+7","v":58},59,60,61,62,63]
["Date du menu","2018-07-21","2018-07-22","2018-07-28","2018-07-29","2018-08-04","2018-08-05","2018-08-11"]
["Référence viande"]
["Viande"]
["Quantité viande"]
["Référence observation"]
["Observation"]
[]
["Proposition menus viande weekend."]
[]
["Numéro du menu",{"$f":"B83+7","v":64},{"$f":"C83+7","v":65},66,67,68,69,70]
["Date du menu","2018-08-12","2018-08-18","2018-08-19","2018-08-25","2018-08-26","2018-09-01","2018-09-02"]
["Référence viande"]
["Viande"]
["Quantité viande"]
["Référence observation"]
["Observation"]
[]
["Proposition menus viande weekend."]
[]
["Numéro du menu",{"$f":"B93+7","v":71},{"$f":"C93+7","v":72},73,74,75,76,77]
["Date du menu","2018-09-08","2018-09-09","2018-09-15","2018-09-16","2018-09-22","2018-09-23","2018-09-29"]
["Référence viande"]
["Viande"]
["Quantité viande"]
["Référence observation"]
["Observation"]
[]
["Proposition menus viande weekend."]
[]
["Numéro du menu",{"$f":"B103+7","v":78},{"$f":"C103+7","v":79},80,81,82,83,84]
["Date du menu","2018-09-30","2018-10-06","2018-10-07","2018-10-13","2018-10-14","2018-10-20","2018-10-21"]
["Référence viande"]
["Viande"]
["Quantité viande"]
["Référence observation"]
["Observation"]
[]
["Proposition menus viande weekend."]
[]
["Numéro du menu",{"$f":"B113+7","v":85},{"$f":"C113+7","v":86},87,88,89,90,91]
["Date du menu","2018-10-27","2018-10-28","2018-11-03","2018-11-04","2018-11-10","2018-11-11","2018-11-17"]
["Référence viande"]
["Viande"]
["Quantité viande"]
["Référence observation"]
["Observation"]
[]
["Proposition menus viande weekend."]
[]
["Numéro du menu",{"$f":"B123+7","v":92},{"$f":"C123+7","v":93},94,95,96,97,98]
["Date du menu","2018-11-18","2018-11-24","2018-11-25","2018-12-01","2018-12-02","2018-12-08","2018-12-09"]
["Référence viande"]
["Viande"]
["Quantité viande"]
["Référence observation"]
["Observation"]
[]
["Proposition menus viande weekend."]
[]
["Numéro du menu",{"$f":"B133+7","v":99},{"$f":"C133+7","v":100},101,102,103,104,105]
["Date du menu","2018-12-15","2018-12-16","2018-12-22","2018-12-23","2018-12-29","2018-12-30"]
["Référence viande"]
["Viande"]
["Quantité viande"]
["Référence observation"]
["Observation"]