{"text_format":"1","workbook":"xlsx","n_sheets":34,"sheets":["MENU GENERAL","SOUS MENU ADMIN","SOUS MENU PDG","SOUS MENU CHEF EQ","SOUS MENU OPERATEUR","CHECKLIST","RETARD IMMO","DOSSIER LOG V2","Rech COND","BDD COND","Rech REMORQUE","BDD REMORQUE","MENU LIV HUNTSMAN","BL HSO OUDALLE","HSO OUDALLE","ZDGN HSO OUDALLE","BL XHS118 INFINEUM","XHS118 INFINEUM","ZDGN XHS118 INFINEUM","BL HSA118 INFINEUM","HSA118 INFINEUM","ZDGN HSA118 INFINEUM","BL HSA118 ENI","HSA118 ENI","ZDGN HSA118 ENI","BL AS305BD CHEVRON","AS305BD CHEVRON","ZDGN AS305BD CHEVRON","BL AS305BD ALKION","AS305BD ALKION","ZDGN AS305BD ALKION","BL HSA118 VISCOL","HSA118 VISCOL","ZDGN HSA118 VISCOL"],"not_rendered":{"charts":0,"images":29,"macros":1,"external_links":0,"defined_names":8,"comments":0,"pivot_tables":0},"unopened":[],"bounds":{"document_bytes":16777216,"sheet_cells":100000,"rows_first":2000,"rows_last":500,"rows_between":2000,"halvings":0,"cell_chars":16384,"cell_head_chars":4096},"cells_cut":0,"cells_raw":0,"read":"whole","date_system":"1900"}

{"sheet":"MENU GENERAL","index":0,"n_rows":0,"n_cols":0,"rows_kept":0,"cut":false,"hidden":false,"merged":[]}

{"sheet":"SOUS MENU ADMIN","index":1,"n_rows":0,"n_cols":0,"rows_kept":0,"cut":false,"hidden":false,"merged":[]}

{"sheet":"SOUS MENU PDG","index":2,"n_rows":0,"n_cols":0,"rows_kept":0,"cut":false,"hidden":false,"merged":[]}

{"sheet":"SOUS MENU CHEF EQ","index":3,"n_rows":0,"n_cols":0,"rows_kept":0,"cut":false,"hidden":false,"merged":[]}

{"sheet":"SOUS MENU OPERATEUR","index":4,"n_rows":0,"n_cols":0,"rows_kept":0,"cut":false,"hidden":false,"merged":[]}

{"sheet":"CHECKLIST","index":5,"n_rows":55,"n_cols":8,"rows_kept":55,"cut":false,"hidden":false,"merged":[[50,4,50,5],[41,1,41,2],[42,2,42,3],[54,0,54,1],[54,2,54,4],[49,2,51,3],[41,3,41,4],[42,0,42,1],[44,0,45,6],[46,0,47,6],[49,0,49,1],[49,4,49,5],[31,0,31,6],[32,0,32,3],[33,0,33,3],[39,0,39,2],[35,3,37,4],[24,0,24,3],[26,0,26,3],[28,0,28,3],[29,0,29,1],[30,0,30,3],[25,2,25,3],[27,2,27,3],[22,0,22,1],[22,2,22,3],[22,4,22,6],[23,0,23,1],[23,2,23,3],[23,4,23,6],[15,0,15,3],[17,0,17,3],[19,0,19,3],[21,0,21,6],[16,2,16,3],[18,2,18,3],[20,2,20,3],[10,0,10,6],[7,5,7,6],[8,5,8,6],[5,0,5,1],[6,0,6,1],[7,0,7,1],[8,0,8,1],[9,0,9,1],[5,3,5,4],[7,3,7,4],[8,3,9,4],[3,1,3,5],[4,0,4,1],[4,2,4,4],[4,5,4,6],[0,5,0,6],[1,5,1,6],[2,5,2,6],[0,2,0,3],[1,2,1,3],[13,0,13,6],[14,5,14,6],[14,3,14,4],[11,5,11,6],[12,5,12,6],[11,1,11,3],[12,0,12,1],[12,2,12,3]]}
[null,null,"LISTE DE CONTRÔLE DES VEHICULES",null,"N°de Delivery :",null,null,"test"]
[null,null,"(Matières premières / Produits finis / Déchets)",null,"N°de Shipment :"]
[null,null,null,null,"N°de Order :"]
[null,"PARTIE I - A compléter à l'arrivée du véhicule"]
["Raison du Transport",null,"Conditionnement du produit",null,null,"Présentation"]
[null,null,null,null,null,"Date :",{"$f":"TODAY()","v":"2019-10-23"}]
{"$rows_left_out":50}
{"sheet":"RETARD IMMO","index":6,"n_rows":17,"n_cols":13,"rows_kept":17,"cut":false,"hidden":false,"merged":[[0,3,0,8],[2,3,2,5],[2,10,2,11],[1,5,1,7]]}
[null,null,null,{"$f":"NOW()","v":"2019-10-23T23:29:15.310"}]
["                                                          CITERNES IMMOBILISEES  ","                                                         ",null,null,null,"RETARD CHARGEMENT & IMMO"]
["CITERNE","PRODUIT","Slot","DATE DE LIVRAISON",null,null,"COMMANDE","RAISON DE L’IMMO","CITERNE","PRODUIT","DATE DE DEBUT",null,"RAISON DE L’IMMO"]
["4097 TS 73","ASF/90",null,null,"2018-12-21","10H15",null,"MP","UTTU241779/8","SS25/A","2018-09-28","8H40","RETOUR CLIENT"]
["BY 173 KZ","A300",null,null,"2018-12-21","11H15",null,"MP","BW776XY","ACIDE SULFURIQUE","2018-12-26","6h00","STOCK"]
["BX 799 NB","SOUDE",null,null,"2018-12-19","21H00",null,"MP","BX627CC","ACIDE SULFURIQUE","2018-12-04","17h00","STOCK"]
{"$rows_left_out":12}
{"sheet":"DOSSIER LOG V2","index":7,"n_rows":0,"n_cols":0,"rows_kept":0,"cut":false,"hidden":false,"merged":[]}

{"sheet":"Rech COND","index":8,"n_rows":9,"n_cols":3,"rows_kept":9,"cut":false,"hidden":false,"merged":[]}
[null,null,"RECHERCHE D'UN CONDUCTEUR"]
[null,"NOM DU CONDUCTEUR","CUNY"]
[null,"PRÉNOM DU CONDUCTEUR",{"$f":"IF($C$2=\"\",\"\",VLOOKUP($C$2,'BDD COND'!$A$5:$G$9999,2,FALSE))","v":"DOMINIQUE"}]
[null,"VALIDITÉ PERMIS DE CONDUIRE",{"$f":"IF($C$2=\"\",\"\",IF(VLOOKUP($C$2,'BDD COND'!$A$5:$H$9999,3,FALSE)=\"\",\"\",VLOOKUP($C$2,'BDD COND'!$A$5:$H$9999,3,FALSE)))","v":"2020-04-18"}]
[null,"VALIDITÉ DU TITRE ADR",{"$f":"IF($C$2=\"\",\"\",IF(VLOOKUP($C$2,'BDD COND'!$A$5:$H$9999,4,FALSE)=\"\",\"\",VLOOKUP($C$2,'BDD COND'!$A$5:$H$9999,4,FALSE)))","v":"A DEMANDER"}]
[null,"VALIDITÉ DE L'ACCUEIL INNOSPEC",{"$f":"IF($C$2=\"\",\"\",IF(VLOOKUP($C$2,'BDD COND'!$A$5:$H$9999,5,FALSE)=\"\",\"\",VLOOKUP($C$2,'BDD COND'!$A$5:$H$9999,5,FALSE)))","v":"2019-04-09"}]
{"$rows_left_out":4}
{"sheet":"BDD COND","index":9,"n_rows":117,"n_cols":8,"rows_kept":117,"cut":false,"hidden":false,"merged":[[0,0,0,1]]}
["RECHERCHE",null,null,"BASE DE DONNÉES CONDUCTEURS"]
[]
[]
["NOM DU CONDUCTEUR","PRÉNOM","VALIDITÉ PERMIS DE CONDUIRE","VALIDITÉ TITRE ADR","VALIDITÉ ACCUEIL INNOSPEC","IMMATRICULATION TRACTEUR","VALIDITÉ MINES TRACTEUR","SOCIÉTÉ"]
["ABDESSELEM","PASCAL","2019-04-12","2019-12-14","2018-12-04","DN391JJ","2019-01-05","XPOLOGISTICS St Mihiel"]
["AMAR","MOHAMED","2019-01-17","2020-12-18","2019-04-10","1BGO897","2018-05-30","TRAFUCO"]
{"$rows_left_out":112}
{"sheet":"Rech REMORQUE","index":10,"n_rows":13,"n_cols":3,"rows_kept":13,"cut":false,"hidden":false,"merged":[]}
[null,null,"RECHERCHE D'UNE REMORQUE & TRACTEUR"]
[null,"IMMATRICULATION","BZ016TC"]
[null,"DATE DES MINES",{"$f":"IF(C2=\"\",\"\",IF(VLOOKUP(C2,'BDD REMORQUE'!$B$2:$D$1043,2,FALSE)=\"\",\"\",VLOOKUP(C2,'BDD REMORQUE'!$B$2:$D$1043,2,FALSE)))","v":"2019-02-14"}]
[null,"CODE CITERNE / CAPACITÉ",{"$f":"IF(ISBLANK(C2),\"\",VLOOKUP($C$2,'BDD REMORQUE'!B:E,ROW(A3),FALSE))","v":"L4BH - MONOCUVE - 32479L"}]
[null,"SOCIÉTÉ",{"$f":"IF(ISBLANK(C2),\"\",VLOOKUP($C$2,'BDD REMORQUE'!B:E,ROW(A4),FALSE))","v":"XPOLogistics SAINT MIHIEL"}]
[null,"LÉGENDE"]
{"$rows_left_out":8}
{"sheet":"BDD REMORQUE","index":11,"n_rows":433,"n_cols":5,"rows_kept":433,"cut":false,"hidden":false,"merged":[]}
[null,"IMMATRICULATION","DATE DES MINES","CODE CITERNE / CAPACITÉ","SOCIÉTÉ"]
[null,"1QEC514","2018-11-14","REMORQUE SPECIFIQUE CHARBON ACTIF","DESOTEC"]
[null,"2277TS73","2019-01-09","L4BH - MONOCUVE - 34500L","BM CHIMIE"]
[null,"9413VR73","2019-02-15","L4BH - MONOCUVE - CAPACITÉ NC","BM CHIMIE"]
[null,"AA140JB",null,null,"XPOLogistics SANDOUVILLE"]
[null,"AA726ZR",null,null,"XPOLogistics SANDOUVILLE"]
{"$rows_left_out":428}
{"sheet":"MENU LIV HUNTSMAN","index":12,"n_rows":0,"n_cols":0,"rows_kept":0,"cut":false,"hidden":false,"merged":[]}

{"sheet":"BL HSO OUDALLE","index":13,"n_rows":51,"n_cols":9,"rows_kept":51,"cut":false,"hidden":false,"merged":[[0,7,0,8],[14,1,14,2],[15,1,15,2],[13,1,13,3],[6,1,6,2],[7,1,7,2],[9,1,9,2],[11,1,11,2],[12,1,12,2],[1,7,1,8],[6,4,6,5],[6,7,6,8],[1,4,1,5],[0,4,0,5],[48,1,48,8],[7,4,7,5],[7,7,7,8],[49,1,49,8],[50,1,50,8],[21,7,21,8],[23,1,23,2],[18,7,18,8]]}
[null,"Huntsman Holland B.V.",null,null,"HUNTSMAN",null,null,{"$f":"TODAY()","v":"2019-10-23"}]
[null,"Merseyweg 10",null,null,"Enriching lives through innovation",null,null,"Delivery Note"]
[null,"P.O. Box 1020"]
[null,"3180 AA Rozenburg"]
[null,"Netherlands"]
[]
{"$rows_left_out":46}
{"sheet":"HSO OUDALLE","index":14,"n_rows":44,"n_cols":10,"rows_kept":44,"cut":false,"hidden":false,"merged":[]}
[]
[null,"date chargement","date livraison","HSS Delivery","Delivery Innospec","Lubrizol Ref","citerne","Transporteur","Seals Number","Quantité"]
[null,"2018-10-01","2018-10-02",72590746,"70026281","4503050962","BW776XY","XPOLOGISTICS","543617-18-19-20",25600]
[null,"2018-10-02","2018-10-03",72590747,"70026288","4503050963","BX799NB"]
[null,"2018-10-03","2018-10-04",72590748,"70026386","4503050970"]
[null,"2018-10-16","2018-10-17",72598137,"70026763","4503059161","BX627CC"]
{"$rows_left_out":39}
{"sheet":"ZDGN HSO OUDALLE","index":15,"n_rows":99,"n_cols":9,"rows_kept":99,"cut":false,"hidden":false,"merged":[[2,7,2,8],[1,5,1,6],[3,5,3,6],[0,1,0,2],[0,3,0,6],[2,1,2,2],[3,1,3,2],[55,0,55,3],[50,2,50,3],[51,0,51,1],[52,1,52,2],[46,0,46,1],[55,6,55,7],[4,7,4,8],[8,1,8,2],[9,1,9,2],[10,1,10,3],[4,1,4,2],[20,1,20,2],[16,5,16,6],[11,1,11,2],[7,5,7,6],[11,5,11,6],[15,1,15,2],[16,1,16,2],[15,5,15,6],[27,7,27,8],[37,3,37,5],[41,0,41,1],[24,2,24,3],[25,1,25,4],[26,1,26,2],[28,1,29,4],[31,1,31,4],[32,1,32,2],[33,1,33,4],[24,0,36,0],[37,0,37,1],[38,0,38,1],[39,0,39,1],[40,0,40,1],[23,5,23,8],[22,5,22,6],[23,3,23,4],[24,6,25,6],[24,7,25,7],[45,6,46,6],[45,7,46,7],[36,1,36,4],[53,0,53,1],[53,2,53,3],[53,5,53,6],[48,5,48,7],[37,6,38,6],[43,7,43,8],[48,2,48,4],[48,0,49,1],[50,0,50,1],[45,0,45,1],[45,4,45,5],[46,2,47,3],[38,3,44,5],[57,1,57,7],[58,1,58,7],[59,2,59,7],[60,2,60,7],[61,2,61,7],[62,2,62,7],[63,1,63,4],[64,2,64,7],[65,2,65,7],[66,2,66,7],[74,1,74,7],[75,1,75,7],[76,1,76,7],[78,2,78,7],[67,2,67,7],[68,2,68,7],[69,2,69,7],[70,2,70,7],[71,2,71,7],[83,2,83,7],[84,2,84,7],[85,2,85,8],[86,2,86,8],[79,2,79,8],[80,2,80,7],[81,2,81,7],[82,2,82,7],[93,2,93,8],[95,1,95,6],[98,1,98,7],[88,2,88,8],[89,2,89,7],[90,2,90,7],[91,2,91,7],[92,2,92,8]]}
[null,"DANGEROUS GOODS DECLARATION, SHIPPING NOTE & CONTAINER/VEHICULE PACKING CERTIFICATE © SITPRO 1995",null,"           DANGEROUS GOOD NOTE",null,null,null,"1 / 1"]
[null,"Exporter",null,null,1,"Customs reference/status",null,null,2]
[null,"Huntsman Holland BV St.Mihiel",null,null,null,null,null,70029417]
[null,"BP . 19 - ZI de HAN-sur-Meuse",null,null,null,"Booking number",null,"Exporter's reference",4]
[null,"55300 Saint Mihiel",null,null,null,null,null,72629149]
[null,{"$f":"UPPER(\"france\")","v":"FRANCE"},null,null,null,null,null,"Forwarder's reference",5]
{"$rows_left_out":94}
{"sheet":"BL XHS118 INFINEUM","index":16,"n_rows":48,"n_cols":9,"rows_kept":48,"cut":false,"hidden":false,"merged":[[45,1,45,8],[46,1,46,8],[47,1,47,8],[21,7,21,8],[23,1,23,2],[0,4,0,6],[14,1,14,3],[1,4,1,6],[13,1,13,3],[18,7,18,8],[7,1,7,2],[7,4,7,5],[7,7,7,8],[9,1,9,2],[11,1,11,2],[0,7,0,8],[1,7,1,8],[6,1,6,2],[6,4,6,5],[6,7,6,8]]}
[null,"Huntsman Holland B.V.",null,null,"HUNTSMAN",null,null,{"$f":"TODAY()","v":"2019-10-23"}]
[null,"Merseyweg 10",null,null,"Enriching lives through Innovation",null,null,"Delivery Note"]
[null,"P.O. Box 1020"]
[null,"3180 AA Rozenburg"]
[null,"Netherlands"]
[]
{"$rows_left_out":43}
{"sheet":"XHS118 INFINEUM","index":17,"n_rows":4,"n_cols":10,"rows_kept":4,"cut":false,"hidden":false,"merged":[]}
[]
[null,"date chargement","date livraison","HSS Delivery","Delivery Innospec","Infineum Ref","citerne","Transporteur","Seals Number","Quantité"]
[null,"2018-01-02","2018-01-03",72449062,"70015254","4502880677","BY935MY","XPOLOGISTICS","543617-18-19-20",25600]
[null,"2018-09-13","2018-09-14",72556301,"70024876",null,"EF395XY-CUVE2"]

{"sheet":"ZDGN XHS118 INFINEUM","index":18,"n_rows":99,"n_cols":9,"rows_kept":99,"cut":false,"hidden":false,"merged":[[91,2,91,7],[92,2,92,8],[93,2,93,8],[95,1,95,6],[98,1,98,7],[84,2,84,7],[78,2,78,7],[79,2,79,8],[80,2,80,7],[81,2,81,7],[82,2,82,7],[83,2,83,7],[85,2,85,8],[86,2,86,8],[88,2,88,8],[89,2,89,7],[90,2,90,7],[76,1,76,7],[63,1,63,4],[64,2,64,7],[65,2,65,7],[66,2,66,7],[67,2,67,7],[68,2,68,7],[69,2,69,7],[70,2,70,7],[71,2,71,7],[74,1,74,7],[75,1,75,7],[62,2,62,7],[52,1,52,2],[53,0,53,1],[53,2,53,3],[53,5,53,6],[55,0,55,3],[55,6,55,7],[57,1,57,7],[58,1,58,7],[59,2,59,7],[60,2,60,7],[61,2,61,7],[51,0,51,1],[43,7,43,8],[45,0,45,1],[45,4,45,5],[45,6,46,6],[45,7,46,7],[46,0,46,1],[46,2,47,3],[48,0,49,1],[48,2,48,4],[48,5,48,7],[50,0,50,1],[50,2,50,3],[20,1,20,2],[22,5,22,6],[23,3,23,4],[23,5,23,8],[37,0,37,1],[37,3,37,5],[37,6,38,6],[38,0,38,1],[38,3,44,5],[39,0,39,1],[40,0,40,1],[41,0,41,1],[28,1,30,4],[32,1,32,4],[34,1,34,4],[33,1,33,2],[24,0,36,0],[24,2,24,3],[24,6,25,6],[24,7,25,7],[25,1,25,4],[26,1,26,2],[27,7,27,8],[31,1,31,4],[36,1,36,4],[10,1,10,3],[11,5,11,6],[15,1,15,2],[15,5,15,6],[16,1,16,2],[16,5,16,6],[11,1,11,3],[4,1,4,2],[4,7,4,8],[7,5,7,6],[8,1,8,2],[3,1,3,2],[3,5,3,6],[0,1,0,2],[0,3,0,6],[1,5,1,6],[2,1,2,2],[2,7,2,8]]}
[null,"DANGEROUS GOODS DECLARATION, SHIPPING NOTE & CONTAINER/VEHICULE PACKING CERTIFICATE © SITPRO 1995",null,"           DANGEROUS GOOD NOTE",null,null,null,"1 / 1"]
[null,"Exporter",null,null,1,"Customs reference/status",null,null,2]
[null,"Huntsman Holland BV St.Mihiel"]
[null,"BP . 19 - ZI de HAN-sur-Meuse",null,null,null,"Booking number",null,"Exporter's reference",4]
[null,"55300 Saint Mihiel"]
[null,{"$f":"UPPER(\"france\")","v":"FRANCE"},null,null,null,null,null,"Forwarder's reference",5]
{"$rows_left_out":94}
{"sheet":"BL HSA118 INFINEUM","index":19,"n_rows":50,"n_cols":9,"rows_kept":50,"cut":false,"hidden":false,"merged":[[7,1,7,2],[7,4,7,5],[7,7,7,8],[9,1,9,2],[6,7,6,8],[0,4,0,6],[0,7,0,8],[1,4,1,6],[1,7,1,8],[6,1,6,2],[6,4,6,5],[49,1,49,8],[11,1,11,2],[13,1,13,3],[14,1,14,3],[18,7,18,8],[21,7,21,8],[47,1,47,8],[48,1,48,8]]}
[null,"Huntsman Holland B.V.",null,null,"HUNTSMAN",null,null,{"$f":"TODAY()","v":"2019-10-23"}]
[null,"Merseyweg 10",null,null,"Enriching lives through Innovation",null,null,"Delivery Note"]
[null,"P.O. Box 1020"]
[null,"3180 AA Rozenburg"]
[null,"Netherlands"]
[]
{"$rows_left_out":45}
{"sheet":"HSA118 INFINEUM","index":20,"n_rows":8,"n_cols":10,"rows_kept":8,"cut":false,"hidden":false,"merged":[]}
[]
[null,"date chargement","date livraison","HSS Delivery","Delivery Innospec","Infineum Ref","citerne","Transporteur","Seals Number","Quantité"]
[null,"2018-01-02","2018-01-03",72449062,"70015254","4502880677","BY935MY","XPOLOGISTICS","543617-18-19-20",25600]
[null,"2018-09-13","2018-09-14",72556301,"70024876",null,"EF395XY-CUVE2"]
[null,"2018-10-22","2018-10-24",72598184,"70027064","4500087330","EG275BM"]
[null,"2018-10-24","2018-10-26",72598185,"70027173","4500879331","ET802FZ"]
{"$rows_left_out":3}
{"sheet":"ZDGN HSA118 INFINEUM","index":21,"n_rows":99,"n_cols":9,"rows_kept":99,"cut":false,"hidden":false,"merged":[[91,2,91,7],[92,2,92,8],[93,2,93,8],[95,1,95,6],[98,1,98,7],[76,1,76,7],[63,1,63,4],[64,2,64,7],[65,2,65,7],[66,2,66,7],[67,2,67,7],[69,2,69,7],[70,2,70,7],[71,2,71,7],[74,1,74,7],[75,1,75,7],[68,2,68,7],[86,2,86,8],[88,2,88,8],[89,2,89,7],[90,2,90,7],[78,2,78,7],[79,2,79,8],[80,2,80,7],[81,2,81,7],[82,2,82,7],[83,2,83,7],[84,2,84,7],[85,2,85,8],[62,2,62,7],[52,1,52,2],[53,0,53,1],[53,2,53,3],[53,5,53,6],[55,0,55,3],[55,6,55,7],[57,1,57,7],[58,1,58,7],[59,2,59,7],[60,2,60,7],[61,2,61,7],[51,0,51,1],[43,7,43,8],[45,0,45,1],[45,4,45,5],[45,6,46,6],[45,7,46,7],[46,0,46,1],[46,2,47,3],[48,0,49,1],[48,2,48,4],[48,5,48,7],[50,0,50,1],[50,2,50,3],[37,6,38,6],[38,0,38,1],[38,3,44,5],[39,0,39,1],[40,0,40,1],[41,0,41,1],[37,0,37,1],[37,3,37,5],[24,0,36,0],[24,2,24,3],[24,6,25,6],[24,7,25,7],[25,1,25,4],[26,1,26,2],[27,7,27,8],[36,1,36,4],[27,3,27,4],[28,1,29,4],[30,1,35,4],[15,5,15,6],[16,1,16,2],[16,5,16,6],[20,1,20,2],[3,1,3,2],[3,5,3,6],[0,1,0,2],[0,3,0,6],[1,5,1,6],[2,1,2,2],[23,3,23,4],[23,5,23,8],[2,7,2,8],[22,5,22,6],[4,1,4,2],[4,7,4,8],[7,5,7,6],[8,1,8,2],[10,1,10,3],[11,1,11,3],[11,5,11,6],[15,1,15,2]]}
[null,"DANGEROUS GOODS DECLARATION, SHIPPING NOTE & CONTAINER/VEHICULE PACKING CERTIFICATE © SITPRO 1995",null,"           DANGEROUS GOOD NOTE",null,null,null,"1 / 1"]
[null,"Exporter",null,null,1,"Customs reference/status",null,null,2]
[null,"Huntsman Holland BV St.Mihiel"]
[null,"BP . 19 - ZI de HAN-sur-Meuse",null,null,null,"Booking number",null,"Exporter's reference",4]
[null,"55300 Saint Mihiel"]
[null,{"$f":"UPPER(\"france\")","v":"FRANCE"},null,null,null,null,null,"Forwarder's reference",5]
{"$rows_left_out":94}
{"sheet":"BL HSA118 ENI","index":22,"n_rows":48,"n_cols":9,"rows_kept":48,"cut":false,"hidden":false,"merged":[[0,4,0,6],[0,7,0,8],[1,4,1,6],[1,7,1,8],[6,1,6,2],[6,4,6,5],[6,7,6,8],[7,1,7,2],[7,4,7,5],[7,7,7,8],[9,1,9,2],[13,1,13,3],[47,1,47,8],[14,1,14,3],[18,7,18,8],[21,7,21,8],[45,1,45,8],[46,1,46,8]]}
[null,"Huntsman Holland B.V.",null,null,"HUNTSMAN",null,null,{"$f":"TODAY()","v":"2019-10-23"}]
[null,"Merseyweg 10",null,null,"Enriching lives through Innovation",null,null,"Delivery Note"]
[null,"P.O. Box 1020"]
[null,"3180 AA Rozenburg"]
[null,"Netherlands"]
[]
{"$rows_left_out":43}
{"sheet":"HSA118 ENI","index":23,"n_rows":8,"n_cols":10,"rows_kept":8,"cut":false,"hidden":false,"merged":[]}
[]
[null,"date chargement","date livraison","HSS Delivery","Delivery Innospec","Eni ROBASSOMERO Ref","citerne","Transporteur","Seals Number","Quantité"]
[null,"2018-01-02","2018-01-03",72449062,"70015254","550","BW705NF","XPOLOGISTICS","543617-18-19-20",25600]
[null,"2018-10-10","2018-10-12",72598181,null,"5500012640"]
[null,"2018-10-17","2018-10-19",72598183,"70026764","5500012640","BY038MZ"]
[null,"2018-11-19","2018-11-21",72515006,"70028099","5500012640","BW635ND"]
{"$rows_left_out":3}
{"sheet":"ZDGN HSA118 ENI","index":24,"n_rows":99,"n_cols":9,"rows_kept":99,"cut":false,"hidden":false,"merged":[[91,2,91,7],[92,2,92,8],[93,2,93,8],[95,1,95,6],[98,1,98,7],[76,1,76,7],[63,1,63,4],[64,2,64,7],[65,2,65,7],[66,2,66,7],[67,2,67,7],[69,2,69,7],[70,2,70,7],[71,2,71,7],[74,1,74,7],[75,1,75,7],[68,2,68,7],[86,2,86,8],[88,2,88,8],[89,2,89,7],[90,2,90,7],[78,2,78,7],[79,2,79,8],[80,2,80,7],[81,2,81,7],[82,2,82,7],[83,2,83,7],[84,2,84,7],[85,2,85,8],[62,2,62,7],[52,1,52,2],[53,0,53,1],[53,2,53,3],[53,5,53,6],[55,0,55,3],[55,6,55,7],[57,1,57,7],[58,1,58,7],[59,2,59,7],[60,2,60,7],[61,2,61,7],[51,0,51,1],[41,0,41,1],[43,7,43,8],[45,0,45,1],[45,4,45,5],[45,6,46,6],[45,7,46,7],[46,0,46,1],[46,2,47,3],[48,0,49,1],[48,2,48,4],[48,5,48,7],[50,0,50,1],[50,2,50,3],[32,1,32,4],[37,0,37,1],[37,3,37,5],[37,6,38,6],[38,0,38,1],[38,3,44,5],[39,0,39,1],[40,0,40,1],[3,1,3,2],[3,5,3,6],[23,3,23,4],[23,5,23,8],[24,0,36,0],[24,2,24,3],[24,6,25,6],[24,7,25,7],[25,1,25,4],[26,1,26,2],[27,3,27,4],[27,7,27,8],[28,1,29,4],[36,1,36,4],[30,1,30,4],[31,1,31,3],[22,5,22,6],[4,1,4,2],[4,7,4,8],[7,5,7,6],[10,1,10,3],[11,1,11,3],[11,5,11,6],[15,1,15,2],[15,5,15,6],[16,1,16,2],[16,5,16,6],[20,1,20,2],[0,1,0,2],[0,3,0,6],[1,5,1,6],[2,1,2,2],[2,7,2,8]]}
[null,"DANGEROUS GOODS DECLARATION, SHIPPING NOTE & CONTAINER/VEHICULE PACKING CERTIFICATE © SITPRO 1995",null,"           DANGEROUS GOOD NOTE",null,null,null,"1 / 1"]
[null,"Exporter",null,null,1,"Customs reference/status",null,null,2]
[null,"Huntsman Holland BV St.Mihiel"]
[null,"BP . 19 - ZI de HAN-sur-Meuse",null,null,null,"Booking number",null,"Exporter's reference",4]
[null,"55300 Saint Mihiel"]
[null,{"$f":"UPPER(\"france\")","v":"FRANCE"},null,null,null,null,null,"Forwarder's reference",5]
{"$rows_left_out":94}
{"sheet":"BL AS305BD CHEVRON","index":25,"n_rows":48,"n_cols":9,"rows_kept":48,"cut":false,"hidden":false,"merged":[[14,1,14,3],[0,4,0,6],[0,7,0,8],[1,4,1,6],[1,7,1,8],[6,1,6,2],[6,4,6,5],[6,7,6,8],[7,1,7,2],[7,4,7,5],[7,7,7,8],[9,1,9,2],[13,1,13,3],[18,7,18,8],[21,7,21,8],[45,1,45,8],[46,1,46,8],[47,1,47,8]]}
[null,"Huntsman Holland B.V.",null,null,"HUNTSMAN",null,null,{"$f":"TODAY()","v":"2019-10-23"}]
[null,"Merseyweg 10",null,null,"Enriching lives through Innovation",null,null,"Delivery Note"]
[null,"P.O. Box 1020"]
[null,"3180 AA Rozenburg"]
[null,"Netherlands"]
[]
{"$rows_left_out":43}
{"sheet":"AS305BD CHEVRON","index":26,"n_rows":6,"n_cols":10,"rows_kept":6,"cut":false,"hidden":false,"merged":[]}
[]
[null,"date chargement","date livraison","HSS Delivery","Delivery Innospec","CHEVRON  Ref","citerne","Transporteur","Seals Number","Quantité"]
[null,"2018-01-02","2018-01-03",72449062,"70015254","450","TASU","XPOLOGISTICS","543617-18-19-20",25600]
[null,"2018-09-15",null,725883069,"70025363","4500226158/00020","BY701KZ"]
[null,"2018-09-15","2018-09-18",72583071,"70025429","4500226158/00040","BA507NW"]
[null,"2018-09-16",null,72583072,"70025442","4500226158/00050","BX028CD"]
{"$rows_left_out":1}
{"sheet":"ZDGN AS305BD CHEVRON","index":27,"n_rows":0,"n_cols":0,"rows_kept":0,"cut":false,"hidden":false,"merged":[]}

{"sheet":"BL AS305BD ALKION","index":28,"n_rows":48,"n_cols":9,"rows_kept":48,"cut":false,"hidden":false,"merged":[[18,7,18,8],[21,7,21,8],[45,1,45,8],[46,1,46,8],[47,1,47,8],[26,4,26,5],[14,1,14,3],[0,4,0,6],[0,7,0,8],[1,4,1,6],[1,7,1,8],[6,1,6,2],[6,4,6,5],[6,7,6,8],[7,1,7,2],[7,4,7,5],[7,7,7,8],[9,1,9,2],[13,1,13,3]]}
[null,"Huntsman Holland B.V.",null,null,"HUNTSMAN",null,null,{"$f":"TODAY()","v":"2019-10-23"}]
[null,"Merseyweg 10",null,null,"Enriching lives through Innovation",null,null,"Delivery Note"]
[null,"P.O. Box 1020"]
[null,"3180 AA Rozenburg"]
[null,"Netherlands"]
[]
{"$rows_left_out":43}
{"sheet":"AS305BD ALKION","index":29,"n_rows":6,"n_cols":10,"rows_kept":6,"cut":false,"hidden":false,"merged":[]}
[]
[null,"date chargement","date livraison","HSS Delivery","Delivery Innospec","ALKION  Ref","citerne","Transporteur","Seals Number","Quantité"]
[null,"2018-01-02","2018-01-03",72449062,"70015254","450","INGU","XPOLOGISTICS","543617-18-19-20",25600]
[null,"2018-09-15","2018-09-17",72583068,"70025362","4500226158","BX158NB CUVE 2"]
[null,"2018-09-17","2018-09-18",72583074,"70025511","4500226158","EF128XY CUVE 2"]
[null,"2018-09-16",null,72583078,"70025535","4500226158/00070","BW692NB"]
{"$rows_left_out":1}
{"sheet":"ZDGN AS305BD ALKION","index":30,"n_rows":99,"n_cols":9,"rows_kept":99,"cut":false,"hidden":false,"merged":[[0,1,0,2],[0,3,0,6],[1,5,1,6],[2,1,2,2],[2,7,2,8],[22,5,22,6],[4,1,4,2],[4,7,4,8],[7,5,7,6],[10,1,10,3],[11,1,11,3],[11,5,11,6],[15,1,15,2],[15,5,15,6],[16,1,16,2],[16,5,16,6],[20,1,20,2],[3,1,3,2],[3,5,3,6],[23,3,23,4],[23,5,23,8],[24,0,36,0],[24,2,24,3],[24,6,25,6],[24,7,25,7],[25,1,25,4],[26,1,26,2],[27,3,27,4],[27,7,27,8],[28,1,29,4],[30,1,30,4],[31,1,31,3],[32,1,32,4],[36,1,36,4],[37,6,38,6],[38,0,38,1],[38,3,44,5],[39,0,39,1],[40,0,40,1],[41,0,41,1],[37,0,37,1],[37,3,37,5],[51,0,51,1],[43,7,43,8],[45,0,45,1],[45,4,45,5],[45,6,46,6],[45,7,46,7],[46,0,46,1],[46,2,47,3],[48,0,49,1],[48,2,48,4],[48,5,48,7],[50,0,50,1],[50,2,50,3],[62,2,62,7],[52,1,52,2],[53,0,53,1],[53,2,53,3],[53,5,53,6],[55,0,55,3],[55,6,55,7],[57,1,57,7],[58,1,58,7],[59,2,59,7],[60,2,60,7],[61,2,61,7],[76,1,76,7],[63,1,63,4],[64,2,64,7],[65,2,65,7],[66,2,66,7],[67,2,67,7],[68,2,68,7],[69,2,69,7],[70,2,70,7],[71,2,71,7],[74,1,74,7],[75,1,75,7],[90,2,90,7],[78,2,78,7],[79,2,79,8],[80,2,80,7],[81,2,81,7],[82,2,82,7],[83,2,83,7],[84,2,84,7],[85,2,85,8],[86,2,86,8],[88,2,88,8],[89,2,89,7],[91,2,91,7],[92,2,92,8],[93,2,93,8],[95,1,95,6],[98,1,98,7]]}
[null,"DANGEROUS GOODS DECLARATION, SHIPPING NOTE & CONTAINER/VEHICULE PACKING CERTIFICATE © SITPRO 1995",null,"           DANGEROUS GOOD NOTE",null,null,null,"1 / 1"]
[null,"Exporter",null,null,1,"Customs reference/status",null,null,2]
[null,"Huntsman Holland BV St.Mihiel",null,null,null,null,null,70015254]
[null,"BP . 19 - ZI de HAN-sur-Meuse",null,null,null,"Booking number",null,"Exporter's reference",4]
[null,"55300 Saint Mihiel",null,null,null,null,null,72449062]
[null,{"$f":"UPPER(\"france\")","v":"FRANCE"},null,null,null,null,null,"Forwarder's reference",5]
{"$rows_left_out":94}
{"sheet":"BL HSA118 VISCOL","index":31,"n_rows":48,"n_cols":9,"rows_kept":48,"cut":false,"hidden":false,"merged":[[18,7,18,8],[21,7,21,8],[45,1,45,8],[46,1,46,8],[47,1,47,8],[14,1,14,3],[0,4,0,6],[0,7,0,8],[1,4,1,6],[1,7,1,8],[6,1,6,2],[6,4,6,5],[6,7,6,8],[7,1,7,2],[7,4,7,5],[7,7,7,8],[9,1,9,2],[13,1,13,3]]}
[null,"Huntsman Holland B.V.",null,null,"HUNTSMAN",null,null,{"$f":"TODAY()","v":"2019-10-23"}]
[null,"Merseyweg 10",null,null,"Enriching lives through Innovation",null,null,"Delivery Note"]
[null,"P.O. Box 1020"]
[null,"3180 AA Rozenburg"]
[null,"Netherlands"]
[]
{"$rows_left_out":43}
{"sheet":"HSA118 VISCOL","index":32,"n_rows":3,"n_cols":10,"rows_kept":3,"cut":false,"hidden":false,"merged":[]}
[]
[null,"date chargement","date livraison","HSS Delivery","Delivery Innospec","VISCOL  Ref","citerne","Transporteur","Seals Number","Quantité"]
[null,"2018-01-02","2018-01-03",72449062,"70015254","450","BW535NE","XPOLOGISTICS","543617-18-19-20",25600]

{"sheet":"ZDGN HSA118 VISCOL","index":33,"n_rows":0,"n_cols":0,"rows_kept":0,"cut":false,"hidden":false,"merged":[]}