{"text_format":"1","workbook":"xlsx","n_sheets":4,"sheets":["DG","Trimestre","Donnees","PageMaitre"],"not_rendered":{"charts":0,"images":1,"macros":1,"external_links":0,"defined_names":25,"comments":0,"pivot_tables":0},"unopened":[],"bounds":{"document_bytes":16777216,"sheet_cells":100000,"rows_first":2000,"rows_last":500,"rows_between":2000,"halvings":0,"cell_chars":16384,"cell_head_chars":4096},"cells_cut":0,"cells_raw":0,"read":"whole","date_system":"1900"}

{"sheet":"DG","index":0,"n_rows":1000,"n_cols":13,"rows_kept":1000,"cut":false,"hidden":false,"merged":[[5,12,11,12],[4,0,4,2],[5,10,11,11],[13,0,13,9]]}
[null,null,null,"ZONE DE CRITÈRES"]
["No","Objectifs stratégiques","Objectifs annuels","Actions","Cadre responsable","Cadre soutien1","Cadre soutien2","Cadre soutien3","Début","Fin"]
[null,null,null,"DG"]
[]
[null,null,null," "]
[null,null,null,null,null,null,null,null,null,null,{"$f":"Trimestre!D2","v":"T2"}]
[]
[]
[]
[]
[]
[]
[]
[{"$f":"IF($D$3=\"\", \"MODÈLE\",$D$3)","v":"DG"}]
["No","Objectifs stratégiques","Objectifs annuels","Actions","Cadre responsable","Cadre soutien1","Cadre soutien2","Cadre soutien3","Début","Fin","Statut","Trimestre","COMMENTAIRES"]
["2.4","Faire évoluer de façon cohérente l'ensemble de l'offre de formation au régulier et à la formation continue.","Texte1","DG","Denis  ",null,null,null,"T1","T2","Réalisé",{"$f":"IF($J16=\"\",\"\",IF($I16>Trimestre!$D$2,\"Non débuté\",IF(Trimestre!$D$2>$J16,\"Terminé\",\"Courant\")))","v":"Courant"}]
["5.1","Mieux structurer les projets de développement.","Texte1","DG","Denis ",null,null,null,"T1","T2",{"$f":"IF($J17=\"\",\"\",IF($L17=\"Courant\",Donnees!$A$3,IF($L17=\"terminé\",Donnees!$A$4,IF($L18=\"Non débuté\",\"\"))))","v":"En cours"},{"$f":"IF($J17=\"\",\"\",IF($I17>Trimestre!$D$2,\"Non débuté\",IF(Trimestre!$D$2>$J17,\"Terminé\",\"Courant\")))","v":"Courant"}]
["5.2","Analyser régulièrement l'efficacité des processus stratégiques.","Texte 2","DG","Denis",null,null,null,"T1","T2",{"$f":"IF($J18=\"\",\"\",IF($L18=\"Courant\",Donnees!$A$3,IF($L18=\"terminé\",Donnees!$A$4,IF($L19=\"Non débuté\",\"\"))))","v":"En cours"},{"$f":"IF($J18=\"\",\"\",IF($I18>Trimestre!$D$2,\"Non débuté\",IF(Trimestre!$D$2>$J18,\"Terminé\",\"Courant\")))","v":"Courant"}]
["5.3","Revoir les rôles et responsabilités au regard des objectifs du présent plan stratégique.","Texte 3","DG","Denis",null,null,null,"T1","T2",{"$f":"IF($J19=\"\",\"\",IF($L19=\"Courant\",Donnees!$A$3,IF($L19=\"terminé\",Donnees!$A$4,IF($L20=\"Non débuté\",\"\"))))","v":"En cours"},{"$f":"IF($J19=\"\",\"\",IF($I19>Trimestre!$D$2,\"Non débuté\",IF(Trimestre!$D$2>$J19,\"Terminé\",\"Courant\")))","v":"Courant"}]
[null,null,null,null,null,null,null,null,null,null,{"$f":"IF($J20=\"\",\"\",IF($L20=\"Courant\",Donnees!$A$3,IF($L20=\"terminé\",Donnees!$A$4,IF($L21=\"Non débuté\",\"\"))))","v":""},{"$f":"IF($J20=\"\",\"\",IF($I20>Trimestre!$D$2,\"Non débuté\",IF(Trimestre!$D$2>$J20,\"Terminé\",\"Courant\")))","v":""},{"$f":"COUNTIF($K$15:$K$100000,\"><\")","v":5}]
[null,null,null,null,null,null,null,null,null,null,{"$f":"IF($J21=\"\",\"\",IF($L21=\"Courant\",Donnees!$A$3,IF($L21=\"terminé\",Donnees!$A$4,IF($L22=\"Non débuté\",\"\"))))","v":""},{"$f":"IF($J21=\"\",\"\",IF($I21>Trimestre!$D$2,\"Non débuté\",IF(Trimestre!$D$2>$J21,\"Terminé\",\"Courant\")))","v":""},{"$f":"OFFSET(DG!$A$1:$L$1,,,COUNTIF($K$15:$K$100000,\"><\")+14)","v":{"$error":"#VALUE!"}}]
[null,null,null,null,null,null,null,null,null,null,{"$f":"IF($J22=\"\",\"\",IF($L22=\"Courant\",Donnees!$A$3,IF($L22=\"terminé\",Donnees!$A$4,IF($L23=\"Non débuté\",\"\"))))","v":""},{"$f":"IF($J22=\"\",\"\",IF($I22>Trimestre!$D$2,\"Non débuté\",IF(Trimestre!$D$2>$J22,\"Terminé\",\"Courant\")))","v":""}]
[null,null,null,null,null,null,null,null,null,null,{"$f":"IF($J23=\"\",\"\",IF($L23=\"Courant\",Donnees!$A$3,IF($L23=\"terminé\",Donnees!$A$4,IF($L24=\"Non débuté\",\"\"))))","v":""},{"$f":"IF($J23=\"\",\"\",IF($I23>Trimestre!$D$2,\"Non débuté\",IF(Trimestre!$D$2>$J23,\"Terminé\",\"Courant\")))","v":""}]
[null,null,null,null,null,null,null,null,null,null,{"$f":"IF($J24=\"\",\"\",IF($L24=\"Courant\",Donnees!$A$3,IF($L24=\"terminé\",Donnees!$A$4,IF($L25=\"Non débuté\",\"\"))))","v":""},{"$f":"IF($J24=\"\",\"\",IF($I24>Trimestre!$D$2,\"Non débuté\",IF(Trimestre!$D$2>$J24,\"Terminé\",\"Courant\")))","v":""}]
[null,null,null,null,null,null,null,null,null,null,{"$f":"IF($J25=\"\",\"\",IF($L25=\"Courant\",Donnees!$A$3,IF($L25=\"terminé\",Donnees!$A$4,IF($L26=\"Non débuté\",\"\"))))","v":""},{"$f":"IF($J25=\"\",\"\",IF($I25>Trimestre!$D$2,\"Non débuté\",IF(Trimestre!$D$2>$J25,\"Terminé\",\"Courant\")))","v":""}]
[null,null,null,null,null,null,null,null,null,null,{"$f":"IF($J26=\"\",\"\",IF($L26=\"Courant\",Donnees!$A$3,IF($L26=\"terminé\",Donnees!$A$4,IF($L27=\"Non débuté\",\"\"))))","v":""},{"$f":"IF($J26=\"\",\"\",IF($I26>Trimestre!$D$2,\"Non débuté\",IF(Trimestre!$D$2>$J26,\"Terminé\",\"Courant\")))","v":""}]
[null,null,null,null,null,null,null,null,null,null,{"$f":"IF($J27=\"\",\"\",IF($L27=\"Courant\",Donnees!$A$3,IF($L27=\"terminé\",Donnees!$A$4,IF($L28=\"Non débuté\",\"\"))))","v":""},{"$f":"IF($J27=\"\",\"\",IF($I27>Trimestre!$D$2,\"Non débuté\",IF(Trimestre!$D$2>$J27,\"Terminé\",\"Courant\")))","v":""}]
[null,null,null,null,null,null,null,null,null,null,{"$f":"IF($J28=\"\",\"\",IF($L28=\"Courant\",Donnees!$A$3,IF($L28=\"terminé\",Donnees!$A$4,IF($L29=\"Non débuté\",\"\"))))","v":""},{"$f":"IF($J28=\"\",\"\",IF($I28>Trimestre!$D$2,\"Non débuté\",IF(Trimestre!$D$2>$J28,\"Terminé\",\"Courant\")))","v":""}]
[null,null,null,null,null,null,null,null,null,null,{"$f":"IF($J29=\"\",\"\",IF($L29=\"Courant\",Donnees!$A$3,IF($L29=\"terminé\",Donnees!$A$4,IF($L30=\"Non débuté\",\"\"))))","v":""},{"$f":"IF($J29=\"\",\"\",IF($I29>Trimestre!$D$2,\"Non débuté\",IF(Trimestre!$D$2>$J29,\"Terminé\",\"Courant\")))","v":""}]
[null,null,null,null,null,null,null,null,null,null,{"$f":"IF($J30=\"\",\"\",IF($L30=\"Courant\",Donnees!$A$3,IF($L30=\"terminé\",Donnees!$A$4,IF($L31=\"Non débuté\",\"\"))))","v":""},{"$f":"IF($J30=\"\",\"\",IF($I30>Trimestre!$D$2,\"Non débuté\",IF(Trimestre!$D$2>$J30,\"Terminé\",\"Courant\")))","v":""}]
[null,null,null,null,null,null,null,null,null,null,{"$f":"IF($J31=\"\",\"\",IF($L31=\"Courant\",Donnees!$A$3,IF($L31=\"terminé\",Donnees!$A$4,IF($L32=\"Non débuté\",\"\"))))","v":""},{"$f":"IF($J31=\"\",\"\",IF($I31>Trimestre!$D$2,\"Non débuté\",IF(Trimestre!$D$2>$J31,\"Terminé\",\"Courant\")))","v":""}]
[null,null,null,null,null,null,null,null,null,null,{"$f":"IF($J32=\"\",\"\",IF($L32=\"Courant\",Donnees!$A$3,IF($L32=\"terminé\",Donnees!$A$4,IF($L33=\"Non débuté\",\"\"))))","v":""},{"$f":"IF($J32=\"\",\"\",IF($I32>Trimestre!$D$2,\"Non débuté\",IF(Trimestre!$D$2>$J32,\"Terminé\",\"Courant\")))","v":""}]
[null,null,null,null,null,null,null,null,null,null,{"$f":"IF($J33=\"\",\"\",IF($L33=\"Courant\",Donnees!$A$3,IF($L33=\"terminé\",Donnees!$A$4,IF($L34=\"Non débuté\",\"\"))))","v":""},{"$f":"IF($J33=\"\",\"\",IF($I33>Trimestre!$D$2,\"Non débuté\",IF(Trimestre!$D$2>$J33,\"Terminé\",\"Courant\")))","v":""}]
[null,null,null,null,null,null,null,null,null,null,{"$f":"IF($J34=\"\",\"\",IF($L34=\"Courant\",Donnees!$A$3,IF($L34=\"terminé\",Donnees!$A$4,IF($L35=\"Non débuté\",\"\"))))","v":""},{"$f":"IF($J34=\"\",\"\",IF($I34>Trimestre!$D$2,\"Non débuté\",IF(Trimestre!$D$2>$J34,\"Terminé\",\"Courant\")))","v":""}]
[null,null,null,null,null,null,null,null,null,null,{"$f":"IF($J35=\"\",\"\",IF($L35=\"Courant\",Donnees!$A$3,IF($L35=\"terminé\",Donnees!$A$4,IF($L36=\"Non débuté\",\"\"))))","v":""},{"$f":"IF($J35=\"\",\"\",IF($I35>Trimestre!$D$2,\"Non débuté\",IF(Trimestre!$D$2>$J35,\"Terminé\",\"Courant\")))","v":""}]
[null,null,null,null,null,null,null,null,null,null,{"$f":"IF($J36=\"\",\"\",IF($L36=\"Courant\",Donnees!$A$3,IF($L36=\"terminé\",Donnees!$A$4,IF($L37=\"Non débuté\",\"\"))))","v":""},{"$f":"IF($J36=\"\",\"\",IF($I36>Trimestre!$D$2,\"Non débuté\",IF(Trimestre!$D$2>$J36,\"Terminé\",\"Courant\")))","v":""}]
[null,null,null,null,null,null,null,null,null,null,{"$f":"IF($J37=\"\",\"\",IF($L37=\"Courant\",Donnees!$A$3,IF($L37=\"terminé\",Donnees!$A$4,IF($L38=\"Non débuté\",\"\"))))","v":""},{"$f":"IF($J37=\"\",\"\",IF($I37>Trimestre!$D$2,\"Non débuté\",IF(Trimestre!$D$2>$J37,\"Terminé\",\"Courant\")))","v":""}]
[null,null,null,null,null,null,null,null,null,null,{"$f":"IF($J38=\"\",\"\",IF($L38=\"Courant\",Donnees!$A$3,IF($L38=\"terminé\",Donnees!$A$4,IF($L39=\"Non débuté\",\"\"))))","v":""},{"$f":"IF($J38=\"\",\"\",IF($I38>Trimestre!$D$2,\"Non débuté\",IF(Trimestre!$D$2>$J38,\"Terminé\",\"Courant\")))","v":""}]
[null,null,null,null,null,null,null,null,null,null,{"$f":"IF($J39=\"\",\"\",IF($L39=\"Courant\",Donnees!$A$3,IF($L39=\"terminé\",Donnees!$A$4,IF($L40=\"Non débuté\",\"\"))))","v":""},{"$f":"IF($J39=\"\",\"\",IF($I39>Trimestre!$D$2,\"Non débuté\",IF(Trimestre!$D$2>$J39,\"Terminé\",\"Courant\")))","v":""}]
[null,null,null,null,null,null,null,null,null,null,{"$f":"IF($J40=\"\",\"\",IF($L40=\"Courant\",Donnees!$A$3,IF($L40=\"terminé\",Donnees!$A$4,IF($L41=\"Non débuté\",\"\"))))","v":""},{"$f":"IF($J40=\"\",\"\",IF($I40>Trimestre!$D$2,\"Non débuté\",IF(Trimestre!$D$2>$J40,\"Terminé\",\"Courant\")))","v":""}]
[null,null,null,null,null,null,null,null,null,null,{"$f":"IF($J41=\"\",\"\",IF($L41=\"Courant\",Donnees!$A$3,IF($L41=\"terminé\",Donnees!$A$4,IF($L42=\"Non débuté\",\"\"))))","v":""},{"$f":"IF($J41=\"\",\"\",IF($I41>Trimestre!$D$2,\"Non débuté\",IF(Trimestre!$D$2>$J41,\"Terminé\",\"Courant\")))","v":""}]
[null,null,null,null,null,null,null,null,null,null,{"$f":"IF($J42=\"\",\"\",IF($L42=\"Courant\",Donnees!$A$3,IF($L42=\"terminé\",Donnees!$A$4,IF($L43=\"Non débuté\",\"\"))))","v":""},{"$f":"IF($J42=\"\",\"\",IF($I42>Trimestre!$D$2,\"Non débuté\",IF(Trimestre!$D$2>$J42,\"Terminé\",\"Courant\")))","v":""}]
[null,null,null,null,null,null,null,null,null,null,{"$f":"IF($J43=\"\",\"\",IF($L43=\"Courant\",Donnees!$A$3,IF($L43=\"terminé\",Donnees!$A$4,IF($L44=\"Non débuté\",\"\"))))","v":""},{"$f":"IF($J43=\"\",\"\",IF($I43>Trimestre!$D$2,\"Non débuté\",IF(Trimestre!$D$2>$J43,\"Terminé\",\"Courant\")))","v":""}]
[null,null,null,null,null,null,null,null,null,null,{"$f":"IF($J44=\"\",\"\",IF($L44=\"Courant\",Donnees!$A$3,IF($L44=\"terminé\",Donnees!$A$4,IF($L45=\"Non débuté\",\"\"))))","v":""},{"$f":"IF($J44=\"\",\"\",IF($I44>Trimestre!$D$2,\"Non débuté\",IF(Trimestre!$D$2>$J44,\"Terminé\",\"Courant\")))","v":""}]
[null,null,null,null,null,null,null,null,null,null,{"$f":"IF($J45=\"\",\"\",IF($L45=\"Courant\",Donnees!$A$3,IF($L45=\"terminé\",Donnees!$A$4,IF($L46=\"Non débuté\",\"\"))))","v":""},{"$f":"IF($J45=\"\",\"\",IF($I45>Trimestre!$D$2,\"Non débuté\",IF(Trimestre!$D$2>$J45,\"Terminé\",\"Courant\")))","v":""}]
[null,null,null,null,null,null,null,null,null,null,{"$f":"IF($J46=\"\",\"\",IF($L46=\"Courant\",Donnees!$A$3,IF($L46=\"terminé\",Donnees!$A$4,IF($L47=\"Non débuté\",\"\"))))","v":""},{"$f":"IF($J46=\"\",\"\",IF($I46>Trimestre!$D$2,\"Non débuté\",IF(Trimestre!$D$2>$J46,\"Terminé\",\"Courant\")))","v":""}]
[null,null,null,null,null,null,null,null,null,null,{"$f":"IF($J47=\"\",\"\",IF($L47=\"Courant\",Donnees!$A$3,IF($L47=\"terminé\",Donnees!$A$4,IF($L48=\"Non débuté\",\"\"))))","v":""},{"$f":"IF($J47=\"\",\"\",IF($I47>Trimestre!$D$2,\"Non débuté\",IF(Trimestre!$D$2>$J47,\"Terminé\",\"Courant\")))","v":""}]
[null,null,null,null,null,null,null,null,null,null,{"$f":"IF($J48=\"\",\"\",IF($L48=\"Courant\",Donnees!$A$3,IF($L48=\"terminé\",Donnees!$A$4,IF($L49=\"Non débuté\",\"\"))))","v":""},{"$f":"IF($J48=\"\",\"\",IF($I48>Trimestre!$D$2,\"Non débuté\",IF(Trimestre!$D$2>$J48,\"Terminé\",\"Courant\")))","v":""}]
[null,null,null,null,null,null,null,null,null,null,{"$f":"IF($J49=\"\",\"\",IF($L49=\"Courant\",Donnees!$A$3,IF($L49=\"terminé\",Donnees!$A$4,IF($L50=\"Non débuté\",\"\"))))","v":""},{"$f":"IF($J49=\"\",\"\",IF($I49>Trimestre!$D$2,\"Non débuté\",IF(Trimestre!$D$2>$J49,\"Terminé\",\"Courant\")))","v":""}]
[null,null,null,null,null,null,null,null,null,null,{"$f":"IF($J50=\"\",\"\",IF($L50=\"Courant\",Donnees!$A$3,IF($L50=\"terminé\",Donnees!$A$4,IF($L51=\"Non débuté\",\"\"))))","v":""},{"$f":"IF($J50=\"\",\"\",IF($I50>Trimestre!$D$2,\"Non débuté\",IF(Trimestre!$D$2>$J50,\"Terminé\",\"Courant\")))","v":""}]
[null,null,null,null,null,null,null,null,null,null,{"$f":"IF($J51=\"\",\"\",IF($L51=\"Courant\",Donnees!$A$3,IF($L51=\"terminé\",Donnees!$A$4,IF($L52=\"Non débuté\",\"\"))))","v":""},{"$f":"IF($J51=\"\",\"\",IF($I51>Trimestre!$D$2,\"Non débuté\",IF(Trimestre!$D$2>$J51,\"Terminé\",\"Courant\")))","v":""}]
[null,null,null,null,null,null,null,null,null,null,{"$f":"IF($J52=\"\",\"\",IF($L52=\"Courant\",Donnees!$A$3,IF($L52=\"terminé\",Donnees!$A$4,IF($L53=\"Non débuté\",\"\"))))","v":""},{"$f":"IF($J52=\"\",\"\",IF($I52>Trimestre!$D$2,\"Non débuté\",IF(Trimestre!$D$2>$J52,\"Terminé\",\"Courant\")))","v":""}]
[null,null,null,null,null,null,null,null,null,null,{"$f":"IF($J53=\"\",\"\",IF($L53=\"Courant\",Donnees!$A$3,IF($L53=\"terminé\",Donnees!$A$4,IF($L54=\"Non débuté\",\"\"))))","v":""},{"$f":"IF($J53=\"\",\"\",IF($I53>Trimestre!$D$2,\"Non débuté\",IF(Trimestre!$D$2>$J53,\"Terminé\",\"Courant\")))","v":""}]
[null,null,null,null,null,null,null,null,null,null,{"$f":"IF($J54=\"\",\"\",IF($L54=\"Courant\",Donnees!$A$3,IF($L54=\"terminé\",Donnees!$A$4,IF($L55=\"Non débuté\",\"\"))))","v":""},{"$f":"IF($J54=\"\",\"\",IF($I54>Trimestre!$D$2,\"Non débuté\",IF(Trimestre!$D$2>$J54,\"Terminé\",\"Courant\")))","v":""}]
[null,null,null,null,null,null,null,null,null,null,{"$f":"IF($J55=\"\",\"\",IF($L55=\"Courant\",Donnees!$A$3,IF($L55=\"terminé\",Donnees!$A$4,IF($L56=\"Non débuté\",\"\"))))","v":""},{"$f":"IF($J55=\"\",\"\",IF($I55>Trimestre!$D$2,\"Non débuté\",IF(Trimestre!$D$2>$J55,\"Terminé\",\"Courant\")))","v":""}]
[null,null,null,null,null,null,null,null,null,null,{"$f":"IF($J56=\"\",\"\",IF($L56=\"Courant\",Donnees!$A$3,IF($L56=\"terminé\",Donnees!$A$4,IF($L57=\"Non débuté\",\"\"))))","v":""},{"$f":"IF($J56=\"\",\"\",IF($I56>Trimestre!$D$2,\"Non débuté\",IF(Trimestre!$D$2>$J56,\"Terminé\",\"Courant\")))","v":""}]
[null,null,null,null,null,null,null,null,null,null,{"$f":"IF($J57=\"\",\"\",IF($L57=\"Courant\",Donnees!$A$3,IF($L57=\"terminé\",Donnees!$A$4,IF($L58=\"Non débuté\",\"\"))))","v":""},{"$f":"IF($J57=\"\",\"\",IF($I57>Trimestre!$D$2,\"Non débuté\",IF(Trimestre!$D$2>$J57,\"Terminé\",\"Courant\")))","v":""}]
[null,null,null,null,null,null,null,null,null,null,{"$f":"IF($J58=\"\",\"\",IF($L58=\"Courant\",Donnees!$A$3,IF($L58=\"terminé\",Donnees!$A$4,IF($L59=\"Non débuté\",\"\"))))","v":""},{"$f":"IF($J58=\"\",\"\",IF($I58>Trimestre!$D$2,\"Non débuté\",IF(Trimestre!$D$2>$J58,\"Terminé\",\"Courant\")))","v":""}]
[null,null,null,null,null,null,null,null,null,null,{"$f":"IF($J59=\"\",\"\",IF($L59=\"Courant\",Donnees!$A$3,IF($L59=\"terminé\",Donnees!$A$4,IF($L60=\"Non débuté\",\"\"))))","v":""},{"$f":"IF($J59=\"\",\"\",IF($I59>Trimestre!$D$2,\"Non débuté\",IF(Trimestre!$D$2>$J59,\"Terminé\",\"Courant\")))","v":""}]
[null,null,null,null,null,null,null,null,null,null,{"$f":"IF($J60=\"\",\"\",IF($L60=\"Courant\",Donnees!$A$3,IF($L60=\"terminé\",Donnees!$A$4,IF($L61=\"Non débuté\",\"\"))))","v":""},{"$f":"IF($J60=\"\",\"\",IF($I60>Trimestre!$D$2,\"Non débuté\",IF(Trimestre!$D$2>$J60,\"Terminé\",\"Courant\")))","v":""}]
[null,null,null,null,null,null,null,null,null,null,{"$f":"IF($J61=\"\",\"\",IF($L61=\"Courant\",Donnees!$A$3,IF($L61=\"terminé\",Donnees!$A$4,IF($L62=\"Non débuté\",\"\"))))","v":""},{"$f":"IF($J61=\"\",\"\",IF($I61>Trimestre!$D$2,\"Non débuté\",IF(Trimestre!$D$2>$J61,\"Terminé\",\"Courant\")))","v":""}]
[null,null,null,null,null,null,null,null,null,null,{"$f":"IF($J62=\"\",\"\",IF($L62=\"Courant\",Donnees!$A$3,IF($L62=\"terminé\",Donnees!$A$4,IF($L63=\"Non débuté\",\"\"))))","v":""},{"$f":"IF($J62=\"\",\"\",IF($I62>Trimestre!$D$2,\"Non débuté\",IF(Trimestre!$D$2>$J62,\"Terminé\",\"Courant\")))","v":""}]
[null,null,null,null,null,null,null,null,null,null,{"$f":"IF($J63=\"\",\"\",IF($L63=\"Courant\",Donnees!$A$3,IF($L63=\"terminé\",Donnees!$A$4,IF($L64=\"Non débuté\",\"\"))))","v":""},{"$f":"IF($J63=\"\",\"\",IF($I63>Trimestre!$D$2,\"Non débuté\",IF(Trimestre!$D$2>$J63,\"Terminé\",\"Courant\")))","v":""}]
[null,null,null,null,null,null,null,null,null,null,{"$f":"IF($J64=\"\",\"\",IF($L64=\"Courant\",Donnees!$A$3,IF($L64=\"terminé\",Donnees!$A$4,IF($L65=\"Non débuté\",\"\"))))","v":""},{"$f":"IF($J64=\"\",\"\",IF($I64>Trimestre!$D$2,\"Non débuté\",IF(Trimestre!$D$2>$J64,\"Terminé\",\"Courant\")))","v":""}]
[null,null,null,null,null,null,null,null,null,null,{"$f":"IF($J65=\"\",\"\",IF($L65=\"Courant\",Donnees!$A$3,IF($L65=\"terminé\",Donnees!$A$4,IF($L66=\"Non débuté\",\"\"))))","v":""},{"$f":"IF($J65=\"\",\"\",IF($I65>Trimestre!$D$2,\"Non débuté\",IF(Trimestre!$D$2>$J65,\"Terminé\",\"Courant\")))","v":""}]
[null,null,null,null,null,null,null,null,null,null,{"$f":"IF($J66=\"\",\"\",IF($L66=\"Courant\",Donnees!$A$3,IF($L66=\"terminé\",Donnees!$A$4,IF($L67=\"Non débuté\",\"\"))))","v":""},{"$f":"IF($J66=\"\",\"\",IF($I66>Trimestre!$D$2,\"Non débuté\",IF(Trimestre!$D$2>$J66,\"Terminé\",\"Courant\")))","v":""}]
[null,null,null,null,null,null,null,null,null,null,{"$f":"IF($J67=\"\",\"\",IF($L67=\"Courant\",Donnees!$A$3,IF($L67=\"terminé\",Donnees!$A$4,IF($L68=\"Non débuté\",\"\"))))","v":""},{"$f":"IF($J67=\"\",\"\",IF($I67>Trimestre!$D$2,\"Non débuté\",IF(Trimestre!$D$2>$J67,\"Terminé\",\"Courant\")))","v":""}]
[null,null,null,null,null,null,null,null,null,null,{"$f":"IF($J68=\"\",\"\",IF($L68=\"Courant\",Donnees!$A$3,IF($L68=\"terminé\",Donnees!$A$4,IF($L69=\"Non débuté\",\"\"))))","v":""},{"$f":"IF($J68=\"\",\"\",IF($I68>Trimestre!$D$2,\"Non débuté\",IF(Trimestre!$D$2>$J68,\"Terminé\",\"Courant\")))","v":""}]
[null,null,null,null,null,null,null,null,null,null,{"$f":"IF($J69=\"\",\"\",IF($L69=\"Courant\",Donnees!$A$3,IF($L69=\"terminé\",Donnees!$A$4,IF($L70=\"Non débuté\",\"\"))))","v":""},{"$f":"IF($J69=\"\",\"\",IF($I69>Trimestre!$D$2,\"Non débuté\",IF(Trimestre!$D$2>$J69,\"Terminé\",\"Courant\")))","v":""}]
[null,null,null,null,null,null,null,null,null,null,{"$f":"IF($J70=\"\",\"\",IF($L70=\"Courant\",Donnees!$A$3,IF($L70=\"terminé\",Donnees!$A$4,IF($L71=\"Non débuté\",\"\"))))","v":""},{"$f":"IF($J70=\"\",\"\",IF($I70>Trimestre!$D$2,\"Non débuté\",IF(Trimestre!$D$2>$J70,\"Terminé\",\"Courant\")))","v":""}]
[null,null,null,null,null,null,null,null,null,null,{"$f":"IF($J71=\"\",\"\",IF($L71=\"Courant\",Donnees!$A$3,IF($L71=\"terminé\",Donnees!$A$4,IF($L72=\"Non débuté\",\"\"))))","v":""},{"$f":"IF($J71=\"\",\"\",IF($I71>Trimestre!$D$2,\"Non débuté\",IF(Trimestre!$D$2>$J71,\"Terminé\",\"Courant\")))","v":""}]
[null,null,null,null,null,null,null,null,null,null,{"$f":"IF($J72=\"\",\"\",IF($L72=\"Courant\",Donnees!$A$3,IF($L72=\"terminé\",Donnees!$A$4,IF($L73=\"Non débuté\",\"\"))))","v":""},{"$f":"IF($J72=\"\",\"\",IF($I72>Trimestre!$D$2,\"Non débuté\",IF(Trimestre!$D$2>$J72,\"Terminé\",\"Courant\")))","v":""}]
[null,null,null,null,null,null,null,null,null,null,{"$f":"IF($J73=\"\",\"\",IF($L73=\"Courant\",Donnees!$A$3,IF($L73=\"terminé\",Donnees!$A$4,IF($L74=\"Non débuté\",\"\"))))","v":""},{"$f":"IF($J73=\"\",\"\",IF($I73>Trimestre!$D$2,\"Non débuté\",IF(Trimestre!$D$2>$J73,\"Terminé\",\"Courant\")))","v":""}]
[null,null,null,null,null,null,null,null,null,null,{"$f":"IF($J74=\"\",\"\",IF($L74=\"Courant\",Donnees!$A$3,IF($L74=\"terminé\",Donnees!$A$4,IF($L75=\"Non débuté\",\"\"))))","v":""},{"$f":"IF($J74=\"\",\"\",IF($I74>Trimestre!$D$2,\"Non débuté\",IF(Trimestre!$D$2>$J74,\"Terminé\",\"Courant\")))","v":""}]
[null,null,null,null,null,null,null,null,null,null,{"$f":"IF($J75=\"\",\"\",IF($L75=\"Courant\",Donnees!$A$3,IF($L75=\"terminé\",Donnees!$A$4,IF($L76=\"Non débuté\",\"\"))))","v":""},{"$f":"IF($J75=\"\",\"\",IF($I75>Trimestre!$D$2,\"Non débuté\",IF(Trimestre!$D$2>$J75,\"Terminé\",\"Courant\")))","v":""}]
[null,null,null,null,null,null,null,null,null,null,{"$f":"IF($J76=\"\",\"\",IF($L76=\"Courant\",Donnees!$A$3,IF($L76=\"terminé\",Donnees!$A$4,IF($L77=\"Non débuté\",\"\"))))","v":""},{"$f":"IF($J76=\"\",\"\",IF($I76>Trimestre!$D$2,\"Non débuté\",IF(Trimestre!$D$2>$J76,\"Terminé\",\"Courant\")))","v":""}]
[null,null,null,null,null,null,null,null,null,null,{"$f":"IF($J77=\"\",\"\",IF($L77=\"Courant\",Donnees!$A$3,IF($L77=\"terminé\",Donnees!$A$4,IF($L78=\"Non débuté\",\"\"))))","v":""},{"$f":"IF($J77=\"\",\"\",IF($I77>Trimestre!$D$2,\"Non débuté\",IF(Trimestre!$D$2>$J77,\"Terminé\",\"Courant\")))","v":""}]
[null,null,null,null,null,null,null,null,null,null,{"$f":"IF($J78=\"\",\"\",IF($L78=\"Courant\",Donnees!$A$3,IF($L78=\"terminé\",Donnees!$A$4,IF($L79=\"Non débuté\",\"\"))))","v":""},{"$f":"IF($J78=\"\",\"\",IF($I78>Trimestre!$D$2,\"Non débuté\",IF(Trimestre!$D$2>$J78,\"Terminé\",\"Courant\")))","v":""}]
[null,null,null,null,null,null,null,null,null,null,{"$f":"IF($J79=\"\",\"\",IF($L79=\"Courant\",Donnees!$A$3,IF($L79=\"terminé\",Donnees!$A$4,IF($L80=\"Non débuté\",\"\"))))","v":""},{"$f":"IF($J79=\"\",\"\",IF($I79>Trimestre!$D$2,\"Non débuté\",IF(Trimestre!$D$2>$J79,\"Terminé\",\"Courant\")))","v":""}]
[null,null,null,null,null,null,null,null,null,null,{"$f":"IF($J80=\"\",\"\",IF($L80=\"Courant\",Donnees!$A$3,IF($L80=\"terminé\",Donnees!$A$4,IF($L81=\"Non débuté\",\"\"))))","v":""},{"$f":"IF($J80=\"\",\"\",IF($I80>Trimestre!$D$2,\"Non débuté\",IF(Trimestre!$D$2>$J80,\"Terminé\",\"Courant\")))","v":""}]
[null,null,null,null,null,null,null,null,null,null,{"$f":"IF($J81=\"\",\"\",IF($L81=\"Courant\",Donnees!$A$3,IF($L81=\"terminé\",Donnees!$A$4,IF($L82=\"Non débuté\",\"\"))))","v":""},{"$f":"IF($J81=\"\",\"\",IF($I81>Trimestre!$D$2,\"Non débuté\",IF(Trimestre!$D$2>$J81,\"Terminé\",\"Courant\")))","v":""}]
[null,null,null,null,null,null,null,null,null,null,{"$f":"IF($J82=\"\",\"\",IF($L82=\"Courant\",Donnees!$A$3,IF($L82=\"terminé\",Donnees!$A$4,IF($L83=\"Non débuté\",\"\"))))","v":""},{"$f":"IF($J82=\"\",\"\",IF($I82>Trimestre!$D$2,\"Non débuté\",IF(Trimestre!$D$2>$J82,\"Terminé\",\"Courant\")))","v":""}]
[null,null,null,null,null,null,null,null,null,null,{"$f":"IF($J83=\"\",\"\",IF($L83=\"Courant\",Donnees!$A$3,IF($L83=\"terminé\",Donnees!$A$4,IF($L84=\"Non débuté\",\"\"))))","v":""},{"$f":"IF($J83=\"\",\"\",IF($I83>Trimestre!$D$2,\"Non débuté\",IF(Trimestre!$D$2>$J83,\"Terminé\",\"Courant\")))","v":""}]
[null,null,null,null,null,null,null,null,null,null,{"$f":"IF($J84=\"\",\"\",IF($L84=\"Courant\",Donnees!$A$3,IF($L84=\"terminé\",Donnees!$A$4,IF($L85=\"Non débuté\",\"\"))))","v":""},{"$f":"IF($J84=\"\",\"\",IF($I84>Trimestre!$D$2,\"Non débuté\",IF(Trimestre!$D$2>$J84,\"Terminé\",\"Courant\")))","v":""}]
[null,null,null,null,null,null,null,null,null,null,{"$f":"IF($J85=\"\",\"\",IF($L85=\"Courant\",Donnees!$A$3,IF($L85=\"terminé\",Donnees!$A$4,IF($L86=\"Non débuté\",\"\"))))","v":""},{"$f":"IF($J85=\"\",\"\",IF($I85>Trimestre!$D$2,\"Non débuté\",IF(Trimestre!$D$2>$J85,\"Terminé\",\"Courant\")))","v":""}]
[null,null,null,null,null,null,null,null,null,null,{"$f":"IF($J86=\"\",\"\",IF($L86=\"Courant\",Donnees!$A$3,IF($L86=\"terminé\",Donnees!$A$4,IF($L87=\"Non débuté\",\"\"))))","v":""},{"$f":"IF($J86=\"\",\"\",IF($I86>Trimestre!$D$2,\"Non débuté\",IF(Trimestre!$D$2>$J86,\"Terminé\",\"Courant\")))","v":""}]
[null,null,null,null,null,null,null,null,null,null,{"$f":"IF($J87=\"\",\"\",IF($L87=\"Courant\",Donnees!$A$3,IF($L87=\"terminé\",Donnees!$A$4,IF($L88=\"Non débuté\",\"\"))))","v":""},{"$f":"IF($J87=\"\",\"\",IF($I87>Trimestre!$D$2,\"Non débuté\",IF(Trimestre!$D$2>$J87,\"Terminé\",\"Courant\")))","v":""}]
[null,null,null,null,null,null,null,null,null,null,{"$f":"IF($J88=\"\",\"\",IF($L88=\"Courant\",Donnees!$A$3,IF($L88=\"terminé\",Donnees!$A$4,IF($L89=\"Non débuté\",\"\"))))","v":""},{"$f":"IF($J88=\"\",\"\",IF($I88>Trimestre!$D$2,\"Non débuté\",IF(Trimestre!$D$2>$J88,\"Terminé\",\"Courant\")))","v":""}]
[null,null,null,null,null,null,null,null,null,null,{"$f":"IF($J89=\"\",\"\",IF($L89=\"Courant\",Donnees!$A$3,IF($L89=\"terminé\",Donnees!$A$4,IF($L90=\"Non débuté\",\"\"))))","v":""},{"$f":"IF($J89=\"\",\"\",IF($I89>Trimestre!$D$2,\"Non débuté\",IF(Trimestre!$D$2>$J89,\"Terminé\",\"Courant\")))","v":""}]
[null,null,null,null,null,null,null,null,null,null,{"$f":"IF($J90=\"\",\"\",IF($L90=\"Courant\",Donnees!$A$3,IF($L90=\"terminé\",Donnees!$A$4,IF($L91=\"Non débuté\",\"\"))))","v":""},{"$f":"IF($J90=\"\",\"\",IF($I90>Trimestre!$D$2,\"Non débuté\",IF(Trimestre!$D$2>$J90,\"Terminé\",\"Courant\")))","v":""}]
[null,null,null,null,null,null,null,null,null,null,{"$f":"IF($J91=\"\",\"\",IF($L91=\"Courant\",Donnees!$A$3,IF($L91=\"terminé\",Donnees!$A$4,IF($L92=\"Non débuté\",\"\"))))","v":""},{"$f":"IF($J91=\"\",\"\",IF($I91>Trimestre!$D$2,\"Non débuté\",IF(Trimestre!$D$2>$J91,\"Terminé\",\"Courant\")))","v":""}]
[null,null,null,null,null,null,null,null,null,null,{"$f":"IF($J92=\"\",\"\",IF($L92=\"Courant\",Donnees!$A$3,IF($L92=\"terminé\",Donnees!$A$4,IF($L93=\"Non débuté\",\"\"))))","v":""},{"$f":"IF($J92=\"\",\"\",IF($I92>Trimestre!$D$2,\"Non débuté\",IF(Trimestre!$D$2>$J92,\"Terminé\",\"Courant\")))","v":""}]
[null,null,null,null,null,null,null,null,null,null,{"$f":"IF($J93=\"\",\"\",IF($L93=\"Courant\",Donnees!$A$3,IF($L93=\"terminé\",Donnees!$A$4,IF($L94=\"Non débuté\",\"\"))))","v":""},{"$f":"IF($J93=\"\",\"\",IF($I93>Trimestre!$D$2,\"Non débuté\",IF(Trimestre!$D$2>$J93,\"Terminé\",\"Courant\")))","v":""}]
[null,null,null,null,null,null,null,null,null,null,{"$f":"IF($J94=\"\",\"\",IF($L94=\"Courant\",Donnees!$A$3,IF($L94=\"terminé\",Donnees!$A$4,IF($L95=\"Non débuté\",\"\"))))","v":""},{"$f":"IF($J94=\"\",\"\",IF($I94>Trimestre!$D$2,\"Non débuté\",IF(Trimestre!$D$2>$J94,\"Terminé\",\"Courant\")))","v":""}]
[null,null,null,null,null,null,null,null,null,null,{"$f":"IF($J95=\"\",\"\",IF($L95=\"Courant\",Donnees!$A$3,IF($L95=\"terminé\",Donnees!$A$4,IF($L96=\"Non débuté\",\"\"))))","v":""},{"$f":"IF($J95=\"\",\"\",IF($I95>Trimestre!$D$2,\"Non débuté\",IF(Trimestre!$D$2>$J95,\"Terminé\",\"Courant\")))","v":""}]
[null,null,null,null,null,null,null,null,null,null,{"$f":"IF($J96=\"\",\"\",IF($L96=\"Courant\",Donnees!$A$3,IF($L96=\"terminé\",Donnees!$A$4,IF($L97=\"Non débuté\",\"\"))))","v":""},{"$f":"IF($J96=\"\",\"\",IF($I96>Trimestre!$D$2,\"Non débuté\",IF(Trimestre!$D$2>$J96,\"Terminé\",\"Courant\")))","v":""}]
[null,null,null,null,null,null,null,null,null,null,{"$f":"IF($J97=\"\",\"\",IF($L97=\"Courant\",Donnees!$A$3,IF($L97=\"terminé\",Donnees!$A$4,IF($L98=\"Non débuté\",\"\"))))","v":""},{"$f":"IF($J97=\"\",\"\",IF($I97>Trimestre!$D$2,\"Non débuté\",IF(Trimestre!$D$2>$J97,\"Terminé\",\"Courant\")))","v":""}]
[null,null,null,null,null,null,null,null,null,null,{"$f":"IF($J98=\"\",\"\",IF($L98=\"Courant\",Donnees!$A$3,IF($L98=\"terminé\",Donnees!$A$4,IF($L99=\"Non débuté\",\"\"))))","v":""},{"$f":"IF($J98=\"\",\"\",IF($I98>Trimestre!$D$2,\"Non débuté\",IF(Trimestre!$D$2>$J98,\"Terminé\",\"Courant\")))","v":""}]
[null,null,null,null,null,null,null,null,null,null,{"$f":"IF($J99=\"\",\"\",IF($L99=\"Courant\",Donnees!$A$3,IF($L99=\"terminé\",Donnees!$A$4,IF($L100=\"Non débuté\",\"\"))))","v":""},{"$f":"IF($J99=\"\",\"\",IF($I99>Trimestre!$D$2,\"Non débuté\",IF(Trimestre!$D$2>$J99,\"Terminé\",\"Courant\")))","v":""}]
[null,null,null,null,null,null,null,null,null,null,{"$f":"IF($J100=\"\",\"\",IF($L100=\"Courant\",Donnees!$A$3,IF($L100=\"terminé\",Donnees!$A$4,IF($L101=\"Non débuté\",\"\"))))","v":""},{"$f":"IF($J100=\"\",\"\",IF($I100>Trimestre!$D$2,\"Non débuté\",IF(Trimestre!$D$2>$J100,\"Terminé\",\"Courant\")))","v":""}]
[null,null,null,null,null,null,null,null,null,null,{"$f":"IF($J101=\"\",\"\",IF($L101=\"Courant\",Donnees!$A$3,IF($L101=\"terminé\",Donnees!$A$4,IF($L102=\"Non débuté\",\"\"))))","v":""},{"$f":"IF($J101=\"\",\"\",IF($I101>Trimestre!$D$2,\"Non débuté\",IF(Trimestre!$D$2>$J101,\"Terminé\",\"Courant\")))","v":""}]
[null,null,null,null,null,null,null,null,null,null,{"$f":"IF($J102=\"\",\"\",IF($L102=\"Courant\",Donnees!$A$3,IF($L102=\"terminé\",Donnees!$A$4,IF($L103=\"Non débuté\",\"\"))))","v":""},{"$f":"IF($J102=\"\",\"\",IF($I102>Trimestre!$D$2,\"Non débuté\",IF(Trimestre!$D$2>$J102,\"Terminé\",\"Courant\")))","v":""}]
[null,null,null,null,null,null,null,null,null,null,{"$f":"IF($J103=\"\",\"\",IF($L103=\"Courant\",Donnees!$A$3,IF($L103=\"terminé\",Donnees!$A$4,IF($L104=\"Non débuté\",\"\"))))","v":""},{"$f":"IF($J103=\"\",\"\",IF($I103>Trimestre!$D$2,\"Non débuté\",IF(Trimestre!$D$2>$J103,\"Terminé\",\"Courant\")))","v":""}]
[null,null,null,null,null,null,null,null,null,null,{"$f":"IF($J104=\"\",\"\",IF($L104=\"Courant\",Donnees!$A$3,IF($L104=\"terminé\",Donnees!$A$4,IF($L105=\"Non débuté\",\"\"))))","v":""},{"$f":"IF($J104=\"\",\"\",IF($I104>Trimestre!$D$2,\"Non débuté\",IF(Trimestre!$D$2>$J104,\"Terminé\",\"Courant\")))","v":""}]
[null,null,null,null,null,null,null,null,null,null,{"$f":"IF($J105=\"\",\"\",IF($L105=\"Courant\",Donnees!$A$3,IF($L105=\"terminé\",Donnees!$A$4,IF($L106=\"Non débuté\",\"\"))))","v":""},{"$f":"IF($J105=\"\",\"\",IF($I105>Trimestre!$D$2,\"Non débuté\",IF(Trimestre!$D$2>$J105,\"Terminé\",\"Courant\")))","v":""}]
[null,null,null,null,null,null,null,null,null,null,{"$f":"IF($J106=\"\",\"\",IF($L106=\"Courant\",Donnees!$A$3,IF($L106=\"terminé\",Donnees!$A$4,IF($L107=\"Non débuté\",\"\"))))","v":""},{"$f":"IF($J106=\"\",\"\",IF($I106>Trimestre!$D$2,\"Non débuté\",IF(Trimestre!$D$2>$J106,\"Terminé\",\"Courant\")))","v":""}]
[null,null,null,null,null,null,null,null,null,null,{"$f":"IF($J107=\"\",\"\",IF($L107=\"Courant\",Donnees!$A$3,IF($L107=\"terminé\",Donnees!$A$4,IF($L108=\"Non débuté\",\"\"))))","v":""},{"$f":"IF($J107=\"\",\"\",IF($I107>Trimestre!$D$2,\"Non débuté\",IF(Trimestre!$D$2>$J107,\"Terminé\",\"Courant\")))","v":""}]
[null,null,null,null,null,null,null,null,null,null,{"$f":"IF($J108=\"\",\"\",IF($L108=\"Courant\",Donnees!$A$3,IF($L108=\"terminé\",Donnees!$A$4,IF($L109=\"Non débuté\",\"\"))))","v":""},{"$f":"IF($J108=\"\",\"\",IF($I108>Trimestre!$D$2,\"Non débuté\",IF(Trimestre!$D$2>$J108,\"Terminé\",\"Courant\")))","v":""}]
[null,null,null,null,null,null,null,null,null,null,{"$f":"IF($J109=\"\",\"\",IF($L109=\"Courant\",Donnees!$A$3,IF($L109=\"terminé\",Donnees!$A$4,IF($L110=\"Non débuté\",\"\"))))","v":""},{"$f":"IF($J109=\"\",\"\",IF($I109>Trimestre!$D$2,\"Non débuté\",IF(Trimestre!$D$2>$J109,\"Terminé\",\"Courant\")))","v":""}]
[null,null,null,null,null,null,null,null,null,null,{"$f":"IF($J110=\"\",\"\",IF($L110=\"Courant\",Donnees!$A$3,IF($L110=\"terminé\",Donnees!$A$4,IF($L111=\"Non débuté\",\"\"))))","v":""},{"$f":"IF($J110=\"\",\"\",IF($I110>Trimestre!$D$2,\"Non débuté\",IF(Trimestre!$D$2>$J110,\"Terminé\",\"Courant\")))","v":""}]
[null,null,null,null,null,null,null,null,null,null,{"$f":"IF($J111=\"\",\"\",IF($L111=\"Courant\",Donnees!$A$3,IF($L111=\"terminé\",Donnees!$A$4,IF($L112=\"Non débuté\",\"\"))))","v":""},{"$f":"IF($J111=\"\",\"\",IF($I111>Trimestre!$D$2,\"Non débuté\",IF(Trimestre!$D$2>$J111,\"Terminé\",\"Courant\")))","v":""}]
[null,null,null,null,null,null,null,null,null,null,{"$f":"IF($J112=\"\",\"\",IF($L112=\"Courant\",Donnees!$A$3,IF($L112=\"terminé\",Donnees!$A$4,IF($L113=\"Non débuté\",\"\"))))","v":""},{"$f":"IF($J112=\"\",\"\",IF($I112>Trimestre!$D$2,\"Non débuté\",IF(Trimestre!$D$2>$J112,\"Terminé\",\"Courant\")))","v":""}]
[null,null,null,null,null,null,null,null,null,null,{"$f":"IF($J113=\"\",\"\",IF($L113=\"Courant\",Donnees!$A$3,IF($L113=\"terminé\",Donnees!$A$4,IF($L114=\"Non débuté\",\"\"))))","v":""},{"$f":"IF($J113=\"\",\"\",IF($I113>Trimestre!$D$2,\"Non débuté\",IF(Trimestre!$D$2>$J113,\"Terminé\",\"Courant\")))","v":""}]
[null,null,null,null,null,null,null,null,null,null,{"$f":"IF($J114=\"\",\"\",IF($L114=\"Courant\",Donnees!$A$3,IF($L114=\"terminé\",Donnees!$A$4,IF($L115=\"Non débuté\",\"\"))))","v":""},{"$f":"IF($J114=\"\",\"\",IF($I114>Trimestre!$D$2,\"Non débuté\",IF(Trimestre!$D$2>$J114,\"Terminé\",\"Courant\")))","v":""}]
[null,null,null,null,null,null,null,null,null,null,{"$f":"IF($J115=\"\",\"\",IF($L115=\"Courant\",Donnees!$A$3,IF($L115=\"terminé\",Donnees!$A$4,IF($L116=\"Non débuté\",\"\"))))","v":""},{"$f":"IF($J115=\"\",\"\",IF($I115>Trimestre!$D$2,\"Non débuté\",IF(Trimestre!$D$2>$J115,\"Terminé\",\"Courant\")))","v":""}]
[null,null,null,null,null,null,null,null,null,null,{"$f":"IF($J116=\"\",\"\",IF($L116=\"Courant\",Donnees!$A$3,IF($L116=\"terminé\",Donnees!$A$4,IF($L117=\"Non débuté\",\"\"))))","v":""},{"$f":"IF($J116=\"\",\"\",IF($I116>Trimestre!$D$2,\"Non débuté\",IF(Trimestre!$D$2>$J116,\"Terminé\",\"Courant\")))","v":""}]
[null,null,null,null,null,null,null,null,null,null,{"$f":"IF($J117=\"\",\"\",IF($L117=\"Courant\",Donnees!$A$3,IF($L117=\"terminé\",Donnees!$A$4,IF($L118=\"Non débuté\",\"\"))))","v":""},{"$f":"IF($J117=\"\",\"\",IF($I117>Trimestre!$D$2,\"Non débuté\",IF(Trimestre!$D$2>$J117,\"Terminé\",\"Courant\")))","v":""}]
[null,null,null,null,null,null,null,null,null,null,{"$f":"IF($J118=\"\",\"\",IF($L118=\"Courant\",Donnees!$A$3,IF($L118=\"terminé\",Donnees!$A$4,IF($L119=\"Non débuté\",\"\"))))","v":""},{"$f":"IF($J118=\"\",\"\",IF($I118>Trimestre!$D$2,\"Non débuté\",IF(Trimestre!$D$2>$J118,\"Terminé\",\"Courant\")))","v":""}]
[null,null,null,null,null,null,null,null,null,null,{"$f":"IF($J119=\"\",\"\",IF($L119=\"Courant\",Donnees!$A$3,IF($L119=\"terminé\",Donnees!$A$4,IF($L120=\"Non débuté\",\"\"))))","v":""},{"$f":"IF($J119=\"\",\"\",IF($I119>Trimestre!$D$2,\"Non débuté\",IF(Trimestre!$D$2>$J119,\"Terminé\",\"Courant\")))","v":""}]
[null,null,null,null,null,null,null,null,null,null,{"$f":"IF($J120=\"\",\"\",IF($L120=\"Courant\",Donnees!$A$3,IF($L120=\"terminé\",Donnees!$A$4,IF($L121=\"Non débuté\",\"\"))))","v":""},{"$f":"IF($J120=\"\",\"\",IF($I120>Trimestre!$D$2,\"Non débuté\",IF(Trimestre!$D$2>$J120,\"Terminé\",\"Courant\")))","v":""}]
[null,null,null,null,null,null,null,null,null,null,{"$f":"IF($J121=\"\",\"\",IF($L121=\"Courant\",Donnees!$A$3,IF($L121=\"terminé\",Donnees!$A$4,IF($L122=\"Non débuté\",\"\"))))","v":""},{"$f":"IF($J121=\"\",\"\",IF($I121>Trimestre!$D$2,\"Non débuté\",IF(Trimestre!$D$2>$J121,\"Terminé\",\"Courant\")))","v":""}]
[null,null,null,null,null,null,null,null,null,null,{"$f":"IF($J122=\"\",\"\",IF($L122=\"Courant\",Donnees!$A$3,IF($L122=\"terminé\",Donnees!$A$4,IF($L123=\"Non débuté\",\"\"))))","v":""},{"$f":"IF($J122=\"\",\"\",IF($I122>Trimestre!$D$2,\"Non débuté\",IF(Trimestre!$D$2>$J122,\"Terminé\",\"Courant\")))","v":""}]
[null,null,null,null,null,null,null,null,null,null,{"$f":"IF($J123=\"\",\"\",IF($L123=\"Courant\",Donnees!$A$3,IF($L123=\"terminé\",Donnees!$A$4,IF($L124=\"Non débuté\",\"\"))))","v":""},{"$f":"IF($J123=\"\",\"\",IF($I123>Trimestre!$D$2,\"Non débuté\",IF(Trimestre!$D$2>$J123,\"Terminé\",\"Courant\")))","v":""}]
[null,null,null,null,null,null,null,null,null,null,{"$f":"IF($J124=\"\",\"\",IF($L124=\"Courant\",Donnees!$A$3,IF($L124=\"terminé\",Donnees!$A$4,IF($L125=\"Non débuté\",\"\"))))","v":""},{"$f":"IF($J124=\"\",\"\",IF($I124>Trimestre!$D$2,\"Non débuté\",IF(Trimestre!$D$2>$J124,\"Terminé\",\"Courant\")))","v":""}]
[null,null,null,null,null,null,null,null,null,null,{"$f":"IF($J125=\"\",\"\",IF($L125=\"Courant\",Donnees!$A$3,IF($L125=\"terminé\",Donnees!$A$4,IF($L126=\"Non débuté\",\"\"))))","v":""},{"$f":"IF($J125=\"\",\"\",IF($I125>Trimestre!$D$2,\"Non débuté\",IF(Trimestre!$D$2>$J125,\"Terminé\",\"Courant\")))","v":""}]
[null,null,null,null,null,null,null,null,null,null,{"$f":"IF($J126=\"\",\"\",IF($L126=\"Courant\",Donnees!$A$3,IF($L126=\"terminé\",Donnees!$A$4,IF($L127=\"Non débuté\",\"\"))))","v":""},{"$f":"IF($J126=\"\",\"\",IF($I126>Trimestre!$D$2,\"Non débuté\",IF(Trimestre!$D$2>$J126,\"Terminé\",\"Courant\")))","v":""}]
[null,null,null,null,null,null,null,null,null,null,{"$f":"IF($J127=\"\",\"\",IF($L127=\"Courant\",Donnees!$A$3,IF($L127=\"terminé\",Donnees!$A$4,IF($L128=\"Non débuté\",\"\"))))","v":""},{"$f":"IF($J127=\"\",\"\",IF($I127>Trimestre!$D$2,\"Non débuté\",IF(Trimestre!$D$2>$J127,\"Terminé\",\"Courant\")))","v":""}]
[null,null,null,null,null,null,null,null,null,null,{"$f":"IF($J128=\"\",\"\",IF($L128=\"Courant\",Donnees!$A$3,IF($L128=\"terminé\",Donnees!$A$4,IF($L129=\"Non débuté\",\"\"))))","v":""},{"$f":"IF($J128=\"\",\"\",IF($I128>Trimestre!$D$2,\"Non débuté\",IF(Trimestre!$D$2>$J128,\"Terminé\",\"Courant\")))","v":""}]
[null,null,null,null,null,null,null,null,null,null,{"$f":"IF($J129=\"\",\"\",IF($L129=\"Courant\",Donnees!$A$3,IF($L129=\"terminé\",Donnees!$A$4,IF($L130=\"Non débuté\",\"\"))))","v":""},{"$f":"IF($J129=\"\",\"\",IF($I129>Trimestre!$D$2,\"Non débuté\",IF(Trimestre!$D$2>$J129,\"Terminé\",\"Courant\")))","v":""}]
[null,null,null,null,null,null,null,null,null,null,{"$f":"IF($J130=\"\",\"\",IF($L130=\"Courant\",Donnees!$A$3,IF($L130=\"terminé\",Donnees!$A$4,IF($L131=\"Non débuté\",\"\"))))","v":""},{"$f":"IF($J130=\"\",\"\",IF($I130>Trimestre!$D$2,\"Non débuté\",IF(Trimestre!$D$2>$J130,\"Terminé\",\"Courant\")))","v":""}]
[null,null,null,null,null,null,null,null,null,null,{"$f":"IF($J131=\"\",\"\",IF($L131=\"Courant\",Donnees!$A$3,IF($L131=\"terminé\",Donnees!$A$4,IF($L132=\"Non débuté\",\"\"))))","v":""},{"$f":"IF($J131=\"\",\"\",IF($I131>Trimestre!$D$2,\"Non débuté\",IF(Trimestre!$D$2>$J131,\"Terminé\",\"Courant\")))","v":""}]
[null,null,null,null,null,null,null,null,null,null,{"$f":"IF($J132=\"\",\"\",IF($L132=\"Courant\",Donnees!$A$3,IF($L132=\"terminé\",Donnees!$A$4,IF($L133=\"Non débuté\",\"\"))))","v":""},{"$f":"IF($J132=\"\",\"\",IF($I132>Trimestre!$D$2,\"Non débuté\",IF(Trimestre!$D$2>$J132,\"Terminé\",\"Courant\")))","v":""}]
[null,null,null,null,null,null,null,null,null,null,{"$f":"IF($J133=\"\",\"\",IF($L133=\"Courant\",Donnees!$A$3,IF($L133=\"terminé\",Donnees!$A$4,IF($L134=\"Non débuté\",\"\"))))","v":""},{"$f":"IF($J133=\"\",\"\",IF($I133>Trimestre!$D$2,\"Non débuté\",IF(Trimestre!$D$2>$J133,\"Terminé\",\"Courant\")))","v":""}]
[null,null,null,null,null,null,null,null,null,null,{"$f":"IF($J134=\"\",\"\",IF($L134=\"Courant\",Donnees!$A$3,IF($L134=\"terminé\",Donnees!$A$4,IF($L135=\"Non débuté\",\"\"))))","v":""},{"$f":"IF($J134=\"\",\"\",IF($I134>Trimestre!$D$2,\"Non débuté\",IF(Trimestre!$D$2>$J134,\"Terminé\",\"Courant\")))","v":""}]
[null,null,null,null,null,null,null,null,null,null,{"$f":"IF($J135=\"\",\"\",IF($L135=\"Courant\",Donnees!$A$3,IF($L135=\"terminé\",Donnees!$A$4,IF($L136=\"Non débuté\",\"\"))))","v":""},{"$f":"IF($J135=\"\",\"\",IF($I135>Trimestre!$D$2,\"Non débuté\",IF(Trimestre!$D$2>$J135,\"Terminé\",\"Courant\")))","v":""}]
[null,null,null,null,null,null,null,null,null,null,{"$f":"IF($J136=\"\",\"\",IF($L136=\"Courant\",Donnees!$A$3,IF($L136=\"terminé\",Donnees!$A$4,IF($L137=\"Non débuté\",\"\"))))","v":""},{"$f":"IF($J136=\"\",\"\",IF($I136>Trimestre!$D$2,\"Non débuté\",IF(Trimestre!$D$2>$J136,\"Terminé\",\"Courant\")))","v":""}]
[null,null,null,null,null,null,null,null,null,null,{"$f":"IF($J137=\"\",\"\",IF($L137=\"Courant\",Donnees!$A$3,IF($L137=\"terminé\",Donnees!$A$4,IF($L138=\"Non débuté\",\"\"))))","v":""},{"$f":"IF($J137=\"\",\"\",IF($I137>Trimestre!$D$2,\"Non débuté\",IF(Trimestre!$D$2>$J137,\"Terminé\",\"Courant\")))","v":""}]
[null,null,null,null,null,null,null,null,null,null,{"$f":"IF($J138=\"\",\"\",IF($L138=\"Courant\",Donnees!$A$3,IF($L138=\"terminé\",Donnees!$A$4,IF($L139=\"Non débuté\",\"\"))))","v":""},{"$f":"IF($J138=\"\",\"\",IF($I138>Trimestre!$D$2,\"Non débuté\",IF(Trimestre!$D$2>$J138,\"Terminé\",\"Courant\")))","v":""}]
[null,null,null,null,null,null,null,null,null,null,{"$f":"IF($J139=\"\",\"\",IF($L139=\"Courant\",Donnees!$A$3,IF($L139=\"terminé\",Donnees!$A$4,IF($L140=\"Non débuté\",\"\"))))","v":""},{"$f":"IF($J139=\"\",\"\",IF($I139>Trimestre!$D$2,\"Non débuté\",IF(Trimestre!$D$2>$J139,\"Terminé\",\"Courant\")))","v":""}]
[null,null,null,null,null,null,null,null,null,null,{"$f":"IF($J140=\"\",\"\",IF($L140=\"Courant\",Donnees!$A$3,IF($L140=\"terminé\",Donnees!$A$4,IF($L141=\"Non débuté\",\"\"))))","v":""},{"$f":"IF($J140=\"\",\"\",IF($I140>Trimestre!$D$2,\"Non débuté\",IF(Trimestre!$D$2>$J140,\"Terminé\",\"Courant\")))","v":""}]
[null,null,null,null,null,null,null,null,null,null,{"$f":"IF($J141=\"\",\"\",IF($L141=\"Courant\",Donnees!$A$3,IF($L141=\"terminé\",Donnees!$A$4,IF($L142=\"Non débuté\",\"\"))))","v":""},{"$f":"IF($J141=\"\",\"\",IF($I141>Trimestre!$D$2,\"Non débuté\",IF(Trimestre!$D$2>$J141,\"Terminé\",\"Courant\")))","v":""}]
[null,null,null,null,null,null,null,null,null,null,{"$f":"IF($J142=\"\",\"\",IF($L142=\"Courant\",Donnees!$A$3,IF($L142=\"terminé\",Donnees!$A$4,IF($L143=\"Non débuté\",\"\"))))","v":""},{"$f":"IF($J142=\"\",\"\",IF($I142>Trimestre!$D$2,\"Non débuté\",IF(Trimestre!$D$2>$J142,\"Terminé\",\"Courant\")))","v":""}]
[null,null,null,null,null,null,null,null,null,null,{"$f":"IF($J143=\"\",\"\",IF($L143=\"Courant\",Donnees!$A$3,IF($L143=\"terminé\",Donnees!$A$4,IF($L144=\"Non débuté\",\"\"))))","v":""},{"$f":"IF($J143=\"\",\"\",IF($I143>Trimestre!$D$2,\"Non débuté\",IF(Trimestre!$D$2>$J143,\"Terminé\",\"Courant\")))","v":""}]
[null,null,null,null,null,null,null,null,null,null,{"$f":"IF($J144=\"\",\"\",IF($L144=\"Courant\",Donnees!$A$3,IF($L144=\"terminé\",Donnees!$A$4,IF($L145=\"Non débuté\",\"\"))))","v":""},{"$f":"IF($J144=\"\",\"\",IF($I144>Trimestre!$D$2,\"Non débuté\",IF(Trimestre!$D$2>$J144,\"Terminé\",\"Courant\")))","v":""}]
[null,null,null,null,null,null,null,null,null,null,{"$f":"IF($J145=\"\",\"\",IF($L145=\"Courant\",Donnees!$A$3,IF($L145=\"terminé\",Donnees!$A$4,IF($L146=\"Non débuté\",\"\"))))","v":""},{"$f":"IF($J145=\"\",\"\",IF($I145>Trimestre!$D$2,\"Non débuté\",IF(Trimestre!$D$2>$J145,\"Terminé\",\"Courant\")))","v":""}]
[null,null,null,null,null,null,null,null,null,null,{"$f":"IF($J146=\"\",\"\",IF($L146=\"Courant\",Donnees!$A$3,IF($L146=\"terminé\",Donnees!$A$4,IF($L147=\"Non débuté\",\"\"))))","v":""},{"$f":"IF($J146=\"\",\"\",IF($I146>Trimestre!$D$2,\"Non débuté\",IF(Trimestre!$D$2>$J146,\"Terminé\",\"Courant\")))","v":""}]
[null,null,null,null,null,null,null,null,null,null,{"$f":"IF($J147=\"\",\"\",IF($L147=\"Courant\",Donnees!$A$3,IF($L147=\"terminé\",Donnees!$A$4,IF($L148=\"Non débuté\",\"\"))))","v":""},{"$f":"IF($J147=\"\",\"\",IF($I147>Trimestre!$D$2,\"Non débuté\",IF(Trimestre!$D$2>$J147,\"Terminé\",\"Courant\")))","v":""}]
[null,null,null,null,null,null,null,null,null,null,{"$f":"IF($J148=\"\",\"\",IF($L148=\"Courant\",Donnees!$A$3,IF($L148=\"terminé\",Donnees!$A$4,IF($L149=\"Non débuté\",\"\"))))","v":""},{"$f":"IF($J148=\"\",\"\",IF($I148>Trimestre!$D$2,\"Non débuté\",IF(Trimestre!$D$2>$J148,\"Terminé\",\"Courant\")))","v":""}]
[null,null,null,null,null,null,null,null,null,null,{"$f":"IF($J149=\"\",\"\",IF($L149=\"Courant\",Donnees!$A$3,IF($L149=\"terminé\",Donnees!$A$4,IF($L150=\"Non débuté\",\"\"))))","v":""},{"$f":"IF($J149=\"\",\"\",IF($I149>Trimestre!$D$2,\"Non débuté\",IF(Trimestre!$D$2>$J149,\"Terminé\",\"Courant\")))","v":""}]
[null,null,null,null,null,null,null,null,null,null,{"$f":"IF($J150=\"\",\"\",IF($L150=\"Courant\",Donnees!$A$3,IF($L150=\"terminé\",Donnees!$A$4,IF($L151=\"Non débuté\",\"\"))))","v":""},{"$f":"IF($J150=\"\",\"\",IF($I150>Trimestre!$D$2,\"Non débuté\",IF(Trimestre!$D$2>$J150,\"Terminé\",\"Courant\")))","v":""}]
[null,null,null,null,null,null,null,null,null,null,{"$f":"IF($J151=\"\",\"\",IF($L151=\"Courant\",Donnees!$A$3,IF($L151=\"terminé\",Donnees!$A$4,IF($L152=\"Non débuté\",\"\"))))","v":""},{"$f":"IF($J151=\"\",\"\",IF($I151>Trimestre!$D$2,\"Non débuté\",IF(Trimestre!$D$2>$J151,\"Terminé\",\"Courant\")))","v":""}]
[null,null,null,null,null,null,null,null,null,null,{"$f":"IF($J152=\"\",\"\",IF($L152=\"Courant\",Donnees!$A$3,IF($L152=\"terminé\",Donnees!$A$4,IF($L153=\"Non débuté\",\"\"))))","v":""},{"$f":"IF($J152=\"\",\"\",IF($I152>Trimestre!$D$2,\"Non débuté\",IF(Trimestre!$D$2>$J152,\"Terminé\",\"Courant\")))","v":""}]
[null,null,null,null,null,null,null,null,null,null,{"$f":"IF($J153=\"\",\"\",IF($L153=\"Courant\",Donnees!$A$3,IF($L153=\"terminé\",Donnees!$A$4,IF($L154=\"Non débuté\",\"\"))))","v":""},{"$f":"IF($J153=\"\",\"\",IF($I153>Trimestre!$D$2,\"Non débuté\",IF(Trimestre!$D$2>$J153,\"Terminé\",\"Courant\")))","v":""}]
[null,null,null,null,null,null,null,null,null,null,{"$f":"IF($J154=\"\",\"\",IF($L154=\"Courant\",Donnees!$A$3,IF($L154=\"terminé\",Donnees!$A$4,IF($L155=\"Non débuté\",\"\"))))","v":""},{"$f":"IF($J154=\"\",\"\",IF($I154>Trimestre!$D$2,\"Non débuté\",IF(Trimestre!$D$2>$J154,\"Terminé\",\"Courant\")))","v":""}]
[null,null,null,null,null,null,null,null,null,null,{"$f":"IF($J155=\"\",\"\",IF($L155=\"Courant\",Donnees!$A$3,IF($L155=\"terminé\",Donnees!$A$4,IF($L156=\"Non débuté\",\"\"))))","v":""},{"$f":"IF($J155=\"\",\"\",IF($I155>Trimestre!$D$2,\"Non débuté\",IF(Trimestre!$D$2>$J155,\"Terminé\",\"Courant\")))","v":""}]
[null,null,null,null,null,null,null,null,null,null,{"$f":"IF($J156=\"\",\"\",IF($L156=\"Courant\",Donnees!$A$3,IF($L156=\"terminé\",Donnees!$A$4,IF($L157=\"Non débuté\",\"\"))))","v":""},{"$f":"IF($J156=\"\",\"\",IF($I156>Trimestre!$D$2,\"Non débuté\",IF(Trimestre!$D$2>$J156,\"Terminé\",\"Courant\")))","v":""}]
[null,null,null,null,null,null,null,null,null,null,{"$f":"IF($J157=\"\",\"\",IF($L157=\"Courant\",Donnees!$A$3,IF($L157=\"terminé\",Donnees!$A$4,IF($L158=\"Non débuté\",\"\"))))","v":""},{"$f":"IF($J157=\"\",\"\",IF($I157>Trimestre!$D$2,\"Non débuté\",IF(Trimestre!$D$2>$J157,\"Terminé\",\"Courant\")))","v":""}]
[null,null,null,null,null,null,null,null,null,null,{"$f":"IF($J158=\"\",\"\",IF($L158=\"Courant\",Donnees!$A$3,IF($L158=\"terminé\",Donnees!$A$4,IF($L159=\"Non débuté\",\"\"))))","v":""},{"$f":"IF($J158=\"\",\"\",IF($I158>Trimestre!$D$2,\"Non débuté\",IF(Trimestre!$D$2>$J158,\"Terminé\",\"Courant\")))","v":""}]
[null,null,null,null,null,null,null,null,null,null,{"$f":"IF($J159=\"\",\"\",IF($L159=\"Courant\",Donnees!$A$3,IF($L159=\"terminé\",Donnees!$A$4,IF($L160=\"Non débuté\",\"\"))))","v":""},{"$f":"IF($J159=\"\",\"\",IF($I159>Trimestre!$D$2,\"Non débuté\",IF(Trimestre!$D$2>$J159,\"Terminé\",\"Courant\")))","v":""}]
[null,null,null,null,null,null,null,null,null,null,{"$f":"IF($J160=\"\",\"\",IF($L160=\"Courant\",Donnees!$A$3,IF($L160=\"terminé\",Donnees!$A$4,IF($L161=\"Non débuté\",\"\"))))","v":""},{"$f":"IF($J160=\"\",\"\",IF($I160>Trimestre!$D$2,\"Non débuté\",IF(Trimestre!$D$2>$J160,\"Terminé\",\"Courant\")))","v":""}]
[null,null,null,null,null,null,null,null,null,null,{"$f":"IF($J161=\"\",\"\",IF($L161=\"Courant\",Donnees!$A$3,IF($L161=\"terminé\",Donnees!$A$4,IF($L162=\"Non débuté\",\"\"))))","v":""},{"$f":"IF($J161=\"\",\"\",IF($I161>Trimestre!$D$2,\"Non débuté\",IF(Trimestre!$D$2>$J161,\"Terminé\",\"Courant\")))","v":""}]
[null,null,null,null,null,null,null,null,null,null,{"$f":"IF($J162=\"\",\"\",IF($L162=\"Courant\",Donnees!$A$3,IF($L162=\"terminé\",Donnees!$A$4,IF($L163=\"Non débuté\",\"\"))))","v":""},{"$f":"IF($J162=\"\",\"\",IF($I162>Trimestre!$D$2,\"Non débuté\",IF(Trimestre!$D$2>$J162,\"Terminé\",\"Courant\")))","v":""}]
[null,null,null,null,null,null,null,null,null,null,{"$f":"IF($J163=\"\",\"\",IF($L163=\"Courant\",Donnees!$A$3,IF($L163=\"terminé\",Donnees!$A$4,IF($L164=\"Non débuté\",\"\"))))","v":""},{"$f":"IF($J163=\"\",\"\",IF($I163>Trimestre!$D$2,\"Non débuté\",IF(Trimestre!$D$2>$J163,\"Terminé\",\"Courant\")))","v":""}]
[null,null,null,null,null,null,null,null,null,null,{"$f":"IF($J164=\"\",\"\",IF($L164=\"Courant\",Donnees!$A$3,IF($L164=\"terminé\",Donnees!$A$4,IF($L165=\"Non débuté\",\"\"))))","v":""},{"$f":"IF($J164=\"\",\"\",IF($I164>Trimestre!$D$2,\"Non débuté\",IF(Trimestre!$D$2>$J164,\"Terminé\",\"Courant\")))","v":""}]
[null,null,null,null,null,null,null,null,null,null,{"$f":"IF($J165=\"\",\"\",IF($L165=\"Courant\",Donnees!$A$3,IF($L165=\"terminé\",Donnees!$A$4,IF($L166=\"Non débuté\",\"\"))))","v":""},{"$f":"IF($J165=\"\",\"\",IF($I165>Trimestre!$D$2,\"Non débuté\",IF(Trimestre!$D$2>$J165,\"Terminé\",\"Courant\")))","v":""}]
[null,null,null,null,null,null,null,null,null,null,{"$f":"IF($J166=\"\",\"\",IF($L166=\"Courant\",Donnees!$A$3,IF($L166=\"terminé\",Donnees!$A$4,IF($L167=\"Non débuté\",\"\"))))","v":""},{"$f":"IF($J166=\"\",\"\",IF($I166>Trimestre!$D$2,\"Non débuté\",IF(Trimestre!$D$2>$J166,\"Terminé\",\"Courant\")))","v":""}]
[null,null,null,null,null,null,null,null,null,null,{"$f":"IF($J167=\"\",\"\",IF($L167=\"Courant\",Donnees!$A$3,IF($L167=\"terminé\",Donnees!$A$4,IF($L168=\"Non débuté\",\"\"))))","v":""},{"$f":"IF($J167=\"\",\"\",IF($I167>Trimestre!$D$2,\"Non débuté\",IF(Trimestre!$D$2>$J167,\"Terminé\",\"Courant\")))","v":""}]
[null,null,null,null,null,null,null,null,null,null,{"$f":"IF($J168=\"\",\"\",IF($L168=\"Courant\",Donnees!$A$3,IF($L168=\"terminé\",Donnees!$A$4,IF($L169=\"Non débuté\",\"\"))))","v":""},{"$f":"IF($J168=\"\",\"\",IF($I168>Trimestre!$D$2,\"Non débuté\",IF(Trimestre!$D$2>$J168,\"Terminé\",\"Courant\")))","v":""}]
[null,null,null,null,null,null,null,null,null,null,{"$f":"IF($J169=\"\",\"\",IF($L169=\"Courant\",Donnees!$A$3,IF($L169=\"terminé\",Donnees!$A$4,IF($L170=\"Non débuté\",\"\"))))","v":""},{"$f":"IF($J169=\"\",\"\",IF($I169>Trimestre!$D$2,\"Non débuté\",IF(Trimestre!$D$2>$J169,\"Terminé\",\"Courant\")))","v":""}]
[null,null,null,null,null,null,null,null,null,null,{"$f":"IF($J170=\"\",\"\",IF($L170=\"Courant\",Donnees!$A$3,IF($L170=\"terminé\",Donnees!$A$4,IF($L171=\"Non débuté\",\"\"))))","v":""},{"$f":"IF($J170=\"\",\"\",IF($I170>Trimestre!$D$2,\"Non débuté\",IF(Trimestre!$D$2>$J170,\"Terminé\",\"Courant\")))","v":""}]
[null,null,null,null,null,null,null,null,null,null,{"$f":"IF($J171=\"\",\"\",IF($L171=\"Courant\",Donnees!$A$3,IF($L171=\"terminé\",Donnees!$A$4,IF($L172=\"Non débuté\",\"\"))))","v":""},{"$f":"IF($J171=\"\",\"\",IF($I171>Trimestre!$D$2,\"Non débuté\",IF(Trimestre!$D$2>$J171,\"Terminé\",\"Courant\")))","v":""}]
[null,null,null,null,null,null,null,null,null,null,{"$f":"IF($J172=\"\",\"\",IF($L172=\"Courant\",Donnees!$A$3,IF($L172=\"terminé\",Donnees!$A$4,IF($L173=\"Non débuté\",\"\"))))","v":""},{"$f":"IF($J172=\"\",\"\",IF($I172>Trimestre!$D$2,\"Non débuté\",IF(Trimestre!$D$2>$J172,\"Terminé\",\"Courant\")))","v":""}]
[null,null,null,null,null,null,null,null,null,null,{"$f":"IF($J173=\"\",\"\",IF($L173=\"Courant\",Donnees!$A$3,IF($L173=\"terminé\",Donnees!$A$4,IF($L174=\"Non débuté\",\"\"))))","v":""},{"$f":"IF($J173=\"\",\"\",IF($I173>Trimestre!$D$2,\"Non débuté\",IF(Trimestre!$D$2>$J173,\"Terminé\",\"Courant\")))","v":""}]
[null,null,null,null,null,null,null,null,null,null,{"$f":"IF($J174=\"\",\"\",IF($L174=\"Courant\",Donnees!$A$3,IF($L174=\"terminé\",Donnees!$A$4,IF($L175=\"Non débuté\",\"\"))))","v":""},{"$f":"IF($J174=\"\",\"\",IF($I174>Trimestre!$D$2,\"Non débuté\",IF(Trimestre!$D$2>$J174,\"Terminé\",\"Courant\")))","v":""}]
[null,null,null,null,null,null,null,null,null,null,{"$f":"IF($J175=\"\",\"\",IF($L175=\"Courant\",Donnees!$A$3,IF($L175=\"terminé\",Donnees!$A$4,IF($L176=\"Non débuté\",\"\"))))","v":""},{"$f":"IF($J175=\"\",\"\",IF($I175>Trimestre!$D$2,\"Non débuté\",IF(Trimestre!$D$2>$J175,\"Terminé\",\"Courant\")))","v":""}]
[null,null,null,null,null,null,null,null,null,null,{"$f":"IF($J176=\"\",\"\",IF($L176=\"Courant\",Donnees!$A$3,IF($L176=\"terminé\",Donnees!$A$4,IF($L177=\"Non débuté\",\"\"))))","v":""},{"$f":"IF($J176=\"\",\"\",IF($I176>Trimestre!$D$2,\"Non débuté\",IF(Trimestre!$D$2>$J176,\"Terminé\",\"Courant\")))","v":""}]
[null,null,null,null,null,null,null,null,null,null,{"$f":"IF($J177=\"\",\"\",IF($L177=\"Courant\",Donnees!$A$3,IF($L177=\"terminé\",Donnees!$A$4,IF($L178=\"Non débuté\",\"\"))))","v":""},{"$f":"IF($J177=\"\",\"\",IF($I177>Trimestre!$D$2,\"Non débuté\",IF(Trimestre!$D$2>$J177,\"Terminé\",\"Courant\")))","v":""}]
[null,null,null,null,null,null,null,null,null,null,{"$f":"IF($J178=\"\",\"\",IF($L178=\"Courant\",Donnees!$A$3,IF($L178=\"terminé\",Donnees!$A$4,IF($L179=\"Non débuté\",\"\"))))","v":""},{"$f":"IF($J178=\"\",\"\",IF($I178>Trimestre!$D$2,\"Non débuté\",IF(Trimestre!$D$2>$J178,\"Terminé\",\"Courant\")))","v":""}]
[null,null,null,null,null,null,null,null,null,null,{"$f":"IF($J179=\"\",\"\",IF($L179=\"Courant\",Donnees!$A$3,IF($L179=\"terminé\",Donnees!$A$4,IF($L180=\"Non débuté\",\"\"))))","v":""},{"$f":"IF($J179=\"\",\"\",IF($I179>Trimestre!$D$2,\"Non débuté\",IF(Trimestre!$D$2>$J179,\"Terminé\",\"Courant\")))","v":""}]
[null,null,null,null,null,null,null,null,null,null,{"$f":"IF($J180=\"\",\"\",IF($L180=\"Courant\",Donnees!$A$3,IF($L180=\"terminé\",Donnees!$A$4,IF($L181=\"Non débuté\",\"\"))))","v":""},{"$f":"IF($J180=\"\",\"\",IF($I180>Trimestre!$D$2,\"Non débuté\",IF(Trimestre!$D$2>$J180,\"Terminé\",\"Courant\")))","v":""}]
[null,null,null,null,null,null,null,null,null,null,{"$f":"IF($J181=\"\",\"\",IF($L181=\"Courant\",Donnees!$A$3,IF($L181=\"terminé\",Donnees!$A$4,IF($L182=\"Non débuté\",\"\"))))","v":""},{"$f":"IF($J181=\"\",\"\",IF($I181>Trimestre!$D$2,\"Non débuté\",IF(Trimestre!$D$2>$J181,\"Terminé\",\"Courant\")))","v":""}]
[null,null,null,null,null,null,null,null,null,null,{"$f":"IF($J182=\"\",\"\",IF($L182=\"Courant\",Donnees!$A$3,IF($L182=\"terminé\",Donnees!$A$4,IF($L183=\"Non débuté\",\"\"))))","v":""},{"$f":"IF($J182=\"\",\"\",IF($I182>Trimestre!$D$2,\"Non débuté\",IF(Trimestre!$D$2>$J182,\"Terminé\",\"Courant\")))","v":""}]
[null,null,null,null,null,null,null,null,null,null,{"$f":"IF($J183=\"\",\"\",IF($L183=\"Courant\",Donnees!$A$3,IF($L183=\"terminé\",Donnees!$A$4,IF($L184=\"Non débuté\",\"\"))))","v":""},{"$f":"IF($J183=\"\",\"\",IF($I183>Trimestre!$D$2,\"Non débuté\",IF(Trimestre!$D$2>$J183,\"Terminé\",\"Courant\")))","v":""}]
[null,null,null,null,null,null,null,null,null,null,{"$f":"IF($J184=\"\",\"\",IF($L184=\"Courant\",Donnees!$A$3,IF($L184=\"terminé\",Donnees!$A$4,IF($L185=\"Non débuté\",\"\"))))","v":""},{"$f":"IF($J184=\"\",\"\",IF($I184>Trimestre!$D$2,\"Non débuté\",IF(Trimestre!$D$2>$J184,\"Terminé\",\"Courant\")))","v":""}]
[null,null,null,null,null,null,null,null,null,null,{"$f":"IF($J185=\"\",\"\",IF($L185=\"Courant\",Donnees!$A$3,IF($L185=\"terminé\",Donnees!$A$4,IF($L186=\"Non débuté\",\"\"))))","v":""},{"$f":"IF($J185=\"\",\"\",IF($I185>Trimestre!$D$2,\"Non débuté\",IF(Trimestre!$D$2>$J185,\"Terminé\",\"Courant\")))","v":""}]
[null,null,null,null,null,null,null,null,null,null,{"$f":"IF($J186=\"\",\"\",IF($L186=\"Courant\",Donnees!$A$3,IF($L186=\"terminé\",Donnees!$A$4,IF($L187=\"Non débuté\",\"\"))))","v":""},{"$f":"IF($J186=\"\",\"\",IF($I186>Trimestre!$D$2,\"Non débuté\",IF(Trimestre!$D$2>$J186,\"Terminé\",\"Courant\")))","v":""}]
[null,null,null,null,null,null,null,null,null,null,{"$f":"IF($J187=\"\",\"\",IF($L187=\"Courant\",Donnees!$A$3,IF($L187=\"terminé\",Donnees!$A$4,IF($L188=\"Non débuté\",\"\"))))","v":""},{"$f":"IF($J187=\"\",\"\",IF($I187>Trimestre!$D$2,\"Non débuté\",IF(Trimestre!$D$2>$J187,\"Terminé\",\"Courant\")))","v":""}]
[null,null,null,null,null,null,null,null,null,null,{"$f":"IF($J188=\"\",\"\",IF($L188=\"Courant\",Donnees!$A$3,IF($L188=\"terminé\",Donnees!$A$4,IF($L189=\"Non débuté\",\"\"))))","v":""},{"$f":"IF($J188=\"\",\"\",IF($I188>Trimestre!$D$2,\"Non débuté\",IF(Trimestre!$D$2>$J188,\"Terminé\",\"Courant\")))","v":""}]
[null,null,null,null,null,null,null,null,null,null,{"$f":"IF($J189=\"\",\"\",IF($L189=\"Courant\",Donnees!$A$3,IF($L189=\"terminé\",Donnees!$A$4,IF($L190=\"Non débuté\",\"\"))))","v":""},{"$f":"IF($J189=\"\",\"\",IF($I189>Trimestre!$D$2,\"Non débuté\",IF(Trimestre!$D$2>$J189,\"Terminé\",\"Courant\")))","v":""}]
[null,null,null,null,null,null,null,null,null,null,{"$f":"IF($J190=\"\",\"\",IF($L190=\"Courant\",Donnees!$A$3,IF($L190=\"terminé\",Donnees!$A$4,IF($L191=\"Non débuté\",\"\"))))","v":""},{"$f":"IF($J190=\"\",\"\",IF($I190>Trimestre!$D$2,\"Non débuté\",IF(Trimestre!$D$2>$J190,\"Terminé\",\"Courant\")))","v":""}]
[null,null,null,null,null,null,null,null,null,null,{"$f":"IF($J191=\"\",\"\",IF($L191=\"Courant\",Donnees!$A$3,IF($L191=\"terminé\",Donnees!$A$4,IF($L192=\"Non débuté\",\"\"))))","v":""},{"$f":"IF($J191=\"\",\"\",IF($I191>Trimestre!$D$2,\"Non débuté\",IF(Trimestre!$D$2>$J191,\"Terminé\",\"Courant\")))","v":""}]
[null,null,null,null,null,null,null,null,null,null,{"$f":"IF($J192=\"\",\"\",IF($L192=\"Courant\",Donnees!$A$3,IF($L192=\"terminé\",Donnees!$A$4,IF($L193=\"Non débuté\",\"\"))))","v":""},{"$f":"IF($J192=\"\",\"\",IF($I192>Trimestre!$D$2,\"Non débuté\",IF(Trimestre!$D$2>$J192,\"Terminé\",\"Courant\")))","v":""}]
[null,null,null,null,null,null,null,null,null,null,{"$f":"IF($J193=\"\",\"\",IF($L193=\"Courant\",Donnees!$A$3,IF($L193=\"terminé\",Donnees!$A$4,IF($L194=\"Non débuté\",\"\"))))","v":""},{"$f":"IF($J193=\"\",\"\",IF($I193>Trimestre!$D$2,\"Non débuté\",IF(Trimestre!$D$2>$J193,\"Terminé\",\"Courant\")))","v":""}]
[null,null,null,null,null,null,null,null,null,null,{"$f":"IF($J194=\"\",\"\",IF($L194=\"Courant\",Donnees!$A$3,IF($L194=\"terminé\",Donnees!$A$4,IF($L195=\"Non débuté\",\"\"))))","v":""},{"$f":"IF($J194=\"\",\"\",IF($I194>Trimestre!$D$2,\"Non débuté\",IF(Trimestre!$D$2>$J194,\"Terminé\",\"Courant\")))","v":""}]
[null,null,null,null,null,null,null,null,null,null,{"$f":"IF($J195=\"\",\"\",IF($L195=\"Courant\",Donnees!$A$3,IF($L195=\"terminé\",Donnees!$A$4,IF($L196=\"Non débuté\",\"\"))))","v":""},{"$f":"IF($J195=\"\",\"\",IF($I195>Trimestre!$D$2,\"Non débuté\",IF(Trimestre!$D$2>$J195,\"Terminé\",\"Courant\")))","v":""}]
[null,null,null,null,null,null,null,null,null,null,{"$f":"IF($J196=\"\",\"\",IF($L196=\"Courant\",Donnees!$A$3,IF($L196=\"terminé\",Donnees!$A$4,IF($L197=\"Non débuté\",\"\"))))","v":""},{"$f":"IF($J196=\"\",\"\",IF($I196>Trimestre!$D$2,\"Non débuté\",IF(Trimestre!$D$2>$J196,\"Terminé\",\"Courant\")))","v":""}]
[null,null,null,null,null,null,null,null,null,null,{"$f":"IF($J197=\"\",\"\",IF($L197=\"Courant\",Donnees!$A$3,IF($L197=\"terminé\",Donnees!$A$4,IF($L198=\"Non débuté\",\"\"))))","v":""},{"$f":"IF($J197=\"\",\"\",IF($I197>Trimestre!$D$2,\"Non débuté\",IF(Trimestre!$D$2>$J197,\"Terminé\",\"Courant\")))","v":""}]
[null,null,null,null,null,null,null,null,null,null,{"$f":"IF($J198=\"\",\"\",IF($L198=\"Courant\",Donnees!$A$3,IF($L198=\"terminé\",Donnees!$A$4,IF($L199=\"Non débuté\",\"\"))))","v":""},{"$f":"IF($J198=\"\",\"\",IF($I198>Trimestre!$D$2,\"Non débuté\",IF(Trimestre!$D$2>$J198,\"Terminé\",\"Courant\")))","v":""}]
[null,null,null,null,null,null,null,null,null,null,{"$f":"IF($J199=\"\",\"\",IF($L199=\"Courant\",Donnees!$A$3,IF($L199=\"terminé\",Donnees!$A$4,IF($L200=\"Non débuté\",\"\"))))","v":""},{"$f":"IF($J199=\"\",\"\",IF($I199>Trimestre!$D$2,\"Non débuté\",IF(Trimestre!$D$2>$J199,\"Terminé\",\"Courant\")))","v":""}]
[null,null,null,null,null,null,null,null,null,null,{"$f":"IF($J200=\"\",\"\",IF($L200=\"Courant\",Donnees!$A$3,IF($L200=\"terminé\",Donnees!$A$4,IF($L201=\"Non débuté\",\"\"))))","v":""},{"$f":"IF($J200=\"\",\"\",IF($I200>Trimestre!$D$2,\"Non débuté\",IF(Trimestre!$D$2>$J200,\"Terminé\",\"Courant\")))","v":""}]
[null,null,null,null,null,null,null,null,null,null,{"$f":"IF($J201=\"\",\"\",IF($L201=\"Courant\",Donnees!$A$3,IF($L201=\"terminé\",Donnees!$A$4,IF($L202=\"Non débuté\",\"\"))))","v":""},{"$f":"IF($J201=\"\",\"\",IF($I201>Trimestre!$D$2,\"Non débuté\",IF(Trimestre!$D$2>$J201,\"Terminé\",\"Courant\")))","v":""}]
[null,null,null,null,null,null,null,null,null,null,{"$f":"IF($J202=\"\",\"\",IF($L202=\"Courant\",Donnees!$A$3,IF($L202=\"terminé\",Donnees!$A$4,IF($L203=\"Non débuté\",\"\"))))","v":""},{"$f":"IF($J202=\"\",\"\",IF($I202>Trimestre!$D$2,\"Non débuté\",IF(Trimestre!$D$2>$J202,\"Terminé\",\"Courant\")))","v":""}]
[null,null,null,null,null,null,null,null,null,null,{"$f":"IF($J203=\"\",\"\",IF($L203=\"Courant\",Donnees!$A$3,IF($L203=\"terminé\",Donnees!$A$4,IF($L204=\"Non débuté\",\"\"))))","v":""},{"$f":"IF($J203=\"\",\"\",IF($I203>Trimestre!$D$2,\"Non débuté\",IF(Trimestre!$D$2>$J203,\"Terminé\",\"Courant\")))","v":""}]
[null,null,null,null,null,null,null,null,null,null,{"$f":"IF($J204=\"\",\"\",IF($L204=\"Courant\",Donnees!$A$3,IF($L204=\"terminé\",Donnees!$A$4,IF($L205=\"Non débuté\",\"\"))))","v":""},{"$f":"IF($J204=\"\",\"\",IF($I204>Trimestre!$D$2,\"Non débuté\",IF(Trimestre!$D$2>$J204,\"Terminé\",\"Courant\")))","v":""}]
[null,null,null,null,null,null,null,null,null,null,{"$f":"IF($J205=\"\",\"\",IF($L205=\"Courant\",Donnees!$A$3,IF($L205=\"terminé\",Donnees!$A$4,IF($L206=\"Non débuté\",\"\"))))","v":""},{"$f":"IF($J205=\"\",\"\",IF($I205>Trimestre!$D$2,\"Non débuté\",IF(Trimestre!$D$2>$J205,\"Terminé\",\"Courant\")))","v":""}]
[null,null,null,null,null,null,null,null,null,null,{"$f":"IF($J206=\"\",\"\",IF($L206=\"Courant\",Donnees!$A$3,IF($L206=\"terminé\",Donnees!$A$4,IF($L207=\"Non débuté\",\"\"))))","v":""},{"$f":"IF($J206=\"\",\"\",IF($I206>Trimestre!$D$2,\"Non débuté\",IF(Trimestre!$D$2>$J206,\"Terminé\",\"Courant\")))","v":""}]
[null,null,null,null,null,null,null,null,null,null,{"$f":"IF($J207=\"\",\"\",IF($L207=\"Courant\",Donnees!$A$3,IF($L207=\"terminé\",Donnees!$A$4,IF($L208=\"Non débuté\",\"\"))))","v":""},{"$f":"IF($J207=\"\",\"\",IF($I207>Trimestre!$D$2,\"Non débuté\",IF(Trimestre!$D$2>$J207,\"Terminé\",\"Courant\")))","v":""}]
[null,null,null,null,null,null,null,null,null,null,{"$f":"IF($J208=\"\",\"\",IF($L208=\"Courant\",Donnees!$A$3,IF($L208=\"terminé\",Donnees!$A$4,IF($L209=\"Non débuté\",\"\"))))","v":""},{"$f":"IF($J208=\"\",\"\",IF($I208>Trimestre!$D$2,\"Non débuté\",IF(Trimestre!$D$2>$J208,\"Terminé\",\"Courant\")))","v":""}]
[null,null,null,null,null,null,null,null,null,null,{"$f":"IF($J209=\"\",\"\",IF($L209=\"Courant\",Donnees!$A$3,IF($L209=\"terminé\",Donnees!$A$4,IF($L210=\"Non débuté\",\"\"))))","v":""},{"$f":"IF($J209=\"\",\"\",IF($I209>Trimestre!$D$2,\"Non débuté\",IF(Trimestre!$D$2>$J209,\"Terminé\",\"Courant\")))","v":""}]
[null,null,null,null,null,null,null,null,null,null,{"$f":"IF($J210=\"\",\"\",IF($L210=\"Courant\",Donnees!$A$3,IF($L210=\"terminé\",Donnees!$A$4,IF($L211=\"Non débuté\",\"\"))))","v":""},{"$f":"IF($J210=\"\",\"\",IF($I210>Trimestre!$D$2,\"Non débuté\",IF(Trimestre!$D$2>$J210,\"Terminé\",\"Courant\")))","v":""}]
[null,null,null,null,null,null,null,null,null,null,{"$f":"IF($J211=\"\",\"\",IF($L211=\"Courant\",Donnees!$A$3,IF($L211=\"terminé\",Donnees!$A$4,IF($L212=\"Non débuté\",\"\"))))","v":""},{"$f":"IF($J211=\"\",\"\",IF($I211>Trimestre!$D$2,\"Non débuté\",IF(Trimestre!$D$2>$J211,\"Terminé\",\"Courant\")))","v":""}]
[null,null,null,null,null,null,null,null,null,null,{"$f":"IF($J212=\"\",\"\",IF($L212=\"Courant\",Donnees!$A$3,IF($L212=\"terminé\",Donnees!$A$4,IF($L213=\"Non débuté\",\"\"))))","v":""},{"$f":"IF($J212=\"\",\"\",IF($I212>Trimestre!$D$2,\"Non débuté\",IF(Trimestre!$D$2>$J212,\"Terminé\",\"Courant\")))","v":""}]
[null,null,null,null,null,null,null,null,null,null,{"$f":"IF($J213=\"\",\"\",IF($L213=\"Courant\",Donnees!$A$3,IF($L213=\"terminé\",Donnees!$A$4,IF($L214=\"Non débuté\",\"\"))))","v":""},{"$f":"IF($J213=\"\",\"\",IF($I213>Trimestre!$D$2,\"Non débuté\",IF(Trimestre!$D$2>$J213,\"Terminé\",\"Courant\")))","v":""}]
[null,null,null,null,null,null,null,null,null,null,{"$f":"IF($J214=\"\",\"\",IF($L214=\"Courant\",Donnees!$A$3,IF($L214=\"terminé\",Donnees!$A$4,IF($L215=\"Non débuté\",\"\"))))","v":""},{"$f":"IF($J214=\"\",\"\",IF($I214>Trimestre!$D$2,\"Non débuté\",IF(Trimestre!$D$2>$J214,\"Terminé\",\"Courant\")))","v":""}]
[null,null,null,null,null,null,null,null,null,null,{"$f":"IF($J215=\"\",\"\",IF($L215=\"Courant\",Donnees!$A$3,IF($L215=\"terminé\",Donnees!$A$4,IF($L216=\"Non débuté\",\"\"))))","v":""},{"$f":"IF($J215=\"\",\"\",IF($I215>Trimestre!$D$2,\"Non débuté\",IF(Trimestre!$D$2>$J215,\"Terminé\",\"Courant\")))","v":""}]
[null,null,null,null,null,null,null,null,null,null,{"$f":"IF($J216=\"\",\"\",IF($L216=\"Courant\",Donnees!$A$3,IF($L216=\"terminé\",Donnees!$A$4,IF($L217=\"Non débuté\",\"\"))))","v":""},{"$f":"IF($J216=\"\",\"\",IF($I216>Trimestre!$D$2,\"Non débuté\",IF(Trimestre!$D$2>$J216,\"Terminé\",\"Courant\")))","v":""}]
[null,null,null,null,null,null,null,null,null,null,{"$f":"IF($J217=\"\",\"\",IF($L217=\"Courant\",Donnees!$A$3,IF($L217=\"terminé\",Donnees!$A$4,IF($L218=\"Non débuté\",\"\"))))","v":""},{"$f":"IF($J217=\"\",\"\",IF($I217>Trimestre!$D$2,\"Non débuté\",IF(Trimestre!$D$2>$J217,\"Terminé\",\"Courant\")))","v":""}]
[null,null,null,null,null,null,null,null,null,null,{"$f":"IF($J218=\"\",\"\",IF($L218=\"Courant\",Donnees!$A$3,IF($L218=\"terminé\",Donnees!$A$4,IF($L219=\"Non débuté\",\"\"))))","v":""},{"$f":"IF($J218=\"\",\"\",IF($I218>Trimestre!$D$2,\"Non débuté\",IF(Trimestre!$D$2>$J218,\"Terminé\",\"Courant\")))","v":""}]
[null,null,null,null,null,null,null,null,null,null,{"$f":"IF($J219=\"\",\"\",IF($L219=\"Courant\",Donnees!$A$3,IF($L219=\"terminé\",Donnees!$A$4,IF($L220=\"Non débuté\",\"\"))))","v":""},{"$f":"IF($J219=\"\",\"\",IF($I219>Trimestre!$D$2,\"Non débuté\",IF(Trimestre!$D$2>$J219,\"Terminé\",\"Courant\")))","v":""}]
[null,null,null,null,null,null,null,null,null,null,{"$f":"IF($J220=\"\",\"\",IF($L220=\"Courant\",Donnees!$A$3,IF($L220=\"terminé\",Donnees!$A$4,IF($L221=\"Non débuté\",\"\"))))","v":""},{"$f":"IF($J220=\"\",\"\",IF($I220>Trimestre!$D$2,\"Non débuté\",IF(Trimestre!$D$2>$J220,\"Terminé\",\"Courant\")))","v":""}]
[null,null,null,null,null,null,null,null,null,null,{"$f":"IF($J221=\"\",\"\",IF($L221=\"Courant\",Donnees!$A$3,IF($L221=\"terminé\",Donnees!$A$4,IF($L222=\"Non débuté\",\"\"))))","v":""},{"$f":"IF($J221=\"\",\"\",IF($I221>Trimestre!$D$2,\"Non débuté\",IF(Trimestre!$D$2>$J221,\"Terminé\",\"Courant\")))","v":""}]
[null,null,null,null,null,null,null,null,null,null,{"$f":"IF($J222=\"\",\"\",IF($L222=\"Courant\",Donnees!$A$3,IF($L222=\"terminé\",Donnees!$A$4,IF($L223=\"Non débuté\",\"\"))))","v":""},{"$f":"IF($J222=\"\",\"\",IF($I222>Trimestre!$D$2,\"Non débuté\",IF(Trimestre!$D$2>$J222,\"Terminé\",\"Courant\")))","v":""}]
[null,null,null,null,null,null,null,null,null,null,{"$f":"IF($J223=\"\",\"\",IF($L223=\"Courant\",Donnees!$A$3,IF($L223=\"terminé\",Donnees!$A$4,IF($L224=\"Non débuté\",\"\"))))","v":""},{"$f":"IF($J223=\"\",\"\",IF($I223>Trimestre!$D$2,\"Non débuté\",IF(Trimestre!$D$2>$J223,\"Terminé\",\"Courant\")))","v":""}]
[null,null,null,null,null,null,null,null,null,null,{"$f":"IF($J224=\"\",\"\",IF($L224=\"Courant\",Donnees!$A$3,IF($L224=\"terminé\",Donnees!$A$4,IF($L225=\"Non débuté\",\"\"))))","v":""},{"$f":"IF($J224=\"\",\"\",IF($I224>Trimestre!$D$2,\"Non débuté\",IF(Trimestre!$D$2>$J224,\"Terminé\",\"Courant\")))","v":""}]
[null,null,null,null,null,null,null,null,null,null,{"$f":"IF($J225=\"\",\"\",IF($L225=\"Courant\",Donnees!$A$3,IF($L225=\"terminé\",Donnees!$A$4,IF($L226=\"Non débuté\",\"\"))))","v":""},{"$f":"IF($J225=\"\",\"\",IF($I225>Trimestre!$D$2,\"Non débuté\",IF(Trimestre!$D$2>$J225,\"Terminé\",\"Courant\")))","v":""}]
[null,null,null,null,null,null,null,null,null,null,{"$f":"IF($J226=\"\",\"\",IF($L226=\"Courant\",Donnees!$A$3,IF($L226=\"terminé\",Donnees!$A$4,IF($L227=\"Non débuté\",\"\"))))","v":""},{"$f":"IF($J226=\"\",\"\",IF($I226>Trimestre!$D$2,\"Non débuté\",IF(Trimestre!$D$2>$J226,\"Terminé\",\"Courant\")))","v":""}]
[null,null,null,null,null,null,null,null,null,null,{"$f":"IF($J227=\"\",\"\",IF($L227=\"Courant\",Donnees!$A$3,IF($L227=\"terminé\",Donnees!$A$4,IF($L228=\"Non débuté\",\"\"))))","v":""},{"$f":"IF($J227=\"\",\"\",IF($I227>Trimestre!$D$2,\"Non débuté\",IF(Trimestre!$D$2>$J227,\"Terminé\",\"Courant\")))","v":""}]
[null,null,null,null,null,null,null,null,null,null,{"$f":"IF($J228=\"\",\"\",IF($L228=\"Courant\",Donnees!$A$3,IF($L228=\"terminé\",Donnees!$A$4,IF($L229=\"Non débuté\",\"\"))))","v":""},{"$f":"IF($J228=\"\",\"\",IF($I228>Trimestre!$D$2,\"Non débuté\",IF(Trimestre!$D$2>$J228,\"Terminé\",\"Courant\")))","v":""}]
[null,null,null,null,null,null,null,null,null,null,{"$f":"IF($J229=\"\",\"\",IF($L229=\"Courant\",Donnees!$A$3,IF($L229=\"terminé\",Donnees!$A$4,IF($L230=\"Non débuté\",\"\"))))","v":""},{"$f":"IF($J229=\"\",\"\",IF($I229>Trimestre!$D$2,\"Non débuté\",IF(Trimestre!$D$2>$J229,\"Terminé\",\"Courant\")))","v":""}]
[null,null,null,null,null,null,null,null,null,null,{"$f":"IF($J230=\"\",\"\",IF($L230=\"Courant\",Donnees!$A$3,IF($L230=\"terminé\",Donnees!$A$4,IF($L231=\"Non débuté\",\"\"))))","v":""},{"$f":"IF($J230=\"\",\"\",IF($I230>Trimestre!$D$2,\"Non débuté\",IF(Trimestre!$D$2>$J230,\"Terminé\",\"Courant\")))","v":""}]
[null,null,null,null,null,null,null,null,null,null,{"$f":"IF($J231=\"\",\"\",IF($L231=\"Courant\",Donnees!$A$3,IF($L231=\"terminé\",Donnees!$A$4,IF($L232=\"Non débuté\",\"\"))))","v":""},{"$f":"IF($J231=\"\",\"\",IF($I231>Trimestre!$D$2,\"Non débuté\",IF(Trimestre!$D$2>$J231,\"Terminé\",\"Courant\")))","v":""}]
[null,null,null,null,null,null,null,null,null,null,{"$f":"IF($J232=\"\",\"\",IF($L232=\"Courant\",Donnees!$A$3,IF($L232=\"terminé\",Donnees!$A$4,IF($L233=\"Non débuté\",\"\"))))","v":""},{"$f":"IF($J232=\"\",\"\",IF($I232>Trimestre!$D$2,\"Non débuté\",IF(Trimestre!$D$2>$J232,\"Terminé\",\"Courant\")))","v":""}]
[null,null,null,null,null,null,null,null,null,null,{"$f":"IF($J233=\"\",\"\",IF($L233=\"Courant\",Donnees!$A$3,IF($L233=\"terminé\",Donnees!$A$4,IF($L234=\"Non débuté\",\"\"))))","v":""},{"$f":"IF($J233=\"\",\"\",IF($I233>Trimestre!$D$2,\"Non débuté\",IF(Trimestre!$D$2>$J233,\"Terminé\",\"Courant\")))","v":""}]
[null,null,null,null,null,null,null,null,null,null,{"$f":"IF($J234=\"\",\"\",IF($L234=\"Courant\",Donnees!$A$3,IF($L234=\"terminé\",Donnees!$A$4,IF($L235=\"Non débuté\",\"\"))))","v":""},{"$f":"IF($J234=\"\",\"\",IF($I234>Trimestre!$D$2,\"Non débuté\",IF(Trimestre!$D$2>$J234,\"Terminé\",\"Courant\")))","v":""}]
[null,null,null,null,null,null,null,null,null,null,{"$f":"IF($J235=\"\",\"\",IF($L235=\"Courant\",Donnees!$A$3,IF($L235=\"terminé\",Donnees!$A$4,IF($L236=\"Non débuté\",\"\"))))","v":""},{"$f":"IF($J235=\"\",\"\",IF($I235>Trimestre!$D$2,\"Non débuté\",IF(Trimestre!$D$2>$J235,\"Terminé\",\"Courant\")))","v":""}]
[null,null,null,null,null,null,null,null,null,null,{"$f":"IF($J236=\"\",\"\",IF($L236=\"Courant\",Donnees!$A$3,IF($L236=\"terminé\",Donnees!$A$4,IF($L237=\"Non débuté\",\"\"))))","v":""},{"$f":"IF($J236=\"\",\"\",IF($I236>Trimestre!$D$2,\"Non débuté\",IF(Trimestre!$D$2>$J236,\"Terminé\",\"Courant\")))","v":""}]
[null,null,null,null,null,null,null,null,null,null,{"$f":"IF($J237=\"\",\"\",IF($L237=\"Courant\",Donnees!$A$3,IF($L237=\"terminé\",Donnees!$A$4,IF($L238=\"Non débuté\",\"\"))))","v":""},{"$f":"IF($J237=\"\",\"\",IF($I237>Trimestre!$D$2,\"Non débuté\",IF(Trimestre!$D$2>$J237,\"Terminé\",\"Courant\")))","v":""}]
[null,null,null,null,null,null,null,null,null,null,{"$f":"IF($J238=\"\",\"\",IF($L238=\"Courant\",Donnees!$A$3,IF($L238=\"terminé\",Donnees!$A$4,IF($L239=\"Non débuté\",\"\"))))","v":""},{"$f":"IF($J238=\"\",\"\",IF($I238>Trimestre!$D$2,\"Non débuté\",IF(Trimestre!$D$2>$J238,\"Terminé\",\"Courant\")))","v":""}]
[null,null,null,null,null,null,null,null,null,null,{"$f":"IF($J239=\"\",\"\",IF($L239=\"Courant\",Donnees!$A$3,IF($L239=\"terminé\",Donnees!$A$4,IF($L240=\"Non débuté\",\"\"))))","v":""},{"$f":"IF($J239=\"\",\"\",IF($I239>Trimestre!$D$2,\"Non débuté\",IF(Trimestre!$D$2>$J239,\"Terminé\",\"Courant\")))","v":""}]
[null,null,null,null,null,null,null,null,null,null,{"$f":"IF($J240=\"\",\"\",IF($L240=\"Courant\",Donnees!$A$3,IF($L240=\"terminé\",Donnees!$A$4,IF($L241=\"Non débuté\",\"\"))))","v":""},{"$f":"IF($J240=\"\",\"\",IF($I240>Trimestre!$D$2,\"Non débuté\",IF(Trimestre!$D$2>$J240,\"Terminé\",\"Courant\")))","v":""}]
[null,null,null,null,null,null,null,null,null,null,{"$f":"IF($J241=\"\",\"\",IF($L241=\"Courant\",Donnees!$A$3,IF($L241=\"terminé\",Donnees!$A$4,IF($L242=\"Non débuté\",\"\"))))","v":""},{"$f":"IF($J241=\"\",\"\",IF($I241>Trimestre!$D$2,\"Non débuté\",IF(Trimestre!$D$2>$J241,\"Terminé\",\"Courant\")))","v":""}]
[null,null,null,null,null,null,null,null,null,null,{"$f":"IF($J242=\"\",\"\",IF($L242=\"Courant\",Donnees!$A$3,IF($L242=\"terminé\",Donnees!$A$4,IF($L243=\"Non débuté\",\"\"))))","v":""},{"$f":"IF($J242=\"\",\"\",IF($I242>Trimestre!$D$2,\"Non débuté\",IF(Trimestre!$D$2>$J242,\"Terminé\",\"Courant\")))","v":""}]
[null,null,null,null,null,null,null,null,null,null,{"$f":"IF($J243=\"\",\"\",IF($L243=\"Courant\",Donnees!$A$3,IF($L243=\"terminé\",Donnees!$A$4,IF($L244=\"Non débuté\",\"\"))))","v":""},{"$f":"IF($J243=\"\",\"\",IF($I243>Trimestre!$D$2,\"Non débuté\",IF(Trimestre!$D$2>$J243,\"Terminé\",\"Courant\")))","v":""}]
[null,null,null,null,null,null,null,null,null,null,{"$f":"IF($J244=\"\",\"\",IF($L244=\"Courant\",Donnees!$A$3,IF($L244=\"terminé\",Donnees!$A$4,IF($L245=\"Non débuté\",\"\"))))","v":""},{"$f":"IF($J244=\"\",\"\",IF($I244>Trimestre!$D$2,\"Non débuté\",IF(Trimestre!$D$2>$J244,\"Terminé\",\"Courant\")))","v":""}]
[null,null,null,null,null,null,null,null,null,null,{"$f":"IF($J245=\"\",\"\",IF($L245=\"Courant\",Donnees!$A$3,IF($L245=\"terminé\",Donnees!$A$4,IF($L246=\"Non débuté\",\"\"))))","v":""},{"$f":"IF($J245=\"\",\"\",IF($I245>Trimestre!$D$2,\"Non débuté\",IF(Trimestre!$D$2>$J245,\"Terminé\",\"Courant\")))","v":""}]
[null,null,null,null,null,null,null,null,null,null,{"$f":"IF($J246=\"\",\"\",IF($L246=\"Courant\",Donnees!$A$3,IF($L246=\"terminé\",Donnees!$A$4,IF($L247=\"Non débuté\",\"\"))))","v":""},{"$f":"IF($J246=\"\",\"\",IF($I246>Trimestre!$D$2,\"Non débuté\",IF(Trimestre!$D$2>$J246,\"Terminé\",\"Courant\")))","v":""}]
[null,null,null,null,null,null,null,null,null,null,{"$f":"IF($J247=\"\",\"\",IF($L247=\"Courant\",Donnees!$A$3,IF($L247=\"terminé\",Donnees!$A$4,IF($L248=\"Non débuté\",\"\"))))","v":""},{"$f":"IF($J247=\"\",\"\",IF($I247>Trimestre!$D$2,\"Non débuté\",IF(Trimestre!$D$2>$J247,\"Terminé\",\"Courant\")))","v":""}]
[null,null,null,null,null,null,null,null,null,null,{"$f":"IF($J248=\"\",\"\",IF($L248=\"Courant\",Donnees!$A$3,IF($L248=\"terminé\",Donnees!$A$4,IF($L249=\"Non débuté\",\"\"))))","v":""},{"$f":"IF($J248=\"\",\"\",IF($I248>Trimestre!$D$2,\"Non débuté\",IF(Trimestre!$D$2>$J248,\"Terminé\",\"Courant\")))","v":""}]
[null,null,null,null,null,null,null,null,null,null,{"$f":"IF($J249=\"\",\"\",IF($L249=\"Courant\",Donnees!$A$3,IF($L249=\"terminé\",Donnees!$A$4,IF($L250=\"Non débuté\",\"\"))))","v":""},{"$f":"IF($J249=\"\",\"\",IF($I249>Trimestre!$D$2,\"Non débuté\",IF(Trimestre!$D$2>$J249,\"Terminé\",\"Courant\")))","v":""}]
[null,null,null,null,null,null,null,null,null,null,{"$f":"IF($J250=\"\",\"\",IF($L250=\"Courant\",Donnees!$A$3,IF($L250=\"terminé\",Donnees!$A$4,IF($L251=\"Non débuté\",\"\"))))","v":""},{"$f":"IF($J250=\"\",\"\",IF($I250>Trimestre!$D$2,\"Non débuté\",IF(Trimestre!$D$2>$J250,\"Terminé\",\"Courant\")))","v":""}]
[null,null,null,null,null,null,null,null,null,null,{"$f":"IF($J251=\"\",\"\",IF($L251=\"Courant\",Donnees!$A$3,IF($L251=\"terminé\",Donnees!$A$4,IF($L252=\"Non débuté\",\"\"))))","v":""},{"$f":"IF($J251=\"\",\"\",IF($I251>Trimestre!$D$2,\"Non débuté\",IF(Trimestre!$D$2>$J251,\"Terminé\",\"Courant\")))","v":""}]
[null,null,null,null,null,null,null,null,null,null,{"$f":"IF($J252=\"\",\"\",IF($L252=\"Courant\",Donnees!$A$3,IF($L252=\"terminé\",Donnees!$A$4,IF($L253=\"Non débuté\",\"\"))))","v":""},{"$f":"IF($J252=\"\",\"\",IF($I252>Trimestre!$D$2,\"Non débuté\",IF(Trimestre!$D$2>$J252,\"Terminé\",\"Courant\")))","v":""}]
[null,null,null,null,null,null,null,null,null,null,{"$f":"IF($J253=\"\",\"\",IF($L253=\"Courant\",Donnees!$A$3,IF($L253=\"terminé\",Donnees!$A$4,IF($L254=\"Non débuté\",\"\"))))","v":""},{"$f":"IF($J253=\"\",\"\",IF($I253>Trimestre!$D$2,\"Non débuté\",IF(Trimestre!$D$2>$J253,\"Terminé\",\"Courant\")))","v":""}]
[null,null,null,null,null,null,null,null,null,null,{"$f":"IF($J254=\"\",\"\",IF($L254=\"Courant\",Donnees!$A$3,IF($L254=\"terminé\",Donnees!$A$4,IF($L255=\"Non débuté\",\"\"))))","v":""},{"$f":"IF($J254=\"\",\"\",IF($I254>Trimestre!$D$2,\"Non débuté\",IF(Trimestre!$D$2>$J254,\"Terminé\",\"Courant\")))","v":""}]
[null,null,null,null,null,null,null,null,null,null,{"$f":"IF($J255=\"\",\"\",IF($L255=\"Courant\",Donnees!$A$3,IF($L255=\"terminé\",Donnees!$A$4,IF($L256=\"Non débuté\",\"\"))))","v":""},{"$f":"IF($J255=\"\",\"\",IF($I255>Trimestre!$D$2,\"Non débuté\",IF(Trimestre!$D$2>$J255,\"Terminé\",\"Courant\")))","v":""}]
[null,null,null,null,null,null,null,null,null,null,{"$f":"IF($J256=\"\",\"\",IF($L256=\"Courant\",Donnees!$A$3,IF($L256=\"terminé\",Donnees!$A$4,IF($L257=\"Non débuté\",\"\"))))","v":""},{"$f":"IF($J256=\"\",\"\",IF($I256>Trimestre!$D$2,\"Non débuté\",IF(Trimestre!$D$2>$J256,\"Terminé\",\"Courant\")))","v":""}]
[null,null,null,null,null,null,null,null,null,null,{"$f":"IF($J257=\"\",\"\",IF($L257=\"Courant\",Donnees!$A$3,IF($L257=\"terminé\",Donnees!$A$4,IF($L258=\"Non débuté\",\"\"))))","v":""},{"$f":"IF($J257=\"\",\"\",IF($I257>Trimestre!$D$2,\"Non débuté\",IF(Trimestre!$D$2>$J257,\"Terminé\",\"Courant\")))","v":""}]
[null,null,null,null,null,null,null,null,null,null,{"$f":"IF($J258=\"\",\"\",IF($L258=\"Courant\",Donnees!$A$3,IF($L258=\"terminé\",Donnees!$A$4,IF($L259=\"Non débuté\",\"\"))))","v":""},{"$f":"IF($J258=\"\",\"\",IF($I258>Trimestre!$D$2,\"Non débuté\",IF(Trimestre!$D$2>$J258,\"Terminé\",\"Courant\")))","v":""}]
[null,null,null,null,null,null,null,null,null,null,{"$f":"IF($J259=\"\",\"\",IF($L259=\"Courant\",Donnees!$A$3,IF($L259=\"terminé\",Donnees!$A$4,IF($L260=\"Non débuté\",\"\"))))","v":""},{"$f":"IF($J259=\"\",\"\",IF($I259>Trimestre!$D$2,\"Non débuté\",IF(Trimestre!$D$2>$J259,\"Terminé\",\"Courant\")))","v":""}]
[null,null,null,null,null,null,null,null,null,null,{"$f":"IF($J260=\"\",\"\",IF($L260=\"Courant\",Donnees!$A$3,IF($L260=\"terminé\",Donnees!$A$4,IF($L261=\"Non débuté\",\"\"))))","v":""},{"$f":"IF($J260=\"\",\"\",IF($I260>Trimestre!$D$2,\"Non débuté\",IF(Trimestre!$D$2>$J260,\"Terminé\",\"Courant\")))","v":""}]
[null,null,null,null,null,null,null,null,null,null,{"$f":"IF($J261=\"\",\"\",IF($L261=\"Courant\",Donnees!$A$3,IF($L261=\"terminé\",Donnees!$A$4,IF($L262=\"Non débuté\",\"\"))))","v":""},{"$f":"IF($J261=\"\",\"\",IF($I261>Trimestre!$D$2,\"Non débuté\",IF(Trimestre!$D$2>$J261,\"Terminé\",\"Courant\")))","v":""}]
[null,null,null,null,null,null,null,null,null,null,{"$f":"IF($J262=\"\",\"\",IF($L262=\"Courant\",Donnees!$A$3,IF($L262=\"terminé\",Donnees!$A$4,IF($L263=\"Non débuté\",\"\"))))","v":""},{"$f":"IF($J262=\"\",\"\",IF($I262>Trimestre!$D$2,\"Non débuté\",IF(Trimestre!$D$2>$J262,\"Terminé\",\"Courant\")))","v":""}]
[null,null,null,null,null,null,null,null,null,null,{"$f":"IF($J263=\"\",\"\",IF($L263=\"Courant\",Donnees!$A$3,IF($L263=\"terminé\",Donnees!$A$4,IF($L264=\"Non débuté\",\"\"))))","v":""},{"$f":"IF($J263=\"\",\"\",IF($I263>Trimestre!$D$2,\"Non débuté\",IF(Trimestre!$D$2>$J263,\"Terminé\",\"Courant\")))","v":""}]
[null,null,null,null,null,null,null,null,null,null,{"$f":"IF($J264=\"\",\"\",IF($L264=\"Courant\",Donnees!$A$3,IF($L264=\"terminé\",Donnees!$A$4,IF($L265=\"Non débuté\",\"\"))))","v":""},{"$f":"IF($J264=\"\",\"\",IF($I264>Trimestre!$D$2,\"Non débuté\",IF(Trimestre!$D$2>$J264,\"Terminé\",\"Courant\")))","v":""}]
[null,null,null,null,null,null,null,null,null,null,{"$f":"IF($J265=\"\",\"\",IF($L265=\"Courant\",Donnees!$A$3,IF($L265=\"terminé\",Donnees!$A$4,IF($L266=\"Non débuté\",\"\"))))","v":""},{"$f":"IF($J265=\"\",\"\",IF($I265>Trimestre!$D$2,\"Non débuté\",IF(Trimestre!$D$2>$J265,\"Terminé\",\"Courant\")))","v":""}]
[null,null,null,null,null,null,null,null,null,null,{"$f":"IF($J266=\"\",\"\",IF($L266=\"Courant\",Donnees!$A$3,IF($L266=\"terminé\",Donnees!$A$4,IF($L267=\"Non débuté\",\"\"))))","v":""},{"$f":"IF($J266=\"\",\"\",IF($I266>Trimestre!$D$2,\"Non débuté\",IF(Trimestre!$D$2>$J266,\"Terminé\",\"Courant\")))","v":""}]
[null,null,null,null,null,null,null,null,null,null,{"$f":"IF($J267=\"\",\"\",IF($L267=\"Courant\",Donnees!$A$3,IF($L267=\"terminé\",Donnees!$A$4,IF($L268=\"Non débuté\",\"\"))))","v":""},{"$f":"IF($J267=\"\",\"\",IF($I267>Trimestre!$D$2,\"Non débuté\",IF(Trimestre!$D$2>$J267,\"Terminé\",\"Courant\")))","v":""}]
[null,null,null,null,null,null,null,null,null,null,{"$f":"IF($J268=\"\",\"\",IF($L268=\"Courant\",Donnees!$A$3,IF($L268=\"terminé\",Donnees!$A$4,IF($L269=\"Non débuté\",\"\"))))","v":""},{"$f":"IF($J268=\"\",\"\",IF($I268>Trimestre!$D$2,\"Non débuté\",IF(Trimestre!$D$2>$J268,\"Terminé\",\"Courant\")))","v":""}]
[null,null,null,null,null,null,null,null,null,null,{"$f":"IF($J269=\"\",\"\",IF($L269=\"Courant\",Donnees!$A$3,IF($L269=\"terminé\",Donnees!$A$4,IF($L270=\"Non débuté\",\"\"))))","v":""},{"$f":"IF($J269=\"\",\"\",IF($I269>Trimestre!$D$2,\"Non débuté\",IF(Trimestre!$D$2>$J269,\"Terminé\",\"Courant\")))","v":""}]
[null,null,null,null,null,null,null,null,null,null,{"$f":"IF($J270=\"\",\"\",IF($L270=\"Courant\",Donnees!$A$3,IF($L270=\"terminé\",Donnees!$A$4,IF($L271=\"Non débuté\",\"\"))))","v":""},{"$f":"IF($J270=\"\",\"\",IF($I270>Trimestre!$D$2,\"Non débuté\",IF(Trimestre!$D$2>$J270,\"Terminé\",\"Courant\")))","v":""}]
[null,null,null,null,null,null,null,null,null,null,{"$f":"IF($J271=\"\",\"\",IF($L271=\"Courant\",Donnees!$A$3,IF($L271=\"terminé\",Donnees!$A$4,IF($L272=\"Non débuté\",\"\"))))","v":""},{"$f":"IF($J271=\"\",\"\",IF($I271>Trimestre!$D$2,\"Non débuté\",IF(Trimestre!$D$2>$J271,\"Terminé\",\"Courant\")))","v":""}]
[null,null,null,null,null,null,null,null,null,null,{"$f":"IF($J272=\"\",\"\",IF($L272=\"Courant\",Donnees!$A$3,IF($L272=\"terminé\",Donnees!$A$4,IF($L273=\"Non débuté\",\"\"))))","v":""},{"$f":"IF($J272=\"\",\"\",IF($I272>Trimestre!$D$2,\"Non débuté\",IF(Trimestre!$D$2>$J272,\"Terminé\",\"Courant\")))","v":""}]
[null,null,null,null,null,null,null,null,null,null,{"$f":"IF($J273=\"\",\"\",IF($L273=\"Courant\",Donnees!$A$3,IF($L273=\"terminé\",Donnees!$A$4,IF($L274=\"Non débuté\",\"\"))))","v":""},{"$f":"IF($J273=\"\",\"\",IF($I273>Trimestre!$D$2,\"Non débuté\",IF(Trimestre!$D$2>$J273,\"Terminé\",\"Courant\")))","v":""}]
[null,null,null,null,null,null,null,null,null,null,{"$f":"IF($J274=\"\",\"\",IF($L274=\"Courant\",Donnees!$A$3,IF($L274=\"terminé\",Donnees!$A$4,IF($L275=\"Non débuté\",\"\"))))","v":""},{"$f":"IF($J274=\"\",\"\",IF($I274>Trimestre!$D$2,\"Non débuté\",IF(Trimestre!$D$2>$J274,\"Terminé\",\"Courant\")))","v":""}]
[null,null,null,null,null,null,null,null,null,null,{"$f":"IF($J275=\"\",\"\",IF($L275=\"Courant\",Donnees!$A$3,IF($L275=\"terminé\",Donnees!$A$4,IF($L276=\"Non débuté\",\"\"))))","v":""},{"$f":"IF($J275=\"\",\"\",IF($I275>Trimestre!$D$2,\"Non débuté\",IF(Trimestre!$D$2>$J275,\"Terminé\",\"Courant\")))","v":""}]
[null,null,null,null,null,null,null,null,null,null,{"$f":"IF($J276=\"\",\"\",IF($L276=\"Courant\",Donnees!$A$3,IF($L276=\"terminé\",Donnees!$A$4,IF($L277=\"Non débuté\",\"\"))))","v":""},{"$f":"IF($J276=\"\",\"\",IF($I276>Trimestre!$D$2,\"Non débuté\",IF(Trimestre!$D$2>$J276,\"Terminé\",\"Courant\")))","v":""}]
[null,null,null,null,null,null,null,null,null,null,{"$f":"IF($J277=\"\",\"\",IF($L277=\"Courant\",Donnees!$A$3,IF($L277=\"terminé\",Donnees!$A$4,IF($L278=\"Non débuté\",\"\"))))","v":""},{"$f":"IF($J277=\"\",\"\",IF($I277>Trimestre!$D$2,\"Non débuté\",IF(Trimestre!$D$2>$J277,\"Terminé\",\"Courant\")))","v":""}]
[null,null,null,null,null,null,null,null,null,null,{"$f":"IF($J278=\"\",\"\",IF($L278=\"Courant\",Donnees!$A$3,IF($L278=\"terminé\",Donnees!$A$4,IF($L279=\"Non débuté\",\"\"))))","v":""},{"$f":"IF($J278=\"\",\"\",IF($I278>Trimestre!$D$2,\"Non débuté\",IF(Trimestre!$D$2>$J278,\"Terminé\",\"Courant\")))","v":""}]
[null,null,null,null,null,null,null,null,null,null,{"$f":"IF($J279=\"\",\"\",IF($L279=\"Courant\",Donnees!$A$3,IF($L279=\"terminé\",Donnees!$A$4,IF($L280=\"Non débuté\",\"\"))))","v":""},{"$f":"IF($J279=\"\",\"\",IF($I279>Trimestre!$D$2,\"Non débuté\",IF(Trimestre!$D$2>$J279,\"Terminé\",\"Courant\")))","v":""}]
[null,null,null,null,null,null,null,null,null,null,{"$f":"IF($J280=\"\",\"\",IF($L280=\"Courant\",Donnees!$A$3,IF($L280=\"terminé\",Donnees!$A$4,IF($L281=\"Non débuté\",\"\"))))","v":""},{"$f":"IF($J280=\"\",\"\",IF($I280>Trimestre!$D$2,\"Non débuté\",IF(Trimestre!$D$2>$J280,\"Terminé\",\"Courant\")))","v":""}]
[null,null,null,null,null,null,null,null,null,null,{"$f":"IF($J281=\"\",\"\",IF($L281=\"Courant\",Donnees!$A$3,IF($L281=\"terminé\",Donnees!$A$4,IF($L282=\"Non débuté\",\"\"))))","v":""},{"$f":"IF($J281=\"\",\"\",IF($I281>Trimestre!$D$2,\"Non débuté\",IF(Trimestre!$D$2>$J281,\"Terminé\",\"Courant\")))","v":""}]
[null,null,null,null,null,null,null,null,null,null,{"$f":"IF($J282=\"\",\"\",IF($L282=\"Courant\",Donnees!$A$3,IF($L282=\"terminé\",Donnees!$A$4,IF($L283=\"Non débuté\",\"\"))))","v":""},{"$f":"IF($J282=\"\",\"\",IF($I282>Trimestre!$D$2,\"Non débuté\",IF(Trimestre!$D$2>$J282,\"Terminé\",\"Courant\")))","v":""}]
[null,null,null,null,null,null,null,null,null,null,{"$f":"IF($J283=\"\",\"\",IF($L283=\"Courant\",Donnees!$A$3,IF($L283=\"terminé\",Donnees!$A$4,IF($L284=\"Non débuté\",\"\"))))","v":""},{"$f":"IF($J283=\"\",\"\",IF($I283>Trimestre!$D$2,\"Non débuté\",IF(Trimestre!$D$2>$J283,\"Terminé\",\"Courant\")))","v":""}]
[null,null,null,null,null,null,null,null,null,null,{"$f":"IF($J284=\"\",\"\",IF($L284=\"Courant\",Donnees!$A$3,IF($L284=\"terminé\",Donnees!$A$4,IF($L285=\"Non débuté\",\"\"))))","v":""},{"$f":"IF($J284=\"\",\"\",IF($I284>Trimestre!$D$2,\"Non débuté\",IF(Trimestre!$D$2>$J284,\"Terminé\",\"Courant\")))","v":""}]
[null,null,null,null,null,null,null,null,null,null,{"$f":"IF($J285=\"\",\"\",IF($L285=\"Courant\",Donnees!$A$3,IF($L285=\"terminé\",Donnees!$A$4,IF($L286=\"Non débuté\",\"\"))))","v":""},{"$f":"IF($J285=\"\",\"\",IF($I285>Trimestre!$D$2,\"Non débuté\",IF(Trimestre!$D$2>$J285,\"Terminé\",\"Courant\")))","v":""}]
[null,null,null,null,null,null,null,null,null,null,{"$f":"IF($J286=\"\",\"\",IF($L286=\"Courant\",Donnees!$A$3,IF($L286=\"terminé\",Donnees!$A$4,IF($L287=\"Non débuté\",\"\"))))","v":""},{"$f":"IF($J286=\"\",\"\",IF($I286>Trimestre!$D$2,\"Non débuté\",IF(Trimestre!$D$2>$J286,\"Terminé\",\"Courant\")))","v":""}]
[null,null,null,null,null,null,null,null,null,null,{"$f":"IF($J287=\"\",\"\",IF($L287=\"Courant\",Donnees!$A$3,IF($L287=\"terminé\",Donnees!$A$4,IF($L288=\"Non débuté\",\"\"))))","v":""},{"$f":"IF($J287=\"\",\"\",IF($I287>Trimestre!$D$2,\"Non débuté\",IF(Trimestre!$D$2>$J287,\"Terminé\",\"Courant\")))","v":""}]
[null,null,null,null,null,null,null,null,null,null,{"$f":"IF($J288=\"\",\"\",IF($L288=\"Courant\",Donnees!$A$3,IF($L288=\"terminé\",Donnees!$A$4,IF($L289=\"Non débuté\",\"\"))))","v":""},{"$f":"IF($J288=\"\",\"\",IF($I288>Trimestre!$D$2,\"Non débuté\",IF(Trimestre!$D$2>$J288,\"Terminé\",\"Courant\")))","v":""}]
[null,null,null,null,null,null,null,null,null,null,{"$f":"IF($J289=\"\",\"\",IF($L289=\"Courant\",Donnees!$A$3,IF($L289=\"terminé\",Donnees!$A$4,IF($L290=\"Non débuté\",\"\"))))","v":""},{"$f":"IF($J289=\"\",\"\",IF($I289>Trimestre!$D$2,\"Non débuté\",IF(Trimestre!$D$2>$J289,\"Terminé\",\"Courant\")))","v":""}]
[null,null,null,null,null,null,null,null,null,null,{"$f":"IF($J290=\"\",\"\",IF($L290=\"Courant\",Donnees!$A$3,IF($L290=\"terminé\",Donnees!$A$4,IF($L291=\"Non débuté\",\"\"))))","v":""},{"$f":"IF($J290=\"\",\"\",IF($I290>Trimestre!$D$2,\"Non débuté\",IF(Trimestre!$D$2>$J290,\"Terminé\",\"Courant\")))","v":""}]
[null,null,null,null,null,null,null,null,null,null,{"$f":"IF($J291=\"\",\"\",IF($L291=\"Courant\",Donnees!$A$3,IF($L291=\"terminé\",Donnees!$A$4,IF($L292=\"Non débuté\",\"\"))))","v":""},{"$f":"IF($J291=\"\",\"\",IF($I291>Trimestre!$D$2,\"Non débuté\",IF(Trimestre!$D$2>$J291,\"Terminé\",\"Courant\")))","v":""}]
[null,null,null,null,null,null,null,null,null,null,{"$f":"IF($J292=\"\",\"\",IF($L292=\"Courant\",Donnees!$A$3,IF($L292=\"terminé\",Donnees!$A$4,IF($L293=\"Non débuté\",\"\"))))","v":""},{"$f":"IF($J292=\"\",\"\",IF($I292>Trimestre!$D$2,\"Non débuté\",IF(Trimestre!$D$2>$J292,\"Terminé\",\"Courant\")))","v":""}]
[null,null,null,null,null,null,null,null,null,null,{"$f":"IF($J293=\"\",\"\",IF($L293=\"Courant\",Donnees!$A$3,IF($L293=\"terminé\",Donnees!$A$4,IF($L294=\"Non débuté\",\"\"))))","v":""},{"$f":"IF($J293=\"\",\"\",IF($I293>Trimestre!$D$2,\"Non débuté\",IF(Trimestre!$D$2>$J293,\"Terminé\",\"Courant\")))","v":""}]
[null,null,null,null,null,null,null,null,null,null,{"$f":"IF($J294=\"\",\"\",IF($L294=\"Courant\",Donnees!$A$3,IF($L294=\"terminé\",Donnees!$A$4,IF($L295=\"Non débuté\",\"\"))))","v":""},{"$f":"IF($J294=\"\",\"\",IF($I294>Trimestre!$D$2,\"Non débuté\",IF(Trimestre!$D$2>$J294,\"Terminé\",\"Courant\")))","v":""}]
[null,null,null,null,null,null,null,null,null,null,{"$f":"IF($J295=\"\",\"\",IF($L295=\"Courant\",Donnees!$A$3,IF($L295=\"terminé\",Donnees!$A$4,IF($L296=\"Non débuté\",\"\"))))","v":""},{"$f":"IF($J295=\"\",\"\",IF($I295>Trimestre!$D$2,\"Non débuté\",IF(Trimestre!$D$2>$J295,\"Terminé\",\"Courant\")))","v":""}]
[null,null,null,null,null,null,null,null,null,null,{"$f":"IF($J296=\"\",\"\",IF($L296=\"Courant\",Donnees!$A$3,IF($L296=\"terminé\",Donnees!$A$4,IF($L297=\"Non débuté\",\"\"))))","v":""},{"$f":"IF($J296=\"\",\"\",IF($I296>Trimestre!$D$2,\"Non débuté\",IF(Trimestre!$D$2>$J296,\"Terminé\",\"Courant\")))","v":""}]
[null,null,null,null,null,null,null,null,null,null,{"$f":"IF($J297=\"\",\"\",IF($L297=\"Courant\",Donnees!$A$3,IF($L297=\"terminé\",Donnees!$A$4,IF($L298=\"Non débuté\",\"\"))))","v":""},{"$f":"IF($J297=\"\",\"\",IF($I297>Trimestre!$D$2,\"Non débuté\",IF(Trimestre!$D$2>$J297,\"Terminé\",\"Courant\")))","v":""}]
[null,null,null,null,null,null,null,null,null,null,{"$f":"IF($J298=\"\",\"\",IF($L298=\"Courant\",Donnees!$A$3,IF($L298=\"terminé\",Donnees!$A$4,IF($L299=\"Non débuté\",\"\"))))","v":""},{"$f":"IF($J298=\"\",\"\",IF($I298>Trimestre!$D$2,\"Non débuté\",IF(Trimestre!$D$2>$J298,\"Terminé\",\"Courant\")))","v":""}]
[null,null,null,null,null,null,null,null,null,null,{"$f":"IF($J299=\"\",\"\",IF($L299=\"Courant\",Donnees!$A$3,IF($L299=\"terminé\",Donnees!$A$4,IF($L300=\"Non débuté\",\"\"))))","v":""},{"$f":"IF($J299=\"\",\"\",IF($I299>Trimestre!$D$2,\"Non débuté\",IF(Trimestre!$D$2>$J299,\"Terminé\",\"Courant\")))","v":""}]
[null,null,null,null,null,null,null,null,null,null,{"$f":"IF($J300=\"\",\"\",IF($L300=\"Courant\",Donnees!$A$3,IF($L300=\"terminé\",Donnees!$A$4,IF($L301=\"Non débuté\",\"\"))))","v":""},{"$f":"IF($J300=\"\",\"\",IF($I300>Trimestre!$D$2,\"Non débuté\",IF(Trimestre!$D$2>$J300,\"Terminé\",\"Courant\")))","v":""}]
[null,null,null,null,null,null,null,null,null,null,{"$f":"IF($J301=\"\",\"\",IF($L301=\"Courant\",Donnees!$A$3,IF($L301=\"terminé\",Donnees!$A$4,IF($L302=\"Non débuté\",\"\"))))","v":""},{"$f":"IF($J301=\"\",\"\",IF($I301>Trimestre!$D$2,\"Non débuté\",IF(Trimestre!$D$2>$J301,\"Terminé\",\"Courant\")))","v":""}]
[null,null,null,null,null,null,null,null,null,null,{"$f":"IF($J302=\"\",\"\",IF($L302=\"Courant\",Donnees!$A$3,IF($L302=\"terminé\",Donnees!$A$4,IF($L303=\"Non débuté\",\"\"))))","v":""},{"$f":"IF($J302=\"\",\"\",IF($I302>Trimestre!$D$2,\"Non débuté\",IF(Trimestre!$D$2>$J302,\"Terminé\",\"Courant\")))","v":""}]
[null,null,null,null,null,null,null,null,null,null,{"$f":"IF($J303=\"\",\"\",IF($L303=\"Courant\",Donnees!$A$3,IF($L303=\"terminé\",Donnees!$A$4,IF($L304=\"Non débuté\",\"\"))))","v":""},{"$f":"IF($J303=\"\",\"\",IF($I303>Trimestre!$D$2,\"Non débuté\",IF(Trimestre!$D$2>$J303,\"Terminé\",\"Courant\")))","v":""}]
[null,null,null,null,null,null,null,null,null,null,{"$f":"IF($J304=\"\",\"\",IF($L304=\"Courant\",Donnees!$A$3,IF($L304=\"terminé\",Donnees!$A$4,IF($L305=\"Non débuté\",\"\"))))","v":""},{"$f":"IF($J304=\"\",\"\",IF($I304>Trimestre!$D$2,\"Non débuté\",IF(Trimestre!$D$2>$J304,\"Terminé\",\"Courant\")))","v":""}]
[null,null,null,null,null,null,null,null,null,null,{"$f":"IF($J305=\"\",\"\",IF($L305=\"Courant\",Donnees!$A$3,IF($L305=\"terminé\",Donnees!$A$4,IF($L306=\"Non débuté\",\"\"))))","v":""},{"$f":"IF($J305=\"\",\"\",IF($I305>Trimestre!$D$2,\"Non débuté\",IF(Trimestre!$D$2>$J305,\"Terminé\",\"Courant\")))","v":""}]
[null,null,null,null,null,null,null,null,null,null,{"$f":"IF($J306=\"\",\"\",IF($L306=\"Courant\",Donnees!$A$3,IF($L306=\"terminé\",Donnees!$A$4,IF($L307=\"Non débuté\",\"\"))))","v":""},{"$f":"IF($J306=\"\",\"\",IF($I306>Trimestre!$D$2,\"Non débuté\",IF(Trimestre!$D$2>$J306,\"Terminé\",\"Courant\")))","v":""}]
[null,null,null,null,null,null,null,null,null,null,{"$f":"IF($J307=\"\",\"\",IF($L307=\"Courant\",Donnees!$A$3,IF($L307=\"terminé\",Donnees!$A$4,IF($L308=\"Non débuté\",\"\"))))","v":""},{"$f":"IF($J307=\"\",\"\",IF($I307>Trimestre!$D$2,\"Non débuté\",IF(Trimestre!$D$2>$J307,\"Terminé\",\"Courant\")))","v":""}]
[null,null,null,null,null,null,null,null,null,null,{"$f":"IF($J308=\"\",\"\",IF($L308=\"Courant\",Donnees!$A$3,IF($L308=\"terminé\",Donnees!$A$4,IF($L309=\"Non débuté\",\"\"))))","v":""},{"$f":"IF($J308=\"\",\"\",IF($I308>Trimestre!$D$2,\"Non débuté\",IF(Trimestre!$D$2>$J308,\"Terminé\",\"Courant\")))","v":""}]
[null,null,null,null,null,null,null,null,null,null,{"$f":"IF($J309=\"\",\"\",IF($L309=\"Courant\",Donnees!$A$3,IF($L309=\"terminé\",Donnees!$A$4,IF($L310=\"Non débuté\",\"\"))))","v":""},{"$f":"IF($J309=\"\",\"\",IF($I309>Trimestre!$D$2,\"Non débuté\",IF(Trimestre!$D$2>$J309,\"Terminé\",\"Courant\")))","v":""}]
[null,null,null,null,null,null,null,null,null,null,{"$f":"IF($J310=\"\",\"\",IF($L310=\"Courant\",Donnees!$A$3,IF($L310=\"terminé\",Donnees!$A$4,IF($L311=\"Non débuté\",\"\"))))","v":""},{"$f":"IF($J310=\"\",\"\",IF($I310>Trimestre!$D$2,\"Non débuté\",IF(Trimestre!$D$2>$J310,\"Terminé\",\"Courant\")))","v":""}]
[null,null,null,null,null,null,null,null,null,null,{"$f":"IF($J311=\"\",\"\",IF($L311=\"Courant\",Donnees!$A$3,IF($L311=\"terminé\",Donnees!$A$4,IF($L312=\"Non débuté\",\"\"))))","v":""},{"$f":"IF($J311=\"\",\"\",IF($I311>Trimestre!$D$2,\"Non débuté\",IF(Trimestre!$D$2>$J311,\"Terminé\",\"Courant\")))","v":""}]
[null,null,null,null,null,null,null,null,null,null,{"$f":"IF($J312=\"\",\"\",IF($L312=\"Courant\",Donnees!$A$3,IF($L312=\"terminé\",Donnees!$A$4,IF($L313=\"Non débuté\",\"\"))))","v":""},{"$f":"IF($J312=\"\",\"\",IF($I312>Trimestre!$D$2,\"Non débuté\",IF(Trimestre!$D$2>$J312,\"Terminé\",\"Courant\")))","v":""}]
[null,null,null,null,null,null,null,null,null,null,{"$f":"IF($J313=\"\",\"\",IF($L313=\"Courant\",Donnees!$A$3,IF($L313=\"terminé\",Donnees!$A$4,IF($L314=\"Non débuté\",\"\"))))","v":""},{"$f":"IF($J313=\"\",\"\",IF($I313>Trimestre!$D$2,\"Non débuté\",IF(Trimestre!$D$2>$J313,\"Terminé\",\"Courant\")))","v":""}]
[null,null,null,null,null,null,null,null,null,null,{"$f":"IF($J314=\"\",\"\",IF($L314=\"Courant\",Donnees!$A$3,IF($L314=\"terminé\",Donnees!$A$4,IF($L315=\"Non débuté\",\"\"))))","v":""},{"$f":"IF($J314=\"\",\"\",IF($I314>Trimestre!$D$2,\"Non débuté\",IF(Trimestre!$D$2>$J314,\"Terminé\",\"Courant\")))","v":""}]
[null,null,null,null,null,null,null,null,null,null,{"$f":"IF($J315=\"\",\"\",IF($L315=\"Courant\",Donnees!$A$3,IF($L315=\"terminé\",Donnees!$A$4,IF($L316=\"Non débuté\",\"\"))))","v":""},{"$f":"IF($J315=\"\",\"\",IF($I315>Trimestre!$D$2,\"Non débuté\",IF(Trimestre!$D$2>$J315,\"Terminé\",\"Courant\")))","v":""}]
[null,null,null,null,null,null,null,null,null,null,{"$f":"IF($J316=\"\",\"\",IF($L316=\"Courant\",Donnees!$A$3,IF($L316=\"terminé\",Donnees!$A$4,IF($L317=\"Non débuté\",\"\"))))","v":""},{"$f":"IF($J316=\"\",\"\",IF($I316>Trimestre!$D$2,\"Non débuté\",IF(Trimestre!$D$2>$J316,\"Terminé\",\"Courant\")))","v":""}]
[null,null,null,null,null,null,null,null,null,null,{"$f":"IF($J317=\"\",\"\",IF($L317=\"Courant\",Donnees!$A$3,IF($L317=\"terminé\",Donnees!$A$4,IF($L318=\"Non débuté\",\"\"))))","v":""},{"$f":"IF($J317=\"\",\"\",IF($I317>Trimestre!$D$2,\"Non débuté\",IF(Trimestre!$D$2>$J317,\"Terminé\",\"Courant\")))","v":""}]
[null,null,null,null,null,null,null,null,null,null,{"$f":"IF($J318=\"\",\"\",IF($L318=\"Courant\",Donnees!$A$3,IF($L318=\"terminé\",Donnees!$A$4,IF($L319=\"Non débuté\",\"\"))))","v":""},{"$f":"IF($J318=\"\",\"\",IF($I318>Trimestre!$D$2,\"Non débuté\",IF(Trimestre!$D$2>$J318,\"Terminé\",\"Courant\")))","v":""}]
[null,null,null,null,null,null,null,null,null,null,{"$f":"IF($J319=\"\",\"\",IF($L319=\"Courant\",Donnees!$A$3,IF($L319=\"terminé\",Donnees!$A$4,IF($L320=\"Non débuté\",\"\"))))","v":""},{"$f":"IF($J319=\"\",\"\",IF($I319>Trimestre!$D$2,\"Non débuté\",IF(Trimestre!$D$2>$J319,\"Terminé\",\"Courant\")))","v":""}]
[null,null,null,null,null,null,null,null,null,null,{"$f":"IF($J320=\"\",\"\",IF($L320=\"Courant\",Donnees!$A$3,IF($L320=\"terminé\",Donnees!$A$4,IF($L321=\"Non débuté\",\"\"))))","v":""},{"$f":"IF($J320=\"\",\"\",IF($I320>Trimestre!$D$2,\"Non débuté\",IF(Trimestre!$D$2>$J320,\"Terminé\",\"Courant\")))","v":""}]
[null,null,null,null,null,null,null,null,null,null,{"$f":"IF($J321=\"\",\"\",IF($L321=\"Courant\",Donnees!$A$3,IF($L321=\"terminé\",Donnees!$A$4,IF($L322=\"Non débuté\",\"\"))))","v":""},{"$f":"IF($J321=\"\",\"\",IF($I321>Trimestre!$D$2,\"Non débuté\",IF(Trimestre!$D$2>$J321,\"Terminé\",\"Courant\")))","v":""}]
[null,null,null,null,null,null,null,null,null,null,{"$f":"IF($J322=\"\",\"\",IF($L322=\"Courant\",Donnees!$A$3,IF($L322=\"terminé\",Donnees!$A$4,IF($L323=\"Non débuté\",\"\"))))","v":""},{"$f":"IF($J322=\"\",\"\",IF($I322>Trimestre!$D$2,\"Non débuté\",IF(Trimestre!$D$2>$J322,\"Terminé\",\"Courant\")))","v":""}]
[null,null,null,null,null,null,null,null,null,null,{"$f":"IF($J323=\"\",\"\",IF($L323=\"Courant\",Donnees!$A$3,IF($L323=\"terminé\",Donnees!$A$4,IF($L324=\"Non débuté\",\"\"))))","v":""},{"$f":"IF($J323=\"\",\"\",IF($I323>Trimestre!$D$2,\"Non débuté\",IF(Trimestre!$D$2>$J323,\"Terminé\",\"Courant\")))","v":""}]
[null,null,null,null,null,null,null,null,null,null,{"$f":"IF($J324=\"\",\"\",IF($L324=\"Courant\",Donnees!$A$3,IF($L324=\"terminé\",Donnees!$A$4,IF($L325=\"Non débuté\",\"\"))))","v":""},{"$f":"IF($J324=\"\",\"\",IF($I324>Trimestre!$D$2,\"Non débuté\",IF(Trimestre!$D$2>$J324,\"Terminé\",\"Courant\")))","v":""}]
[null,null,null,null,null,null,null,null,null,null,{"$f":"IF($J325=\"\",\"\",IF($L325=\"Courant\",Donnees!$A$3,IF($L325=\"terminé\",Donnees!$A$4,IF($L326=\"Non débuté\",\"\"))))","v":""},{"$f":"IF($J325=\"\",\"\",IF($I325>Trimestre!$D$2,\"Non débuté\",IF(Trimestre!$D$2>$J325,\"Terminé\",\"Courant\")))","v":""}]
[null,null,null,null,null,null,null,null,null,null,{"$f":"IF($J326=\"\",\"\",IF($L326=\"Courant\",Donnees!$A$3,IF($L326=\"terminé\",Donnees!$A$4,IF($L327=\"Non débuté\",\"\"))))","v":""},{"$f":"IF($J326=\"\",\"\",IF($I326>Trimestre!$D$2,\"Non débuté\",IF(Trimestre!$D$2>$J326,\"Terminé\",\"Courant\")))","v":""}]
[null,null,null,null,null,null,null,null,null,null,{"$f":"IF($J327=\"\",\"\",IF($L327=\"Courant\",Donnees!$A$3,IF($L327=\"terminé\",Donnees!$A$4,IF($L328=\"Non débuté\",\"\"))))","v":""},{"$f":"IF($J327=\"\",\"\",IF($I327>Trimestre!$D$2,\"Non débuté\",IF(Trimestre!$D$2>$J327,\"Terminé\",\"Courant\")))","v":""}]
[null,null,null,null,null,null,null,null,null,null,{"$f":"IF($J328=\"\",\"\",IF($L328=\"Courant\",Donnees!$A$3,IF($L328=\"terminé\",Donnees!$A$4,IF($L329=\"Non débuté\",\"\"))))","v":""},{"$f":"IF($J328=\"\",\"\",IF($I328>Trimestre!$D$2,\"Non débuté\",IF(Trimestre!$D$2>$J328,\"Terminé\",\"Courant\")))","v":""}]
[null,null,null,null,null,null,null,null,null,null,{"$f":"IF($J329=\"\",\"\",IF($L329=\"Courant\",Donnees!$A$3,IF($L329=\"terminé\",Donnees!$A$4,IF($L330=\"Non débuté\",\"\"))))","v":""},{"$f":"IF($J329=\"\",\"\",IF($I329>Trimestre!$D$2,\"Non débuté\",IF(Trimestre!$D$2>$J329,\"Terminé\",\"Courant\")))","v":""}]
[null,null,null,null,null,null,null,null,null,null,{"$f":"IF($J330=\"\",\"\",IF($L330=\"Courant\",Donnees!$A$3,IF($L330=\"terminé\",Donnees!$A$4,IF($L331=\"Non débuté\",\"\"))))","v":""},{"$f":"IF($J330=\"\",\"\",IF($I330>Trimestre!$D$2,\"Non débuté\",IF(Trimestre!$D$2>$J330,\"Terminé\",\"Courant\")))","v":""}]
[null,null,null,null,null,null,null,null,null,null,{"$f":"IF($J331=\"\",\"\",IF($L331=\"Courant\",Donnees!$A$3,IF($L331=\"terminé\",Donnees!$A$4,IF($L332=\"Non débuté\",\"\"))))","v":""},{"$f":"IF($J331=\"\",\"\",IF($I331>Trimestre!$D$2,\"Non débuté\",IF(Trimestre!$D$2>$J331,\"Terminé\",\"Courant\")))","v":""}]
[null,null,null,null,null,null,null,null,null,null,{"$f":"IF($J332=\"\",\"\",IF($L332=\"Courant\",Donnees!$A$3,IF($L332=\"terminé\",Donnees!$A$4,IF($L333=\"Non débuté\",\"\"))))","v":""},{"$f":"IF($J332=\"\",\"\",IF($I332>Trimestre!$D$2,\"Non débuté\",IF(Trimestre!$D$2>$J332,\"Terminé\",\"Courant\")))","v":""}]
[null,null,null,null,null,null,null,null,null,null,{"$f":"IF($J333=\"\",\"\",IF($L333=\"Courant\",Donnees!$A$3,IF($L333=\"terminé\",Donnees!$A$4,IF($L334=\"Non débuté\",\"\"))))","v":""},{"$f":"IF($J333=\"\",\"\",IF($I333>Trimestre!$D$2,\"Non débuté\",IF(Trimestre!$D$2>$J333,\"Terminé\",\"Courant\")))","v":""}]
[null,null,null,null,null,null,null,null,null,null,{"$f":"IF($J334=\"\",\"\",IF($L334=\"Courant\",Donnees!$A$3,IF($L334=\"terminé\",Donnees!$A$4,IF($L335=\"Non débuté\",\"\"))))","v":""},{"$f":"IF($J334=\"\",\"\",IF($I334>Trimestre!$D$2,\"Non débuté\",IF(Trimestre!$D$2>$J334,\"Terminé\",\"Courant\")))","v":""}]
[null,null,null,null,null,null,null,null,null,null,{"$f":"IF($J335=\"\",\"\",IF($L335=\"Courant\",Donnees!$A$3,IF($L335=\"terminé\",Donnees!$A$4,IF($L336=\"Non débuté\",\"\"))))","v":""},{"$f":"IF($J335=\"\",\"\",IF($I335>Trimestre!$D$2,\"Non débuté\",IF(Trimestre!$D$2>$J335,\"Terminé\",\"Courant\")))","v":""}]
[null,null,null,null,null,null,null,null,null,null,{"$f":"IF($J336=\"\",\"\",IF($L336=\"Courant\",Donnees!$A$3,IF($L336=\"terminé\",Donnees!$A$4,IF($L337=\"Non débuté\",\"\"))))","v":""},{"$f":"IF($J336=\"\",\"\",IF($I336>Trimestre!$D$2,\"Non débuté\",IF(Trimestre!$D$2>$J336,\"Terminé\",\"Courant\")))","v":""}]
[null,null,null,null,null,null,null,null,null,null,{"$f":"IF($J337=\"\",\"\",IF($L337=\"Courant\",Donnees!$A$3,IF($L337=\"terminé\",Donnees!$A$4,IF($L338=\"Non débuté\",\"\"))))","v":""},{"$f":"IF($J337=\"\",\"\",IF($I337>Trimestre!$D$2,\"Non débuté\",IF(Trimestre!$D$2>$J337,\"Terminé\",\"Courant\")))","v":""}]
[null,null,null,null,null,null,null,null,null,null,{"$f":"IF($J338=\"\",\"\",IF($L338=\"Courant\",Donnees!$A$3,IF($L338=\"terminé\",Donnees!$A$4,IF($L339=\"Non débuté\",\"\"))))","v":""},{"$f":"IF($J338=\"\",\"\",IF($I338>Trimestre!$D$2,\"Non débuté\",IF(Trimestre!$D$2>$J338,\"Terminé\",\"Courant\")))","v":""}]
[null,null,null,null,null,null,null,null,null,null,{"$f":"IF($J339=\"\",\"\",IF($L339=\"Courant\",Donnees!$A$3,IF($L339=\"terminé\",Donnees!$A$4,IF($L340=\"Non débuté\",\"\"))))","v":""},{"$f":"IF($J339=\"\",\"\",IF($I339>Trimestre!$D$2,\"Non débuté\",IF(Trimestre!$D$2>$J339,\"Terminé\",\"Courant\")))","v":""}]
[null,null,null,null,null,null,null,null,null,null,{"$f":"IF($J340=\"\",\"\",IF($L340=\"Courant\",Donnees!$A$3,IF($L340=\"terminé\",Donnees!$A$4,IF($L341=\"Non débuté\",\"\"))))","v":""},{"$f":"IF($J340=\"\",\"\",IF($I340>Trimestre!$D$2,\"Non débuté\",IF(Trimestre!$D$2>$J340,\"Terminé\",\"Courant\")))","v":""}]
[null,null,null,null,null,null,null,null,null,null,{"$f":"IF($J341=\"\",\"\",IF($L341=\"Courant\",Donnees!$A$3,IF($L341=\"terminé\",Donnees!$A$4,IF($L342=\"Non débuté\",\"\"))))","v":""},{"$f":"IF($J341=\"\",\"\",IF($I341>Trimestre!$D$2,\"Non débuté\",IF(Trimestre!$D$2>$J341,\"Terminé\",\"Courant\")))","v":""}]
[null,null,null,null,null,null,null,null,null,null,{"$f":"IF($J342=\"\",\"\",IF($L342=\"Courant\",Donnees!$A$3,IF($L342=\"terminé\",Donnees!$A$4,IF($L343=\"Non débuté\",\"\"))))","v":""},{"$f":"IF($J342=\"\",\"\",IF($I342>Trimestre!$D$2,\"Non débuté\",IF(Trimestre!$D$2>$J342,\"Terminé\",\"Courant\")))","v":""}]
[null,null,null,null,null,null,null,null,null,null,{"$f":"IF($J343=\"\",\"\",IF($L343=\"Courant\",Donnees!$A$3,IF($L343=\"terminé\",Donnees!$A$4,IF($L344=\"Non débuté\",\"\"))))","v":""},{"$f":"IF($J343=\"\",\"\",IF($I343>Trimestre!$D$2,\"Non débuté\",IF(Trimestre!$D$2>$J343,\"Terminé\",\"Courant\")))","v":""}]
[null,null,null,null,null,null,null,null,null,null,{"$f":"IF($J344=\"\",\"\",IF($L344=\"Courant\",Donnees!$A$3,IF($L344=\"terminé\",Donnees!$A$4,IF($L345=\"Non débuté\",\"\"))))","v":""},{"$f":"IF($J344=\"\",\"\",IF($I344>Trimestre!$D$2,\"Non débuté\",IF(Trimestre!$D$2>$J344,\"Terminé\",\"Courant\")))","v":""}]
[null,null,null,null,null,null,null,null,null,null,{"$f":"IF($J345=\"\",\"\",IF($L345=\"Courant\",Donnees!$A$3,IF($L345=\"terminé\",Donnees!$A$4,IF($L346=\"Non débuté\",\"\"))))","v":""},{"$f":"IF($J345=\"\",\"\",IF($I345>Trimestre!$D$2,\"Non débuté\",IF(Trimestre!$D$2>$J345,\"Terminé\",\"Courant\")))","v":""}]
[null,null,null,null,null,null,null,null,null,null,{"$f":"IF($J346=\"\",\"\",IF($L346=\"Courant\",Donnees!$A$3,IF($L346=\"terminé\",Donnees!$A$4,IF($L347=\"Non débuté\",\"\"))))","v":""},{"$f":"IF($J346=\"\",\"\",IF($I346>Trimestre!$D$2,\"Non débuté\",IF(Trimestre!$D$2>$J346,\"Terminé\",\"Courant\")))","v":""}]
[null,null,null,null,null,null,null,null,null,null,{"$f":"IF($J347=\"\",\"\",IF($L347=\"Courant\",Donnees!$A$3,IF($L347=\"terminé\",Donnees!$A$4,IF($L348=\"Non débuté\",\"\"))))","v":""},{"$f":"IF($J347=\"\",\"\",IF($I347>Trimestre!$D$2,\"Non débuté\",IF(Trimestre!$D$2>$J347,\"Terminé\",\"Courant\")))","v":""}]
[null,null,null,null,null,null,null,null,null,null,{"$f":"IF($J348=\"\",\"\",IF($L348=\"Courant\",Donnees!$A$3,IF($L348=\"terminé\",Donnees!$A$4,IF($L349=\"Non débuté\",\"\"))))","v":""},{"$f":"IF($J348=\"\",\"\",IF($I348>Trimestre!$D$2,\"Non débuté\",IF(Trimestre!$D$2>$J348,\"Terminé\",\"Courant\")))","v":""}]
[null,null,null,null,null,null,null,null,null,null,{"$f":"IF($J349=\"\",\"\",IF($L349=\"Courant\",Donnees!$A$3,IF($L349=\"terminé\",Donnees!$A$4,IF($L350=\"Non débuté\",\"\"))))","v":""},{"$f":"IF($J349=\"\",\"\",IF($I349>Trimestre!$D$2,\"Non débuté\",IF(Trimestre!$D$2>$J349,\"Terminé\",\"Courant\")))","v":""}]
[null,null,null,null,null,null,null,null,null,null,{"$f":"IF($J350=\"\",\"\",IF($L350=\"Courant\",Donnees!$A$3,IF($L350=\"terminé\",Donnees!$A$4,IF($L351=\"Non débuté\",\"\"))))","v":""},{"$f":"IF($J350=\"\",\"\",IF($I350>Trimestre!$D$2,\"Non débuté\",IF(Trimestre!$D$2>$J350,\"Terminé\",\"Courant\")))","v":""}]
[null,null,null,null,null,null,null,null,null,null,{"$f":"IF($J351=\"\",\"\",IF($L351=\"Courant\",Donnees!$A$3,IF($L351=\"terminé\",Donnees!$A$4,IF($L352=\"Non débuté\",\"\"))))","v":""},{"$f":"IF($J351=\"\",\"\",IF($I351>Trimestre!$D$2,\"Non débuté\",IF(Trimestre!$D$2>$J351,\"Terminé\",\"Courant\")))","v":""}]
[null,null,null,null,null,null,null,null,null,null,{"$f":"IF($J352=\"\",\"\",IF($L352=\"Courant\",Donnees!$A$3,IF($L352=\"terminé\",Donnees!$A$4,IF($L353=\"Non débuté\",\"\"))))","v":""},{"$f":"IF($J352=\"\",\"\",IF($I352>Trimestre!$D$2,\"Non débuté\",IF(Trimestre!$D$2>$J352,\"Terminé\",\"Courant\")))","v":""}]
[null,null,null,null,null,null,null,null,null,null,{"$f":"IF($J353=\"\",\"\",IF($L353=\"Courant\",Donnees!$A$3,IF($L353=\"terminé\",Donnees!$A$4,IF($L354=\"Non débuté\",\"\"))))","v":""},{"$f":"IF($J353=\"\",\"\",IF($I353>Trimestre!$D$2,\"Non débuté\",IF(Trimestre!$D$2>$J353,\"Terminé\",\"Courant\")))","v":""}]
[null,null,null,null,null,null,null,null,null,null,{"$f":"IF($J354=\"\",\"\",IF($L354=\"Courant\",Donnees!$A$3,IF($L354=\"terminé\",Donnees!$A$4,IF($L355=\"Non débuté\",\"\"))))","v":""},{"$f":"IF($J354=\"\",\"\",IF($I354>Trimestre!$D$2,\"Non débuté\",IF(Trimestre!$D$2>$J354,\"Terminé\",\"Courant\")))","v":""}]
[null,null,null,null,null,null,null,null,null,null,{"$f":"IF($J355=\"\",\"\",IF($L355=\"Courant\",Donnees!$A$3,IF($L355=\"terminé\",Donnees!$A$4,IF($L356=\"Non débuté\",\"\"))))","v":""},{"$f":"IF($J355=\"\",\"\",IF($I355>Trimestre!$D$2,\"Non débuté\",IF(Trimestre!$D$2>$J355,\"Terminé\",\"Courant\")))","v":""}]
[null,null,null,null,null,null,null,null,null,null,{"$f":"IF($J356=\"\",\"\",IF($L356=\"Courant\",Donnees!$A$3,IF($L356=\"terminé\",Donnees!$A$4,IF($L357=\"Non débuté\",\"\"))))","v":""},{"$f":"IF($J356=\"\",\"\",IF($I356>Trimestre!$D$2,\"Non débuté\",IF(Trimestre!$D$2>$J356,\"Terminé\",\"Courant\")))","v":""}]
[null,null,null,null,null,null,null,null,null,null,{"$f":"IF($J357=\"\",\"\",IF($L357=\"Courant\",Donnees!$A$3,IF($L357=\"terminé\",Donnees!$A$4,IF($L358=\"Non débuté\",\"\"))))","v":""},{"$f":"IF($J357=\"\",\"\",IF($I357>Trimestre!$D$2,\"Non débuté\",IF(Trimestre!$D$2>$J357,\"Terminé\",\"Courant\")))","v":""}]
[null,null,null,null,null,null,null,null,null,null,{"$f":"IF($J358=\"\",\"\",IF($L358=\"Courant\",Donnees!$A$3,IF($L358=\"terminé\",Donnees!$A$4,IF($L359=\"Non débuté\",\"\"))))","v":""},{"$f":"IF($J358=\"\",\"\",IF($I358>Trimestre!$D$2,\"Non débuté\",IF(Trimestre!$D$2>$J358,\"Terminé\",\"Courant\")))","v":""}]
[null,null,null,null,null,null,null,null,null,null,{"$f":"IF($J359=\"\",\"\",IF($L359=\"Courant\",Donnees!$A$3,IF($L359=\"terminé\",Donnees!$A$4,IF($L360=\"Non débuté\",\"\"))))","v":""},{"$f":"IF($J359=\"\",\"\",IF($I359>Trimestre!$D$2,\"Non débuté\",IF(Trimestre!$D$2>$J359,\"Terminé\",\"Courant\")))","v":""}]
[null,null,null,null,null,null,null,null,null,null,{"$f":"IF($J360=\"\",\"\",IF($L360=\"Courant\",Donnees!$A$3,IF($L360=\"terminé\",Donnees!$A$4,IF($L361=\"Non débuté\",\"\"))))","v":""},{"$f":"IF($J360=\"\",\"\",IF($I360>Trimestre!$D$2,\"Non débuté\",IF(Trimestre!$D$2>$J360,\"Terminé\",\"Courant\")))","v":""}]
[null,null,null,null,null,null,null,null,null,null,{"$f":"IF($J361=\"\",\"\",IF($L361=\"Courant\",Donnees!$A$3,IF($L361=\"terminé\",Donnees!$A$4,IF($L362=\"Non débuté\",\"\"))))","v":""},{"$f":"IF($J361=\"\",\"\",IF($I361>Trimestre!$D$2,\"Non débuté\",IF(Trimestre!$D$2>$J361,\"Terminé\",\"Courant\")))","v":""}]
[null,null,null,null,null,null,null,null,null,null,{"$f":"IF($J362=\"\",\"\",IF($L362=\"Courant\",Donnees!$A$3,IF($L362=\"terminé\",Donnees!$A$4,IF($L363=\"Non débuté\",\"\"))))","v":""},{"$f":"IF($J362=\"\",\"\",IF($I362>Trimestre!$D$2,\"Non débuté\",IF(Trimestre!$D$2>$J362,\"Terminé\",\"Courant\")))","v":""}]
[null,null,null,null,null,null,null,null,null,null,{"$f":"IF($J363=\"\",\"\",IF($L363=\"Courant\",Donnees!$A$3,IF($L363=\"terminé\",Donnees!$A$4,IF($L364=\"Non débuté\",\"\"))))","v":""},{"$f":"IF($J363=\"\",\"\",IF($I363>Trimestre!$D$2,\"Non débuté\",IF(Trimestre!$D$2>$J363,\"Terminé\",\"Courant\")))","v":""}]
[null,null,null,null,null,null,null,null,null,null,{"$f":"IF($J364=\"\",\"\",IF($L364=\"Courant\",Donnees!$A$3,IF($L364=\"terminé\",Donnees!$A$4,IF($L365=\"Non débuté\",\"\"))))","v":""},{"$f":"IF($J364=\"\",\"\",IF($I364>Trimestre!$D$2,\"Non débuté\",IF(Trimestre!$D$2>$J364,\"Terminé\",\"Courant\")))","v":""}]
[null,null,null,null,null,null,null,null,null,null,{"$f":"IF($J365=\"\",\"\",IF($L365=\"Courant\",Donnees!$A$3,IF($L365=\"terminé\",Donnees!$A$4,IF($L366=\"Non débuté\",\"\"))))","v":""},{"$f":"IF($J365=\"\",\"\",IF($I365>Trimestre!$D$2,\"Non débuté\",IF(Trimestre!$D$2>$J365,\"Terminé\",\"Courant\")))","v":""}]
[null,null,null,null,null,null,null,null,null,null,{"$f":"IF($J366=\"\",\"\",IF($L366=\"Courant\",Donnees!$A$3,IF($L366=\"terminé\",Donnees!$A$4,IF($L367=\"Non débuté\",\"\"))))","v":""},{"$f":"IF($J366=\"\",\"\",IF($I366>Trimestre!$D$2,\"Non débuté\",IF(Trimestre!$D$2>$J366,\"Terminé\",\"Courant\")))","v":""}]
[null,null,null,null,null,null,null,null,null,null,{"$f":"IF($J367=\"\",\"\",IF($L367=\"Courant\",Donnees!$A$3,IF($L367=\"terminé\",Donnees!$A$4,IF($L368=\"Non débuté\",\"\"))))","v":""},{"$f":"IF($J367=\"\",\"\",IF($I367>Trimestre!$D$2,\"Non débuté\",IF(Trimestre!$D$2>$J367,\"Terminé\",\"Courant\")))","v":""}]
[null,null,null,null,null,null,null,null,null,null,{"$f":"IF($J368=\"\",\"\",IF($L368=\"Courant\",Donnees!$A$3,IF($L368=\"terminé\",Donnees!$A$4,IF($L369=\"Non débuté\",\"\"))))","v":""},{"$f":"IF($J368=\"\",\"\",IF($I368>Trimestre!$D$2,\"Non débuté\",IF(Trimestre!$D$2>$J368,\"Terminé\",\"Courant\")))","v":""}]
[null,null,null,null,null,null,null,null,null,null,{"$f":"IF($J369=\"\",\"\",IF($L369=\"Courant\",Donnees!$A$3,IF($L369=\"terminé\",Donnees!$A$4,IF($L370=\"Non débuté\",\"\"))))","v":""},{"$f":"IF($J369=\"\",\"\",IF($I369>Trimestre!$D$2,\"Non débuté\",IF(Trimestre!$D$2>$J369,\"Terminé\",\"Courant\")))","v":""}]
[null,null,null,null,null,null,null,null,null,null,{"$f":"IF($J370=\"\",\"\",IF($L370=\"Courant\",Donnees!$A$3,IF($L370=\"terminé\",Donnees!$A$4,IF($L371=\"Non débuté\",\"\"))))","v":""},{"$f":"IF($J370=\"\",\"\",IF($I370>Trimestre!$D$2,\"Non débuté\",IF(Trimestre!$D$2>$J370,\"Terminé\",\"Courant\")))","v":""}]
[null,null,null,null,null,null,null,null,null,null,{"$f":"IF($J371=\"\",\"\",IF($L371=\"Courant\",Donnees!$A$3,IF($L371=\"terminé\",Donnees!$A$4,IF($L372=\"Non débuté\",\"\"))))","v":""},{"$f":"IF($J371=\"\",\"\",IF($I371>Trimestre!$D$2,\"Non débuté\",IF(Trimestre!$D$2>$J371,\"Terminé\",\"Courant\")))","v":""}]
[null,null,null,null,null,null,null,null,null,null,{"$f":"IF($J372=\"\",\"\",IF($L372=\"Courant\",Donnees!$A$3,IF($L372=\"terminé\",Donnees!$A$4,IF($L373=\"Non débuté\",\"\"))))","v":""},{"$f":"IF($J372=\"\",\"\",IF($I372>Trimestre!$D$2,\"Non débuté\",IF(Trimestre!$D$2>$J372,\"Terminé\",\"Courant\")))","v":""}]
[null,null,null,null,null,null,null,null,null,null,{"$f":"IF($J373=\"\",\"\",IF($L373=\"Courant\",Donnees!$A$3,IF($L373=\"terminé\",Donnees!$A$4,IF($L374=\"Non débuté\",\"\"))))","v":""},{"$f":"IF($J373=\"\",\"\",IF($I373>Trimestre!$D$2,\"Non débuté\",IF(Trimestre!$D$2>$J373,\"Terminé\",\"Courant\")))","v":""}]
[null,null,null,null,null,null,null,null,null,null,{"$f":"IF($J374=\"\",\"\",IF($L374=\"Courant\",Donnees!$A$3,IF($L374=\"terminé\",Donnees!$A$4,IF($L375=\"Non débuté\",\"\"))))","v":""},{"$f":"IF($J374=\"\",\"\",IF($I374>Trimestre!$D$2,\"Non débuté\",IF(Trimestre!$D$2>$J374,\"Terminé\",\"Courant\")))","v":""}]
[null,null,null,null,null,null,null,null,null,null,{"$f":"IF($J375=\"\",\"\",IF($L375=\"Courant\",Donnees!$A$3,IF($L375=\"terminé\",Donnees!$A$4,IF($L376=\"Non débuté\",\"\"))))","v":""},{"$f":"IF($J375=\"\",\"\",IF($I375>Trimestre!$D$2,\"Non débuté\",IF(Trimestre!$D$2>$J375,\"Terminé\",\"Courant\")))","v":""}]
[null,null,null,null,null,null,null,null,null,null,{"$f":"IF($J376=\"\",\"\",IF($L376=\"Courant\",Donnees!$A$3,IF($L376=\"terminé\",Donnees!$A$4,IF($L377=\"Non débuté\",\"\"))))","v":""},{"$f":"IF($J376=\"\",\"\",IF($I376>Trimestre!$D$2,\"Non débuté\",IF(Trimestre!$D$2>$J376,\"Terminé\",\"Courant\")))","v":""}]
[null,null,null,null,null,null,null,null,null,null,{"$f":"IF($J377=\"\",\"\",IF($L377=\"Courant\",Donnees!$A$3,IF($L377=\"terminé\",Donnees!$A$4,IF($L378=\"Non débuté\",\"\"))))","v":""},{"$f":"IF($J377=\"\",\"\",IF($I377>Trimestre!$D$2,\"Non débuté\",IF(Trimestre!$D$2>$J377,\"Terminé\",\"Courant\")))","v":""}]
[null,null,null,null,null,null,null,null,null,null,{"$f":"IF($J378=\"\",\"\",IF($L378=\"Courant\",Donnees!$A$3,IF($L378=\"terminé\",Donnees!$A$4,IF($L379=\"Non débuté\",\"\"))))","v":""},{"$f":"IF($J378=\"\",\"\",IF($I378>Trimestre!$D$2,\"Non débuté\",IF(Trimestre!$D$2>$J378,\"Terminé\",\"Courant\")))","v":""}]
[null,null,null,null,null,null,null,null,null,null,{"$f":"IF($J379=\"\",\"\",IF($L379=\"Courant\",Donnees!$A$3,IF($L379=\"terminé\",Donnees!$A$4,IF($L380=\"Non débuté\",\"\"))))","v":""},{"$f":"IF($J379=\"\",\"\",IF($I379>Trimestre!$D$2,\"Non débuté\",IF(Trimestre!$D$2>$J379,\"Terminé\",\"Courant\")))","v":""}]
[null,null,null,null,null,null,null,null,null,null,{"$f":"IF($J380=\"\",\"\",IF($L380=\"Courant\",Donnees!$A$3,IF($L380=\"terminé\",Donnees!$A$4,IF($L381=\"Non débuté\",\"\"))))","v":""},{"$f":"IF($J380=\"\",\"\",IF($I380>Trimestre!$D$2,\"Non débuté\",IF(Trimestre!$D$2>$J380,\"Terminé\",\"Courant\")))","v":""}]
[null,null,null,null,null,null,null,null,null,null,{"$f":"IF($J381=\"\",\"\",IF($L381=\"Courant\",Donnees!$A$3,IF($L381=\"terminé\",Donnees!$A$4,IF($L382=\"Non débuté\",\"\"))))","v":""},{"$f":"IF($J381=\"\",\"\",IF($I381>Trimestre!$D$2,\"Non débuté\",IF(Trimestre!$D$2>$J381,\"Terminé\",\"Courant\")))","v":""}]
[null,null,null,null,null,null,null,null,null,null,{"$f":"IF($J382=\"\",\"\",IF($L382=\"Courant\",Donnees!$A$3,IF($L382=\"terminé\",Donnees!$A$4,IF($L383=\"Non débuté\",\"\"))))","v":""},{"$f":"IF($J382=\"\",\"\",IF($I382>Trimestre!$D$2,\"Non débuté\",IF(Trimestre!$D$2>$J382,\"Terminé\",\"Courant\")))","v":""}]
[null,null,null,null,null,null,null,null,null,null,{"$f":"IF($J383=\"\",\"\",IF($L383=\"Courant\",Donnees!$A$3,IF($L383=\"terminé\",Donnees!$A$4,IF($L384=\"Non débuté\",\"\"))))","v":""},{"$f":"IF($J383=\"\",\"\",IF($I383>Trimestre!$D$2,\"Non débuté\",IF(Trimestre!$D$2>$J383,\"Terminé\",\"Courant\")))","v":""}]
[null,null,null,null,null,null,null,null,null,null,{"$f":"IF($J384=\"\",\"\",IF($L384=\"Courant\",Donnees!$A$3,IF($L384=\"terminé\",Donnees!$A$4,IF($L385=\"Non débuté\",\"\"))))","v":""},{"$f":"IF($J384=\"\",\"\",IF($I384>Trimestre!$D$2,\"Non débuté\",IF(Trimestre!$D$2>$J384,\"Terminé\",\"Courant\")))","v":""}]
[null,null,null,null,null,null,null,null,null,null,{"$f":"IF($J385=\"\",\"\",IF($L385=\"Courant\",Donnees!$A$3,IF($L385=\"terminé\",Donnees!$A$4,IF($L386=\"Non débuté\",\"\"))))","v":""},{"$f":"IF($J385=\"\",\"\",IF($I385>Trimestre!$D$2,\"Non débuté\",IF(Trimestre!$D$2>$J385,\"Terminé\",\"Courant\")))","v":""}]
[null,null,null,null,null,null,null,null,null,null,{"$f":"IF($J386=\"\",\"\",IF($L386=\"Courant\",Donnees!$A$3,IF($L386=\"terminé\",Donnees!$A$4,IF($L387=\"Non débuté\",\"\"))))","v":""},{"$f":"IF($J386=\"\",\"\",IF($I386>Trimestre!$D$2,\"Non débuté\",IF(Trimestre!$D$2>$J386,\"Terminé\",\"Courant\")))","v":""}]
[null,null,null,null,null,null,null,null,null,null,{"$f":"IF($J387=\"\",\"\",IF($L387=\"Courant\",Donnees!$A$3,IF($L387=\"terminé\",Donnees!$A$4,IF($L388=\"Non débuté\",\"\"))))","v":""},{"$f":"IF($J387=\"\",\"\",IF($I387>Trimestre!$D$2,\"Non débuté\",IF(Trimestre!$D$2>$J387,\"Terminé\",\"Courant\")))","v":""}]
[null,null,null,null,null,null,null,null,null,null,{"$f":"IF($J388=\"\",\"\",IF($L388=\"Courant\",Donnees!$A$3,IF($L388=\"terminé\",Donnees!$A$4,IF($L389=\"Non débuté\",\"\"))))","v":""},{"$f":"IF($J388=\"\",\"\",IF($I388>Trimestre!$D$2,\"Non débuté\",IF(Trimestre!$D$2>$J388,\"Terminé\",\"Courant\")))","v":""}]
[null,null,null,null,null,null,null,null,null,null,{"$f":"IF($J389=\"\",\"\",IF($L389=\"Courant\",Donnees!$A$3,IF($L389=\"terminé\",Donnees!$A$4,IF($L390=\"Non débuté\",\"\"))))","v":""},{"$f":"IF($J389=\"\",\"\",IF($I389>Trimestre!$D$2,\"Non débuté\",IF(Trimestre!$D$2>$J389,\"Terminé\",\"Courant\")))","v":""}]
[null,null,null,null,null,null,null,null,null,null,{"$f":"IF($J390=\"\",\"\",IF($L390=\"Courant\",Donnees!$A$3,IF($L390=\"terminé\",Donnees!$A$4,IF($L391=\"Non débuté\",\"\"))))","v":""},{"$f":"IF($J390=\"\",\"\",IF($I390>Trimestre!$D$2,\"Non débuté\",IF(Trimestre!$D$2>$J390,\"Terminé\",\"Courant\")))","v":""}]
[null,null,null,null,null,null,null,null,null,null,{"$f":"IF($J391=\"\",\"\",IF($L391=\"Courant\",Donnees!$A$3,IF($L391=\"terminé\",Donnees!$A$4,IF($L392=\"Non débuté\",\"\"))))","v":""},{"$f":"IF($J391=\"\",\"\",IF($I391>Trimestre!$D$2,\"Non débuté\",IF(Trimestre!$D$2>$J391,\"Terminé\",\"Courant\")))","v":""}]
[null,null,null,null,null,null,null,null,null,null,{"$f":"IF($J392=\"\",\"\",IF($L392=\"Courant\",Donnees!$A$3,IF($L392=\"terminé\",Donnees!$A$4,IF($L393=\"Non débuté\",\"\"))))","v":""},{"$f":"IF($J392=\"\",\"\",IF($I392>Trimestre!$D$2,\"Non débuté\",IF(Trimestre!$D$2>$J392,\"Terminé\",\"Courant\")))","v":""}]
[null,null,null,null,null,null,null,null,null,null,{"$f":"IF($J393=\"\",\"\",IF($L393=\"Courant\",Donnees!$A$3,IF($L393=\"terminé\",Donnees!$A$4,IF($L394=\"Non débuté\",\"\"))))","v":""},{"$f":"IF($J393=\"\",\"\",IF($I393>Trimestre!$D$2,\"Non débuté\",IF(Trimestre!$D$2>$J393,\"Terminé\",\"Courant\")))","v":""}]
[null,null,null,null,null,null,null,null,null,null,{"$f":"IF($J394=\"\",\"\",IF($L394=\"Courant\",Donnees!$A$3,IF($L394=\"terminé\",Donnees!$A$4,IF($L395=\"Non débuté\",\"\"))))","v":""},{"$f":"IF($J394=\"\",\"\",IF($I394>Trimestre!$D$2,\"Non débuté\",IF(Trimestre!$D$2>$J394,\"Terminé\",\"Courant\")))","v":""}]
[null,null,null,null,null,null,null,null,null,null,{"$f":"IF($J395=\"\",\"\",IF($L395=\"Courant\",Donnees!$A$3,IF($L395=\"terminé\",Donnees!$A$4,IF($L396=\"Non débuté\",\"\"))))","v":""},{"$f":"IF($J395=\"\",\"\",IF($I395>Trimestre!$D$2,\"Non débuté\",IF(Trimestre!$D$2>$J395,\"Terminé\",\"Courant\")))","v":""}]
[null,null,null,null,null,null,null,null,null,null,{"$f":"IF($J396=\"\",\"\",IF($L396=\"Courant\",Donnees!$A$3,IF($L396=\"terminé\",Donnees!$A$4,IF($L397=\"Non débuté\",\"\"))))","v":""},{"$f":"IF($J396=\"\",\"\",IF($I396>Trimestre!$D$2,\"Non débuté\",IF(Trimestre!$D$2>$J396,\"Terminé\",\"Courant\")))","v":""}]
[null,null,null,null,null,null,null,null,null,null,{"$f":"IF($J397=\"\",\"\",IF($L397=\"Courant\",Donnees!$A$3,IF($L397=\"terminé\",Donnees!$A$4,IF($L398=\"Non débuté\",\"\"))))","v":""},{"$f":"IF($J397=\"\",\"\",IF($I397>Trimestre!$D$2,\"Non débuté\",IF(Trimestre!$D$2>$J397,\"Terminé\",\"Courant\")))","v":""}]
[null,null,null,null,null,null,null,null,null,null,{"$f":"IF($J398=\"\",\"\",IF($L398=\"Courant\",Donnees!$A$3,IF($L398=\"terminé\",Donnees!$A$4,IF($L399=\"Non débuté\",\"\"))))","v":""},{"$f":"IF($J398=\"\",\"\",IF($I398>Trimestre!$D$2,\"Non débuté\",IF(Trimestre!$D$2>$J398,\"Terminé\",\"Courant\")))","v":""}]
[null,null,null,null,null,null,null,null,null,null,{"$f":"IF($J399=\"\",\"\",IF($L399=\"Courant\",Donnees!$A$3,IF($L399=\"terminé\",Donnees!$A$4,IF($L400=\"Non débuté\",\"\"))))","v":""},{"$f":"IF($J399=\"\",\"\",IF($I399>Trimestre!$D$2,\"Non débuté\",IF(Trimestre!$D$2>$J399,\"Terminé\",\"Courant\")))","v":""}]
[null,null,null,null,null,null,null,null,null,null,{"$f":"IF($J400=\"\",\"\",IF($L400=\"Courant\",Donnees!$A$3,IF($L400=\"terminé\",Donnees!$A$4,IF($L401=\"Non débuté\",\"\"))))","v":""},{"$f":"IF($J400=\"\",\"\",IF($I400>Trimestre!$D$2,\"Non débuté\",IF(Trimestre!$D$2>$J400,\"Terminé\",\"Courant\")))","v":""}]
[null,null,null,null,null,null,null,null,null,null,{"$f":"IF($J401=\"\",\"\",IF($L401=\"Courant\",Donnees!$A$3,IF($L401=\"terminé\",Donnees!$A$4,IF($L402=\"Non débuté\",\"\"))))","v":""},{"$f":"IF($J401=\"\",\"\",IF($I401>Trimestre!$D$2,\"Non débuté\",IF(Trimestre!$D$2>$J401,\"Terminé\",\"Courant\")))","v":""}]
[null,null,null,null,null,null,null,null,null,null,{"$f":"IF($J402=\"\",\"\",IF($L402=\"Courant\",Donnees!$A$3,IF($L402=\"terminé\",Donnees!$A$4,IF($L403=\"Non débuté\",\"\"))))","v":""},{"$f":"IF($J402=\"\",\"\",IF($I402>Trimestre!$D$2,\"Non débuté\",IF(Trimestre!$D$2>$J402,\"Terminé\",\"Courant\")))","v":""}]
[null,null,null,null,null,null,null,null,null,null,{"$f":"IF($J403=\"\",\"\",IF($L403=\"Courant\",Donnees!$A$3,IF($L403=\"terminé\",Donnees!$A$4,IF($L404=\"Non débuté\",\"\"))))","v":""},{"$f":"IF($J403=\"\",\"\",IF($I403>Trimestre!$D$2,\"Non débuté\",IF(Trimestre!$D$2>$J403,\"Terminé\",\"Courant\")))","v":""}]
[null,null,null,null,null,null,null,null,null,null,{"$f":"IF($J404=\"\",\"\",IF($L404=\"Courant\",Donnees!$A$3,IF($L404=\"terminé\",Donnees!$A$4,IF($L405=\"Non débuté\",\"\"))))","v":""},{"$f":"IF($J404=\"\",\"\",IF($I404>Trimestre!$D$2,\"Non débuté\",IF(Trimestre!$D$2>$J404,\"Terminé\",\"Courant\")))","v":""}]
[null,null,null,null,null,null,null,null,null,null,{"$f":"IF($J405=\"\",\"\",IF($L405=\"Courant\",Donnees!$A$3,IF($L405=\"terminé\",Donnees!$A$4,IF($L406=\"Non débuté\",\"\"))))","v":""},{"$f":"IF($J405=\"\",\"\",IF($I405>Trimestre!$D$2,\"Non débuté\",IF(Trimestre!$D$2>$J405,\"Terminé\",\"Courant\")))","v":""}]
[null,null,null,null,null,null,null,null,null,null,{"$f":"IF($J406=\"\",\"\",IF($L406=\"Courant\",Donnees!$A$3,IF($L406=\"terminé\",Donnees!$A$4,IF($L407=\"Non débuté\",\"\"))))","v":""},{"$f":"IF($J406=\"\",\"\",IF($I406>Trimestre!$D$2,\"Non débuté\",IF(Trimestre!$D$2>$J406,\"Terminé\",\"Courant\")))","v":""}]
[null,null,null,null,null,null,null,null,null,null,{"$f":"IF($J407=\"\",\"\",IF($L407=\"Courant\",Donnees!$A$3,IF($L407=\"terminé\",Donnees!$A$4,IF($L408=\"Non débuté\",\"\"))))","v":""},{"$f":"IF($J407=\"\",\"\",IF($I407>Trimestre!$D$2,\"Non débuté\",IF(Trimestre!$D$2>$J407,\"Terminé\",\"Courant\")))","v":""}]
[null,null,null,null,null,null,null,null,null,null,{"$f":"IF($J408=\"\",\"\",IF($L408=\"Courant\",Donnees!$A$3,IF($L408=\"terminé\",Donnees!$A$4,IF($L409=\"Non débuté\",\"\"))))","v":""},{"$f":"IF($J408=\"\",\"\",IF($I408>Trimestre!$D$2,\"Non débuté\",IF(Trimestre!$D$2>$J408,\"Terminé\",\"Courant\")))","v":""}]
[null,null,null,null,null,null,null,null,null,null,{"$f":"IF($J409=\"\",\"\",IF($L409=\"Courant\",Donnees!$A$3,IF($L409=\"terminé\",Donnees!$A$4,IF($L410=\"Non débuté\",\"\"))))","v":""},{"$f":"IF($J409=\"\",\"\",IF($I409>Trimestre!$D$2,\"Non débuté\",IF(Trimestre!$D$2>$J409,\"Terminé\",\"Courant\")))","v":""}]
[null,null,null,null,null,null,null,null,null,null,{"$f":"IF($J410=\"\",\"\",IF($L410=\"Courant\",Donnees!$A$3,IF($L410=\"terminé\",Donnees!$A$4,IF($L411=\"Non débuté\",\"\"))))","v":""},{"$f":"IF($J410=\"\",\"\",IF($I410>Trimestre!$D$2,\"Non débuté\",IF(Trimestre!$D$2>$J410,\"Terminé\",\"Courant\")))","v":""}]
[null,null,null,null,null,null,null,null,null,null,{"$f":"IF($J411=\"\",\"\",IF($L411=\"Courant\",Donnees!$A$3,IF($L411=\"terminé\",Donnees!$A$4,IF($L412=\"Non débuté\",\"\"))))","v":""},{"$f":"IF($J411=\"\",\"\",IF($I411>Trimestre!$D$2,\"Non débuté\",IF(Trimestre!$D$2>$J411,\"Terminé\",\"Courant\")))","v":""}]
[null,null,null,null,null,null,null,null,null,null,{"$f":"IF($J412=\"\",\"\",IF($L412=\"Courant\",Donnees!$A$3,IF($L412=\"terminé\",Donnees!$A$4,IF($L413=\"Non débuté\",\"\"))))","v":""},{"$f":"IF($J412=\"\",\"\",IF($I412>Trimestre!$D$2,\"Non débuté\",IF(Trimestre!$D$2>$J412,\"Terminé\",\"Courant\")))","v":""}]
[null,null,null,null,null,null,null,null,null,null,{"$f":"IF($J413=\"\",\"\",IF($L413=\"Courant\",Donnees!$A$3,IF($L413=\"terminé\",Donnees!$A$4,IF($L414=\"Non débuté\",\"\"))))","v":""},{"$f":"IF($J413=\"\",\"\",IF($I413>Trimestre!$D$2,\"Non débuté\",IF(Trimestre!$D$2>$J413,\"Terminé\",\"Courant\")))","v":""}]
[null,null,null,null,null,null,null,null,null,null,{"$f":"IF($J414=\"\",\"\",IF($L414=\"Courant\",Donnees!$A$3,IF($L414=\"terminé\",Donnees!$A$4,IF($L415=\"Non débuté\",\"\"))))","v":""},{"$f":"IF($J414=\"\",\"\",IF($I414>Trimestre!$D$2,\"Non débuté\",IF(Trimestre!$D$2>$J414,\"Terminé\",\"Courant\")))","v":""}]
[null,null,null,null,null,null,null,null,null,null,{"$f":"IF($J415=\"\",\"\",IF($L415=\"Courant\",Donnees!$A$3,IF($L415=\"terminé\",Donnees!$A$4,IF($L416=\"Non débuté\",\"\"))))","v":""},{"$f":"IF($J415=\"\",\"\",IF($I415>Trimestre!$D$2,\"Non débuté\",IF(Trimestre!$D$2>$J415,\"Terminé\",\"Courant\")))","v":""}]
[null,null,null,null,null,null,null,null,null,null,{"$f":"IF($J416=\"\",\"\",IF($L416=\"Courant\",Donnees!$A$3,IF($L416=\"terminé\",Donnees!$A$4,IF($L417=\"Non débuté\",\"\"))))","v":""},{"$f":"IF($J416=\"\",\"\",IF($I416>Trimestre!$D$2,\"Non débuté\",IF(Trimestre!$D$2>$J416,\"Terminé\",\"Courant\")))","v":""}]
[null,null,null,null,null,null,null,null,null,null,{"$f":"IF($J417=\"\",\"\",IF($L417=\"Courant\",Donnees!$A$3,IF($L417=\"terminé\",Donnees!$A$4,IF($L418=\"Non débuté\",\"\"))))","v":""},{"$f":"IF($J417=\"\",\"\",IF($I417>Trimestre!$D$2,\"Non débuté\",IF(Trimestre!$D$2>$J417,\"Terminé\",\"Courant\")))","v":""}]
[null,null,null,null,null,null,null,null,null,null,{"$f":"IF($J418=\"\",\"\",IF($L418=\"Courant\",Donnees!$A$3,IF($L418=\"terminé\",Donnees!$A$4,IF($L419=\"Non débuté\",\"\"))))","v":""},{"$f":"IF($J418=\"\",\"\",IF($I418>Trimestre!$D$2,\"Non débuté\",IF(Trimestre!$D$2>$J418,\"Terminé\",\"Courant\")))","v":""}]
[null,null,null,null,null,null,null,null,null,null,{"$f":"IF($J419=\"\",\"\",IF($L419=\"Courant\",Donnees!$A$3,IF($L419=\"terminé\",Donnees!$A$4,IF($L420=\"Non débuté\",\"\"))))","v":""},{"$f":"IF($J419=\"\",\"\",IF($I419>Trimestre!$D$2,\"Non débuté\",IF(Trimestre!$D$2>$J419,\"Terminé\",\"Courant\")))","v":""}]
[null,null,null,null,null,null,null,null,null,null,{"$f":"IF($J420=\"\",\"\",IF($L420=\"Courant\",Donnees!$A$3,IF($L420=\"terminé\",Donnees!$A$4,IF($L421=\"Non débuté\",\"\"))))","v":""},{"$f":"IF($J420=\"\",\"\",IF($I420>Trimestre!$D$2,\"Non débuté\",IF(Trimestre!$D$2>$J420,\"Terminé\",\"Courant\")))","v":""}]
[null,null,null,null,null,null,null,null,null,null,{"$f":"IF($J421=\"\",\"\",IF($L421=\"Courant\",Donnees!$A$3,IF($L421=\"terminé\",Donnees!$A$4,IF($L422=\"Non débuté\",\"\"))))","v":""},{"$f":"IF($J421=\"\",\"\",IF($I421>Trimestre!$D$2,\"Non débuté\",IF(Trimestre!$D$2>$J421,\"Terminé\",\"Courant\")))","v":""}]
[null,null,null,null,null,null,null,null,null,null,{"$f":"IF($J422=\"\",\"\",IF($L422=\"Courant\",Donnees!$A$3,IF($L422=\"terminé\",Donnees!$A$4,IF($L423=\"Non débuté\",\"\"))))","v":""},{"$f":"IF($J422=\"\",\"\",IF($I422>Trimestre!$D$2,\"Non débuté\",IF(Trimestre!$D$2>$J422,\"Terminé\",\"Courant\")))","v":""}]
[null,null,null,null,null,null,null,null,null,null,{"$f":"IF($J423=\"\",\"\",IF($L423=\"Courant\",Donnees!$A$3,IF($L423=\"terminé\",Donnees!$A$4,IF($L424=\"Non débuté\",\"\"))))","v":""},{"$f":"IF($J423=\"\",\"\",IF($I423>Trimestre!$D$2,\"Non débuté\",IF(Trimestre!$D$2>$J423,\"Terminé\",\"Courant\")))","v":""}]
[null,null,null,null,null,null,null,null,null,null,{"$f":"IF($J424=\"\",\"\",IF($L424=\"Courant\",Donnees!$A$3,IF($L424=\"terminé\",Donnees!$A$4,IF($L425=\"Non débuté\",\"\"))))","v":""},{"$f":"IF($J424=\"\",\"\",IF($I424>Trimestre!$D$2,\"Non débuté\",IF(Trimestre!$D$2>$J424,\"Terminé\",\"Courant\")))","v":""}]
[null,null,null,null,null,null,null,null,null,null,{"$f":"IF($J425=\"\",\"\",IF($L425=\"Courant\",Donnees!$A$3,IF($L425=\"terminé\",Donnees!$A$4,IF($L426=\"Non débuté\",\"\"))))","v":""},{"$f":"IF($J425=\"\",\"\",IF($I425>Trimestre!$D$2,\"Non débuté\",IF(Trimestre!$D$2>$J425,\"Terminé\",\"Courant\")))","v":""}]
[null,null,null,null,null,null,null,null,null,null,{"$f":"IF($J426=\"\",\"\",IF($L426=\"Courant\",Donnees!$A$3,IF($L426=\"terminé\",Donnees!$A$4,IF($L427=\"Non débuté\",\"\"))))","v":""},{"$f":"IF($J426=\"\",\"\",IF($I426>Trimestre!$D$2,\"Non débuté\",IF(Trimestre!$D$2>$J426,\"Terminé\",\"Courant\")))","v":""}]
[null,null,null,null,null,null,null,null,null,null,{"$f":"IF($J427=\"\",\"\",IF($L427=\"Courant\",Donnees!$A$3,IF($L427=\"terminé\",Donnees!$A$4,IF($L428=\"Non débuté\",\"\"))))","v":""},{"$f":"IF($J427=\"\",\"\",IF($I427>Trimestre!$D$2,\"Non débuté\",IF(Trimestre!$D$2>$J427,\"Terminé\",\"Courant\")))","v":""}]
[null,null,null,null,null,null,null,null,null,null,{"$f":"IF($J428=\"\",\"\",IF($L428=\"Courant\",Donnees!$A$3,IF($L428=\"terminé\",Donnees!$A$4,IF($L429=\"Non débuté\",\"\"))))","v":""},{"$f":"IF($J428=\"\",\"\",IF($I428>Trimestre!$D$2,\"Non débuté\",IF(Trimestre!$D$2>$J428,\"Terminé\",\"Courant\")))","v":""}]
[null,null,null,null,null,null,null,null,null,null,{"$f":"IF($J429=\"\",\"\",IF($L429=\"Courant\",Donnees!$A$3,IF($L429=\"terminé\",Donnees!$A$4,IF($L430=\"Non débuté\",\"\"))))","v":""},{"$f":"IF($J429=\"\",\"\",IF($I429>Trimestre!$D$2,\"Non débuté\",IF(Trimestre!$D$2>$J429,\"Terminé\",\"Courant\")))","v":""}]
[null,null,null,null,null,null,null,null,null,null,{"$f":"IF($J430=\"\",\"\",IF($L430=\"Courant\",Donnees!$A$3,IF($L430=\"terminé\",Donnees!$A$4,IF($L431=\"Non débuté\",\"\"))))","v":""},{"$f":"IF($J430=\"\",\"\",IF($I430>Trimestre!$D$2,\"Non débuté\",IF(Trimestre!$D$2>$J430,\"Terminé\",\"Courant\")))","v":""}]
[null,null,null,null,null,null,null,null,null,null,{"$f":"IF($J431=\"\",\"\",IF($L431=\"Courant\",Donnees!$A$3,IF($L431=\"terminé\",Donnees!$A$4,IF($L432=\"Non débuté\",\"\"))))","v":""},{"$f":"IF($J431=\"\",\"\",IF($I431>Trimestre!$D$2,\"Non débuté\",IF(Trimestre!$D$2>$J431,\"Terminé\",\"Courant\")))","v":""}]
[null,null,null,null,null,null,null,null,null,null,{"$f":"IF($J432=\"\",\"\",IF($L432=\"Courant\",Donnees!$A$3,IF($L432=\"terminé\",Donnees!$A$4,IF($L433=\"Non débuté\",\"\"))))","v":""},{"$f":"IF($J432=\"\",\"\",IF($I432>Trimestre!$D$2,\"Non débuté\",IF(Trimestre!$D$2>$J432,\"Terminé\",\"Courant\")))","v":""}]
[null,null,null,null,null,null,null,null,null,null,{"$f":"IF($J433=\"\",\"\",IF($L433=\"Courant\",Donnees!$A$3,IF($L433=\"terminé\",Donnees!$A$4,IF($L434=\"Non débuté\",\"\"))))","v":""},{"$f":"IF($J433=\"\",\"\",IF($I433>Trimestre!$D$2,\"Non débuté\",IF(Trimestre!$D$2>$J433,\"Terminé\",\"Courant\")))","v":""}]
[null,null,null,null,null,null,null,null,null,null,{"$f":"IF($J434=\"\",\"\",IF($L434=\"Courant\",Donnees!$A$3,IF($L434=\"terminé\",Donnees!$A$4,IF($L435=\"Non débuté\",\"\"))))","v":""},{"$f":"IF($J434=\"\",\"\",IF($I434>Trimestre!$D$2,\"Non débuté\",IF(Trimestre!$D$2>$J434,\"Terminé\",\"Courant\")))","v":""}]
[null,null,null,null,null,null,null,null,null,null,{"$f":"IF($J435=\"\",\"\",IF($L435=\"Courant\",Donnees!$A$3,IF($L435=\"terminé\",Donnees!$A$4,IF($L436=\"Non débuté\",\"\"))))","v":""},{"$f":"IF($J435=\"\",\"\",IF($I435>Trimestre!$D$2,\"Non débuté\",IF(Trimestre!$D$2>$J435,\"Terminé\",\"Courant\")))","v":""}]
[null,null,null,null,null,null,null,null,null,null,{"$f":"IF($J436=\"\",\"\",IF($L436=\"Courant\",Donnees!$A$3,IF($L436=\"terminé\",Donnees!$A$4,IF($L437=\"Non débuté\",\"\"))))","v":""},{"$f":"IF($J436=\"\",\"\",IF($I436>Trimestre!$D$2,\"Non débuté\",IF(Trimestre!$D$2>$J436,\"Terminé\",\"Courant\")))","v":""}]
[null,null,null,null,null,null,null,null,null,null,{"$f":"IF($J437=\"\",\"\",IF($L437=\"Courant\",Donnees!$A$3,IF($L437=\"terminé\",Donnees!$A$4,IF($L438=\"Non débuté\",\"\"))))","v":""},{"$f":"IF($J437=\"\",\"\",IF($I437>Trimestre!$D$2,\"Non débuté\",IF(Trimestre!$D$2>$J437,\"Terminé\",\"Courant\")))","v":""}]
[null,null,null,null,null,null,null,null,null,null,{"$f":"IF($J438=\"\",\"\",IF($L438=\"Courant\",Donnees!$A$3,IF($L438=\"terminé\",Donnees!$A$4,IF($L439=\"Non débuté\",\"\"))))","v":""},{"$f":"IF($J438=\"\",\"\",IF($I438>Trimestre!$D$2,\"Non débuté\",IF(Trimestre!$D$2>$J438,\"Terminé\",\"Courant\")))","v":""}]
[null,null,null,null,null,null,null,null,null,null,{"$f":"IF($J439=\"\",\"\",IF($L439=\"Courant\",Donnees!$A$3,IF($L439=\"terminé\",Donnees!$A$4,IF($L440=\"Non débuté\",\"\"))))","v":""},{"$f":"IF($J439=\"\",\"\",IF($I439>Trimestre!$D$2,\"Non débuté\",IF(Trimestre!$D$2>$J439,\"Terminé\",\"Courant\")))","v":""}]
[null,null,null,null,null,null,null,null,null,null,{"$f":"IF($J440=\"\",\"\",IF($L440=\"Courant\",Donnees!$A$3,IF($L440=\"terminé\",Donnees!$A$4,IF($L441=\"Non débuté\",\"\"))))","v":""},{"$f":"IF($J440=\"\",\"\",IF($I440>Trimestre!$D$2,\"Non débuté\",IF(Trimestre!$D$2>$J440,\"Terminé\",\"Courant\")))","v":""}]
[null,null,null,null,null,null,null,null,null,null,{"$f":"IF($J441=\"\",\"\",IF($L441=\"Courant\",Donnees!$A$3,IF($L441=\"terminé\",Donnees!$A$4,IF($L442=\"Non débuté\",\"\"))))","v":""},{"$f":"IF($J441=\"\",\"\",IF($I441>Trimestre!$D$2,\"Non débuté\",IF(Trimestre!$D$2>$J441,\"Terminé\",\"Courant\")))","v":""}]
[null,null,null,null,null,null,null,null,null,null,{"$f":"IF($J442=\"\",\"\",IF($L442=\"Courant\",Donnees!$A$3,IF($L442=\"terminé\",Donnees!$A$4,IF($L443=\"Non débuté\",\"\"))))","v":""},{"$f":"IF($J442=\"\",\"\",IF($I442>Trimestre!$D$2,\"Non débuté\",IF(Trimestre!$D$2>$J442,\"Terminé\",\"Courant\")))","v":""}]
[null,null,null,null,null,null,null,null,null,null,{"$f":"IF($J443=\"\",\"\",IF($L443=\"Courant\",Donnees!$A$3,IF($L443=\"terminé\",Donnees!$A$4,IF($L444=\"Non débuté\",\"\"))))","v":""},{"$f":"IF($J443=\"\",\"\",IF($I443>Trimestre!$D$2,\"Non débuté\",IF(Trimestre!$D$2>$J443,\"Terminé\",\"Courant\")))","v":""}]
[null,null,null,null,null,null,null,null,null,null,{"$f":"IF($J444=\"\",\"\",IF($L444=\"Courant\",Donnees!$A$3,IF($L444=\"terminé\",Donnees!$A$4,IF($L445=\"Non débuté\",\"\"))))","v":""},{"$f":"IF($J444=\"\",\"\",IF($I444>Trimestre!$D$2,\"Non débuté\",IF(Trimestre!$D$2>$J444,\"Terminé\",\"Courant\")))","v":""}]
[null,null,null,null,null,null,null,null,null,null,{"$f":"IF($J445=\"\",\"\",IF($L445=\"Courant\",Donnees!$A$3,IF($L445=\"terminé\",Donnees!$A$4,IF($L446=\"Non débuté\",\"\"))))","v":""},{"$f":"IF($J445=\"\",\"\",IF($I445>Trimestre!$D$2,\"Non débuté\",IF(Trimestre!$D$2>$J445,\"Terminé\",\"Courant\")))","v":""}]
[null,null,null,null,null,null,null,null,null,null,{"$f":"IF($J446=\"\",\"\",IF($L446=\"Courant\",Donnees!$A$3,IF($L446=\"terminé\",Donnees!$A$4,IF($L447=\"Non débuté\",\"\"))))","v":""},{"$f":"IF($J446=\"\",\"\",IF($I446>Trimestre!$D$2,\"Non débuté\",IF(Trimestre!$D$2>$J446,\"Terminé\",\"Courant\")))","v":""}]
[null,null,null,null,null,null,null,null,null,null,{"$f":"IF($J447=\"\",\"\",IF($L447=\"Courant\",Donnees!$A$3,IF($L447=\"terminé\",Donnees!$A$4,IF($L448=\"Non débuté\",\"\"))))","v":""},{"$f":"IF($J447=\"\",\"\",IF($I447>Trimestre!$D$2,\"Non débuté\",IF(Trimestre!$D$2>$J447,\"Terminé\",\"Courant\")))","v":""}]
[null,null,null,null,null,null,null,null,null,null,{"$f":"IF($J448=\"\",\"\",IF($L448=\"Courant\",Donnees!$A$3,IF($L448=\"terminé\",Donnees!$A$4,IF($L449=\"Non débuté\",\"\"))))","v":""},{"$f":"IF($J448=\"\",\"\",IF($I448>Trimestre!$D$2,\"Non débuté\",IF(Trimestre!$D$2>$J448,\"Terminé\",\"Courant\")))","v":""}]
[null,null,null,null,null,null,null,null,null,null,{"$f":"IF($J449=\"\",\"\",IF($L449=\"Courant\",Donnees!$A$3,IF($L449=\"terminé\",Donnees!$A$4,IF($L450=\"Non débuté\",\"\"))))","v":""},{"$f":"IF($J449=\"\",\"\",IF($I449>Trimestre!$D$2,\"Non débuté\",IF(Trimestre!$D$2>$J449,\"Terminé\",\"Courant\")))","v":""}]
[null,null,null,null,null,null,null,null,null,null,{"$f":"IF($J450=\"\",\"\",IF($L450=\"Courant\",Donnees!$A$3,IF($L450=\"terminé\",Donnees!$A$4,IF($L451=\"Non débuté\",\"\"))))","v":""},{"$f":"IF($J450=\"\",\"\",IF($I450>Trimestre!$D$2,\"Non débuté\",IF(Trimestre!$D$2>$J450,\"Terminé\",\"Courant\")))","v":""}]
[null,null,null,null,null,null,null,null,null,null,{"$f":"IF($J451=\"\",\"\",IF($L451=\"Courant\",Donnees!$A$3,IF($L451=\"terminé\",Donnees!$A$4,IF($L452=\"Non débuté\",\"\"))))","v":""},{"$f":"IF($J451=\"\",\"\",IF($I451>Trimestre!$D$2,\"Non débuté\",IF(Trimestre!$D$2>$J451,\"Terminé\",\"Courant\")))","v":""}]
[null,null,null,null,null,null,null,null,null,null,{"$f":"IF($J452=\"\",\"\",IF($L452=\"Courant\",Donnees!$A$3,IF($L452=\"terminé\",Donnees!$A$4,IF($L453=\"Non débuté\",\"\"))))","v":""},{"$f":"IF($J452=\"\",\"\",IF($I452>Trimestre!$D$2,\"Non débuté\",IF(Trimestre!$D$2>$J452,\"Terminé\",\"Courant\")))","v":""}]
[null,null,null,null,null,null,null,null,null,null,{"$f":"IF($J453=\"\",\"\",IF($L453=\"Courant\",Donnees!$A$3,IF($L453=\"terminé\",Donnees!$A$4,IF($L454=\"Non débuté\",\"\"))))","v":""},{"$f":"IF($J453=\"\",\"\",IF($I453>Trimestre!$D$2,\"Non débuté\",IF(Trimestre!$D$2>$J453,\"Terminé\",\"Courant\")))","v":""}]
[null,null,null,null,null,null,null,null,null,null,{"$f":"IF($J454=\"\",\"\",IF($L454=\"Courant\",Donnees!$A$3,IF($L454=\"terminé\",Donnees!$A$4,IF($L455=\"Non débuté\",\"\"))))","v":""},{"$f":"IF($J454=\"\",\"\",IF($I454>Trimestre!$D$2,\"Non débuté\",IF(Trimestre!$D$2>$J454,\"Terminé\",\"Courant\")))","v":""}]
[null,null,null,null,null,null,null,null,null,null,{"$f":"IF($J455=\"\",\"\",IF($L455=\"Courant\",Donnees!$A$3,IF($L455=\"terminé\",Donnees!$A$4,IF($L456=\"Non débuté\",\"\"))))","v":""},{"$f":"IF($J455=\"\",\"\",IF($I455>Trimestre!$D$2,\"Non débuté\",IF(Trimestre!$D$2>$J455,\"Terminé\",\"Courant\")))","v":""}]
[null,null,null,null,null,null,null,null,null,null,{"$f":"IF($J456=\"\",\"\",IF($L456=\"Courant\",Donnees!$A$3,IF($L456=\"terminé\",Donnees!$A$4,IF($L457=\"Non débuté\",\"\"))))","v":""},{"$f":"IF($J456=\"\",\"\",IF($I456>Trimestre!$D$2,\"Non débuté\",IF(Trimestre!$D$2>$J456,\"Terminé\",\"Courant\")))","v":""}]
[null,null,null,null,null,null,null,null,null,null,{"$f":"IF($J457=\"\",\"\",IF($L457=\"Courant\",Donnees!$A$3,IF($L457=\"terminé\",Donnees!$A$4,IF($L458=\"Non débuté\",\"\"))))","v":""},{"$f":"IF($J457=\"\",\"\",IF($I457>Trimestre!$D$2,\"Non débuté\",IF(Trimestre!$D$2>$J457,\"Terminé\",\"Courant\")))","v":""}]
[null,null,null,null,null,null,null,null,null,null,{"$f":"IF($J458=\"\",\"\",IF($L458=\"Courant\",Donnees!$A$3,IF($L458=\"terminé\",Donnees!$A$4,IF($L459=\"Non débuté\",\"\"))))","v":""},{"$f":"IF($J458=\"\",\"\",IF($I458>Trimestre!$D$2,\"Non débuté\",IF(Trimestre!$D$2>$J458,\"Terminé\",\"Courant\")))","v":""}]
[null,null,null,null,null,null,null,null,null,null,{"$f":"IF($J459=\"\",\"\",IF($L459=\"Courant\",Donnees!$A$3,IF($L459=\"terminé\",Donnees!$A$4,IF($L460=\"Non débuté\",\"\"))))","v":""},{"$f":"IF($J459=\"\",\"\",IF($I459>Trimestre!$D$2,\"Non débuté\",IF(Trimestre!$D$2>$J459,\"Terminé\",\"Courant\")))","v":""}]
[null,null,null,null,null,null,null,null,null,null,{"$f":"IF($J460=\"\",\"\",IF($L460=\"Courant\",Donnees!$A$3,IF($L460=\"terminé\",Donnees!$A$4,IF($L461=\"Non débuté\",\"\"))))","v":""},{"$f":"IF($J460=\"\",\"\",IF($I460>Trimestre!$D$2,\"Non débuté\",IF(Trimestre!$D$2>$J460,\"Terminé\",\"Courant\")))","v":""}]
[null,null,null,null,null,null,null,null,null,null,{"$f":"IF($J461=\"\",\"\",IF($L461=\"Courant\",Donnees!$A$3,IF($L461=\"terminé\",Donnees!$A$4,IF($L462=\"Non débuté\",\"\"))))","v":""},{"$f":"IF($J461=\"\",\"\",IF($I461>Trimestre!$D$2,\"Non débuté\",IF(Trimestre!$D$2>$J461,\"Terminé\",\"Courant\")))","v":""}]
[null,null,null,null,null,null,null,null,null,null,{"$f":"IF($J462=\"\",\"\",IF($L462=\"Courant\",Donnees!$A$3,IF($L462=\"terminé\",Donnees!$A$4,IF($L463=\"Non débuté\",\"\"))))","v":""},{"$f":"IF($J462=\"\",\"\",IF($I462>Trimestre!$D$2,\"Non débuté\",IF(Trimestre!$D$2>$J462,\"Terminé\",\"Courant\")))","v":""}]
[null,null,null,null,null,null,null,null,null,null,{"$f":"IF($J463=\"\",\"\",IF($L463=\"Courant\",Donnees!$A$3,IF($L463=\"terminé\",Donnees!$A$4,IF($L464=\"Non débuté\",\"\"))))","v":""},{"$f":"IF($J463=\"\",\"\",IF($I463>Trimestre!$D$2,\"Non débuté\",IF(Trimestre!$D$2>$J463,\"Terminé\",\"Courant\")))","v":""}]
[null,null,null,null,null,null,null,null,null,null,{"$f":"IF($J464=\"\",\"\",IF($L464=\"Courant\",Donnees!$A$3,IF($L464=\"terminé\",Donnees!$A$4,IF($L465=\"Non débuté\",\"\"))))","v":""},{"$f":"IF($J464=\"\",\"\",IF($I464>Trimestre!$D$2,\"Non débuté\",IF(Trimestre!$D$2>$J464,\"Terminé\",\"Courant\")))","v":""}]
[null,null,null,null,null,null,null,null,null,null,{"$f":"IF($J465=\"\",\"\",IF($L465=\"Courant\",Donnees!$A$3,IF($L465=\"terminé\",Donnees!$A$4,IF($L466=\"Non débuté\",\"\"))))","v":""},{"$f":"IF($J465=\"\",\"\",IF($I465>Trimestre!$D$2,\"Non débuté\",IF(Trimestre!$D$2>$J465,\"Terminé\",\"Courant\")))","v":""}]
[null,null,null,null,null,null,null,null,null,null,{"$f":"IF($J466=\"\",\"\",IF($L466=\"Courant\",Donnees!$A$3,IF($L466=\"terminé\",Donnees!$A$4,IF($L467=\"Non débuté\",\"\"))))","v":""},{"$f":"IF($J466=\"\",\"\",IF($I466>Trimestre!$D$2,\"Non débuté\",IF(Trimestre!$D$2>$J466,\"Terminé\",\"Courant\")))","v":""}]
[null,null,null,null,null,null,null,null,null,null,{"$f":"IF($J467=\"\",\"\",IF($L467=\"Courant\",Donnees!$A$3,IF($L467=\"terminé\",Donnees!$A$4,IF($L468=\"Non débuté\",\"\"))))","v":""},{"$f":"IF($J467=\"\",\"\",IF($I467>Trimestre!$D$2,\"Non débuté\",IF(Trimestre!$D$2>$J467,\"Terminé\",\"Courant\")))","v":""}]
[null,null,null,null,null,null,null,null,null,null,{"$f":"IF($J468=\"\",\"\",IF($L468=\"Courant\",Donnees!$A$3,IF($L468=\"terminé\",Donnees!$A$4,IF($L469=\"Non débuté\",\"\"))))","v":""},{"$f":"IF($J468=\"\",\"\",IF($I468>Trimestre!$D$2,\"Non débuté\",IF(Trimestre!$D$2>$J468,\"Terminé\",\"Courant\")))","v":""}]
[null,null,null,null,null,null,null,null,null,null,{"$f":"IF($J469=\"\",\"\",IF($L469=\"Courant\",Donnees!$A$3,IF($L469=\"terminé\",Donnees!$A$4,IF($L470=\"Non débuté\",\"\"))))","v":""},{"$f":"IF($J469=\"\",\"\",IF($I469>Trimestre!$D$2,\"Non débuté\",IF(Trimestre!$D$2>$J469,\"Terminé\",\"Courant\")))","v":""}]
[null,null,null,null,null,null,null,null,null,null,{"$f":"IF($J470=\"\",\"\",IF($L470=\"Courant\",Donnees!$A$3,IF($L470=\"terminé\",Donnees!$A$4,IF($L471=\"Non débuté\",\"\"))))","v":""},{"$f":"IF($J470=\"\",\"\",IF($I470>Trimestre!$D$2,\"Non débuté\",IF(Trimestre!$D$2>$J470,\"Terminé\",\"Courant\")))","v":""}]
[null,null,null,null,null,null,null,null,null,null,{"$f":"IF($J471=\"\",\"\",IF($L471=\"Courant\",Donnees!$A$3,IF($L471=\"terminé\",Donnees!$A$4,IF($L472=\"Non débuté\",\"\"))))","v":""},{"$f":"IF($J471=\"\",\"\",IF($I471>Trimestre!$D$2,\"Non débuté\",IF(Trimestre!$D$2>$J471,\"Terminé\",\"Courant\")))","v":""}]
[null,null,null,null,null,null,null,null,null,null,{"$f":"IF($J472=\"\",\"\",IF($L472=\"Courant\",Donnees!$A$3,IF($L472=\"terminé\",Donnees!$A$4,IF($L473=\"Non débuté\",\"\"))))","v":""},{"$f":"IF($J472=\"\",\"\",IF($I472>Trimestre!$D$2,\"Non débuté\",IF(Trimestre!$D$2>$J472,\"Terminé\",\"Courant\")))","v":""}]
[null,null,null,null,null,null,null,null,null,null,{"$f":"IF($J473=\"\",\"\",IF($L473=\"Courant\",Donnees!$A$3,IF($L473=\"terminé\",Donnees!$A$4,IF($L474=\"Non débuté\",\"\"))))","v":""},{"$f":"IF($J473=\"\",\"\",IF($I473>Trimestre!$D$2,\"Non débuté\",IF(Trimestre!$D$2>$J473,\"Terminé\",\"Courant\")))","v":""}]
[null,null,null,null,null,null,null,null,null,null,{"$f":"IF($J474=\"\",\"\",IF($L474=\"Courant\",Donnees!$A$3,IF($L474=\"terminé\",Donnees!$A$4,IF($L475=\"Non débuté\",\"\"))))","v":""},{"$f":"IF($J474=\"\",\"\",IF($I474>Trimestre!$D$2,\"Non débuté\",IF(Trimestre!$D$2>$J474,\"Terminé\",\"Courant\")))","v":""}]
[null,null,null,null,null,null,null,null,null,null,{"$f":"IF($J475=\"\",\"\",IF($L475=\"Courant\",Donnees!$A$3,IF($L475=\"terminé\",Donnees!$A$4,IF($L476=\"Non débuté\",\"\"))))","v":""},{"$f":"IF($J475=\"\",\"\",IF($I475>Trimestre!$D$2,\"Non débuté\",IF(Trimestre!$D$2>$J475,\"Terminé\",\"Courant\")))","v":""}]
[null,null,null,null,null,null,null,null,null,null,{"$f":"IF($J476=\"\",\"\",IF($L476=\"Courant\",Donnees!$A$3,IF($L476=\"terminé\",Donnees!$A$4,IF($L477=\"Non débuté\",\"\"))))","v":""},{"$f":"IF($J476=\"\",\"\",IF($I476>Trimestre!$D$2,\"Non débuté\",IF(Trimestre!$D$2>$J476,\"Terminé\",\"Courant\")))","v":""}]
[null,null,null,null,null,null,null,null,null,null,{"$f":"IF($J477=\"\",\"\",IF($L477=\"Courant\",Donnees!$A$3,IF($L477=\"terminé\",Donnees!$A$4,IF($L478=\"Non débuté\",\"\"))))","v":""},{"$f":"IF($J477=\"\",\"\",IF($I477>Trimestre!$D$2,\"Non débuté\",IF(Trimestre!$D$2>$J477,\"Terminé\",\"Courant\")))","v":""}]
[null,null,null,null,null,null,null,null,null,null,{"$f":"IF($J478=\"\",\"\",IF($L478=\"Courant\",Donnees!$A$3,IF($L478=\"terminé\",Donnees!$A$4,IF($L479=\"Non débuté\",\"\"))))","v":""},{"$f":"IF($J478=\"\",\"\",IF($I478>Trimestre!$D$2,\"Non débuté\",IF(Trimestre!$D$2>$J478,\"Terminé\",\"Courant\")))","v":""}]
[null,null,null,null,null,null,null,null,null,null,{"$f":"IF($J479=\"\",\"\",IF($L479=\"Courant\",Donnees!$A$3,IF($L479=\"terminé\",Donnees!$A$4,IF($L480=\"Non débuté\",\"\"))))","v":""},{"$f":"IF($J479=\"\",\"\",IF($I479>Trimestre!$D$2,\"Non débuté\",IF(Trimestre!$D$2>$J479,\"Terminé\",\"Courant\")))","v":""}]
[null,null,null,null,null,null,null,null,null,null,{"$f":"IF($J480=\"\",\"\",IF($L480=\"Courant\",Donnees!$A$3,IF($L480=\"terminé\",Donnees!$A$4,IF($L481=\"Non débuté\",\"\"))))","v":""},{"$f":"IF($J480=\"\",\"\",IF($I480>Trimestre!$D$2,\"Non débuté\",IF(Trimestre!$D$2>$J480,\"Terminé\",\"Courant\")))","v":""}]
[null,null,null,null,null,null,null,null,null,null,{"$f":"IF($J481=\"\",\"\",IF($L481=\"Courant\",Donnees!$A$3,IF($L481=\"terminé\",Donnees!$A$4,IF($L482=\"Non débuté\",\"\"))))","v":""},{"$f":"IF($J481=\"\",\"\",IF($I481>Trimestre!$D$2,\"Non débuté\",IF(Trimestre!$D$2>$J481,\"Terminé\",\"Courant\")))","v":""}]
[null,null,null,null,null,null,null,null,null,null,{"$f":"IF($J482=\"\",\"\",IF($L482=\"Courant\",Donnees!$A$3,IF($L482=\"terminé\",Donnees!$A$4,IF($L483=\"Non débuté\",\"\"))))","v":""},{"$f":"IF($J482=\"\",\"\",IF($I482>Trimestre!$D$2,\"Non débuté\",IF(Trimestre!$D$2>$J482,\"Terminé\",\"Courant\")))","v":""}]
[null,null,null,null,null,null,null,null,null,null,{"$f":"IF($J483=\"\",\"\",IF($L483=\"Courant\",Donnees!$A$3,IF($L483=\"terminé\",Donnees!$A$4,IF($L484=\"Non débuté\",\"\"))))","v":""},{"$f":"IF($J483=\"\",\"\",IF($I483>Trimestre!$D$2,\"Non débuté\",IF(Trimestre!$D$2>$J483,\"Terminé\",\"Courant\")))","v":""}]
[null,null,null,null,null,null,null,null,null,null,{"$f":"IF($J484=\"\",\"\",IF($L484=\"Courant\",Donnees!$A$3,IF($L484=\"terminé\",Donnees!$A$4,IF($L485=\"Non débuté\",\"\"))))","v":""},{"$f":"IF($J484=\"\",\"\",IF($I484>Trimestre!$D$2,\"Non débuté\",IF(Trimestre!$D$2>$J484,\"Terminé\",\"Courant\")))","v":""}]
[null,null,null,null,null,null,null,null,null,null,{"$f":"IF($J485=\"\",\"\",IF($L485=\"Courant\",Donnees!$A$3,IF($L485=\"terminé\",Donnees!$A$4,IF($L486=\"Non débuté\",\"\"))))","v":""},{"$f":"IF($J485=\"\",\"\",IF($I485>Trimestre!$D$2,\"Non débuté\",IF(Trimestre!$D$2>$J485,\"Terminé\",\"Courant\")))","v":""}]
[null,null,null,null,null,null,null,null,null,null,{"$f":"IF($J486=\"\",\"\",IF($L486=\"Courant\",Donnees!$A$3,IF($L486=\"terminé\",Donnees!$A$4,IF($L487=\"Non débuté\",\"\"))))","v":""},{"$f":"IF($J486=\"\",\"\",IF($I486>Trimestre!$D$2,\"Non débuté\",IF(Trimestre!$D$2>$J486,\"Terminé\",\"Courant\")))","v":""}]
[null,null,null,null,null,null,null,null,null,null,{"$f":"IF($J487=\"\",\"\",IF($L487=\"Courant\",Donnees!$A$3,IF($L487=\"terminé\",Donnees!$A$4,IF($L488=\"Non débuté\",\"\"))))","v":""},{"$f":"IF($J487=\"\",\"\",IF($I487>Trimestre!$D$2,\"Non débuté\",IF(Trimestre!$D$2>$J487,\"Terminé\",\"Courant\")))","v":""}]
[null,null,null,null,null,null,null,null,null,null,{"$f":"IF($J488=\"\",\"\",IF($L488=\"Courant\",Donnees!$A$3,IF($L488=\"terminé\",Donnees!$A$4,IF($L489=\"Non débuté\",\"\"))))","v":""},{"$f":"IF($J488=\"\",\"\",IF($I488>Trimestre!$D$2,\"Non débuté\",IF(Trimestre!$D$2>$J488,\"Terminé\",\"Courant\")))","v":""}]
[null,null,null,null,null,null,null,null,null,null,{"$f":"IF($J489=\"\",\"\",IF($L489=\"Courant\",Donnees!$A$3,IF($L489=\"terminé\",Donnees!$A$4,IF($L490=\"Non débuté\",\"\"))))","v":""},{"$f":"IF($J489=\"\",\"\",IF($I489>Trimestre!$D$2,\"Non débuté\",IF(Trimestre!$D$2>$J489,\"Terminé\",\"Courant\")))","v":""}]
[null,null,null,null,null,null,null,null,null,null,{"$f":"IF($J490=\"\",\"\",IF($L490=\"Courant\",Donnees!$A$3,IF($L490=\"terminé\",Donnees!$A$4,IF($L491=\"Non débuté\",\"\"))))","v":""},{"$f":"IF($J490=\"\",\"\",IF($I490>Trimestre!$D$2,\"Non débuté\",IF(Trimestre!$D$2>$J490,\"Terminé\",\"Courant\")))","v":""}]
[null,null,null,null,null,null,null,null,null,null,{"$f":"IF($J491=\"\",\"\",IF($L491=\"Courant\",Donnees!$A$3,IF($L491=\"terminé\",Donnees!$A$4,IF($L492=\"Non débuté\",\"\"))))","v":""},{"$f":"IF($J491=\"\",\"\",IF($I491>Trimestre!$D$2,\"Non débuté\",IF(Trimestre!$D$2>$J491,\"Terminé\",\"Courant\")))","v":""}]
[null,null,null,null,null,null,null,null,null,null,{"$f":"IF($J492=\"\",\"\",IF($L492=\"Courant\",Donnees!$A$3,IF($L492=\"terminé\",Donnees!$A$4,IF($L493=\"Non débuté\",\"\"))))","v":""},{"$f":"IF($J492=\"\",\"\",IF($I492>Trimestre!$D$2,\"Non débuté\",IF(Trimestre!$D$2>$J492,\"Terminé\",\"Courant\")))","v":""}]
[null,null,null,null,null,null,null,null,null,null,{"$f":"IF($J493=\"\",\"\",IF($L493=\"Courant\",Donnees!$A$3,IF($L493=\"terminé\",Donnees!$A$4,IF($L494=\"Non débuté\",\"\"))))","v":""},{"$f":"IF($J493=\"\",\"\",IF($I493>Trimestre!$D$2,\"Non débuté\",IF(Trimestre!$D$2>$J493,\"Terminé\",\"Courant\")))","v":""}]
[null,null,null,null,null,null,null,null,null,null,{"$f":"IF($J494=\"\",\"\",IF($L494=\"Courant\",Donnees!$A$3,IF($L494=\"terminé\",Donnees!$A$4,IF($L495=\"Non débuté\",\"\"))))","v":""},{"$f":"IF($J494=\"\",\"\",IF($I494>Trimestre!$D$2,\"Non débuté\",IF(Trimestre!$D$2>$J494,\"Terminé\",\"Courant\")))","v":""}]
[null,null,null,null,null,null,null,null,null,null,{"$f":"IF($J495=\"\",\"\",IF($L495=\"Courant\",Donnees!$A$3,IF($L495=\"terminé\",Donnees!$A$4,IF($L496=\"Non débuté\",\"\"))))","v":""},{"$f":"IF($J495=\"\",\"\",IF($I495>Trimestre!$D$2,\"Non débuté\",IF(Trimestre!$D$2>$J495,\"Terminé\",\"Courant\")))","v":""}]
[null,null,null,null,null,null,null,null,null,null,{"$f":"IF($J496=\"\",\"\",IF($L496=\"Courant\",Donnees!$A$3,IF($L496=\"terminé\",Donnees!$A$4,IF($L497=\"Non débuté\",\"\"))))","v":""},{"$f":"IF($J496=\"\",\"\",IF($I496>Trimestre!$D$2,\"Non débuté\",IF(Trimestre!$D$2>$J496,\"Terminé\",\"Courant\")))","v":""}]
[null,null,null,null,null,null,null,null,null,null,{"$f":"IF($J497=\"\",\"\",IF($L497=\"Courant\",Donnees!$A$3,IF($L497=\"terminé\",Donnees!$A$4,IF($L498=\"Non débuté\",\"\"))))","v":""},{"$f":"IF($J497=\"\",\"\",IF($I497>Trimestre!$D$2,\"Non débuté\",IF(Trimestre!$D$2>$J497,\"Terminé\",\"Courant\")))","v":""}]
[null,null,null,null,null,null,null,null,null,null,{"$f":"IF($J498=\"\",\"\",IF($L498=\"Courant\",Donnees!$A$3,IF($L498=\"terminé\",Donnees!$A$4,IF($L499=\"Non débuté\",\"\"))))","v":""},{"$f":"IF($J498=\"\",\"\",IF($I498>Trimestre!$D$2,\"Non débuté\",IF(Trimestre!$D$2>$J498,\"Terminé\",\"Courant\")))","v":""}]
[null,null,null,null,null,null,null,null,null,null,{"$f":"IF($J499=\"\",\"\",IF($L499=\"Courant\",Donnees!$A$3,IF($L499=\"terminé\",Donnees!$A$4,IF($L500=\"Non débuté\",\"\"))))","v":""},{"$f":"IF($J499=\"\",\"\",IF($I499>Trimestre!$D$2,\"Non débuté\",IF(Trimestre!$D$2>$J499,\"Terminé\",\"Courant\")))","v":""}]
[null,null,null,null,null,null,null,null,null,null,{"$f":"IF($J500=\"\",\"\",IF($L500=\"Courant\",Donnees!$A$3,IF($L500=\"terminé\",Donnees!$A$4,IF($L501=\"Non débuté\",\"\"))))","v":""},{"$f":"IF($J500=\"\",\"\",IF($I500>Trimestre!$D$2,\"Non débuté\",IF(Trimestre!$D$2>$J500,\"Terminé\",\"Courant\")))","v":""}]
[null,null,null,null,null,null,null,null,null,null,{"$f":"IF($J501=\"\",\"\",IF($L501=\"Courant\",Donnees!$A$3,IF($L501=\"terminé\",Donnees!$A$4,IF($L502=\"Non débuté\",\"\"))))","v":""},{"$f":"IF($J501=\"\",\"\",IF($I501>Trimestre!$D$2,\"Non débuté\",IF(Trimestre!$D$2>$J501,\"Terminé\",\"Courant\")))","v":""}]
[null,null,null,null,null,null,null,null,null,null,{"$f":"IF($J502=\"\",\"\",IF($L502=\"Courant\",Donnees!$A$3,IF($L502=\"terminé\",Donnees!$A$4,IF($L503=\"Non débuté\",\"\"))))","v":""},{"$f":"IF($J502=\"\",\"\",IF($I502>Trimestre!$D$2,\"Non débuté\",IF(Trimestre!$D$2>$J502,\"Terminé\",\"Courant\")))","v":""}]
[null,null,null,null,null,null,null,null,null,null,{"$f":"IF($J503=\"\",\"\",IF($L503=\"Courant\",Donnees!$A$3,IF($L503=\"terminé\",Donnees!$A$4,IF($L504=\"Non débuté\",\"\"))))","v":""},{"$f":"IF($J503=\"\",\"\",IF($I503>Trimestre!$D$2,\"Non débuté\",IF(Trimestre!$D$2>$J503,\"Terminé\",\"Courant\")))","v":""}]
[null,null,null,null,null,null,null,null,null,null,{"$f":"IF($J504=\"\",\"\",IF($L504=\"Courant\",Donnees!$A$3,IF($L504=\"terminé\",Donnees!$A$4,IF($L505=\"Non débuté\",\"\"))))","v":""},{"$f":"IF($J504=\"\",\"\",IF($I504>Trimestre!$D$2,\"Non débuté\",IF(Trimestre!$D$2>$J504,\"Terminé\",\"Courant\")))","v":""}]
[null,null,null,null,null,null,null,null,null,null,{"$f":"IF($J505=\"\",\"\",IF($L505=\"Courant\",Donnees!$A$3,IF($L505=\"terminé\",Donnees!$A$4,IF($L506=\"Non débuté\",\"\"))))","v":""},{"$f":"IF($J505=\"\",\"\",IF($I505>Trimestre!$D$2,\"Non débuté\",IF(Trimestre!$D$2>$J505,\"Terminé\",\"Courant\")))","v":""}]
[null,null,null,null,null,null,null,null,null,null,{"$f":"IF($J506=\"\",\"\",IF($L506=\"Courant\",Donnees!$A$3,IF($L506=\"terminé\",Donnees!$A$4,IF($L507=\"Non débuté\",\"\"))))","v":""},{"$f":"IF($J506=\"\",\"\",IF($I506>Trimestre!$D$2,\"Non débuté\",IF(Trimestre!$D$2>$J506,\"Terminé\",\"Courant\")))","v":""}]
[null,null,null,null,null,null,null,null,null,null,{"$f":"IF($J507=\"\",\"\",IF($L507=\"Courant\",Donnees!$A$3,IF($L507=\"terminé\",Donnees!$A$4,IF($L508=\"Non débuté\",\"\"))))","v":""},{"$f":"IF($J507=\"\",\"\",IF($I507>Trimestre!$D$2,\"Non débuté\",IF(Trimestre!$D$2>$J507,\"Terminé\",\"Courant\")))","v":""}]
[null,null,null,null,null,null,null,null,null,null,{"$f":"IF($J508=\"\",\"\",IF($L508=\"Courant\",Donnees!$A$3,IF($L508=\"terminé\",Donnees!$A$4,IF($L509=\"Non débuté\",\"\"))))","v":""},{"$f":"IF($J508=\"\",\"\",IF($I508>Trimestre!$D$2,\"Non débuté\",IF(Trimestre!$D$2>$J508,\"Terminé\",\"Courant\")))","v":""}]
[null,null,null,null,null,null,null,null,null,null,{"$f":"IF($J509=\"\",\"\",IF($L509=\"Courant\",Donnees!$A$3,IF($L509=\"terminé\",Donnees!$A$4,IF($L510=\"Non débuté\",\"\"))))","v":""},{"$f":"IF($J509=\"\",\"\",IF($I509>Trimestre!$D$2,\"Non débuté\",IF(Trimestre!$D$2>$J509,\"Terminé\",\"Courant\")))","v":""}]
[null,null,null,null,null,null,null,null,null,null,{"$f":"IF($J510=\"\",\"\",IF($L510=\"Courant\",Donnees!$A$3,IF($L510=\"terminé\",Donnees!$A$4,IF($L511=\"Non débuté\",\"\"))))","v":""},{"$f":"IF($J510=\"\",\"\",IF($I510>Trimestre!$D$2,\"Non débuté\",IF(Trimestre!$D$2>$J510,\"Terminé\",\"Courant\")))","v":""}]
[null,null,null,null,null,null,null,null,null,null,{"$f":"IF($J511=\"\",\"\",IF($L511=\"Courant\",Donnees!$A$3,IF($L511=\"terminé\",Donnees!$A$4,IF($L512=\"Non débuté\",\"\"))))","v":""},{"$f":"IF($J511=\"\",\"\",IF($I511>Trimestre!$D$2,\"Non débuté\",IF(Trimestre!$D$2>$J511,\"Terminé\",\"Courant\")))","v":""}]
[null,null,null,null,null,null,null,null,null,null,{"$f":"IF($J512=\"\",\"\",IF($L512=\"Courant\",Donnees!$A$3,IF($L512=\"terminé\",Donnees!$A$4,IF($L513=\"Non débuté\",\"\"))))","v":""},{"$f":"IF($J512=\"\",\"\",IF($I512>Trimestre!$D$2,\"Non débuté\",IF(Trimestre!$D$2>$J512,\"Terminé\",\"Courant\")))","v":""}]
[null,null,null,null,null,null,null,null,null,null,{"$f":"IF($J513=\"\",\"\",IF($L513=\"Courant\",Donnees!$A$3,IF($L513=\"terminé\",Donnees!$A$4,IF($L514=\"Non débuté\",\"\"))))","v":""},{"$f":"IF($J513=\"\",\"\",IF($I513>Trimestre!$D$2,\"Non débuté\",IF(Trimestre!$D$2>$J513,\"Terminé\",\"Courant\")))","v":""}]
[null,null,null,null,null,null,null,null,null,null,{"$f":"IF($J514=\"\",\"\",IF($L514=\"Courant\",Donnees!$A$3,IF($L514=\"terminé\",Donnees!$A$4,IF($L515=\"Non débuté\",\"\"))))","v":""},{"$f":"IF($J514=\"\",\"\",IF($I514>Trimestre!$D$2,\"Non débuté\",IF(Trimestre!$D$2>$J514,\"Terminé\",\"Courant\")))","v":""}]
[null,null,null,null,null,null,null,null,null,null,{"$f":"IF($J515=\"\",\"\",IF($L515=\"Courant\",Donnees!$A$3,IF($L515=\"terminé\",Donnees!$A$4,IF($L516=\"Non débuté\",\"\"))))","v":""},{"$f":"IF($J515=\"\",\"\",IF($I515>Trimestre!$D$2,\"Non débuté\",IF(Trimestre!$D$2>$J515,\"Terminé\",\"Courant\")))","v":""}]
[null,null,null,null,null,null,null,null,null,null,{"$f":"IF($J516=\"\",\"\",IF($L516=\"Courant\",Donnees!$A$3,IF($L516=\"terminé\",Donnees!$A$4,IF($L517=\"Non débuté\",\"\"))))","v":""},{"$f":"IF($J516=\"\",\"\",IF($I516>Trimestre!$D$2,\"Non débuté\",IF(Trimestre!$D$2>$J516,\"Terminé\",\"Courant\")))","v":""}]
[null,null,null,null,null,null,null,null,null,null,{"$f":"IF($J517=\"\",\"\",IF($L517=\"Courant\",Donnees!$A$3,IF($L517=\"terminé\",Donnees!$A$4,IF($L518=\"Non débuté\",\"\"))))","v":""},{"$f":"IF($J517=\"\",\"\",IF($I517>Trimestre!$D$2,\"Non débuté\",IF(Trimestre!$D$2>$J517,\"Terminé\",\"Courant\")))","v":""}]
[null,null,null,null,null,null,null,null,null,null,{"$f":"IF($J518=\"\",\"\",IF($L518=\"Courant\",Donnees!$A$3,IF($L518=\"terminé\",Donnees!$A$4,IF($L519=\"Non débuté\",\"\"))))","v":""},{"$f":"IF($J518=\"\",\"\",IF($I518>Trimestre!$D$2,\"Non débuté\",IF(Trimestre!$D$2>$J518,\"Terminé\",\"Courant\")))","v":""}]
[null,null,null,null,null,null,null,null,null,null,{"$f":"IF($J519=\"\",\"\",IF($L519=\"Courant\",Donnees!$A$3,IF($L519=\"terminé\",Donnees!$A$4,IF($L520=\"Non débuté\",\"\"))))","v":""},{"$f":"IF($J519=\"\",\"\",IF($I519>Trimestre!$D$2,\"Non débuté\",IF(Trimestre!$D$2>$J519,\"Terminé\",\"Courant\")))","v":""}]
[null,null,null,null,null,null,null,null,null,null,{"$f":"IF($J520=\"\",\"\",IF($L520=\"Courant\",Donnees!$A$3,IF($L520=\"terminé\",Donnees!$A$4,IF($L521=\"Non débuté\",\"\"))))","v":""},{"$f":"IF($J520=\"\",\"\",IF($I520>Trimestre!$D$2,\"Non débuté\",IF(Trimestre!$D$2>$J520,\"Terminé\",\"Courant\")))","v":""}]
[null,null,null,null,null,null,null,null,null,null,{"$f":"IF($J521=\"\",\"\",IF($L521=\"Courant\",Donnees!$A$3,IF($L521=\"terminé\",Donnees!$A$4,IF($L522=\"Non débuté\",\"\"))))","v":""},{"$f":"IF($J521=\"\",\"\",IF($I521>Trimestre!$D$2,\"Non débuté\",IF(Trimestre!$D$2>$J521,\"Terminé\",\"Courant\")))","v":""}]
[null,null,null,null,null,null,null,null,null,null,{"$f":"IF($J522=\"\",\"\",IF($L522=\"Courant\",Donnees!$A$3,IF($L522=\"terminé\",Donnees!$A$4,IF($L523=\"Non débuté\",\"\"))))","v":""},{"$f":"IF($J522=\"\",\"\",IF($I522>Trimestre!$D$2,\"Non débuté\",IF(Trimestre!$D$2>$J522,\"Terminé\",\"Courant\")))","v":""}]
[null,null,null,null,null,null,null,null,null,null,{"$f":"IF($J523=\"\",\"\",IF($L523=\"Courant\",Donnees!$A$3,IF($L523=\"terminé\",Donnees!$A$4,IF($L524=\"Non débuté\",\"\"))))","v":""},{"$f":"IF($J523=\"\",\"\",IF($I523>Trimestre!$D$2,\"Non débuté\",IF(Trimestre!$D$2>$J523,\"Terminé\",\"Courant\")))","v":""}]
[null,null,null,null,null,null,null,null,null,null,{"$f":"IF($J524=\"\",\"\",IF($L524=\"Courant\",Donnees!$A$3,IF($L524=\"terminé\",Donnees!$A$4,IF($L525=\"Non débuté\",\"\"))))","v":""},{"$f":"IF($J524=\"\",\"\",IF($I524>Trimestre!$D$2,\"Non débuté\",IF(Trimestre!$D$2>$J524,\"Terminé\",\"Courant\")))","v":""}]
[null,null,null,null,null,null,null,null,null,null,{"$f":"IF($J525=\"\",\"\",IF($L525=\"Courant\",Donnees!$A$3,IF($L525=\"terminé\",Donnees!$A$4,IF($L526=\"Non débuté\",\"\"))))","v":""},{"$f":"IF($J525=\"\",\"\",IF($I525>Trimestre!$D$2,\"Non débuté\",IF(Trimestre!$D$2>$J525,\"Terminé\",\"Courant\")))","v":""}]
[null,null,null,null,null,null,null,null,null,null,{"$f":"IF($J526=\"\",\"\",IF($L526=\"Courant\",Donnees!$A$3,IF($L526=\"terminé\",Donnees!$A$4,IF($L527=\"Non débuté\",\"\"))))","v":""},{"$f":"IF($J526=\"\",\"\",IF($I526>Trimestre!$D$2,\"Non débuté\",IF(Trimestre!$D$2>$J526,\"Terminé\",\"Courant\")))","v":""}]
[null,null,null,null,null,null,null,null,null,null,{"$f":"IF($J527=\"\",\"\",IF($L527=\"Courant\",Donnees!$A$3,IF($L527=\"terminé\",Donnees!$A$4,IF($L528=\"Non débuté\",\"\"))))","v":""},{"$f":"IF($J527=\"\",\"\",IF($I527>Trimestre!$D$2,\"Non débuté\",IF(Trimestre!$D$2>$J527,\"Terminé\",\"Courant\")))","v":""}]
[null,null,null,null,null,null,null,null,null,null,{"$f":"IF($J528=\"\",\"\",IF($L528=\"Courant\",Donnees!$A$3,IF($L528=\"terminé\",Donnees!$A$4,IF($L529=\"Non débuté\",\"\"))))","v":""},{"$f":"IF($J528=\"\",\"\",IF($I528>Trimestre!$D$2,\"Non débuté\",IF(Trimestre!$D$2>$J528,\"Terminé\",\"Courant\")))","v":""}]
[null,null,null,null,null,null,null,null,null,null,{"$f":"IF($J529=\"\",\"\",IF($L529=\"Courant\",Donnees!$A$3,IF($L529=\"terminé\",Donnees!$A$4,IF($L530=\"Non débuté\",\"\"))))","v":""},{"$f":"IF($J529=\"\",\"\",IF($I529>Trimestre!$D$2,\"Non débuté\",IF(Trimestre!$D$2>$J529,\"Terminé\",\"Courant\")))","v":""}]
[null,null,null,null,null,null,null,null,null,null,{"$f":"IF($J530=\"\",\"\",IF($L530=\"Courant\",Donnees!$A$3,IF($L530=\"terminé\",Donnees!$A$4,IF($L531=\"Non débuté\",\"\"))))","v":""},{"$f":"IF($J530=\"\",\"\",IF($I530>Trimestre!$D$2,\"Non débuté\",IF(Trimestre!$D$2>$J530,\"Terminé\",\"Courant\")))","v":""}]
[null,null,null,null,null,null,null,null,null,null,{"$f":"IF($J531=\"\",\"\",IF($L531=\"Courant\",Donnees!$A$3,IF($L531=\"terminé\",Donnees!$A$4,IF($L532=\"Non débuté\",\"\"))))","v":""},{"$f":"IF($J531=\"\",\"\",IF($I531>Trimestre!$D$2,\"Non débuté\",IF(Trimestre!$D$2>$J531,\"Terminé\",\"Courant\")))","v":""}]
[null,null,null,null,null,null,null,null,null,null,{"$f":"IF($J532=\"\",\"\",IF($L532=\"Courant\",Donnees!$A$3,IF($L532=\"terminé\",Donnees!$A$4,IF($L533=\"Non débuté\",\"\"))))","v":""},{"$f":"IF($J532=\"\",\"\",IF($I532>Trimestre!$D$2,\"Non débuté\",IF(Trimestre!$D$2>$J532,\"Terminé\",\"Courant\")))","v":""}]
[null,null,null,null,null,null,null,null,null,null,{"$f":"IF($J533=\"\",\"\",IF($L533=\"Courant\",Donnees!$A$3,IF($L533=\"terminé\",Donnees!$A$4,IF($L534=\"Non débuté\",\"\"))))","v":""},{"$f":"IF($J533=\"\",\"\",IF($I533>Trimestre!$D$2,\"Non débuté\",IF(Trimestre!$D$2>$J533,\"Terminé\",\"Courant\")))","v":""}]
[null,null,null,null,null,null,null,null,null,null,{"$f":"IF($J534=\"\",\"\",IF($L534=\"Courant\",Donnees!$A$3,IF($L534=\"terminé\",Donnees!$A$4,IF($L535=\"Non débuté\",\"\"))))","v":""},{"$f":"IF($J534=\"\",\"\",IF($I534>Trimestre!$D$2,\"Non débuté\",IF(Trimestre!$D$2>$J534,\"Terminé\",\"Courant\")))","v":""}]
[null,null,null,null,null,null,null,null,null,null,{"$f":"IF($J535=\"\",\"\",IF($L535=\"Courant\",Donnees!$A$3,IF($L535=\"terminé\",Donnees!$A$4,IF($L536=\"Non débuté\",\"\"))))","v":""},{"$f":"IF($J535=\"\",\"\",IF($I535>Trimestre!$D$2,\"Non débuté\",IF(Trimestre!$D$2>$J535,\"Terminé\",\"Courant\")))","v":""}]
[null,null,null,null,null,null,null,null,null,null,{"$f":"IF($J536=\"\",\"\",IF($L536=\"Courant\",Donnees!$A$3,IF($L536=\"terminé\",Donnees!$A$4,IF($L537=\"Non débuté\",\"\"))))","v":""},{"$f":"IF($J536=\"\",\"\",IF($I536>Trimestre!$D$2,\"Non débuté\",IF(Trimestre!$D$2>$J536,\"Terminé\",\"Courant\")))","v":""}]
[null,null,null,null,null,null,null,null,null,null,{"$f":"IF($J537=\"\",\"\",IF($L537=\"Courant\",Donnees!$A$3,IF($L537=\"terminé\",Donnees!$A$4,IF($L538=\"Non débuté\",\"\"))))","v":""},{"$f":"IF($J537=\"\",\"\",IF($I537>Trimestre!$D$2,\"Non débuté\",IF(Trimestre!$D$2>$J537,\"Terminé\",\"Courant\")))","v":""}]
[null,null,null,null,null,null,null,null,null,null,{"$f":"IF($J538=\"\",\"\",IF($L538=\"Courant\",Donnees!$A$3,IF($L538=\"terminé\",Donnees!$A$4,IF($L539=\"Non débuté\",\"\"))))","v":""},{"$f":"IF($J538=\"\",\"\",IF($I538>Trimestre!$D$2,\"Non débuté\",IF(Trimestre!$D$2>$J538,\"Terminé\",\"Courant\")))","v":""}]
[null,null,null,null,null,null,null,null,null,null,{"$f":"IF($J539=\"\",\"\",IF($L539=\"Courant\",Donnees!$A$3,IF($L539=\"terminé\",Donnees!$A$4,IF($L540=\"Non débuté\",\"\"))))","v":""},{"$f":"IF($J539=\"\",\"\",IF($I539>Trimestre!$D$2,\"Non débuté\",IF(Trimestre!$D$2>$J539,\"Terminé\",\"Courant\")))","v":""}]
[null,null,null,null,null,null,null,null,null,null,{"$f":"IF($J540=\"\",\"\",IF($L540=\"Courant\",Donnees!$A$3,IF($L540=\"terminé\",Donnees!$A$4,IF($L541=\"Non débuté\",\"\"))))","v":""},{"$f":"IF($J540=\"\",\"\",IF($I540>Trimestre!$D$2,\"Non débuté\",IF(Trimestre!$D$2>$J540,\"Terminé\",\"Courant\")))","v":""}]
[null,null,null,null,null,null,null,null,null,null,{"$f":"IF($J541=\"\",\"\",IF($L541=\"Courant\",Donnees!$A$3,IF($L541=\"terminé\",Donnees!$A$4,IF($L542=\"Non débuté\",\"\"))))","v":""},{"$f":"IF($J541=\"\",\"\",IF($I541>Trimestre!$D$2,\"Non débuté\",IF(Trimestre!$D$2>$J541,\"Terminé\",\"Courant\")))","v":""}]
[null,null,null,null,null,null,null,null,null,null,{"$f":"IF($J542=\"\",\"\",IF($L542=\"Courant\",Donnees!$A$3,IF($L542=\"terminé\",Donnees!$A$4,IF($L543=\"Non débuté\",\"\"))))","v":""},{"$f":"IF($J542=\"\",\"\",IF($I542>Trimestre!$D$2,\"Non débuté\",IF(Trimestre!$D$2>$J542,\"Terminé\",\"Courant\")))","v":""}]
[null,null,null,null,null,null,null,null,null,null,{"$f":"IF($J543=\"\",\"\",IF($L543=\"Courant\",Donnees!$A$3,IF($L543=\"terminé\",Donnees!$A$4,IF($L544=\"Non débuté\",\"\"))))","v":""},{"$f":"IF($J543=\"\",\"\",IF($I543>Trimestre!$D$2,\"Non débuté\",IF(Trimestre!$D$2>$J543,\"Terminé\",\"Courant\")))","v":""}]
[null,null,null,null,null,null,null,null,null,null,{"$f":"IF($J544=\"\",\"\",IF($L544=\"Courant\",Donnees!$A$3,IF($L544=\"terminé\",Donnees!$A$4,IF($L545=\"Non débuté\",\"\"))))","v":""},{"$f":"IF($J544=\"\",\"\",IF($I544>Trimestre!$D$2,\"Non débuté\",IF(Trimestre!$D$2>$J544,\"Terminé\",\"Courant\")))","v":""}]
[null,null,null,null,null,null,null,null,null,null,{"$f":"IF($J545=\"\",\"\",IF($L545=\"Courant\",Donnees!$A$3,IF($L545=\"terminé\",Donnees!$A$4,IF($L546=\"Non débuté\",\"\"))))","v":""},{"$f":"IF($J545=\"\",\"\",IF($I545>Trimestre!$D$2,\"Non débuté\",IF(Trimestre!$D$2>$J545,\"Terminé\",\"Courant\")))","v":""}]
[null,null,null,null,null,null,null,null,null,null,{"$f":"IF($J546=\"\",\"\",IF($L546=\"Courant\",Donnees!$A$3,IF($L546=\"terminé\",Donnees!$A$4,IF($L547=\"Non débuté\",\"\"))))","v":""},{"$f":"IF($J546=\"\",\"\",IF($I546>Trimestre!$D$2,\"Non débuté\",IF(Trimestre!$D$2>$J546,\"Terminé\",\"Courant\")))","v":""}]
[null,null,null,null,null,null,null,null,null,null,{"$f":"IF($J547=\"\",\"\",IF($L547=\"Courant\",Donnees!$A$3,IF($L547=\"terminé\",Donnees!$A$4,IF($L548=\"Non débuté\",\"\"))))","v":""},{"$f":"IF($J547=\"\",\"\",IF($I547>Trimestre!$D$2,\"Non débuté\",IF(Trimestre!$D$2>$J547,\"Terminé\",\"Courant\")))","v":""}]
[null,null,null,null,null,null,null,null,null,null,{"$f":"IF($J548=\"\",\"\",IF($L548=\"Courant\",Donnees!$A$3,IF($L548=\"terminé\",Donnees!$A$4,IF($L549=\"Non débuté\",\"\"))))","v":""},{"$f":"IF($J548=\"\",\"\",IF($I548>Trimestre!$D$2,\"Non débuté\",IF(Trimestre!$D$2>$J548,\"Terminé\",\"Courant\")))","v":""}]
[null,null,null,null,null,null,null,null,null,null,{"$f":"IF($J549=\"\",\"\",IF($L549=\"Courant\",Donnees!$A$3,IF($L549=\"terminé\",Donnees!$A$4,IF($L550=\"Non débuté\",\"\"))))","v":""},{"$f":"IF($J549=\"\",\"\",IF($I549>Trimestre!$D$2,\"Non débuté\",IF(Trimestre!$D$2>$J549,\"Terminé\",\"Courant\")))","v":""}]
[null,null,null,null,null,null,null,null,null,null,{"$f":"IF($J550=\"\",\"\",IF($L550=\"Courant\",Donnees!$A$3,IF($L550=\"terminé\",Donnees!$A$4,IF($L551=\"Non débuté\",\"\"))))","v":""},{"$f":"IF($J550=\"\",\"\",IF($I550>Trimestre!$D$2,\"Non débuté\",IF(Trimestre!$D$2>$J550,\"Terminé\",\"Courant\")))","v":""}]
[null,null,null,null,null,null,null,null,null,null,{"$f":"IF($J551=\"\",\"\",IF($L551=\"Courant\",Donnees!$A$3,IF($L551=\"terminé\",Donnees!$A$4,IF($L552=\"Non débuté\",\"\"))))","v":""},{"$f":"IF($J551=\"\",\"\",IF($I551>Trimestre!$D$2,\"Non débuté\",IF(Trimestre!$D$2>$J551,\"Terminé\",\"Courant\")))","v":""}]
[null,null,null,null,null,null,null,null,null,null,{"$f":"IF($J552=\"\",\"\",IF($L552=\"Courant\",Donnees!$A$3,IF($L552=\"terminé\",Donnees!$A$4,IF($L553=\"Non débuté\",\"\"))))","v":""},{"$f":"IF($J552=\"\",\"\",IF($I552>Trimestre!$D$2,\"Non débuté\",IF(Trimestre!$D$2>$J552,\"Terminé\",\"Courant\")))","v":""}]
[null,null,null,null,null,null,null,null,null,null,{"$f":"IF($J553=\"\",\"\",IF($L553=\"Courant\",Donnees!$A$3,IF($L553=\"terminé\",Donnees!$A$4,IF($L554=\"Non débuté\",\"\"))))","v":""},{"$f":"IF($J553=\"\",\"\",IF($I553>Trimestre!$D$2,\"Non débuté\",IF(Trimestre!$D$2>$J553,\"Terminé\",\"Courant\")))","v":""}]
[null,null,null,null,null,null,null,null,null,null,{"$f":"IF($J554=\"\",\"\",IF($L554=\"Courant\",Donnees!$A$3,IF($L554=\"terminé\",Donnees!$A$4,IF($L555=\"Non débuté\",\"\"))))","v":""},{"$f":"IF($J554=\"\",\"\",IF($I554>Trimestre!$D$2,\"Non débuté\",IF(Trimestre!$D$2>$J554,\"Terminé\",\"Courant\")))","v":""}]
[null,null,null,null,null,null,null,null,null,null,{"$f":"IF($J555=\"\",\"\",IF($L555=\"Courant\",Donnees!$A$3,IF($L555=\"terminé\",Donnees!$A$4,IF($L556=\"Non débuté\",\"\"))))","v":""},{"$f":"IF($J555=\"\",\"\",IF($I555>Trimestre!$D$2,\"Non débuté\",IF(Trimestre!$D$2>$J555,\"Terminé\",\"Courant\")))","v":""}]
[null,null,null,null,null,null,null,null,null,null,{"$f":"IF($J556=\"\",\"\",IF($L556=\"Courant\",Donnees!$A$3,IF($L556=\"terminé\",Donnees!$A$4,IF($L557=\"Non débuté\",\"\"))))","v":""},{"$f":"IF($J556=\"\",\"\",IF($I556>Trimestre!$D$2,\"Non débuté\",IF(Trimestre!$D$2>$J556,\"Terminé\",\"Courant\")))","v":""}]
[null,null,null,null,null,null,null,null,null,null,{"$f":"IF($J557=\"\",\"\",IF($L557=\"Courant\",Donnees!$A$3,IF($L557=\"terminé\",Donnees!$A$4,IF($L558=\"Non débuté\",\"\"))))","v":""},{"$f":"IF($J557=\"\",\"\",IF($I557>Trimestre!$D$2,\"Non débuté\",IF(Trimestre!$D$2>$J557,\"Terminé\",\"Courant\")))","v":""}]
[null,null,null,null,null,null,null,null,null,null,{"$f":"IF($J558=\"\",\"\",IF($L558=\"Courant\",Donnees!$A$3,IF($L558=\"terminé\",Donnees!$A$4,IF($L559=\"Non débuté\",\"\"))))","v":""},{"$f":"IF($J558=\"\",\"\",IF($I558>Trimestre!$D$2,\"Non débuté\",IF(Trimestre!$D$2>$J558,\"Terminé\",\"Courant\")))","v":""}]
[null,null,null,null,null,null,null,null,null,null,{"$f":"IF($J559=\"\",\"\",IF($L559=\"Courant\",Donnees!$A$3,IF($L559=\"terminé\",Donnees!$A$4,IF($L560=\"Non débuté\",\"\"))))","v":""},{"$f":"IF($J559=\"\",\"\",IF($I559>Trimestre!$D$2,\"Non débuté\",IF(Trimestre!$D$2>$J559,\"Terminé\",\"Courant\")))","v":""}]
[null,null,null,null,null,null,null,null,null,null,{"$f":"IF($J560=\"\",\"\",IF($L560=\"Courant\",Donnees!$A$3,IF($L560=\"terminé\",Donnees!$A$4,IF($L561=\"Non débuté\",\"\"))))","v":""},{"$f":"IF($J560=\"\",\"\",IF($I560>Trimestre!$D$2,\"Non débuté\",IF(Trimestre!$D$2>$J560,\"Terminé\",\"Courant\")))","v":""}]
[null,null,null,null,null,null,null,null,null,null,{"$f":"IF($J561=\"\",\"\",IF($L561=\"Courant\",Donnees!$A$3,IF($L561=\"terminé\",Donnees!$A$4,IF($L562=\"Non débuté\",\"\"))))","v":""},{"$f":"IF($J561=\"\",\"\",IF($I561>Trimestre!$D$2,\"Non débuté\",IF(Trimestre!$D$2>$J561,\"Terminé\",\"Courant\")))","v":""}]
[null,null,null,null,null,null,null,null,null,null,{"$f":"IF($J562=\"\",\"\",IF($L562=\"Courant\",Donnees!$A$3,IF($L562=\"terminé\",Donnees!$A$4,IF($L563=\"Non débuté\",\"\"))))","v":""},{"$f":"IF($J562=\"\",\"\",IF($I562>Trimestre!$D$2,\"Non débuté\",IF(Trimestre!$D$2>$J562,\"Terminé\",\"Courant\")))","v":""}]
[null,null,null,null,null,null,null,null,null,null,{"$f":"IF($J563=\"\",\"\",IF($L563=\"Courant\",Donnees!$A$3,IF($L563=\"terminé\",Donnees!$A$4,IF($L564=\"Non débuté\",\"\"))))","v":""},{"$f":"IF($J563=\"\",\"\",IF($I563>Trimestre!$D$2,\"Non débuté\",IF(Trimestre!$D$2>$J563,\"Terminé\",\"Courant\")))","v":""}]
[null,null,null,null,null,null,null,null,null,null,{"$f":"IF($J564=\"\",\"\",IF($L564=\"Courant\",Donnees!$A$3,IF($L564=\"terminé\",Donnees!$A$4,IF($L565=\"Non débuté\",\"\"))))","v":""},{"$f":"IF($J564=\"\",\"\",IF($I564>Trimestre!$D$2,\"Non débuté\",IF(Trimestre!$D$2>$J564,\"Terminé\",\"Courant\")))","v":""}]
[null,null,null,null,null,null,null,null,null,null,{"$f":"IF($J565=\"\",\"\",IF($L565=\"Courant\",Donnees!$A$3,IF($L565=\"terminé\",Donnees!$A$4,IF($L566=\"Non débuté\",\"\"))))","v":""},{"$f":"IF($J565=\"\",\"\",IF($I565>Trimestre!$D$2,\"Non débuté\",IF(Trimestre!$D$2>$J565,\"Terminé\",\"Courant\")))","v":""}]
[null,null,null,null,null,null,null,null,null,null,{"$f":"IF($J566=\"\",\"\",IF($L566=\"Courant\",Donnees!$A$3,IF($L566=\"terminé\",Donnees!$A$4,IF($L567=\"Non débuté\",\"\"))))","v":""},{"$f":"IF($J566=\"\",\"\",IF($I566>Trimestre!$D$2,\"Non débuté\",IF(Trimestre!$D$2>$J566,\"Terminé\",\"Courant\")))","v":""}]
[null,null,null,null,null,null,null,null,null,null,{"$f":"IF($J567=\"\",\"\",IF($L567=\"Courant\",Donnees!$A$3,IF($L567=\"terminé\",Donnees!$A$4,IF($L568=\"Non débuté\",\"\"))))","v":""},{"$f":"IF($J567=\"\",\"\",IF($I567>Trimestre!$D$2,\"Non débuté\",IF(Trimestre!$D$2>$J567,\"Terminé\",\"Courant\")))","v":""}]
[null,null,null,null,null,null,null,null,null,null,{"$f":"IF($J568=\"\",\"\",IF($L568=\"Courant\",Donnees!$A$3,IF($L568=\"terminé\",Donnees!$A$4,IF($L569=\"Non débuté\",\"\"))))","v":""},{"$f":"IF($J568=\"\",\"\",IF($I568>Trimestre!$D$2,\"Non débuté\",IF(Trimestre!$D$2>$J568,\"Terminé\",\"Courant\")))","v":""}]
[null,null,null,null,null,null,null,null,null,null,{"$f":"IF($J569=\"\",\"\",IF($L569=\"Courant\",Donnees!$A$3,IF($L569=\"terminé\",Donnees!$A$4,IF($L570=\"Non débuté\",\"\"))))","v":""},{"$f":"IF($J569=\"\",\"\",IF($I569>Trimestre!$D$2,\"Non débuté\",IF(Trimestre!$D$2>$J569,\"Terminé\",\"Courant\")))","v":""}]
[null,null,null,null,null,null,null,null,null,null,{"$f":"IF($J570=\"\",\"\",IF($L570=\"Courant\",Donnees!$A$3,IF($L570=\"terminé\",Donnees!$A$4,IF($L571=\"Non débuté\",\"\"))))","v":""},{"$f":"IF($J570=\"\",\"\",IF($I570>Trimestre!$D$2,\"Non débuté\",IF(Trimestre!$D$2>$J570,\"Terminé\",\"Courant\")))","v":""}]
[null,null,null,null,null,null,null,null,null,null,{"$f":"IF($J571=\"\",\"\",IF($L571=\"Courant\",Donnees!$A$3,IF($L571=\"terminé\",Donnees!$A$4,IF($L572=\"Non débuté\",\"\"))))","v":""},{"$f":"IF($J571=\"\",\"\",IF($I571>Trimestre!$D$2,\"Non débuté\",IF(Trimestre!$D$2>$J571,\"Terminé\",\"Courant\")))","v":""}]
[null,null,null,null,null,null,null,null,null,null,{"$f":"IF($J572=\"\",\"\",IF($L572=\"Courant\",Donnees!$A$3,IF($L572=\"terminé\",Donnees!$A$4,IF($L573=\"Non débuté\",\"\"))))","v":""},{"$f":"IF($J572=\"\",\"\",IF($I572>Trimestre!$D$2,\"Non débuté\",IF(Trimestre!$D$2>$J572,\"Terminé\",\"Courant\")))","v":""}]
[null,null,null,null,null,null,null,null,null,null,{"$f":"IF($J573=\"\",\"\",IF($L573=\"Courant\",Donnees!$A$3,IF($L573=\"terminé\",Donnees!$A$4,IF($L574=\"Non débuté\",\"\"))))","v":""},{"$f":"IF($J573=\"\",\"\",IF($I573>Trimestre!$D$2,\"Non débuté\",IF(Trimestre!$D$2>$J573,\"Terminé\",\"Courant\")))","v":""}]
[null,null,null,null,null,null,null,null,null,null,{"$f":"IF($J574=\"\",\"\",IF($L574=\"Courant\",Donnees!$A$3,IF($L574=\"terminé\",Donnees!$A$4,IF($L575=\"Non débuté\",\"\"))))","v":""},{"$f":"IF($J574=\"\",\"\",IF($I574>Trimestre!$D$2,\"Non débuté\",IF(Trimestre!$D$2>$J574,\"Terminé\",\"Courant\")))","v":""}]
[null,null,null,null,null,null,null,null,null,null,{"$f":"IF($J575=\"\",\"\",IF($L575=\"Courant\",Donnees!$A$3,IF($L575=\"terminé\",Donnees!$A$4,IF($L576=\"Non débuté\",\"\"))))","v":""},{"$f":"IF($J575=\"\",\"\",IF($I575>Trimestre!$D$2,\"Non débuté\",IF(Trimestre!$D$2>$J575,\"Terminé\",\"Courant\")))","v":""}]
[null,null,null,null,null,null,null,null,null,null,{"$f":"IF($J576=\"\",\"\",IF($L576=\"Courant\",Donnees!$A$3,IF($L576=\"terminé\",Donnees!$A$4,IF($L577=\"Non débuté\",\"\"))))","v":""},{"$f":"IF($J576=\"\",\"\",IF($I576>Trimestre!$D$2,\"Non débuté\",IF(Trimestre!$D$2>$J576,\"Terminé\",\"Courant\")))","v":""}]
[null,null,null,null,null,null,null,null,null,null,{"$f":"IF($J577=\"\",\"\",IF($L577=\"Courant\",Donnees!$A$3,IF($L577=\"terminé\",Donnees!$A$4,IF($L578=\"Non débuté\",\"\"))))","v":""},{"$f":"IF($J577=\"\",\"\",IF($I577>Trimestre!$D$2,\"Non débuté\",IF(Trimestre!$D$2>$J577,\"Terminé\",\"Courant\")))","v":""}]
[null,null,null,null,null,null,null,null,null,null,{"$f":"IF($J578=\"\",\"\",IF($L578=\"Courant\",Donnees!$A$3,IF($L578=\"terminé\",Donnees!$A$4,IF($L579=\"Non débuté\",\"\"))))","v":""},{"$f":"IF($J578=\"\",\"\",IF($I578>Trimestre!$D$2,\"Non débuté\",IF(Trimestre!$D$2>$J578,\"Terminé\",\"Courant\")))","v":""}]
[null,null,null,null,null,null,null,null,null,null,{"$f":"IF($J579=\"\",\"\",IF($L579=\"Courant\",Donnees!$A$3,IF($L579=\"terminé\",Donnees!$A$4,IF($L580=\"Non débuté\",\"\"))))","v":""},{"$f":"IF($J579=\"\",\"\",IF($I579>Trimestre!$D$2,\"Non débuté\",IF(Trimestre!$D$2>$J579,\"Terminé\",\"Courant\")))","v":""}]
[null,null,null,null,null,null,null,null,null,null,{"$f":"IF($J580=\"\",\"\",IF($L580=\"Courant\",Donnees!$A$3,IF($L580=\"terminé\",Donnees!$A$4,IF($L581=\"Non débuté\",\"\"))))","v":""},{"$f":"IF($J580=\"\",\"\",IF($I580>Trimestre!$D$2,\"Non débuté\",IF(Trimestre!$D$2>$J580,\"Terminé\",\"Courant\")))","v":""}]
[null,null,null,null,null,null,null,null,null,null,{"$f":"IF($J581=\"\",\"\",IF($L581=\"Courant\",Donnees!$A$3,IF($L581=\"terminé\",Donnees!$A$4,IF($L582=\"Non débuté\",\"\"))))","v":""},{"$f":"IF($J581=\"\",\"\",IF($I581>Trimestre!$D$2,\"Non débuté\",IF(Trimestre!$D$2>$J581,\"Terminé\",\"Courant\")))","v":""}]
[null,null,null,null,null,null,null,null,null,null,{"$f":"IF($J582=\"\",\"\",IF($L582=\"Courant\",Donnees!$A$3,IF($L582=\"terminé\",Donnees!$A$4,IF($L583=\"Non débuté\",\"\"))))","v":""},{"$f":"IF($J582=\"\",\"\",IF($I582>Trimestre!$D$2,\"Non débuté\",IF(Trimestre!$D$2>$J582,\"Terminé\",\"Courant\")))","v":""}]
[null,null,null,null,null,null,null,null,null,null,{"$f":"IF($J583=\"\",\"\",IF($L583=\"Courant\",Donnees!$A$3,IF($L583=\"terminé\",Donnees!$A$4,IF($L584=\"Non débuté\",\"\"))))","v":""},{"$f":"IF($J583=\"\",\"\",IF($I583>Trimestre!$D$2,\"Non débuté\",IF(Trimestre!$D$2>$J583,\"Terminé\",\"Courant\")))","v":""}]
[null,null,null,null,null,null,null,null,null,null,{"$f":"IF($J584=\"\",\"\",IF($L584=\"Courant\",Donnees!$A$3,IF($L584=\"terminé\",Donnees!$A$4,IF($L585=\"Non débuté\",\"\"))))","v":""},{"$f":"IF($J584=\"\",\"\",IF($I584>Trimestre!$D$2,\"Non débuté\",IF(Trimestre!$D$2>$J584,\"Terminé\",\"Courant\")))","v":""}]
[null,null,null,null,null,null,null,null,null,null,{"$f":"IF($J585=\"\",\"\",IF($L585=\"Courant\",Donnees!$A$3,IF($L585=\"terminé\",Donnees!$A$4,IF($L586=\"Non débuté\",\"\"))))","v":""},{"$f":"IF($J585=\"\",\"\",IF($I585>Trimestre!$D$2,\"Non débuté\",IF(Trimestre!$D$2>$J585,\"Terminé\",\"Courant\")))","v":""}]
[null,null,null,null,null,null,null,null,null,null,{"$f":"IF($J586=\"\",\"\",IF($L586=\"Courant\",Donnees!$A$3,IF($L586=\"terminé\",Donnees!$A$4,IF($L587=\"Non débuté\",\"\"))))","v":""},{"$f":"IF($J586=\"\",\"\",IF($I586>Trimestre!$D$2,\"Non débuté\",IF(Trimestre!$D$2>$J586,\"Terminé\",\"Courant\")))","v":""}]
[null,null,null,null,null,null,null,null,null,null,{"$f":"IF($J587=\"\",\"\",IF($L587=\"Courant\",Donnees!$A$3,IF($L587=\"terminé\",Donnees!$A$4,IF($L588=\"Non débuté\",\"\"))))","v":""},{"$f":"IF($J587=\"\",\"\",IF($I587>Trimestre!$D$2,\"Non débuté\",IF(Trimestre!$D$2>$J587,\"Terminé\",\"Courant\")))","v":""}]
[null,null,null,null,null,null,null,null,null,null,{"$f":"IF($J588=\"\",\"\",IF($L588=\"Courant\",Donnees!$A$3,IF($L588=\"terminé\",Donnees!$A$4,IF($L589=\"Non débuté\",\"\"))))","v":""},{"$f":"IF($J588=\"\",\"\",IF($I588>Trimestre!$D$2,\"Non débuté\",IF(Trimestre!$D$2>$J588,\"Terminé\",\"Courant\")))","v":""}]
[null,null,null,null,null,null,null,null,null,null,{"$f":"IF($J589=\"\",\"\",IF($L589=\"Courant\",Donnees!$A$3,IF($L589=\"terminé\",Donnees!$A$4,IF($L590=\"Non débuté\",\"\"))))","v":""},{"$f":"IF($J589=\"\",\"\",IF($I589>Trimestre!$D$2,\"Non débuté\",IF(Trimestre!$D$2>$J589,\"Terminé\",\"Courant\")))","v":""}]
[null,null,null,null,null,null,null,null,null,null,{"$f":"IF($J590=\"\",\"\",IF($L590=\"Courant\",Donnees!$A$3,IF($L590=\"terminé\",Donnees!$A$4,IF($L591=\"Non débuté\",\"\"))))","v":""},{"$f":"IF($J590=\"\",\"\",IF($I590>Trimestre!$D$2,\"Non débuté\",IF(Trimestre!$D$2>$J590,\"Terminé\",\"Courant\")))","v":""}]
[null,null,null,null,null,null,null,null,null,null,{"$f":"IF($J591=\"\",\"\",IF($L591=\"Courant\",Donnees!$A$3,IF($L591=\"terminé\",Donnees!$A$4,IF($L592=\"Non débuté\",\"\"))))","v":""},{"$f":"IF($J591=\"\",\"\",IF($I591>Trimestre!$D$2,\"Non débuté\",IF(Trimestre!$D$2>$J591,\"Terminé\",\"Courant\")))","v":""}]
[null,null,null,null,null,null,null,null,null,null,{"$f":"IF($J592=\"\",\"\",IF($L592=\"Courant\",Donnees!$A$3,IF($L592=\"terminé\",Donnees!$A$4,IF($L593=\"Non débuté\",\"\"))))","v":""},{"$f":"IF($J592=\"\",\"\",IF($I592>Trimestre!$D$2,\"Non débuté\",IF(Trimestre!$D$2>$J592,\"Terminé\",\"Courant\")))","v":""}]
[null,null,null,null,null,null,null,null,null,null,{"$f":"IF($J593=\"\",\"\",IF($L593=\"Courant\",Donnees!$A$3,IF($L593=\"terminé\",Donnees!$A$4,IF($L594=\"Non débuté\",\"\"))))","v":""},{"$f":"IF($J593=\"\",\"\",IF($I593>Trimestre!$D$2,\"Non débuté\",IF(Trimestre!$D$2>$J593,\"Terminé\",\"Courant\")))","v":""}]
[null,null,null,null,null,null,null,null,null,null,{"$f":"IF($J594=\"\",\"\",IF($L594=\"Courant\",Donnees!$A$3,IF($L594=\"terminé\",Donnees!$A$4,IF($L595=\"Non débuté\",\"\"))))","v":""},{"$f":"IF($J594=\"\",\"\",IF($I594>Trimestre!$D$2,\"Non débuté\",IF(Trimestre!$D$2>$J594,\"Terminé\",\"Courant\")))","v":""}]
[null,null,null,null,null,null,null,null,null,null,{"$f":"IF($J595=\"\",\"\",IF($L595=\"Courant\",Donnees!$A$3,IF($L595=\"terminé\",Donnees!$A$4,IF($L596=\"Non débuté\",\"\"))))","v":""},{"$f":"IF($J595=\"\",\"\",IF($I595>Trimestre!$D$2,\"Non débuté\",IF(Trimestre!$D$2>$J595,\"Terminé\",\"Courant\")))","v":""}]
[null,null,null,null,null,null,null,null,null,null,{"$f":"IF($J596=\"\",\"\",IF($L596=\"Courant\",Donnees!$A$3,IF($L596=\"terminé\",Donnees!$A$4,IF($L597=\"Non débuté\",\"\"))))","v":""},{"$f":"IF($J596=\"\",\"\",IF($I596>Trimestre!$D$2,\"Non débuté\",IF(Trimestre!$D$2>$J596,\"Terminé\",\"Courant\")))","v":""}]
[null,null,null,null,null,null,null,null,null,null,{"$f":"IF($J597=\"\",\"\",IF($L597=\"Courant\",Donnees!$A$3,IF($L597=\"terminé\",Donnees!$A$4,IF($L598=\"Non débuté\",\"\"))))","v":""},{"$f":"IF($J597=\"\",\"\",IF($I597>Trimestre!$D$2,\"Non débuté\",IF(Trimestre!$D$2>$J597,\"Terminé\",\"Courant\")))","v":""}]
[null,null,null,null,null,null,null,null,null,null,{"$f":"IF($J598=\"\",\"\",IF($L598=\"Courant\",Donnees!$A$3,IF($L598=\"terminé\",Donnees!$A$4,IF($L599=\"Non débuté\",\"\"))))","v":""},{"$f":"IF($J598=\"\",\"\",IF($I598>Trimestre!$D$2,\"Non débuté\",IF(Trimestre!$D$2>$J598,\"Terminé\",\"Courant\")))","v":""}]
[null,null,null,null,null,null,null,null,null,null,{"$f":"IF($J599=\"\",\"\",IF($L599=\"Courant\",Donnees!$A$3,IF($L599=\"terminé\",Donnees!$A$4,IF($L600=\"Non débuté\",\"\"))))","v":""},{"$f":"IF($J599=\"\",\"\",IF($I599>Trimestre!$D$2,\"Non débuté\",IF(Trimestre!$D$2>$J599,\"Terminé\",\"Courant\")))","v":""}]
[null,null,null,null,null,null,null,null,null,null,{"$f":"IF($J600=\"\",\"\",IF($L600=\"Courant\",Donnees!$A$3,IF($L600=\"terminé\",Donnees!$A$4,IF($L601=\"Non débuté\",\"\"))))","v":""},{"$f":"IF($J600=\"\",\"\",IF($I600>Trimestre!$D$2,\"Non débuté\",IF(Trimestre!$D$2>$J600,\"Terminé\",\"Courant\")))","v":""}]
[null,null,null,null,null,null,null,null,null,null,{"$f":"IF($J601=\"\",\"\",IF($L601=\"Courant\",Donnees!$A$3,IF($L601=\"terminé\",Donnees!$A$4,IF($L602=\"Non débuté\",\"\"))))","v":""},{"$f":"IF($J601=\"\",\"\",IF($I601>Trimestre!$D$2,\"Non débuté\",IF(Trimestre!$D$2>$J601,\"Terminé\",\"Courant\")))","v":""}]
[null,null,null,null,null,null,null,null,null,null,{"$f":"IF($J602=\"\",\"\",IF($L602=\"Courant\",Donnees!$A$3,IF($L602=\"terminé\",Donnees!$A$4,IF($L603=\"Non débuté\",\"\"))))","v":""},{"$f":"IF($J602=\"\",\"\",IF($I602>Trimestre!$D$2,\"Non débuté\",IF(Trimestre!$D$2>$J602,\"Terminé\",\"Courant\")))","v":""}]
[null,null,null,null,null,null,null,null,null,null,{"$f":"IF($J603=\"\",\"\",IF($L603=\"Courant\",Donnees!$A$3,IF($L603=\"terminé\",Donnees!$A$4,IF($L604=\"Non débuté\",\"\"))))","v":""},{"$f":"IF($J603=\"\",\"\",IF($I603>Trimestre!$D$2,\"Non débuté\",IF(Trimestre!$D$2>$J603,\"Terminé\",\"Courant\")))","v":""}]
[null,null,null,null,null,null,null,null,null,null,{"$f":"IF($J604=\"\",\"\",IF($L604=\"Courant\",Donnees!$A$3,IF($L604=\"terminé\",Donnees!$A$4,IF($L605=\"Non débuté\",\"\"))))","v":""},{"$f":"IF($J604=\"\",\"\",IF($I604>Trimestre!$D$2,\"Non débuté\",IF(Trimestre!$D$2>$J604,\"Terminé\",\"Courant\")))","v":""}]
[null,null,null,null,null,null,null,null,null,null,{"$f":"IF($J605=\"\",\"\",IF($L605=\"Courant\",Donnees!$A$3,IF($L605=\"terminé\",Donnees!$A$4,IF($L606=\"Non débuté\",\"\"))))","v":""},{"$f":"IF($J605=\"\",\"\",IF($I605>Trimestre!$D$2,\"Non débuté\",IF(Trimestre!$D$2>$J605,\"Terminé\",\"Courant\")))","v":""}]
[null,null,null,null,null,null,null,null,null,null,{"$f":"IF($J606=\"\",\"\",IF($L606=\"Courant\",Donnees!$A$3,IF($L606=\"terminé\",Donnees!$A$4,IF($L607=\"Non débuté\",\"\"))))","v":""},{"$f":"IF($J606=\"\",\"\",IF($I606>Trimestre!$D$2,\"Non débuté\",IF(Trimestre!$D$2>$J606,\"Terminé\",\"Courant\")))","v":""}]
[null,null,null,null,null,null,null,null,null,null,{"$f":"IF($J607=\"\",\"\",IF($L607=\"Courant\",Donnees!$A$3,IF($L607=\"terminé\",Donnees!$A$4,IF($L608=\"Non débuté\",\"\"))))","v":""},{"$f":"IF($J607=\"\",\"\",IF($I607>Trimestre!$D$2,\"Non débuté\",IF(Trimestre!$D$2>$J607,\"Terminé\",\"Courant\")))","v":""}]
[null,null,null,null,null,null,null,null,null,null,{"$f":"IF($J608=\"\",\"\",IF($L608=\"Courant\",Donnees!$A$3,IF($L608=\"terminé\",Donnees!$A$4,IF($L609=\"Non débuté\",\"\"))))","v":""},{"$f":"IF($J608=\"\",\"\",IF($I608>Trimestre!$D$2,\"Non débuté\",IF(Trimestre!$D$2>$J608,\"Terminé\",\"Courant\")))","v":""}]
[null,null,null,null,null,null,null,null,null,null,{"$f":"IF($J609=\"\",\"\",IF($L609=\"Courant\",Donnees!$A$3,IF($L609=\"terminé\",Donnees!$A$4,IF($L610=\"Non débuté\",\"\"))))","v":""},{"$f":"IF($J609=\"\",\"\",IF($I609>Trimestre!$D$2,\"Non débuté\",IF(Trimestre!$D$2>$J609,\"Terminé\",\"Courant\")))","v":""}]
[null,null,null,null,null,null,null,null,null,null,{"$f":"IF($J610=\"\",\"\",IF($L610=\"Courant\",Donnees!$A$3,IF($L610=\"terminé\",Donnees!$A$4,IF($L611=\"Non débuté\",\"\"))))","v":""},{"$f":"IF($J610=\"\",\"\",IF($I610>Trimestre!$D$2,\"Non débuté\",IF(Trimestre!$D$2>$J610,\"Terminé\",\"Courant\")))","v":""}]
[null,null,null,null,null,null,null,null,null,null,{"$f":"IF($J611=\"\",\"\",IF($L611=\"Courant\",Donnees!$A$3,IF($L611=\"terminé\",Donnees!$A$4,IF($L612=\"Non débuté\",\"\"))))","v":""},{"$f":"IF($J611=\"\",\"\",IF($I611>Trimestre!$D$2,\"Non débuté\",IF(Trimestre!$D$2>$J611,\"Terminé\",\"Courant\")))","v":""}]
[null,null,null,null,null,null,null,null,null,null,{"$f":"IF($J612=\"\",\"\",IF($L612=\"Courant\",Donnees!$A$3,IF($L612=\"terminé\",Donnees!$A$4,IF($L613=\"Non débuté\",\"\"))))","v":""},{"$f":"IF($J612=\"\",\"\",IF($I612>Trimestre!$D$2,\"Non débuté\",IF(Trimestre!$D$2>$J612,\"Terminé\",\"Courant\")))","v":""}]
[null,null,null,null,null,null,null,null,null,null,{"$f":"IF($J613=\"\",\"\",IF($L613=\"Courant\",Donnees!$A$3,IF($L613=\"terminé\",Donnees!$A$4,IF($L614=\"Non débuté\",\"\"))))","v":""},{"$f":"IF($J613=\"\",\"\",IF($I613>Trimestre!$D$2,\"Non débuté\",IF(Trimestre!$D$2>$J613,\"Terminé\",\"Courant\")))","v":""}]
[null,null,null,null,null,null,null,null,null,null,{"$f":"IF($J614=\"\",\"\",IF($L614=\"Courant\",Donnees!$A$3,IF($L614=\"terminé\",Donnees!$A$4,IF($L615=\"Non débuté\",\"\"))))","v":""},{"$f":"IF($J614=\"\",\"\",IF($I614>Trimestre!$D$2,\"Non débuté\",IF(Trimestre!$D$2>$J614,\"Terminé\",\"Courant\")))","v":""}]
[null,null,null,null,null,null,null,null,null,null,{"$f":"IF($J615=\"\",\"\",IF($L615=\"Courant\",Donnees!$A$3,IF($L615=\"terminé\",Donnees!$A$4,IF($L616=\"Non débuté\",\"\"))))","v":""},{"$f":"IF($J615=\"\",\"\",IF($I615>Trimestre!$D$2,\"Non débuté\",IF(Trimestre!$D$2>$J615,\"Terminé\",\"Courant\")))","v":""}]
[null,null,null,null,null,null,null,null,null,null,{"$f":"IF($J616=\"\",\"\",IF($L616=\"Courant\",Donnees!$A$3,IF($L616=\"terminé\",Donnees!$A$4,IF($L617=\"Non débuté\",\"\"))))","v":""},{"$f":"IF($J616=\"\",\"\",IF($I616>Trimestre!$D$2,\"Non débuté\",IF(Trimestre!$D$2>$J616,\"Terminé\",\"Courant\")))","v":""}]
[null,null,null,null,null,null,null,null,null,null,{"$f":"IF($J617=\"\",\"\",IF($L617=\"Courant\",Donnees!$A$3,IF($L617=\"terminé\",Donnees!$A$4,IF($L618=\"Non débuté\",\"\"))))","v":""},{"$f":"IF($J617=\"\",\"\",IF($I617>Trimestre!$D$2,\"Non débuté\",IF(Trimestre!$D$2>$J617,\"Terminé\",\"Courant\")))","v":""}]
[null,null,null,null,null,null,null,null,null,null,{"$f":"IF($J618=\"\",\"\",IF($L618=\"Courant\",Donnees!$A$3,IF($L618=\"terminé\",Donnees!$A$4,IF($L619=\"Non débuté\",\"\"))))","v":""},{"$f":"IF($J618=\"\",\"\",IF($I618>Trimestre!$D$2,\"Non débuté\",IF(Trimestre!$D$2>$J618,\"Terminé\",\"Courant\")))","v":""}]
[null,null,null,null,null,null,null,null,null,null,{"$f":"IF($J619=\"\",\"\",IF($L619=\"Courant\",Donnees!$A$3,IF($L619=\"terminé\",Donnees!$A$4,IF($L620=\"Non débuté\",\"\"))))","v":""},{"$f":"IF($J619=\"\",\"\",IF($I619>Trimestre!$D$2,\"Non débuté\",IF(Trimestre!$D$2>$J619,\"Terminé\",\"Courant\")))","v":""}]
[null,null,null,null,null,null,null,null,null,null,{"$f":"IF($J620=\"\",\"\",IF($L620=\"Courant\",Donnees!$A$3,IF($L620=\"terminé\",Donnees!$A$4,IF($L621=\"Non débuté\",\"\"))))","v":""},{"$f":"IF($J620=\"\",\"\",IF($I620>Trimestre!$D$2,\"Non débuté\",IF(Trimestre!$D$2>$J620,\"Terminé\",\"Courant\")))","v":""}]
[null,null,null,null,null,null,null,null,null,null,{"$f":"IF($J621=\"\",\"\",IF($L621=\"Courant\",Donnees!$A$3,IF($L621=\"terminé\",Donnees!$A$4,IF($L622=\"Non débuté\",\"\"))))","v":""},{"$f":"IF($J621=\"\",\"\",IF($I621>Trimestre!$D$2,\"Non débuté\",IF(Trimestre!$D$2>$J621,\"Terminé\",\"Courant\")))","v":""}]
[null,null,null,null,null,null,null,null,null,null,{"$f":"IF($J622=\"\",\"\",IF($L622=\"Courant\",Donnees!$A$3,IF($L622=\"terminé\",Donnees!$A$4,IF($L623=\"Non débuté\",\"\"))))","v":""},{"$f":"IF($J622=\"\",\"\",IF($I622>Trimestre!$D$2,\"Non débuté\",IF(Trimestre!$D$2>$J622,\"Terminé\",\"Courant\")))","v":""}]
[null,null,null,null,null,null,null,null,null,null,{"$f":"IF($J623=\"\",\"\",IF($L623=\"Courant\",Donnees!$A$3,IF($L623=\"terminé\",Donnees!$A$4,IF($L624=\"Non débuté\",\"\"))))","v":""},{"$f":"IF($J623=\"\",\"\",IF($I623>Trimestre!$D$2,\"Non débuté\",IF(Trimestre!$D$2>$J623,\"Terminé\",\"Courant\")))","v":""}]
[null,null,null,null,null,null,null,null,null,null,{"$f":"IF($J624=\"\",\"\",IF($L624=\"Courant\",Donnees!$A$3,IF($L624=\"terminé\",Donnees!$A$4,IF($L625=\"Non débuté\",\"\"))))","v":""},{"$f":"IF($J624=\"\",\"\",IF($I624>Trimestre!$D$2,\"Non débuté\",IF(Trimestre!$D$2>$J624,\"Terminé\",\"Courant\")))","v":""}]
[null,null,null,null,null,null,null,null,null,null,{"$f":"IF($J625=\"\",\"\",IF($L625=\"Courant\",Donnees!$A$3,IF($L625=\"terminé\",Donnees!$A$4,IF($L626=\"Non débuté\",\"\"))))","v":""},{"$f":"IF($J625=\"\",\"\",IF($I625>Trimestre!$D$2,\"Non débuté\",IF(Trimestre!$D$2>$J625,\"Terminé\",\"Courant\")))","v":""}]
[null,null,null,null,null,null,null,null,null,null,{"$f":"IF($J626=\"\",\"\",IF($L626=\"Courant\",Donnees!$A$3,IF($L626=\"terminé\",Donnees!$A$4,IF($L627=\"Non débuté\",\"\"))))","v":""},{"$f":"IF($J626=\"\",\"\",IF($I626>Trimestre!$D$2,\"Non débuté\",IF(Trimestre!$D$2>$J626,\"Terminé\",\"Courant\")))","v":""}]
[null,null,null,null,null,null,null,null,null,null,{"$f":"IF($J627=\"\",\"\",IF($L627=\"Courant\",Donnees!$A$3,IF($L627=\"terminé\",Donnees!$A$4,IF($L628=\"Non débuté\",\"\"))))","v":""},{"$f":"IF($J627=\"\",\"\",IF($I627>Trimestre!$D$2,\"Non débuté\",IF(Trimestre!$D$2>$J627,\"Terminé\",\"Courant\")))","v":""}]
[null,null,null,null,null,null,null,null,null,null,{"$f":"IF($J628=\"\",\"\",IF($L628=\"Courant\",Donnees!$A$3,IF($L628=\"terminé\",Donnees!$A$4,IF($L629=\"Non débuté\",\"\"))))","v":""},{"$f":"IF($J628=\"\",\"\",IF($I628>Trimestre!$D$2,\"Non débuté\",IF(Trimestre!$D$2>$J628,\"Terminé\",\"Courant\")))","v":""}]
[null,null,null,null,null,null,null,null,null,null,{"$f":"IF($J629=\"\",\"\",IF($L629=\"Courant\",Donnees!$A$3,IF($L629=\"terminé\",Donnees!$A$4,IF($L630=\"Non débuté\",\"\"))))","v":""},{"$f":"IF($J629=\"\",\"\",IF($I629>Trimestre!$D$2,\"Non débuté\",IF(Trimestre!$D$2>$J629,\"Terminé\",\"Courant\")))","v":""}]
[null,null,null,null,null,null,null,null,null,null,{"$f":"IF($J630=\"\",\"\",IF($L630=\"Courant\",Donnees!$A$3,IF($L630=\"terminé\",Donnees!$A$4,IF($L631=\"Non débuté\",\"\"))))","v":""},{"$f":"IF($J630=\"\",\"\",IF($I630>Trimestre!$D$2,\"Non débuté\",IF(Trimestre!$D$2>$J630,\"Terminé\",\"Courant\")))","v":""}]
[null,null,null,null,null,null,null,null,null,null,{"$f":"IF($J631=\"\",\"\",IF($L631=\"Courant\",Donnees!$A$3,IF($L631=\"terminé\",Donnees!$A$4,IF($L632=\"Non débuté\",\"\"))))","v":""},{"$f":"IF($J631=\"\",\"\",IF($I631>Trimestre!$D$2,\"Non débuté\",IF(Trimestre!$D$2>$J631,\"Terminé\",\"Courant\")))","v":""}]
[null,null,null,null,null,null,null,null,null,null,{"$f":"IF($J632=\"\",\"\",IF($L632=\"Courant\",Donnees!$A$3,IF($L632=\"terminé\",Donnees!$A$4,IF($L633=\"Non débuté\",\"\"))))","v":""},{"$f":"IF($J632=\"\",\"\",IF($I632>Trimestre!$D$2,\"Non débuté\",IF(Trimestre!$D$2>$J632,\"Terminé\",\"Courant\")))","v":""}]
[null,null,null,null,null,null,null,null,null,null,{"$f":"IF($J633=\"\",\"\",IF($L633=\"Courant\",Donnees!$A$3,IF($L633=\"terminé\",Donnees!$A$4,IF($L634=\"Non débuté\",\"\"))))","v":""},{"$f":"IF($J633=\"\",\"\",IF($I633>Trimestre!$D$2,\"Non débuté\",IF(Trimestre!$D$2>$J633,\"Terminé\",\"Courant\")))","v":""}]
[null,null,null,null,null,null,null,null,null,null,{"$f":"IF($J634=\"\",\"\",IF($L634=\"Courant\",Donnees!$A$3,IF($L634=\"terminé\",Donnees!$A$4,IF($L635=\"Non débuté\",\"\"))))","v":""},{"$f":"IF($J634=\"\",\"\",IF($I634>Trimestre!$D$2,\"Non débuté\",IF(Trimestre!$D$2>$J634,\"Terminé\",\"Courant\")))","v":""}]
[null,null,null,null,null,null,null,null,null,null,{"$f":"IF($J635=\"\",\"\",IF($L635=\"Courant\",Donnees!$A$3,IF($L635=\"terminé\",Donnees!$A$4,IF($L636=\"Non débuté\",\"\"))))","v":""},{"$f":"IF($J635=\"\",\"\",IF($I635>Trimestre!$D$2,\"Non débuté\",IF(Trimestre!$D$2>$J635,\"Terminé\",\"Courant\")))","v":""}]
[null,null,null,null,null,null,null,null,null,null,{"$f":"IF($J636=\"\",\"\",IF($L636=\"Courant\",Donnees!$A$3,IF($L636=\"terminé\",Donnees!$A$4,IF($L637=\"Non débuté\",\"\"))))","v":""},{"$f":"IF($J636=\"\",\"\",IF($I636>Trimestre!$D$2,\"Non débuté\",IF(Trimestre!$D$2>$J636,\"Terminé\",\"Courant\")))","v":""}]
[null,null,null,null,null,null,null,null,null,null,{"$f":"IF($J637=\"\",\"\",IF($L637=\"Courant\",Donnees!$A$3,IF($L637=\"terminé\",Donnees!$A$4,IF($L638=\"Non débuté\",\"\"))))","v":""},{"$f":"IF($J637=\"\",\"\",IF($I637>Trimestre!$D$2,\"Non débuté\",IF(Trimestre!$D$2>$J637,\"Terminé\",\"Courant\")))","v":""}]
[null,null,null,null,null,null,null,null,null,null,{"$f":"IF($J638=\"\",\"\",IF($L638=\"Courant\",Donnees!$A$3,IF($L638=\"terminé\",Donnees!$A$4,IF($L639=\"Non débuté\",\"\"))))","v":""},{"$f":"IF($J638=\"\",\"\",IF($I638>Trimestre!$D$2,\"Non débuté\",IF(Trimestre!$D$2>$J638,\"Terminé\",\"Courant\")))","v":""}]
[null,null,null,null,null,null,null,null,null,null,{"$f":"IF($J639=\"\",\"\",IF($L639=\"Courant\",Donnees!$A$3,IF($L639=\"terminé\",Donnees!$A$4,IF($L640=\"Non débuté\",\"\"))))","v":""},{"$f":"IF($J639=\"\",\"\",IF($I639>Trimestre!$D$2,\"Non débuté\",IF(Trimestre!$D$2>$J639,\"Terminé\",\"Courant\")))","v":""}]
[null,null,null,null,null,null,null,null,null,null,{"$f":"IF($J640=\"\",\"\",IF($L640=\"Courant\",Donnees!$A$3,IF($L640=\"terminé\",Donnees!$A$4,IF($L641=\"Non débuté\",\"\"))))","v":""},{"$f":"IF($J640=\"\",\"\",IF($I640>Trimestre!$D$2,\"Non débuté\",IF(Trimestre!$D$2>$J640,\"Terminé\",\"Courant\")))","v":""}]
[null,null,null,null,null,null,null,null,null,null,{"$f":"IF($J641=\"\",\"\",IF($L641=\"Courant\",Donnees!$A$3,IF($L641=\"terminé\",Donnees!$A$4,IF($L642=\"Non débuté\",\"\"))))","v":""},{"$f":"IF($J641=\"\",\"\",IF($I641>Trimestre!$D$2,\"Non débuté\",IF(Trimestre!$D$2>$J641,\"Terminé\",\"Courant\")))","v":""}]
[null,null,null,null,null,null,null,null,null,null,{"$f":"IF($J642=\"\",\"\",IF($L642=\"Courant\",Donnees!$A$3,IF($L642=\"terminé\",Donnees!$A$4,IF($L643=\"Non débuté\",\"\"))))","v":""},{"$f":"IF($J642=\"\",\"\",IF($I642>Trimestre!$D$2,\"Non débuté\",IF(Trimestre!$D$2>$J642,\"Terminé\",\"Courant\")))","v":""}]
[null,null,null,null,null,null,null,null,null,null,{"$f":"IF($J643=\"\",\"\",IF($L643=\"Courant\",Donnees!$A$3,IF($L643=\"terminé\",Donnees!$A$4,IF($L644=\"Non débuté\",\"\"))))","v":""},{"$f":"IF($J643=\"\",\"\",IF($I643>Trimestre!$D$2,\"Non débuté\",IF(Trimestre!$D$2>$J643,\"Terminé\",\"Courant\")))","v":""}]
[null,null,null,null,null,null,null,null,null,null,{"$f":"IF($J644=\"\",\"\",IF($L644=\"Courant\",Donnees!$A$3,IF($L644=\"terminé\",Donnees!$A$4,IF($L645=\"Non débuté\",\"\"))))","v":""},{"$f":"IF($J644=\"\",\"\",IF($I644>Trimestre!$D$2,\"Non débuté\",IF(Trimestre!$D$2>$J644,\"Terminé\",\"Courant\")))","v":""}]
[null,null,null,null,null,null,null,null,null,null,{"$f":"IF($J645=\"\",\"\",IF($L645=\"Courant\",Donnees!$A$3,IF($L645=\"terminé\",Donnees!$A$4,IF($L646=\"Non débuté\",\"\"))))","v":""},{"$f":"IF($J645=\"\",\"\",IF($I645>Trimestre!$D$2,\"Non débuté\",IF(Trimestre!$D$2>$J645,\"Terminé\",\"Courant\")))","v":""}]
[null,null,null,null,null,null,null,null,null,null,{"$f":"IF($J646=\"\",\"\",IF($L646=\"Courant\",Donnees!$A$3,IF($L646=\"terminé\",Donnees!$A$4,IF($L647=\"Non débuté\",\"\"))))","v":""},{"$f":"IF($J646=\"\",\"\",IF($I646>Trimestre!$D$2,\"Non débuté\",IF(Trimestre!$D$2>$J646,\"Terminé\",\"Courant\")))","v":""}]
[null,null,null,null,null,null,null,null,null,null,{"$f":"IF($J647=\"\",\"\",IF($L647=\"Courant\",Donnees!$A$3,IF($L647=\"terminé\",Donnees!$A$4,IF($L648=\"Non débuté\",\"\"))))","v":""},{"$f":"IF($J647=\"\",\"\",IF($I647>Trimestre!$D$2,\"Non débuté\",IF(Trimestre!$D$2>$J647,\"Terminé\",\"Courant\")))","v":""}]
[null,null,null,null,null,null,null,null,null,null,{"$f":"IF($J648=\"\",\"\",IF($L648=\"Courant\",Donnees!$A$3,IF($L648=\"terminé\",Donnees!$A$4,IF($L649=\"Non débuté\",\"\"))))","v":""},{"$f":"IF($J648=\"\",\"\",IF($I648>Trimestre!$D$2,\"Non débuté\",IF(Trimestre!$D$2>$J648,\"Terminé\",\"Courant\")))","v":""}]
[null,null,null,null,null,null,null,null,null,null,{"$f":"IF($J649=\"\",\"\",IF($L649=\"Courant\",Donnees!$A$3,IF($L649=\"terminé\",Donnees!$A$4,IF($L650=\"Non débuté\",\"\"))))","v":""},{"$f":"IF($J649=\"\",\"\",IF($I649>Trimestre!$D$2,\"Non débuté\",IF(Trimestre!$D$2>$J649,\"Terminé\",\"Courant\")))","v":""}]
[null,null,null,null,null,null,null,null,null,null,{"$f":"IF($J650=\"\",\"\",IF($L650=\"Courant\",Donnees!$A$3,IF($L650=\"terminé\",Donnees!$A$4,IF($L651=\"Non débuté\",\"\"))))","v":""},{"$f":"IF($J650=\"\",\"\",IF($I650>Trimestre!$D$2,\"Non débuté\",IF(Trimestre!$D$2>$J650,\"Terminé\",\"Courant\")))","v":""}]
[null,null,null,null,null,null,null,null,null,null,{"$f":"IF($J651=\"\",\"\",IF($L651=\"Courant\",Donnees!$A$3,IF($L651=\"terminé\",Donnees!$A$4,IF($L652=\"Non débuté\",\"\"))))","v":""},{"$f":"IF($J651=\"\",\"\",IF($I651>Trimestre!$D$2,\"Non débuté\",IF(Trimestre!$D$2>$J651,\"Terminé\",\"Courant\")))","v":""}]
[null,null,null,null,null,null,null,null,null,null,{"$f":"IF($J652=\"\",\"\",IF($L652=\"Courant\",Donnees!$A$3,IF($L652=\"terminé\",Donnees!$A$4,IF($L653=\"Non débuté\",\"\"))))","v":""},{"$f":"IF($J652=\"\",\"\",IF($I652>Trimestre!$D$2,\"Non débuté\",IF(Trimestre!$D$2>$J652,\"Terminé\",\"Courant\")))","v":""}]
[null,null,null,null,null,null,null,null,null,null,{"$f":"IF($J653=\"\",\"\",IF($L653=\"Courant\",Donnees!$A$3,IF($L653=\"terminé\",Donnees!$A$4,IF($L654=\"Non débuté\",\"\"))))","v":""},{"$f":"IF($J653=\"\",\"\",IF($I653>Trimestre!$D$2,\"Non débuté\",IF(Trimestre!$D$2>$J653,\"Terminé\",\"Courant\")))","v":""}]
[null,null,null,null,null,null,null,null,null,null,{"$f":"IF($J654=\"\",\"\",IF($L654=\"Courant\",Donnees!$A$3,IF($L654=\"terminé\",Donnees!$A$4,IF($L655=\"Non débuté\",\"\"))))","v":""},{"$f":"IF($J654=\"\",\"\",IF($I654>Trimestre!$D$2,\"Non débuté\",IF(Trimestre!$D$2>$J654,\"Terminé\",\"Courant\")))","v":""}]
[null,null,null,null,null,null,null,null,null,null,{"$f":"IF($J655=\"\",\"\",IF($L655=\"Courant\",Donnees!$A$3,IF($L655=\"terminé\",Donnees!$A$4,IF($L656=\"Non débuté\",\"\"))))","v":""},{"$f":"IF($J655=\"\",\"\",IF($I655>Trimestre!$D$2,\"Non débuté\",IF(Trimestre!$D$2>$J655,\"Terminé\",\"Courant\")))","v":""}]
[null,null,null,null,null,null,null,null,null,null,{"$f":"IF($J656=\"\",\"\",IF($L656=\"Courant\",Donnees!$A$3,IF($L656=\"terminé\",Donnees!$A$4,IF($L657=\"Non débuté\",\"\"))))","v":""},{"$f":"IF($J656=\"\",\"\",IF($I656>Trimestre!$D$2,\"Non débuté\",IF(Trimestre!$D$2>$J656,\"Terminé\",\"Courant\")))","v":""}]
[null,null,null,null,null,null,null,null,null,null,{"$f":"IF($J657=\"\",\"\",IF($L657=\"Courant\",Donnees!$A$3,IF($L657=\"terminé\",Donnees!$A$4,IF($L658=\"Non débuté\",\"\"))))","v":""},{"$f":"IF($J657=\"\",\"\",IF($I657>Trimestre!$D$2,\"Non débuté\",IF(Trimestre!$D$2>$J657,\"Terminé\",\"Courant\")))","v":""}]
[null,null,null,null,null,null,null,null,null,null,{"$f":"IF($J658=\"\",\"\",IF($L658=\"Courant\",Donnees!$A$3,IF($L658=\"terminé\",Donnees!$A$4,IF($L659=\"Non débuté\",\"\"))))","v":""},{"$f":"IF($J658=\"\",\"\",IF($I658>Trimestre!$D$2,\"Non débuté\",IF(Trimestre!$D$2>$J658,\"Terminé\",\"Courant\")))","v":""}]
[null,null,null,null,null,null,null,null,null,null,{"$f":"IF($J659=\"\",\"\",IF($L659=\"Courant\",Donnees!$A$3,IF($L659=\"terminé\",Donnees!$A$4,IF($L660=\"Non débuté\",\"\"))))","v":""},{"$f":"IF($J659=\"\",\"\",IF($I659>Trimestre!$D$2,\"Non débuté\",IF(Trimestre!$D$2>$J659,\"Terminé\",\"Courant\")))","v":""}]
[null,null,null,null,null,null,null,null,null,null,{"$f":"IF($J660=\"\",\"\",IF($L660=\"Courant\",Donnees!$A$3,IF($L660=\"terminé\",Donnees!$A$4,IF($L661=\"Non débuté\",\"\"))))","v":""},{"$f":"IF($J660=\"\",\"\",IF($I660>Trimestre!$D$2,\"Non débuté\",IF(Trimestre!$D$2>$J660,\"Terminé\",\"Courant\")))","v":""}]
[null,null,null,null,null,null,null,null,null,null,{"$f":"IF($J661=\"\",\"\",IF($L661=\"Courant\",Donnees!$A$3,IF($L661=\"terminé\",Donnees!$A$4,IF($L662=\"Non débuté\",\"\"))))","v":""},{"$f":"IF($J661=\"\",\"\",IF($I661>Trimestre!$D$2,\"Non débuté\",IF(Trimestre!$D$2>$J661,\"Terminé\",\"Courant\")))","v":""}]
[null,null,null,null,null,null,null,null,null,null,{"$f":"IF($J662=\"\",\"\",IF($L662=\"Courant\",Donnees!$A$3,IF($L662=\"terminé\",Donnees!$A$4,IF($L663=\"Non débuté\",\"\"))))","v":""},{"$f":"IF($J662=\"\",\"\",IF($I662>Trimestre!$D$2,\"Non débuté\",IF(Trimestre!$D$2>$J662,\"Terminé\",\"Courant\")))","v":""}]
[null,null,null,null,null,null,null,null,null,null,{"$f":"IF($J663=\"\",\"\",IF($L663=\"Courant\",Donnees!$A$3,IF($L663=\"terminé\",Donnees!$A$4,IF($L664=\"Non débuté\",\"\"))))","v":""},{"$f":"IF($J663=\"\",\"\",IF($I663>Trimestre!$D$2,\"Non débuté\",IF(Trimestre!$D$2>$J663,\"Terminé\",\"Courant\")))","v":""}]
[null,null,null,null,null,null,null,null,null,null,{"$f":"IF($J664=\"\",\"\",IF($L664=\"Courant\",Donnees!$A$3,IF($L664=\"terminé\",Donnees!$A$4,IF($L665=\"Non débuté\",\"\"))))","v":""},{"$f":"IF($J664=\"\",\"\",IF($I664>Trimestre!$D$2,\"Non débuté\",IF(Trimestre!$D$2>$J664,\"Terminé\",\"Courant\")))","v":""}]
[null,null,null,null,null,null,null,null,null,null,{"$f":"IF($J665=\"\",\"\",IF($L665=\"Courant\",Donnees!$A$3,IF($L665=\"terminé\",Donnees!$A$4,IF($L666=\"Non débuté\",\"\"))))","v":""},{"$f":"IF($J665=\"\",\"\",IF($I665>Trimestre!$D$2,\"Non débuté\",IF(Trimestre!$D$2>$J665,\"Terminé\",\"Courant\")))","v":""}]
[null,null,null,null,null,null,null,null,null,null,{"$f":"IF($J666=\"\",\"\",IF($L666=\"Courant\",Donnees!$A$3,IF($L666=\"terminé\",Donnees!$A$4,IF($L667=\"Non débuté\",\"\"))))","v":""},{"$f":"IF($J666=\"\",\"\",IF($I666>Trimestre!$D$2,\"Non débuté\",IF(Trimestre!$D$2>$J666,\"Terminé\",\"Courant\")))","v":""}]
[null,null,null,null,null,null,null,null,null,null,{"$f":"IF($J667=\"\",\"\",IF($L667=\"Courant\",Donnees!$A$3,IF($L667=\"terminé\",Donnees!$A$4,IF($L668=\"Non débuté\",\"\"))))","v":""},{"$f":"IF($J667=\"\",\"\",IF($I667>Trimestre!$D$2,\"Non débuté\",IF(Trimestre!$D$2>$J667,\"Terminé\",\"Courant\")))","v":""}]
[null,null,null,null,null,null,null,null,null,null,{"$f":"IF($J668=\"\",\"\",IF($L668=\"Courant\",Donnees!$A$3,IF($L668=\"terminé\",Donnees!$A$4,IF($L669=\"Non débuté\",\"\"))))","v":""},{"$f":"IF($J668=\"\",\"\",IF($I668>Trimestre!$D$2,\"Non débuté\",IF(Trimestre!$D$2>$J668,\"Terminé\",\"Courant\")))","v":""}]
[null,null,null,null,null,null,null,null,null,null,{"$f":"IF($J669=\"\",\"\",IF($L669=\"Courant\",Donnees!$A$3,IF($L669=\"terminé\",Donnees!$A$4,IF($L670=\"Non débuté\",\"\"))))","v":""},{"$f":"IF($J669=\"\",\"\",IF($I669>Trimestre!$D$2,\"Non débuté\",IF(Trimestre!$D$2>$J669,\"Terminé\",\"Courant\")))","v":""}]
[null,null,null,null,null,null,null,null,null,null,{"$f":"IF($J670=\"\",\"\",IF($L670=\"Courant\",Donnees!$A$3,IF($L670=\"terminé\",Donnees!$A$4,IF($L671=\"Non débuté\",\"\"))))","v":""},{"$f":"IF($J670=\"\",\"\",IF($I670>Trimestre!$D$2,\"Non débuté\",IF(Trimestre!$D$2>$J670,\"Terminé\",\"Courant\")))","v":""}]
[null,null,null,null,null,null,null,null,null,null,{"$f":"IF($J671=\"\",\"\",IF($L671=\"Courant\",Donnees!$A$3,IF($L671=\"terminé\",Donnees!$A$4,IF($L672=\"Non débuté\",\"\"))))","v":""},{"$f":"IF($J671=\"\",\"\",IF($I671>Trimestre!$D$2,\"Non débuté\",IF(Trimestre!$D$2>$J671,\"Terminé\",\"Courant\")))","v":""}]
[null,null,null,null,null,null,null,null,null,null,{"$f":"IF($J672=\"\",\"\",IF($L672=\"Courant\",Donnees!$A$3,IF($L672=\"terminé\",Donnees!$A$4,IF($L673=\"Non débuté\",\"\"))))","v":""},{"$f":"IF($J672=\"\",\"\",IF($I672>Trimestre!$D$2,\"Non débuté\",IF(Trimestre!$D$2>$J672,\"Terminé\",\"Courant\")))","v":""}]
[null,null,null,null,null,null,null,null,null,null,{"$f":"IF($J673=\"\",\"\",IF($L673=\"Courant\",Donnees!$A$3,IF($L673=\"terminé\",Donnees!$A$4,IF($L674=\"Non débuté\",\"\"))))","v":""},{"$f":"IF($J673=\"\",\"\",IF($I673>Trimestre!$D$2,\"Non débuté\",IF(Trimestre!$D$2>$J673,\"Terminé\",\"Courant\")))","v":""}]
[null,null,null,null,null,null,null,null,null,null,{"$f":"IF($J674=\"\",\"\",IF($L674=\"Courant\",Donnees!$A$3,IF($L674=\"terminé\",Donnees!$A$4,IF($L675=\"Non débuté\",\"\"))))","v":""},{"$f":"IF($J674=\"\",\"\",IF($I674>Trimestre!$D$2,\"Non débuté\",IF(Trimestre!$D$2>$J674,\"Terminé\",\"Courant\")))","v":""}]
[null,null,null,null,null,null,null,null,null,null,{"$f":"IF($J675=\"\",\"\",IF($L675=\"Courant\",Donnees!$A$3,IF($L675=\"terminé\",Donnees!$A$4,IF($L676=\"Non débuté\",\"\"))))","v":""},{"$f":"IF($J675=\"\",\"\",IF($I675>Trimestre!$D$2,\"Non débuté\",IF(Trimestre!$D$2>$J675,\"Terminé\",\"Courant\")))","v":""}]
[null,null,null,null,null,null,null,null,null,null,{"$f":"IF($J676=\"\",\"\",IF($L676=\"Courant\",Donnees!$A$3,IF($L676=\"terminé\",Donnees!$A$4,IF($L677=\"Non débuté\",\"\"))))","v":""},{"$f":"IF($J676=\"\",\"\",IF($I676>Trimestre!$D$2,\"Non débuté\",IF(Trimestre!$D$2>$J676,\"Terminé\",\"Courant\")))","v":""}]
[null,null,null,null,null,null,null,null,null,null,{"$f":"IF($J677=\"\",\"\",IF($L677=\"Courant\",Donnees!$A$3,IF($L677=\"terminé\",Donnees!$A$4,IF($L678=\"Non débuté\",\"\"))))","v":""},{"$f":"IF($J677=\"\",\"\",IF($I677>Trimestre!$D$2,\"Non débuté\",IF(Trimestre!$D$2>$J677,\"Terminé\",\"Courant\")))","v":""}]
[null,null,null,null,null,null,null,null,null,null,{"$f":"IF($J678=\"\",\"\",IF($L678=\"Courant\",Donnees!$A$3,IF($L678=\"terminé\",Donnees!$A$4,IF($L679=\"Non débuté\",\"\"))))","v":""},{"$f":"IF($J678=\"\",\"\",IF($I678>Trimestre!$D$2,\"Non débuté\",IF(Trimestre!$D$2>$J678,\"Terminé\",\"Courant\")))","v":""}]
[null,null,null,null,null,null,null,null,null,null,{"$f":"IF($J679=\"\",\"\",IF($L679=\"Courant\",Donnees!$A$3,IF($L679=\"terminé\",Donnees!$A$4,IF($L680=\"Non débuté\",\"\"))))","v":""},{"$f":"IF($J679=\"\",\"\",IF($I679>Trimestre!$D$2,\"Non débuté\",IF(Trimestre!$D$2>$J679,\"Terminé\",\"Courant\")))","v":""}]
[null,null,null,null,null,null,null,null,null,null,{"$f":"IF($J680=\"\",\"\",IF($L680=\"Courant\",Donnees!$A$3,IF($L680=\"terminé\",Donnees!$A$4,IF($L681=\"Non débuté\",\"\"))))","v":""},{"$f":"IF($J680=\"\",\"\",IF($I680>Trimestre!$D$2,\"Non débuté\",IF(Trimestre!$D$2>$J680,\"Terminé\",\"Courant\")))","v":""}]
[null,null,null,null,null,null,null,null,null,null,{"$f":"IF($J681=\"\",\"\",IF($L681=\"Courant\",Donnees!$A$3,IF($L681=\"terminé\",Donnees!$A$4,IF($L682=\"Non débuté\",\"\"))))","v":""},{"$f":"IF($J681=\"\",\"\",IF($I681>Trimestre!$D$2,\"Non débuté\",IF(Trimestre!$D$2>$J681,\"Terminé\",\"Courant\")))","v":""}]
[null,null,null,null,null,null,null,null,null,null,{"$f":"IF($J682=\"\",\"\",IF($L682=\"Courant\",Donnees!$A$3,IF($L682=\"terminé\",Donnees!$A$4,IF($L683=\"Non débuté\",\"\"))))","v":""},{"$f":"IF($J682=\"\",\"\",IF($I682>Trimestre!$D$2,\"Non débuté\",IF(Trimestre!$D$2>$J682,\"Terminé\",\"Courant\")))","v":""}]
[null,null,null,null,null,null,null,null,null,null,{"$f":"IF($J683=\"\",\"\",IF($L683=\"Courant\",Donnees!$A$3,IF($L683=\"terminé\",Donnees!$A$4,IF($L684=\"Non débuté\",\"\"))))","v":""},{"$f":"IF($J683=\"\",\"\",IF($I683>Trimestre!$D$2,\"Non débuté\",IF(Trimestre!$D$2>$J683,\"Terminé\",\"Courant\")))","v":""}]
[null,null,null,null,null,null,null,null,null,null,{"$f":"IF($J684=\"\",\"\",IF($L684=\"Courant\",Donnees!$A$3,IF($L684=\"terminé\",Donnees!$A$4,IF($L685=\"Non débuté\",\"\"))))","v":""},{"$f":"IF($J684=\"\",\"\",IF($I684>Trimestre!$D$2,\"Non débuté\",IF(Trimestre!$D$2>$J684,\"Terminé\",\"Courant\")))","v":""}]
[null,null,null,null,null,null,null,null,null,null,{"$f":"IF($J685=\"\",\"\",IF($L685=\"Courant\",Donnees!$A$3,IF($L685=\"terminé\",Donnees!$A$4,IF($L686=\"Non débuté\",\"\"))))","v":""},{"$f":"IF($J685=\"\",\"\",IF($I685>Trimestre!$D$2,\"Non débuté\",IF(Trimestre!$D$2>$J685,\"Terminé\",\"Courant\")))","v":""}]
[null,null,null,null,null,null,null,null,null,null,{"$f":"IF($J686=\"\",\"\",IF($L686=\"Courant\",Donnees!$A$3,IF($L686=\"terminé\",Donnees!$A$4,IF($L687=\"Non débuté\",\"\"))))","v":""},{"$f":"IF($J686=\"\",\"\",IF($I686>Trimestre!$D$2,\"Non débuté\",IF(Trimestre!$D$2>$J686,\"Terminé\",\"Courant\")))","v":""}]
[null,null,null,null,null,null,null,null,null,null,{"$f":"IF($J687=\"\",\"\",IF($L687=\"Courant\",Donnees!$A$3,IF($L687=\"terminé\",Donnees!$A$4,IF($L688=\"Non débuté\",\"\"))))","v":""},{"$f":"IF($J687=\"\",\"\",IF($I687>Trimestre!$D$2,\"Non débuté\",IF(Trimestre!$D$2>$J687,\"Terminé\",\"Courant\")))","v":""}]
[null,null,null,null,null,null,null,null,null,null,{"$f":"IF($J688=\"\",\"\",IF($L688=\"Courant\",Donnees!$A$3,IF($L688=\"terminé\",Donnees!$A$4,IF($L689=\"Non débuté\",\"\"))))","v":""},{"$f":"IF($J688=\"\",\"\",IF($I688>Trimestre!$D$2,\"Non débuté\",IF(Trimestre!$D$2>$J688,\"Terminé\",\"Courant\")))","v":""}]
[null,null,null,null,null,null,null,null,null,null,{"$f":"IF($J689=\"\",\"\",IF($L689=\"Courant\",Donnees!$A$3,IF($L689=\"terminé\",Donnees!$A$4,IF($L690=\"Non débuté\",\"\"))))","v":""},{"$f":"IF($J689=\"\",\"\",IF($I689>Trimestre!$D$2,\"Non débuté\",IF(Trimestre!$D$2>$J689,\"Terminé\",\"Courant\")))","v":""}]
[null,null,null,null,null,null,null,null,null,null,{"$f":"IF($J690=\"\",\"\",IF($L690=\"Courant\",Donnees!$A$3,IF($L690=\"terminé\",Donnees!$A$4,IF($L691=\"Non débuté\",\"\"))))","v":""},{"$f":"IF($J690=\"\",\"\",IF($I690>Trimestre!$D$2,\"Non débuté\",IF(Trimestre!$D$2>$J690,\"Terminé\",\"Courant\")))","v":""}]
[null,null,null,null,null,null,null,null,null,null,{"$f":"IF($J691=\"\",\"\",IF($L691=\"Courant\",Donnees!$A$3,IF($L691=\"terminé\",Donnees!$A$4,IF($L692=\"Non débuté\",\"\"))))","v":""},{"$f":"IF($J691=\"\",\"\",IF($I691>Trimestre!$D$2,\"Non débuté\",IF(Trimestre!$D$2>$J691,\"Terminé\",\"Courant\")))","v":""}]
[null,null,null,null,null,null,null,null,null,null,{"$f":"IF($J692=\"\",\"\",IF($L692=\"Courant\",Donnees!$A$3,IF($L692=\"terminé\",Donnees!$A$4,IF($L693=\"Non débuté\",\"\"))))","v":""},{"$f":"IF($J692=\"\",\"\",IF($I692>Trimestre!$D$2,\"Non débuté\",IF(Trimestre!$D$2>$J692,\"Terminé\",\"Courant\")))","v":""}]
[null,null,null,null,null,null,null,null,null,null,{"$f":"IF($J693=\"\",\"\",IF($L693=\"Courant\",Donnees!$A$3,IF($L693=\"terminé\",Donnees!$A$4,IF($L694=\"Non débuté\",\"\"))))","v":""},{"$f":"IF($J693=\"\",\"\",IF($I693>Trimestre!$D$2,\"Non débuté\",IF(Trimestre!$D$2>$J693,\"Terminé\",\"Courant\")))","v":""}]
[null,null,null,null,null,null,null,null,null,null,{"$f":"IF($J694=\"\",\"\",IF($L694=\"Courant\",Donnees!$A$3,IF($L694=\"terminé\",Donnees!$A$4,IF($L695=\"Non débuté\",\"\"))))","v":""},{"$f":"IF($J694=\"\",\"\",IF($I694>Trimestre!$D$2,\"Non débuté\",IF(Trimestre!$D$2>$J694,\"Terminé\",\"Courant\")))","v":""}]
[null,null,null,null,null,null,null,null,null,null,{"$f":"IF($J695=\"\",\"\",IF($L695=\"Courant\",Donnees!$A$3,IF($L695=\"terminé\",Donnees!$A$4,IF($L696=\"Non débuté\",\"\"))))","v":""},{"$f":"IF($J695=\"\",\"\",IF($I695>Trimestre!$D$2,\"Non débuté\",IF(Trimestre!$D$2>$J695,\"Terminé\",\"Courant\")))","v":""}]
[null,null,null,null,null,null,null,null,null,null,{"$f":"IF($J696=\"\",\"\",IF($L696=\"Courant\",Donnees!$A$3,IF($L696=\"terminé\",Donnees!$A$4,IF($L697=\"Non débuté\",\"\"))))","v":""},{"$f":"IF($J696=\"\",\"\",IF($I696>Trimestre!$D$2,\"Non débuté\",IF(Trimestre!$D$2>$J696,\"Terminé\",\"Courant\")))","v":""}]
[null,null,null,null,null,null,null,null,null,null,{"$f":"IF($J697=\"\",\"\",IF($L697=\"Courant\",Donnees!$A$3,IF($L697=\"terminé\",Donnees!$A$4,IF($L698=\"Non débuté\",\"\"))))","v":""},{"$f":"IF($J697=\"\",\"\",IF($I697>Trimestre!$D$2,\"Non débuté\",IF(Trimestre!$D$2>$J697,\"Terminé\",\"Courant\")))","v":""}]
[null,null,null,null,null,null,null,null,null,null,{"$f":"IF($J698=\"\",\"\",IF($L698=\"Courant\",Donnees!$A$3,IF($L698=\"terminé\",Donnees!$A$4,IF($L699=\"Non débuté\",\"\"))))","v":""},{"$f":"IF($J698=\"\",\"\",IF($I698>Trimestre!$D$2,\"Non débuté\",IF(Trimestre!$D$2>$J698,\"Terminé\",\"Courant\")))","v":""}]
[null,null,null,null,null,null,null,null,null,null,{"$f":"IF($J699=\"\",\"\",IF($L699=\"Courant\",Donnees!$A$3,IF($L699=\"terminé\",Donnees!$A$4,IF($L700=\"Non débuté\",\"\"))))","v":""},{"$f":"IF($J699=\"\",\"\",IF($I699>Trimestre!$D$2,\"Non débuté\",IF(Trimestre!$D$2>$J699,\"Terminé\",\"Courant\")))","v":""}]
[null,null,null,null,null,null,null,null,null,null,{"$f":"IF($J700=\"\",\"\",IF($L700=\"Courant\",Donnees!$A$3,IF($L700=\"terminé\",Donnees!$A$4,IF($L701=\"Non débuté\",\"\"))))","v":""},{"$f":"IF($J700=\"\",\"\",IF($I700>Trimestre!$D$2,\"Non débuté\",IF(Trimestre!$D$2>$J700,\"Terminé\",\"Courant\")))","v":""}]
[null,null,null,null,null,null,null,null,null,null,{"$f":"IF($J701=\"\",\"\",IF($L701=\"Courant\",Donnees!$A$3,IF($L701=\"terminé\",Donnees!$A$4,IF($L702=\"Non débuté\",\"\"))))","v":""},{"$f":"IF($J701=\"\",\"\",IF($I701>Trimestre!$D$2,\"Non débuté\",IF(Trimestre!$D$2>$J701,\"Terminé\",\"Courant\")))","v":""}]
[null,null,null,null,null,null,null,null,null,null,{"$f":"IF($J702=\"\",\"\",IF($L702=\"Courant\",Donnees!$A$3,IF($L702=\"terminé\",Donnees!$A$4,IF($L703=\"Non débuté\",\"\"))))","v":""},{"$f":"IF($J702=\"\",\"\",IF($I702>Trimestre!$D$2,\"Non débuté\",IF(Trimestre!$D$2>$J702,\"Terminé\",\"Courant\")))","v":""}]
[null,null,null,null,null,null,null,null,null,null,{"$f":"IF($J703=\"\",\"\",IF($L703=\"Courant\",Donnees!$A$3,IF($L703=\"terminé\",Donnees!$A$4,IF($L704=\"Non débuté\",\"\"))))","v":""},{"$f":"IF($J703=\"\",\"\",IF($I703>Trimestre!$D$2,\"Non débuté\",IF(Trimestre!$D$2>$J703,\"Terminé\",\"Courant\")))","v":""}]
[null,null,null,null,null,null,null,null,null,null,{"$f":"IF($J704=\"\",\"\",IF($L704=\"Courant\",Donnees!$A$3,IF($L704=\"terminé\",Donnees!$A$4,IF($L705=\"Non débuté\",\"\"))))","v":""},{"$f":"IF($J704=\"\",\"\",IF($I704>Trimestre!$D$2,\"Non débuté\",IF(Trimestre!$D$2>$J704,\"Terminé\",\"Courant\")))","v":""}]
[null,null,null,null,null,null,null,null,null,null,{"$f":"IF($J705=\"\",\"\",IF($L705=\"Courant\",Donnees!$A$3,IF($L705=\"terminé\",Donnees!$A$4,IF($L706=\"Non débuté\",\"\"))))","v":""},{"$f":"IF($J705=\"\",\"\",IF($I705>Trimestre!$D$2,\"Non débuté\",IF(Trimestre!$D$2>$J705,\"Terminé\",\"Courant\")))","v":""}]
[null,null,null,null,null,null,null,null,null,null,{"$f":"IF($J706=\"\",\"\",IF($L706=\"Courant\",Donnees!$A$3,IF($L706=\"terminé\",Donnees!$A$4,IF($L707=\"Non débuté\",\"\"))))","v":""},{"$f":"IF($J706=\"\",\"\",IF($I706>Trimestre!$D$2,\"Non débuté\",IF(Trimestre!$D$2>$J706,\"Terminé\",\"Courant\")))","v":""}]
[null,null,null,null,null,null,null,null,null,null,{"$f":"IF($J707=\"\",\"\",IF($L707=\"Courant\",Donnees!$A$3,IF($L707=\"terminé\",Donnees!$A$4,IF($L708=\"Non débuté\",\"\"))))","v":""},{"$f":"IF($J707=\"\",\"\",IF($I707>Trimestre!$D$2,\"Non débuté\",IF(Trimestre!$D$2>$J707,\"Terminé\",\"Courant\")))","v":""}]
[null,null,null,null,null,null,null,null,null,null,{"$f":"IF($J708=\"\",\"\",IF($L708=\"Courant\",Donnees!$A$3,IF($L708=\"terminé\",Donnees!$A$4,IF($L709=\"Non débuté\",\"\"))))","v":""},{"$f":"IF($J708=\"\",\"\",IF($I708>Trimestre!$D$2,\"Non débuté\",IF(Trimestre!$D$2>$J708,\"Terminé\",\"Courant\")))","v":""}]
[null,null,null,null,null,null,null,null,null,null,{"$f":"IF($J709=\"\",\"\",IF($L709=\"Courant\",Donnees!$A$3,IF($L709=\"terminé\",Donnees!$A$4,IF($L710=\"Non débuté\",\"\"))))","v":""},{"$f":"IF($J709=\"\",\"\",IF($I709>Trimestre!$D$2,\"Non débuté\",IF(Trimestre!$D$2>$J709,\"Terminé\",\"Courant\")))","v":""}]
[null,null,null,null,null,null,null,null,null,null,{"$f":"IF($J710=\"\",\"\",IF($L710=\"Courant\",Donnees!$A$3,IF($L710=\"terminé\",Donnees!$A$4,IF($L711=\"Non débuté\",\"\"))))","v":""},{"$f":"IF($J710=\"\",\"\",IF($I710>Trimestre!$D$2,\"Non débuté\",IF(Trimestre!$D$2>$J710,\"Terminé\",\"Courant\")))","v":""}]
[null,null,null,null,null,null,null,null,null,null,{"$f":"IF($J711=\"\",\"\",IF($L711=\"Courant\",Donnees!$A$3,IF($L711=\"terminé\",Donnees!$A$4,IF($L712=\"Non débuté\",\"\"))))","v":""},{"$f":"IF($J711=\"\",\"\",IF($I711>Trimestre!$D$2,\"Non débuté\",IF(Trimestre!$D$2>$J711,\"Terminé\",\"Courant\")))","v":""}]
[null,null,null,null,null,null,null,null,null,null,{"$f":"IF($J712=\"\",\"\",IF($L712=\"Courant\",Donnees!$A$3,IF($L712=\"terminé\",Donnees!$A$4,IF($L713=\"Non débuté\",\"\"))))","v":""},{"$f":"IF($J712=\"\",\"\",IF($I712>Trimestre!$D$2,\"Non débuté\",IF(Trimestre!$D$2>$J712,\"Terminé\",\"Courant\")))","v":""}]
[null,null,null,null,null,null,null,null,null,null,{"$f":"IF($J713=\"\",\"\",IF($L713=\"Courant\",Donnees!$A$3,IF($L713=\"terminé\",Donnees!$A$4,IF($L714=\"Non débuté\",\"\"))))","v":""},{"$f":"IF($J713=\"\",\"\",IF($I713>Trimestre!$D$2,\"Non débuté\",IF(Trimestre!$D$2>$J713,\"Terminé\",\"Courant\")))","v":""}]
[null,null,null,null,null,null,null,null,null,null,{"$f":"IF($J714=\"\",\"\",IF($L714=\"Courant\",Donnees!$A$3,IF($L714=\"terminé\",Donnees!$A$4,IF($L715=\"Non débuté\",\"\"))))","v":""},{"$f":"IF($J714=\"\",\"\",IF($I714>Trimestre!$D$2,\"Non débuté\",IF(Trimestre!$D$2>$J714,\"Terminé\",\"Courant\")))","v":""}]
[null,null,null,null,null,null,null,null,null,null,{"$f":"IF($J715=\"\",\"\",IF($L715=\"Courant\",Donnees!$A$3,IF($L715=\"terminé\",Donnees!$A$4,IF($L716=\"Non débuté\",\"\"))))","v":""},{"$f":"IF($J715=\"\",\"\",IF($I715>Trimestre!$D$2,\"Non débuté\",IF(Trimestre!$D$2>$J715,\"Terminé\",\"Courant\")))","v":""}]
[null,null,null,null,null,null,null,null,null,null,{"$f":"IF($J716=\"\",\"\",IF($L716=\"Courant\",Donnees!$A$3,IF($L716=\"terminé\",Donnees!$A$4,IF($L717=\"Non débuté\",\"\"))))","v":""},{"$f":"IF($J716=\"\",\"\",IF($I716>Trimestre!$D$2,\"Non débuté\",IF(Trimestre!$D$2>$J716,\"Terminé\",\"Courant\")))","v":""}]
[null,null,null,null,null,null,null,null,null,null,{"$f":"IF($J717=\"\",\"\",IF($L717=\"Courant\",Donnees!$A$3,IF($L717=\"terminé\",Donnees!$A$4,IF($L718=\"Non débuté\",\"\"))))","v":""},{"$f":"IF($J717=\"\",\"\",IF($I717>Trimestre!$D$2,\"Non débuté\",IF(Trimestre!$D$2>$J717,\"Terminé\",\"Courant\")))","v":""}]
[null,null,null,null,null,null,null,null,null,null,{"$f":"IF($J718=\"\",\"\",IF($L718=\"Courant\",Donnees!$A$3,IF($L718=\"terminé\",Donnees!$A$4,IF($L719=\"Non débuté\",\"\"))))","v":""},{"$f":"IF($J718=\"\",\"\",IF($I718>Trimestre!$D$2,\"Non débuté\",IF(Trimestre!$D$2>$J718,\"Terminé\",\"Courant\")))","v":""}]
[null,null,null,null,null,null,null,null,null,null,{"$f":"IF($J719=\"\",\"\",IF($L719=\"Courant\",Donnees!$A$3,IF($L719=\"terminé\",Donnees!$A$4,IF($L720=\"Non débuté\",\"\"))))","v":""},{"$f":"IF($J719=\"\",\"\",IF($I719>Trimestre!$D$2,\"Non débuté\",IF(Trimestre!$D$2>$J719,\"Terminé\",\"Courant\")))","v":""}]
[null,null,null,null,null,null,null,null,null,null,{"$f":"IF($J720=\"\",\"\",IF($L720=\"Courant\",Donnees!$A$3,IF($L720=\"terminé\",Donnees!$A$4,IF($L721=\"Non débuté\",\"\"))))","v":""},{"$f":"IF($J720=\"\",\"\",IF($I720>Trimestre!$D$2,\"Non débuté\",IF(Trimestre!$D$2>$J720,\"Terminé\",\"Courant\")))","v":""}]
[null,null,null,null,null,null,null,null,null,null,{"$f":"IF($J721=\"\",\"\",IF($L721=\"Courant\",Donnees!$A$3,IF($L721=\"terminé\",Donnees!$A$4,IF($L722=\"Non débuté\",\"\"))))","v":""},{"$f":"IF($J721=\"\",\"\",IF($I721>Trimestre!$D$2,\"Non débuté\",IF(Trimestre!$D$2>$J721,\"Terminé\",\"Courant\")))","v":""}]
[null,null,null,null,null,null,null,null,null,null,{"$f":"IF($J722=\"\",\"\",IF($L722=\"Courant\",Donnees!$A$3,IF($L722=\"terminé\",Donnees!$A$4,IF($L723=\"Non débuté\",\"\"))))","v":""},{"$f":"IF($J722=\"\",\"\",IF($I722>Trimestre!$D$2,\"Non débuté\",IF(Trimestre!$D$2>$J722,\"Terminé\",\"Courant\")))","v":""}]
[null,null,null,null,null,null,null,null,null,null,{"$f":"IF($J723=\"\",\"\",IF($L723=\"Courant\",Donnees!$A$3,IF($L723=\"terminé\",Donnees!$A$4,IF($L724=\"Non débuté\",\"\"))))","v":""},{"$f":"IF($J723=\"\",\"\",IF($I723>Trimestre!$D$2,\"Non débuté\",IF(Trimestre!$D$2>$J723,\"Terminé\",\"Courant\")))","v":""}]
[null,null,null,null,null,null,null,null,null,null,{"$f":"IF($J724=\"\",\"\",IF($L724=\"Courant\",Donnees!$A$3,IF($L724=\"terminé\",Donnees!$A$4,IF($L725=\"Non débuté\",\"\"))))","v":""},{"$f":"IF($J724=\"\",\"\",IF($I724>Trimestre!$D$2,\"Non débuté\",IF(Trimestre!$D$2>$J724,\"Terminé\",\"Courant\")))","v":""}]
[null,null,null,null,null,null,null,null,null,null,{"$f":"IF($J725=\"\",\"\",IF($L725=\"Courant\",Donnees!$A$3,IF($L725=\"terminé\",Donnees!$A$4,IF($L726=\"Non débuté\",\"\"))))","v":""},{"$f":"IF($J725=\"\",\"\",IF($I725>Trimestre!$D$2,\"Non débuté\",IF(Trimestre!$D$2>$J725,\"Terminé\",\"Courant\")))","v":""}]
[null,null,null,null,null,null,null,null,null,null,{"$f":"IF($J726=\"\",\"\",IF($L726=\"Courant\",Donnees!$A$3,IF($L726=\"terminé\",Donnees!$A$4,IF($L727=\"Non débuté\",\"\"))))","v":""},{"$f":"IF($J726=\"\",\"\",IF($I726>Trimestre!$D$2,\"Non débuté\",IF(Trimestre!$D$2>$J726,\"Terminé\",\"Courant\")))","v":""}]
[null,null,null,null,null,null,null,null,null,null,{"$f":"IF($J727=\"\",\"\",IF($L727=\"Courant\",Donnees!$A$3,IF($L727=\"terminé\",Donnees!$A$4,IF($L728=\"Non débuté\",\"\"))))","v":""},{"$f":"IF($J727=\"\",\"\",IF($I727>Trimestre!$D$2,\"Non débuté\",IF(Trimestre!$D$2>$J727,\"Terminé\",\"Courant\")))","v":""}]
[null,null,null,null,null,null,null,null,null,null,{"$f":"IF($J728=\"\",\"\",IF($L728=\"Courant\",Donnees!$A$3,IF($L728=\"terminé\",Donnees!$A$4,IF($L729=\"Non débuté\",\"\"))))","v":""},{"$f":"IF($J728=\"\",\"\",IF($I728>Trimestre!$D$2,\"Non débuté\",IF(Trimestre!$D$2>$J728,\"Terminé\",\"Courant\")))","v":""}]
[null,null,null,null,null,null,null,null,null,null,{"$f":"IF($J729=\"\",\"\",IF($L729=\"Courant\",Donnees!$A$3,IF($L729=\"terminé\",Donnees!$A$4,IF($L730=\"Non débuté\",\"\"))))","v":""},{"$f":"IF($J729=\"\",\"\",IF($I729>Trimestre!$D$2,\"Non débuté\",IF(Trimestre!$D$2>$J729,\"Terminé\",\"Courant\")))","v":""}]
[null,null,null,null,null,null,null,null,null,null,{"$f":"IF($J730=\"\",\"\",IF($L730=\"Courant\",Donnees!$A$3,IF($L730=\"terminé\",Donnees!$A$4,IF($L731=\"Non débuté\",\"\"))))","v":""},{"$f":"IF($J730=\"\",\"\",IF($I730>Trimestre!$D$2,\"Non débuté\",IF(Trimestre!$D$2>$J730,\"Terminé\",\"Courant\")))","v":""}]
[null,null,null,null,null,null,null,null,null,null,{"$f":"IF($J731=\"\",\"\",IF($L731=\"Courant\",Donnees!$A$3,IF($L731=\"terminé\",Donnees!$A$4,IF($L732=\"Non débuté\",\"\"))))","v":""},{"$f":"IF($J731=\"\",\"\",IF($I731>Trimestre!$D$2,\"Non débuté\",IF(Trimestre!$D$2>$J731,\"Terminé\",\"Courant\")))","v":""}]
[null,null,null,null,null,null,null,null,null,null,{"$f":"IF($J732=\"\",\"\",IF($L732=\"Courant\",Donnees!$A$3,IF($L732=\"terminé\",Donnees!$A$4,IF($L733=\"Non débuté\",\"\"))))","v":""},{"$f":"IF($J732=\"\",\"\",IF($I732>Trimestre!$D$2,\"Non débuté\",IF(Trimestre!$D$2>$J732,\"Terminé\",\"Courant\")))","v":""}]
[null,null,null,null,null,null,null,null,null,null,{"$f":"IF($J733=\"\",\"\",IF($L733=\"Courant\",Donnees!$A$3,IF($L733=\"terminé\",Donnees!$A$4,IF($L734=\"Non débuté\",\"\"))))","v":""},{"$f":"IF($J733=\"\",\"\",IF($I733>Trimestre!$D$2,\"Non débuté\",IF(Trimestre!$D$2>$J733,\"Terminé\",\"Courant\")))","v":""}]
[null,null,null,null,null,null,null,null,null,null,{"$f":"IF($J734=\"\",\"\",IF($L734=\"Courant\",Donnees!$A$3,IF($L734=\"terminé\",Donnees!$A$4,IF($L735=\"Non débuté\",\"\"))))","v":""},{"$f":"IF($J734=\"\",\"\",IF($I734>Trimestre!$D$2,\"Non débuté\",IF(Trimestre!$D$2>$J734,\"Terminé\",\"Courant\")))","v":""}]
[null,null,null,null,null,null,null,null,null,null,{"$f":"IF($J735=\"\",\"\",IF($L735=\"Courant\",Donnees!$A$3,IF($L735=\"terminé\",Donnees!$A$4,IF($L736=\"Non débuté\",\"\"))))","v":""},{"$f":"IF($J735=\"\",\"\",IF($I735>Trimestre!$D$2,\"Non débuté\",IF(Trimestre!$D$2>$J735,\"Terminé\",\"Courant\")))","v":""}]
[null,null,null,null,null,null,null,null,null,null,{"$f":"IF($J736=\"\",\"\",IF($L736=\"Courant\",Donnees!$A$3,IF($L736=\"terminé\",Donnees!$A$4,IF($L737=\"Non débuté\",\"\"))))","v":""},{"$f":"IF($J736=\"\",\"\",IF($I736>Trimestre!$D$2,\"Non débuté\",IF(Trimestre!$D$2>$J736,\"Terminé\",\"Courant\")))","v":""}]
[null,null,null,null,null,null,null,null,null,null,{"$f":"IF($J737=\"\",\"\",IF($L737=\"Courant\",Donnees!$A$3,IF($L737=\"terminé\",Donnees!$A$4,IF($L738=\"Non débuté\",\"\"))))","v":""},{"$f":"IF($J737=\"\",\"\",IF($I737>Trimestre!$D$2,\"Non débuté\",IF(Trimestre!$D$2>$J737,\"Terminé\",\"Courant\")))","v":""}]
[null,null,null,null,null,null,null,null,null,null,{"$f":"IF($J738=\"\",\"\",IF($L738=\"Courant\",Donnees!$A$3,IF($L738=\"terminé\",Donnees!$A$4,IF($L739=\"Non débuté\",\"\"))))","v":""},{"$f":"IF($J738=\"\",\"\",IF($I738>Trimestre!$D$2,\"Non débuté\",IF(Trimestre!$D$2>$J738,\"Terminé\",\"Courant\")))","v":""}]
[null,null,null,null,null,null,null,null,null,null,{"$f":"IF($J739=\"\",\"\",IF($L739=\"Courant\",Donnees!$A$3,IF($L739=\"terminé\",Donnees!$A$4,IF($L740=\"Non débuté\",\"\"))))","v":""},{"$f":"IF($J739=\"\",\"\",IF($I739>Trimestre!$D$2,\"Non débuté\",IF(Trimestre!$D$2>$J739,\"Terminé\",\"Courant\")))","v":""}]
[null,null,null,null,null,null,null,null,null,null,{"$f":"IF($J740=\"\",\"\",IF($L740=\"Courant\",Donnees!$A$3,IF($L740=\"terminé\",Donnees!$A$4,IF($L741=\"Non débuté\",\"\"))))","v":""},{"$f":"IF($J740=\"\",\"\",IF($I740>Trimestre!$D$2,\"Non débuté\",IF(Trimestre!$D$2>$J740,\"Terminé\",\"Courant\")))","v":""}]
[null,null,null,null,null,null,null,null,null,null,{"$f":"IF($J741=\"\",\"\",IF($L741=\"Courant\",Donnees!$A$3,IF($L741=\"terminé\",Donnees!$A$4,IF($L742=\"Non débuté\",\"\"))))","v":""},{"$f":"IF($J741=\"\",\"\",IF($I741>Trimestre!$D$2,\"Non débuté\",IF(Trimestre!$D$2>$J741,\"Terminé\",\"Courant\")))","v":""}]
[null,null,null,null,null,null,null,null,null,null,{"$f":"IF($J742=\"\",\"\",IF($L742=\"Courant\",Donnees!$A$3,IF($L742=\"terminé\",Donnees!$A$4,IF($L743=\"Non débuté\",\"\"))))","v":""},{"$f":"IF($J742=\"\",\"\",IF($I742>Trimestre!$D$2,\"Non débuté\",IF(Trimestre!$D$2>$J742,\"Terminé\",\"Courant\")))","v":""}]
[null,null,null,null,null,null,null,null,null,null,{"$f":"IF($J743=\"\",\"\",IF($L743=\"Courant\",Donnees!$A$3,IF($L743=\"terminé\",Donnees!$A$4,IF($L744=\"Non débuté\",\"\"))))","v":""},{"$f":"IF($J743=\"\",\"\",IF($I743>Trimestre!$D$2,\"Non débuté\",IF(Trimestre!$D$2>$J743,\"Terminé\",\"Courant\")))","v":""}]
[null,null,null,null,null,null,null,null,null,null,{"$f":"IF($J744=\"\",\"\",IF($L744=\"Courant\",Donnees!$A$3,IF($L744=\"terminé\",Donnees!$A$4,IF($L745=\"Non débuté\",\"\"))))","v":""},{"$f":"IF($J744=\"\",\"\",IF($I744>Trimestre!$D$2,\"Non débuté\",IF(Trimestre!$D$2>$J744,\"Terminé\",\"Courant\")))","v":""}]
[null,null,null,null,null,null,null,null,null,null,{"$f":"IF($J745=\"\",\"\",IF($L745=\"Courant\",Donnees!$A$3,IF($L745=\"terminé\",Donnees!$A$4,IF($L746=\"Non débuté\",\"\"))))","v":""},{"$f":"IF($J745=\"\",\"\",IF($I745>Trimestre!$D$2,\"Non débuté\",IF(Trimestre!$D$2>$J745,\"Terminé\",\"Courant\")))","v":""}]
[null,null,null,null,null,null,null,null,null,null,{"$f":"IF($J746=\"\",\"\",IF($L746=\"Courant\",Donnees!$A$3,IF($L746=\"terminé\",Donnees!$A$4,IF($L747=\"Non débuté\",\"\"))))","v":""},{"$f":"IF($J746=\"\",\"\",IF($I746>Trimestre!$D$2,\"Non débuté\",IF(Trimestre!$D$2>$J746,\"Terminé\",\"Courant\")))","v":""}]
[null,null,null,null,null,null,null,null,null,null,{"$f":"IF($J747=\"\",\"\",IF($L747=\"Courant\",Donnees!$A$3,IF($L747=\"terminé\",Donnees!$A$4,IF($L748=\"Non débuté\",\"\"))))","v":""},{"$f":"IF($J747=\"\",\"\",IF($I747>Trimestre!$D$2,\"Non débuté\",IF(Trimestre!$D$2>$J747,\"Terminé\",\"Courant\")))","v":""}]
[null,null,null,null,null,null,null,null,null,null,{"$f":"IF($J748=\"\",\"\",IF($L748=\"Courant\",Donnees!$A$3,IF($L748=\"terminé\",Donnees!$A$4,IF($L749=\"Non débuté\",\"\"))))","v":""},{"$f":"IF($J748=\"\",\"\",IF($I748>Trimestre!$D$2,\"Non débuté\",IF(Trimestre!$D$2>$J748,\"Terminé\",\"Courant\")))","v":""}]
[null,null,null,null,null,null,null,null,null,null,{"$f":"IF($J749=\"\",\"\",IF($L749=\"Courant\",Donnees!$A$3,IF($L749=\"terminé\",Donnees!$A$4,IF($L750=\"Non débuté\",\"\"))))","v":""},{"$f":"IF($J749=\"\",\"\",IF($I749>Trimestre!$D$2,\"Non débuté\",IF(Trimestre!$D$2>$J749,\"Terminé\",\"Courant\")))","v":""}]
[null,null,null,null,null,null,null,null,null,null,{"$f":"IF($J750=\"\",\"\",IF($L750=\"Courant\",Donnees!$A$3,IF($L750=\"terminé\",Donnees!$A$4,IF($L751=\"Non débuté\",\"\"))))","v":""},{"$f":"IF($J750=\"\",\"\",IF($I750>Trimestre!$D$2,\"Non débuté\",IF(Trimestre!$D$2>$J750,\"Terminé\",\"Courant\")))","v":""}]
[null,null,null,null,null,null,null,null,null,null,{"$f":"IF($J751=\"\",\"\",IF($L751=\"Courant\",Donnees!$A$3,IF($L751=\"terminé\",Donnees!$A$4,IF($L752=\"Non débuté\",\"\"))))","v":""},{"$f":"IF($J751=\"\",\"\",IF($I751>Trimestre!$D$2,\"Non débuté\",IF(Trimestre!$D$2>$J751,\"Terminé\",\"Courant\")))","v":""}]
[null,null,null,null,null,null,null,null,null,null,{"$f":"IF($J752=\"\",\"\",IF($L752=\"Courant\",Donnees!$A$3,IF($L752=\"terminé\",Donnees!$A$4,IF($L753=\"Non débuté\",\"\"))))","v":""},{"$f":"IF($J752=\"\",\"\",IF($I752>Trimestre!$D$2,\"Non débuté\",IF(Trimestre!$D$2>$J752,\"Terminé\",\"Courant\")))","v":""}]
[null,null,null,null,null,null,null,null,null,null,{"$f":"IF($J753=\"\",\"\",IF($L753=\"Courant\",Donnees!$A$3,IF($L753=\"terminé\",Donnees!$A$4,IF($L754=\"Non débuté\",\"\"))))","v":""},{"$f":"IF($J753=\"\",\"\",IF($I753>Trimestre!$D$2,\"Non débuté\",IF(Trimestre!$D$2>$J753,\"Terminé\",\"Courant\")))","v":""}]
[null,null,null,null,null,null,null,null,null,null,{"$f":"IF($J754=\"\",\"\",IF($L754=\"Courant\",Donnees!$A$3,IF($L754=\"terminé\",Donnees!$A$4,IF($L755=\"Non débuté\",\"\"))))","v":""},{"$f":"IF($J754=\"\",\"\",IF($I754>Trimestre!$D$2,\"Non débuté\",IF(Trimestre!$D$2>$J754,\"Terminé\",\"Courant\")))","v":""}]
[null,null,null,null,null,null,null,null,null,null,{"$f":"IF($J755=\"\",\"\",IF($L755=\"Courant\",Donnees!$A$3,IF($L755=\"terminé\",Donnees!$A$4,IF($L756=\"Non débuté\",\"\"))))","v":""},{"$f":"IF($J755=\"\",\"\",IF($I755>Trimestre!$D$2,\"Non débuté\",IF(Trimestre!$D$2>$J755,\"Terminé\",\"Courant\")))","v":""}]
[null,null,null,null,null,null,null,null,null,null,{"$f":"IF($J756=\"\",\"\",IF($L756=\"Courant\",Donnees!$A$3,IF($L756=\"terminé\",Donnees!$A$4,IF($L757=\"Non débuté\",\"\"))))","v":""},{"$f":"IF($J756=\"\",\"\",IF($I756>Trimestre!$D$2,\"Non débuté\",IF(Trimestre!$D$2>$J756,\"Terminé\",\"Courant\")))","v":""}]
[null,null,null,null,null,null,null,null,null,null,{"$f":"IF($J757=\"\",\"\",IF($L757=\"Courant\",Donnees!$A$3,IF($L757=\"terminé\",Donnees!$A$4,IF($L758=\"Non débuté\",\"\"))))","v":""},{"$f":"IF($J757=\"\",\"\",IF($I757>Trimestre!$D$2,\"Non débuté\",IF(Trimestre!$D$2>$J757,\"Terminé\",\"Courant\")))","v":""}]
[null,null,null,null,null,null,null,null,null,null,{"$f":"IF($J758=\"\",\"\",IF($L758=\"Courant\",Donnees!$A$3,IF($L758=\"terminé\",Donnees!$A$4,IF($L759=\"Non débuté\",\"\"))))","v":""},{"$f":"IF($J758=\"\",\"\",IF($I758>Trimestre!$D$2,\"Non débuté\",IF(Trimestre!$D$2>$J758,\"Terminé\",\"Courant\")))","v":""}]
[null,null,null,null,null,null,null,null,null,null,{"$f":"IF($J759=\"\",\"\",IF($L759=\"Courant\",Donnees!$A$3,IF($L759=\"terminé\",Donnees!$A$4,IF($L760=\"Non débuté\",\"\"))))","v":""},{"$f":"IF($J759=\"\",\"\",IF($I759>Trimestre!$D$2,\"Non débuté\",IF(Trimestre!$D$2>$J759,\"Terminé\",\"Courant\")))","v":""}]
[null,null,null,null,null,null,null,null,null,null,{"$f":"IF($J760=\"\",\"\",IF($L760=\"Courant\",Donnees!$A$3,IF($L760=\"terminé\",Donnees!$A$4,IF($L761=\"Non débuté\",\"\"))))","v":""},{"$f":"IF($J760=\"\",\"\",IF($I760>Trimestre!$D$2,\"Non débuté\",IF(Trimestre!$D$2>$J760,\"Terminé\",\"Courant\")))","v":""}]
[null,null,null,null,null,null,null,null,null,null,{"$f":"IF($J761=\"\",\"\",IF($L761=\"Courant\",Donnees!$A$3,IF($L761=\"terminé\",Donnees!$A$4,IF($L762=\"Non débuté\",\"\"))))","v":""},{"$f":"IF($J761=\"\",\"\",IF($I761>Trimestre!$D$2,\"Non débuté\",IF(Trimestre!$D$2>$J761,\"Terminé\",\"Courant\")))","v":""}]
[null,null,null,null,null,null,null,null,null,null,{"$f":"IF($J762=\"\",\"\",IF($L762=\"Courant\",Donnees!$A$3,IF($L762=\"terminé\",Donnees!$A$4,IF($L763=\"Non débuté\",\"\"))))","v":""},{"$f":"IF($J762=\"\",\"\",IF($I762>Trimestre!$D$2,\"Non débuté\",IF(Trimestre!$D$2>$J762,\"Terminé\",\"Courant\")))","v":""}]
[null,null,null,null,null,null,null,null,null,null,{"$f":"IF($J763=\"\",\"\",IF($L763=\"Courant\",Donnees!$A$3,IF($L763=\"terminé\",Donnees!$A$4,IF($L764=\"Non débuté\",\"\"))))","v":""},{"$f":"IF($J763=\"\",\"\",IF($I763>Trimestre!$D$2,\"Non débuté\",IF(Trimestre!$D$2>$J763,\"Terminé\",\"Courant\")))","v":""}]
[null,null,null,null,null,null,null,null,null,null,{"$f":"IF($J764=\"\",\"\",IF($L764=\"Courant\",Donnees!$A$3,IF($L764=\"terminé\",Donnees!$A$4,IF($L765=\"Non débuté\",\"\"))))","v":""},{"$f":"IF($J764=\"\",\"\",IF($I764>Trimestre!$D$2,\"Non débuté\",IF(Trimestre!$D$2>$J764,\"Terminé\",\"Courant\")))","v":""}]
[null,null,null,null,null,null,null,null,null,null,{"$f":"IF($J765=\"\",\"\",IF($L765=\"Courant\",Donnees!$A$3,IF($L765=\"terminé\",Donnees!$A$4,IF($L766=\"Non débuté\",\"\"))))","v":""},{"$f":"IF($J765=\"\",\"\",IF($I765>Trimestre!$D$2,\"Non débuté\",IF(Trimestre!$D$2>$J765,\"Terminé\",\"Courant\")))","v":""}]
[null,null,null,null,null,null,null,null,null,null,{"$f":"IF($J766=\"\",\"\",IF($L766=\"Courant\",Donnees!$A$3,IF($L766=\"terminé\",Donnees!$A$4,IF($L767=\"Non débuté\",\"\"))))","v":""},{"$f":"IF($J766=\"\",\"\",IF($I766>Trimestre!$D$2,\"Non débuté\",IF(Trimestre!$D$2>$J766,\"Terminé\",\"Courant\")))","v":""}]
[null,null,null,null,null,null,null,null,null,null,{"$f":"IF($J767=\"\",\"\",IF($L767=\"Courant\",Donnees!$A$3,IF($L767=\"terminé\",Donnees!$A$4,IF($L768=\"Non débuté\",\"\"))))","v":""},{"$f":"IF($J767=\"\",\"\",IF($I767>Trimestre!$D$2,\"Non débuté\",IF(Trimestre!$D$2>$J767,\"Terminé\",\"Courant\")))","v":""}]
[null,null,null,null,null,null,null,null,null,null,{"$f":"IF($J768=\"\",\"\",IF($L768=\"Courant\",Donnees!$A$3,IF($L768=\"terminé\",Donnees!$A$4,IF($L769=\"Non débuté\",\"\"))))","v":""},{"$f":"IF($J768=\"\",\"\",IF($I768>Trimestre!$D$2,\"Non débuté\",IF(Trimestre!$D$2>$J768,\"Terminé\",\"Courant\")))","v":""}]
[null,null,null,null,null,null,null,null,null,null,{"$f":"IF($J769=\"\",\"\",IF($L769=\"Courant\",Donnees!$A$3,IF($L769=\"terminé\",Donnees!$A$4,IF($L770=\"Non débuté\",\"\"))))","v":""},{"$f":"IF($J769=\"\",\"\",IF($I769>Trimestre!$D$2,\"Non débuté\",IF(Trimestre!$D$2>$J769,\"Terminé\",\"Courant\")))","v":""}]
[null,null,null,null,null,null,null,null,null,null,{"$f":"IF($J770=\"\",\"\",IF($L770=\"Courant\",Donnees!$A$3,IF($L770=\"terminé\",Donnees!$A$4,IF($L771=\"Non débuté\",\"\"))))","v":""},{"$f":"IF($J770=\"\",\"\",IF($I770>Trimestre!$D$2,\"Non débuté\",IF(Trimestre!$D$2>$J770,\"Terminé\",\"Courant\")))","v":""}]
[null,null,null,null,null,null,null,null,null,null,{"$f":"IF($J771=\"\",\"\",IF($L771=\"Courant\",Donnees!$A$3,IF($L771=\"terminé\",Donnees!$A$4,IF($L772=\"Non débuté\",\"\"))))","v":""},{"$f":"IF($J771=\"\",\"\",IF($I771>Trimestre!$D$2,\"Non débuté\",IF(Trimestre!$D$2>$J771,\"Terminé\",\"Courant\")))","v":""}]
[null,null,null,null,null,null,null,null,null,null,{"$f":"IF($J772=\"\",\"\",IF($L772=\"Courant\",Donnees!$A$3,IF($L772=\"terminé\",Donnees!$A$4,IF($L773=\"Non débuté\",\"\"))))","v":""},{"$f":"IF($J772=\"\",\"\",IF($I772>Trimestre!$D$2,\"Non débuté\",IF(Trimestre!$D$2>$J772,\"Terminé\",\"Courant\")))","v":""}]
[null,null,null,null,null,null,null,null,null,null,{"$f":"IF($J773=\"\",\"\",IF($L773=\"Courant\",Donnees!$A$3,IF($L773=\"terminé\",Donnees!$A$4,IF($L774=\"Non débuté\",\"\"))))","v":""},{"$f":"IF($J773=\"\",\"\",IF($I773>Trimestre!$D$2,\"Non débuté\",IF(Trimestre!$D$2>$J773,\"Terminé\",\"Courant\")))","v":""}]
[null,null,null,null,null,null,null,null,null,null,{"$f":"IF($J774=\"\",\"\",IF($L774=\"Courant\",Donnees!$A$3,IF($L774=\"terminé\",Donnees!$A$4,IF($L775=\"Non débuté\",\"\"))))","v":""},{"$f":"IF($J774=\"\",\"\",IF($I774>Trimestre!$D$2,\"Non débuté\",IF(Trimestre!$D$2>$J774,\"Terminé\",\"Courant\")))","v":""}]
[null,null,null,null,null,null,null,null,null,null,{"$f":"IF($J775=\"\",\"\",IF($L775=\"Courant\",Donnees!$A$3,IF($L775=\"terminé\",Donnees!$A$4,IF($L776=\"Non débuté\",\"\"))))","v":""},{"$f":"IF($J775=\"\",\"\",IF($I775>Trimestre!$D$2,\"Non débuté\",IF(Trimestre!$D$2>$J775,\"Terminé\",\"Courant\")))","v":""}]
[null,null,null,null,null,null,null,null,null,null,{"$f":"IF($J776=\"\",\"\",IF($L776=\"Courant\",Donnees!$A$3,IF($L776=\"terminé\",Donnees!$A$4,IF($L777=\"Non débuté\",\"\"))))","v":""},{"$f":"IF($J776=\"\",\"\",IF($I776>Trimestre!$D$2,\"Non débuté\",IF(Trimestre!$D$2>$J776,\"Terminé\",\"Courant\")))","v":""}]
[null,null,null,null,null,null,null,null,null,null,{"$f":"IF($J777=\"\",\"\",IF($L777=\"Courant\",Donnees!$A$3,IF($L777=\"terminé\",Donnees!$A$4,IF($L778=\"Non débuté\",\"\"))))","v":""},{"$f":"IF($J777=\"\",\"\",IF($I777>Trimestre!$D$2,\"Non débuté\",IF(Trimestre!$D$2>$J777,\"Terminé\",\"Courant\")))","v":""}]
[null,null,null,null,null,null,null,null,null,null,{"$f":"IF($J778=\"\",\"\",IF($L778=\"Courant\",Donnees!$A$3,IF($L778=\"terminé\",Donnees!$A$4,IF($L779=\"Non débuté\",\"\"))))","v":""},{"$f":"IF($J778=\"\",\"\",IF($I778>Trimestre!$D$2,\"Non débuté\",IF(Trimestre!$D$2>$J778,\"Terminé\",\"Courant\")))","v":""}]
[null,null,null,null,null,null,null,null,null,null,{"$f":"IF($J779=\"\",\"\",IF($L779=\"Courant\",Donnees!$A$3,IF($L779=\"terminé\",Donnees!$A$4,IF($L780=\"Non débuté\",\"\"))))","v":""},{"$f":"IF($J779=\"\",\"\",IF($I779>Trimestre!$D$2,\"Non débuté\",IF(Trimestre!$D$2>$J779,\"Terminé\",\"Courant\")))","v":""}]
[null,null,null,null,null,null,null,null,null,null,{"$f":"IF($J780=\"\",\"\",IF($L780=\"Courant\",Donnees!$A$3,IF($L780=\"terminé\",Donnees!$A$4,IF($L781=\"Non débuté\",\"\"))))","v":""},{"$f":"IF($J780=\"\",\"\",IF($I780>Trimestre!$D$2,\"Non débuté\",IF(Trimestre!$D$2>$J780,\"Terminé\",\"Courant\")))","v":""}]
[null,null,null,null,null,null,null,null,null,null,{"$f":"IF($J781=\"\",\"\",IF($L781=\"Courant\",Donnees!$A$3,IF($L781=\"terminé\",Donnees!$A$4,IF($L782=\"Non débuté\",\"\"))))","v":""},{"$f":"IF($J781=\"\",\"\",IF($I781>Trimestre!$D$2,\"Non débuté\",IF(Trimestre!$D$2>$J781,\"Terminé\",\"Courant\")))","v":""}]
[null,null,null,null,null,null,null,null,null,null,{"$f":"IF($J782=\"\",\"\",IF($L782=\"Courant\",Donnees!$A$3,IF($L782=\"terminé\",Donnees!$A$4,IF($L783=\"Non débuté\",\"\"))))","v":""},{"$f":"IF($J782=\"\",\"\",IF($I782>Trimestre!$D$2,\"Non débuté\",IF(Trimestre!$D$2>$J782,\"Terminé\",\"Courant\")))","v":""}]
[null,null,null,null,null,null,null,null,null,null,{"$f":"IF($J783=\"\",\"\",IF($L783=\"Courant\",Donnees!$A$3,IF($L783=\"terminé\",Donnees!$A$4,IF($L784=\"Non débuté\",\"\"))))","v":""},{"$f":"IF($J783=\"\",\"\",IF($I783>Trimestre!$D$2,\"Non débuté\",IF(Trimestre!$D$2>$J783,\"Terminé\",\"Courant\")))","v":""}]
[null,null,null,null,null,null,null,null,null,null,{"$f":"IF($J784=\"\",\"\",IF($L784=\"Courant\",Donnees!$A$3,IF($L784=\"terminé\",Donnees!$A$4,IF($L785=\"Non débuté\",\"\"))))","v":""},{"$f":"IF($J784=\"\",\"\",IF($I784>Trimestre!$D$2,\"Non débuté\",IF(Trimestre!$D$2>$J784,\"Terminé\",\"Courant\")))","v":""}]
[null,null,null,null,null,null,null,null,null,null,{"$f":"IF($J785=\"\",\"\",IF($L785=\"Courant\",Donnees!$A$3,IF($L785=\"terminé\",Donnees!$A$4,IF($L786=\"Non débuté\",\"\"))))","v":""},{"$f":"IF($J785=\"\",\"\",IF($I785>Trimestre!$D$2,\"Non débuté\",IF(Trimestre!$D$2>$J785,\"Terminé\",\"Courant\")))","v":""}]
[null,null,null,null,null,null,null,null,null,null,{"$f":"IF($J786=\"\",\"\",IF($L786=\"Courant\",Donnees!$A$3,IF($L786=\"terminé\",Donnees!$A$4,IF($L787=\"Non débuté\",\"\"))))","v":""},{"$f":"IF($J786=\"\",\"\",IF($I786>Trimestre!$D$2,\"Non débuté\",IF(Trimestre!$D$2>$J786,\"Terminé\",\"Courant\")))","v":""}]
[null,null,null,null,null,null,null,null,null,null,{"$f":"IF($J787=\"\",\"\",IF($L787=\"Courant\",Donnees!$A$3,IF($L787=\"terminé\",Donnees!$A$4,IF($L788=\"Non débuté\",\"\"))))","v":""},{"$f":"IF($J787=\"\",\"\",IF($I787>Trimestre!$D$2,\"Non débuté\",IF(Trimestre!$D$2>$J787,\"Terminé\",\"Courant\")))","v":""}]
[null,null,null,null,null,null,null,null,null,null,{"$f":"IF($J788=\"\",\"\",IF($L788=\"Courant\",Donnees!$A$3,IF($L788=\"terminé\",Donnees!$A$4,IF($L789=\"Non débuté\",\"\"))))","v":""},{"$f":"IF($J788=\"\",\"\",IF($I788>Trimestre!$D$2,\"Non débuté\",IF(Trimestre!$D$2>$J788,\"Terminé\",\"Courant\")))","v":""}]
[null,null,null,null,null,null,null,null,null,null,{"$f":"IF($J789=\"\",\"\",IF($L789=\"Courant\",Donnees!$A$3,IF($L789=\"terminé\",Donnees!$A$4,IF($L790=\"Non débuté\",\"\"))))","v":""},{"$f":"IF($J789=\"\",\"\",IF($I789>Trimestre!$D$2,\"Non débuté\",IF(Trimestre!$D$2>$J789,\"Terminé\",\"Courant\")))","v":""}]
[null,null,null,null,null,null,null,null,null,null,{"$f":"IF($J790=\"\",\"\",IF($L790=\"Courant\",Donnees!$A$3,IF($L790=\"terminé\",Donnees!$A$4,IF($L791=\"Non débuté\",\"\"))))","v":""},{"$f":"IF($J790=\"\",\"\",IF($I790>Trimestre!$D$2,\"Non débuté\",IF(Trimestre!$D$2>$J790,\"Terminé\",\"Courant\")))","v":""}]
[null,null,null,null,null,null,null,null,null,null,{"$f":"IF($J791=\"\",\"\",IF($L791=\"Courant\",Donnees!$A$3,IF($L791=\"terminé\",Donnees!$A$4,IF($L792=\"Non débuté\",\"\"))))","v":""},{"$f":"IF($J791=\"\",\"\",IF($I791>Trimestre!$D$2,\"Non débuté\",IF(Trimestre!$D$2>$J791,\"Terminé\",\"Courant\")))","v":""}]
[null,null,null,null,null,null,null,null,null,null,{"$f":"IF($J792=\"\",\"\",IF($L792=\"Courant\",Donnees!$A$3,IF($L792=\"terminé\",Donnees!$A$4,IF($L793=\"Non débuté\",\"\"))))","v":""},{"$f":"IF($J792=\"\",\"\",IF($I792>Trimestre!$D$2,\"Non débuté\",IF(Trimestre!$D$2>$J792,\"Terminé\",\"Courant\")))","v":""}]
[null,null,null,null,null,null,null,null,null,null,{"$f":"IF($J793=\"\",\"\",IF($L793=\"Courant\",Donnees!$A$3,IF($L793=\"terminé\",Donnees!$A$4,IF($L794=\"Non débuté\",\"\"))))","v":""},{"$f":"IF($J793=\"\",\"\",IF($I793>Trimestre!$D$2,\"Non débuté\",IF(Trimestre!$D$2>$J793,\"Terminé\",\"Courant\")))","v":""}]
[null,null,null,null,null,null,null,null,null,null,{"$f":"IF($J794=\"\",\"\",IF($L794=\"Courant\",Donnees!$A$3,IF($L794=\"terminé\",Donnees!$A$4,IF($L795=\"Non débuté\",\"\"))))","v":""},{"$f":"IF($J794=\"\",\"\",IF($I794>Trimestre!$D$2,\"Non débuté\",IF(Trimestre!$D$2>$J794,\"Terminé\",\"Courant\")))","v":""}]
[null,null,null,null,null,null,null,null,null,null,{"$f":"IF($J795=\"\",\"\",IF($L795=\"Courant\",Donnees!$A$3,IF($L795=\"terminé\",Donnees!$A$4,IF($L796=\"Non débuté\",\"\"))))","v":""},{"$f":"IF($J795=\"\",\"\",IF($I795>Trimestre!$D$2,\"Non débuté\",IF(Trimestre!$D$2>$J795,\"Terminé\",\"Courant\")))","v":""}]
[null,null,null,null,null,null,null,null,null,null,{"$f":"IF($J796=\"\",\"\",IF($L796=\"Courant\",Donnees!$A$3,IF($L796=\"terminé\",Donnees!$A$4,IF($L797=\"Non débuté\",\"\"))))","v":""},{"$f":"IF($J796=\"\",\"\",IF($I796>Trimestre!$D$2,\"Non débuté\",IF(Trimestre!$D$2>$J796,\"Terminé\",\"Courant\")))","v":""}]
[null,null,null,null,null,null,null,null,null,null,{"$f":"IF($J797=\"\",\"\",IF($L797=\"Courant\",Donnees!$A$3,IF($L797=\"terminé\",Donnees!$A$4,IF($L798=\"Non débuté\",\"\"))))","v":""},{"$f":"IF($J797=\"\",\"\",IF($I797>Trimestre!$D$2,\"Non débuté\",IF(Trimestre!$D$2>$J797,\"Terminé\",\"Courant\")))","v":""}]
[null,null,null,null,null,null,null,null,null,null,{"$f":"IF($J798=\"\",\"\",IF($L798=\"Courant\",Donnees!$A$3,IF($L798=\"terminé\",Donnees!$A$4,IF($L799=\"Non débuté\",\"\"))))","v":""},{"$f":"IF($J798=\"\",\"\",IF($I798>Trimestre!$D$2,\"Non débuté\",IF(Trimestre!$D$2>$J798,\"Terminé\",\"Courant\")))","v":""}]
[null,null,null,null,null,null,null,null,null,null,{"$f":"IF($J799=\"\",\"\",IF($L799=\"Courant\",Donnees!$A$3,IF($L799=\"terminé\",Donnees!$A$4,IF($L800=\"Non débuté\",\"\"))))","v":""},{"$f":"IF($J799=\"\",\"\",IF($I799>Trimestre!$D$2,\"Non débuté\",IF(Trimestre!$D$2>$J799,\"Terminé\",\"Courant\")))","v":""}]
[null,null,null,null,null,null,null,null,null,null,{"$f":"IF($J800=\"\",\"\",IF($L800=\"Courant\",Donnees!$A$3,IF($L800=\"terminé\",Donnees!$A$4,IF($L801=\"Non débuté\",\"\"))))","v":""},{"$f":"IF($J800=\"\",\"\",IF($I800>Trimestre!$D$2,\"Non débuté\",IF(Trimestre!$D$2>$J800,\"Terminé\",\"Courant\")))","v":""}]
[null,null,null,null,null,null,null,null,null,null,{"$f":"IF($J801=\"\",\"\",IF($L801=\"Courant\",Donnees!$A$3,IF($L801=\"terminé\",Donnees!$A$4,IF($L802=\"Non débuté\",\"\"))))","v":""},{"$f":"IF($J801=\"\",\"\",IF($I801>Trimestre!$D$2,\"Non débuté\",IF(Trimestre!$D$2>$J801,\"Terminé\",\"Courant\")))","v":""}]
[null,null,null,null,null,null,null,null,null,null,{"$f":"IF($J802=\"\",\"\",IF($L802=\"Courant\",Donnees!$A$3,IF($L802=\"terminé\",Donnees!$A$4,IF($L803=\"Non débuté\",\"\"))))","v":""},{"$f":"IF($J802=\"\",\"\",IF($I802>Trimestre!$D$2,\"Non débuté\",IF(Trimestre!$D$2>$J802,\"Terminé\",\"Courant\")))","v":""}]
[null,null,null,null,null,null,null,null,null,null,{"$f":"IF($J803=\"\",\"\",IF($L803=\"Courant\",Donnees!$A$3,IF($L803=\"terminé\",Donnees!$A$4,IF($L804=\"Non débuté\",\"\"))))","v":""},{"$f":"IF($J803=\"\",\"\",IF($I803>Trimestre!$D$2,\"Non débuté\",IF(Trimestre!$D$2>$J803,\"Terminé\",\"Courant\")))","v":""}]
[null,null,null,null,null,null,null,null,null,null,{"$f":"IF($J804=\"\",\"\",IF($L804=\"Courant\",Donnees!$A$3,IF($L804=\"terminé\",Donnees!$A$4,IF($L805=\"Non débuté\",\"\"))))","v":""},{"$f":"IF($J804=\"\",\"\",IF($I804>Trimestre!$D$2,\"Non débuté\",IF(Trimestre!$D$2>$J804,\"Terminé\",\"Courant\")))","v":""}]
[null,null,null,null,null,null,null,null,null,null,{"$f":"IF($J805=\"\",\"\",IF($L805=\"Courant\",Donnees!$A$3,IF($L805=\"terminé\",Donnees!$A$4,IF($L806=\"Non débuté\",\"\"))))","v":""},{"$f":"IF($J805=\"\",\"\",IF($I805>Trimestre!$D$2,\"Non débuté\",IF(Trimestre!$D$2>$J805,\"Terminé\",\"Courant\")))","v":""}]
[null,null,null,null,null,null,null,null,null,null,{"$f":"IF($J806=\"\",\"\",IF($L806=\"Courant\",Donnees!$A$3,IF($L806=\"terminé\",Donnees!$A$4,IF($L807=\"Non débuté\",\"\"))))","v":""},{"$f":"IF($J806=\"\",\"\",IF($I806>Trimestre!$D$2,\"Non débuté\",IF(Trimestre!$D$2>$J806,\"Terminé\",\"Courant\")))","v":""}]
[null,null,null,null,null,null,null,null,null,null,{"$f":"IF($J807=\"\",\"\",IF($L807=\"Courant\",Donnees!$A$3,IF($L807=\"terminé\",Donnees!$A$4,IF($L808=\"Non débuté\",\"\"))))","v":""},{"$f":"IF($J807=\"\",\"\",IF($I807>Trimestre!$D$2,\"Non débuté\",IF(Trimestre!$D$2>$J807,\"Terminé\",\"Courant\")))","v":""}]
[null,null,null,null,null,null,null,null,null,null,{"$f":"IF($J808=\"\",\"\",IF($L808=\"Courant\",Donnees!$A$3,IF($L808=\"terminé\",Donnees!$A$4,IF($L809=\"Non débuté\",\"\"))))","v":""},{"$f":"IF($J808=\"\",\"\",IF($I808>Trimestre!$D$2,\"Non débuté\",IF(Trimestre!$D$2>$J808,\"Terminé\",\"Courant\")))","v":""}]
[null,null,null,null,null,null,null,null,null,null,{"$f":"IF($J809=\"\",\"\",IF($L809=\"Courant\",Donnees!$A$3,IF($L809=\"terminé\",Donnees!$A$4,IF($L810=\"Non débuté\",\"\"))))","v":""},{"$f":"IF($J809=\"\",\"\",IF($I809>Trimestre!$D$2,\"Non débuté\",IF(Trimestre!$D$2>$J809,\"Terminé\",\"Courant\")))","v":""}]
[null,null,null,null,null,null,null,null,null,null,{"$f":"IF($J810=\"\",\"\",IF($L810=\"Courant\",Donnees!$A$3,IF($L810=\"terminé\",Donnees!$A$4,IF($L811=\"Non débuté\",\"\"))))","v":""},{"$f":"IF($J810=\"\",\"\",IF($I810>Trimestre!$D$2,\"Non débuté\",IF(Trimestre!$D$2>$J810,\"Terminé\",\"Courant\")))","v":""}]
[null,null,null,null,null,null,null,null,null,null,{"$f":"IF($J811=\"\",\"\",IF($L811=\"Courant\",Donnees!$A$3,IF($L811=\"terminé\",Donnees!$A$4,IF($L812=\"Non débuté\",\"\"))))","v":""},{"$f":"IF($J811=\"\",\"\",IF($I811>Trimestre!$D$2,\"Non débuté\",IF(Trimestre!$D$2>$J811,\"Terminé\",\"Courant\")))","v":""}]
[null,null,null,null,null,null,null,null,null,null,{"$f":"IF($J812=\"\",\"\",IF($L812=\"Courant\",Donnees!$A$3,IF($L812=\"terminé\",Donnees!$A$4,IF($L813=\"Non débuté\",\"\"))))","v":""},{"$f":"IF($J812=\"\",\"\",IF($I812>Trimestre!$D$2,\"Non débuté\",IF(Trimestre!$D$2>$J812,\"Terminé\",\"Courant\")))","v":""}]
[null,null,null,null,null,null,null,null,null,null,{"$f":"IF($J813=\"\",\"\",IF($L813=\"Courant\",Donnees!$A$3,IF($L813=\"terminé\",Donnees!$A$4,IF($L814=\"Non débuté\",\"\"))))","v":""},{"$f":"IF($J813=\"\",\"\",IF($I813>Trimestre!$D$2,\"Non débuté\",IF(Trimestre!$D$2>$J813,\"Terminé\",\"Courant\")))","v":""}]
[null,null,null,null,null,null,null,null,null,null,{"$f":"IF($J814=\"\",\"\",IF($L814=\"Courant\",Donnees!$A$3,IF($L814=\"terminé\",Donnees!$A$4,IF($L815=\"Non débuté\",\"\"))))","v":""},{"$f":"IF($J814=\"\",\"\",IF($I814>Trimestre!$D$2,\"Non débuté\",IF(Trimestre!$D$2>$J814,\"Terminé\",\"Courant\")))","v":""}]
[null,null,null,null,null,null,null,null,null,null,{"$f":"IF($J815=\"\",\"\",IF($L815=\"Courant\",Donnees!$A$3,IF($L815=\"terminé\",Donnees!$A$4,IF($L816=\"Non débuté\",\"\"))))","v":""},{"$f":"IF($J815=\"\",\"\",IF($I815>Trimestre!$D$2,\"Non débuté\",IF(Trimestre!$D$2>$J815,\"Terminé\",\"Courant\")))","v":""}]
[null,null,null,null,null,null,null,null,null,null,{"$f":"IF($J816=\"\",\"\",IF($L816=\"Courant\",Donnees!$A$3,IF($L816=\"terminé\",Donnees!$A$4,IF($L817=\"Non débuté\",\"\"))))","v":""},{"$f":"IF($J816=\"\",\"\",IF($I816>Trimestre!$D$2,\"Non débuté\",IF(Trimestre!$D$2>$J816,\"Terminé\",\"Courant\")))","v":""}]
[null,null,null,null,null,null,null,null,null,null,{"$f":"IF($J817=\"\",\"\",IF($L817=\"Courant\",Donnees!$A$3,IF($L817=\"terminé\",Donnees!$A$4,IF($L818=\"Non débuté\",\"\"))))","v":""},{"$f":"IF($J817=\"\",\"\",IF($I817>Trimestre!$D$2,\"Non débuté\",IF(Trimestre!$D$2>$J817,\"Terminé\",\"Courant\")))","v":""}]
[null,null,null,null,null,null,null,null,null,null,{"$f":"IF($J818=\"\",\"\",IF($L818=\"Courant\",Donnees!$A$3,IF($L818=\"terminé\",Donnees!$A$4,IF($L819=\"Non débuté\",\"\"))))","v":""},{"$f":"IF($J818=\"\",\"\",IF($I818>Trimestre!$D$2,\"Non débuté\",IF(Trimestre!$D$2>$J818,\"Terminé\",\"Courant\")))","v":""}]
[null,null,null,null,null,null,null,null,null,null,{"$f":"IF($J819=\"\",\"\",IF($L819=\"Courant\",Donnees!$A$3,IF($L819=\"terminé\",Donnees!$A$4,IF($L820=\"Non débuté\",\"\"))))","v":""},{"$f":"IF($J819=\"\",\"\",IF($I819>Trimestre!$D$2,\"Non débuté\",IF(Trimestre!$D$2>$J819,\"Terminé\",\"Courant\")))","v":""}]
[null,null,null,null,null,null,null,null,null,null,{"$f":"IF($J820=\"\",\"\",IF($L820=\"Courant\",Donnees!$A$3,IF($L820=\"terminé\",Donnees!$A$4,IF($L821=\"Non débuté\",\"\"))))","v":""},{"$f":"IF($J820=\"\",\"\",IF($I820>Trimestre!$D$2,\"Non débuté\",IF(Trimestre!$D$2>$J820,\"Terminé\",\"Courant\")))","v":""}]
[null,null,null,null,null,null,null,null,null,null,{"$f":"IF($J821=\"\",\"\",IF($L821=\"Courant\",Donnees!$A$3,IF($L821=\"terminé\",Donnees!$A$4,IF($L822=\"Non débuté\",\"\"))))","v":""},{"$f":"IF($J821=\"\",\"\",IF($I821>Trimestre!$D$2,\"Non débuté\",IF(Trimestre!$D$2>$J821,\"Terminé\",\"Courant\")))","v":""}]
[null,null,null,null,null,null,null,null,null,null,{"$f":"IF($J822=\"\",\"\",IF($L822=\"Courant\",Donnees!$A$3,IF($L822=\"terminé\",Donnees!$A$4,IF($L823=\"Non débuté\",\"\"))))","v":""},{"$f":"IF($J822=\"\",\"\",IF($I822>Trimestre!$D$2,\"Non débuté\",IF(Trimestre!$D$2>$J822,\"Terminé\",\"Courant\")))","v":""}]
[null,null,null,null,null,null,null,null,null,null,{"$f":"IF($J823=\"\",\"\",IF($L823=\"Courant\",Donnees!$A$3,IF($L823=\"terminé\",Donnees!$A$4,IF($L824=\"Non débuté\",\"\"))))","v":""},{"$f":"IF($J823=\"\",\"\",IF($I823>Trimestre!$D$2,\"Non débuté\",IF(Trimestre!$D$2>$J823,\"Terminé\",\"Courant\")))","v":""}]
[null,null,null,null,null,null,null,null,null,null,{"$f":"IF($J824=\"\",\"\",IF($L824=\"Courant\",Donnees!$A$3,IF($L824=\"terminé\",Donnees!$A$4,IF($L825=\"Non débuté\",\"\"))))","v":""},{"$f":"IF($J824=\"\",\"\",IF($I824>Trimestre!$D$2,\"Non débuté\",IF(Trimestre!$D$2>$J824,\"Terminé\",\"Courant\")))","v":""}]
[null,null,null,null,null,null,null,null,null,null,{"$f":"IF($J825=\"\",\"\",IF($L825=\"Courant\",Donnees!$A$3,IF($L825=\"terminé\",Donnees!$A$4,IF($L826=\"Non débuté\",\"\"))))","v":""},{"$f":"IF($J825=\"\",\"\",IF($I825>Trimestre!$D$2,\"Non débuté\",IF(Trimestre!$D$2>$J825,\"Terminé\",\"Courant\")))","v":""}]
[null,null,null,null,null,null,null,null,null,null,{"$f":"IF($J826=\"\",\"\",IF($L826=\"Courant\",Donnees!$A$3,IF($L826=\"terminé\",Donnees!$A$4,IF($L827=\"Non débuté\",\"\"))))","v":""},{"$f":"IF($J826=\"\",\"\",IF($I826>Trimestre!$D$2,\"Non débuté\",IF(Trimestre!$D$2>$J826,\"Terminé\",\"Courant\")))","v":""}]
[null,null,null,null,null,null,null,null,null,null,{"$f":"IF($J827=\"\",\"\",IF($L827=\"Courant\",Donnees!$A$3,IF($L827=\"terminé\",Donnees!$A$4,IF($L828=\"Non débuté\",\"\"))))","v":""},{"$f":"IF($J827=\"\",\"\",IF($I827>Trimestre!$D$2,\"Non débuté\",IF(Trimestre!$D$2>$J827,\"Terminé\",\"Courant\")))","v":""}]
[null,null,null,null,null,null,null,null,null,null,{"$f":"IF($J828=\"\",\"\",IF($L828=\"Courant\",Donnees!$A$3,IF($L828=\"terminé\",Donnees!$A$4,IF($L829=\"Non débuté\",\"\"))))","v":""},{"$f":"IF($J828=\"\",\"\",IF($I828>Trimestre!$D$2,\"Non débuté\",IF(Trimestre!$D$2>$J828,\"Terminé\",\"Courant\")))","v":""}]
[null,null,null,null,null,null,null,null,null,null,{"$f":"IF($J829=\"\",\"\",IF($L829=\"Courant\",Donnees!$A$3,IF($L829=\"terminé\",Donnees!$A$4,IF($L830=\"Non débuté\",\"\"))))","v":""},{"$f":"IF($J829=\"\",\"\",IF($I829>Trimestre!$D$2,\"Non débuté\",IF(Trimestre!$D$2>$J829,\"Terminé\",\"Courant\")))","v":""}]
[null,null,null,null,null,null,null,null,null,null,{"$f":"IF($J830=\"\",\"\",IF($L830=\"Courant\",Donnees!$A$3,IF($L830=\"terminé\",Donnees!$A$4,IF($L831=\"Non débuté\",\"\"))))","v":""},{"$f":"IF($J830=\"\",\"\",IF($I830>Trimestre!$D$2,\"Non débuté\",IF(Trimestre!$D$2>$J830,\"Terminé\",\"Courant\")))","v":""}]
[null,null,null,null,null,null,null,null,null,null,{"$f":"IF($J831=\"\",\"\",IF($L831=\"Courant\",Donnees!$A$3,IF($L831=\"terminé\",Donnees!$A$4,IF($L832=\"Non débuté\",\"\"))))","v":""},{"$f":"IF($J831=\"\",\"\",IF($I831>Trimestre!$D$2,\"Non débuté\",IF(Trimestre!$D$2>$J831,\"Terminé\",\"Courant\")))","v":""}]
[null,null,null,null,null,null,null,null,null,null,{"$f":"IF($J832=\"\",\"\",IF($L832=\"Courant\",Donnees!$A$3,IF($L832=\"terminé\",Donnees!$A$4,IF($L833=\"Non débuté\",\"\"))))","v":""},{"$f":"IF($J832=\"\",\"\",IF($I832>Trimestre!$D$2,\"Non débuté\",IF(Trimestre!$D$2>$J832,\"Terminé\",\"Courant\")))","v":""}]
[null,null,null,null,null,null,null,null,null,null,{"$f":"IF($J833=\"\",\"\",IF($L833=\"Courant\",Donnees!$A$3,IF($L833=\"terminé\",Donnees!$A$4,IF($L834=\"Non débuté\",\"\"))))","v":""},{"$f":"IF($J833=\"\",\"\",IF($I833>Trimestre!$D$2,\"Non débuté\",IF(Trimestre!$D$2>$J833,\"Terminé\",\"Courant\")))","v":""}]
[null,null,null,null,null,null,null,null,null,null,{"$f":"IF($J834=\"\",\"\",IF($L834=\"Courant\",Donnees!$A$3,IF($L834=\"terminé\",Donnees!$A$4,IF($L835=\"Non débuté\",\"\"))))","v":""},{"$f":"IF($J834=\"\",\"\",IF($I834>Trimestre!$D$2,\"Non débuté\",IF(Trimestre!$D$2>$J834,\"Terminé\",\"Courant\")))","v":""}]
[null,null,null,null,null,null,null,null,null,null,{"$f":"IF($J835=\"\",\"\",IF($L835=\"Courant\",Donnees!$A$3,IF($L835=\"terminé\",Donnees!$A$4,IF($L836=\"Non débuté\",\"\"))))","v":""},{"$f":"IF($J835=\"\",\"\",IF($I835>Trimestre!$D$2,\"Non débuté\",IF(Trimestre!$D$2>$J835,\"Terminé\",\"Courant\")))","v":""}]
[null,null,null,null,null,null,null,null,null,null,{"$f":"IF($J836=\"\",\"\",IF($L836=\"Courant\",Donnees!$A$3,IF($L836=\"terminé\",Donnees!$A$4,IF($L837=\"Non débuté\",\"\"))))","v":""},{"$f":"IF($J836=\"\",\"\",IF($I836>Trimestre!$D$2,\"Non débuté\",IF(Trimestre!$D$2>$J836,\"Terminé\",\"Courant\")))","v":""}]
[null,null,null,null,null,null,null,null,null,null,{"$f":"IF($J837=\"\",\"\",IF($L837=\"Courant\",Donnees!$A$3,IF($L837=\"terminé\",Donnees!$A$4,IF($L838=\"Non débuté\",\"\"))))","v":""},{"$f":"IF($J837=\"\",\"\",IF($I837>Trimestre!$D$2,\"Non débuté\",IF(Trimestre!$D$2>$J837,\"Terminé\",\"Courant\")))","v":""}]
[null,null,null,null,null,null,null,null,null,null,{"$f":"IF($J838=\"\",\"\",IF($L838=\"Courant\",Donnees!$A$3,IF($L838=\"terminé\",Donnees!$A$4,IF($L839=\"Non débuté\",\"\"))))","v":""},{"$f":"IF($J838=\"\",\"\",IF($I838>Trimestre!$D$2,\"Non débuté\",IF(Trimestre!$D$2>$J838,\"Terminé\",\"Courant\")))","v":""}]
[null,null,null,null,null,null,null,null,null,null,{"$f":"IF($J839=\"\",\"\",IF($L839=\"Courant\",Donnees!$A$3,IF($L839=\"terminé\",Donnees!$A$4,IF($L840=\"Non débuté\",\"\"))))","v":""},{"$f":"IF($J839=\"\",\"\",IF($I839>Trimestre!$D$2,\"Non débuté\",IF(Trimestre!$D$2>$J839,\"Terminé\",\"Courant\")))","v":""}]
[null,null,null,null,null,null,null,null,null,null,{"$f":"IF($J840=\"\",\"\",IF($L840=\"Courant\",Donnees!$A$3,IF($L840=\"terminé\",Donnees!$A$4,IF($L841=\"Non débuté\",\"\"))))","v":""},{"$f":"IF($J840=\"\",\"\",IF($I840>Trimestre!$D$2,\"Non débuté\",IF(Trimestre!$D$2>$J840,\"Terminé\",\"Courant\")))","v":""}]
[null,null,null,null,null,null,null,null,null,null,{"$f":"IF($J841=\"\",\"\",IF($L841=\"Courant\",Donnees!$A$3,IF($L841=\"terminé\",Donnees!$A$4,IF($L842=\"Non débuté\",\"\"))))","v":""},{"$f":"IF($J841=\"\",\"\",IF($I841>Trimestre!$D$2,\"Non débuté\",IF(Trimestre!$D$2>$J841,\"Terminé\",\"Courant\")))","v":""}]
[null,null,null,null,null,null,null,null,null,null,{"$f":"IF($J842=\"\",\"\",IF($L842=\"Courant\",Donnees!$A$3,IF($L842=\"terminé\",Donnees!$A$4,IF($L843=\"Non débuté\",\"\"))))","v":""},{"$f":"IF($J842=\"\",\"\",IF($I842>Trimestre!$D$2,\"Non débuté\",IF(Trimestre!$D$2>$J842,\"Terminé\",\"Courant\")))","v":""}]
[null,null,null,null,null,null,null,null,null,null,{"$f":"IF($J843=\"\",\"\",IF($L843=\"Courant\",Donnees!$A$3,IF($L843=\"terminé\",Donnees!$A$4,IF($L844=\"Non débuté\",\"\"))))","v":""},{"$f":"IF($J843=\"\",\"\",IF($I843>Trimestre!$D$2,\"Non débuté\",IF(Trimestre!$D$2>$J843,\"Terminé\",\"Courant\")))","v":""}]
[null,null,null,null,null,null,null,null,null,null,{"$f":"IF($J844=\"\",\"\",IF($L844=\"Courant\",Donnees!$A$3,IF($L844=\"terminé\",Donnees!$A$4,IF($L845=\"Non débuté\",\"\"))))","v":""},{"$f":"IF($J844=\"\",\"\",IF($I844>Trimestre!$D$2,\"Non débuté\",IF(Trimestre!$D$2>$J844,\"Terminé\",\"Courant\")))","v":""}]
[null,null,null,null,null,null,null,null,null,null,{"$f":"IF($J845=\"\",\"\",IF($L845=\"Courant\",Donnees!$A$3,IF($L845=\"terminé\",Donnees!$A$4,IF($L846=\"Non débuté\",\"\"))))","v":""},{"$f":"IF($J845=\"\",\"\",IF($I845>Trimestre!$D$2,\"Non débuté\",IF(Trimestre!$D$2>$J845,\"Terminé\",\"Courant\")))","v":""}]
[null,null,null,null,null,null,null,null,null,null,{"$f":"IF($J846=\"\",\"\",IF($L846=\"Courant\",Donnees!$A$3,IF($L846=\"terminé\",Donnees!$A$4,IF($L847=\"Non débuté\",\"\"))))","v":""},{"$f":"IF($J846=\"\",\"\",IF($I846>Trimestre!$D$2,\"Non débuté\",IF(Trimestre!$D$2>$J846,\"Terminé\",\"Courant\")))","v":""}]
[null,null,null,null,null,null,null,null,null,null,{"$f":"IF($J847=\"\",\"\",IF($L847=\"Courant\",Donnees!$A$3,IF($L847=\"terminé\",Donnees!$A$4,IF($L848=\"Non débuté\",\"\"))))","v":""},{"$f":"IF($J847=\"\",\"\",IF($I847>Trimestre!$D$2,\"Non débuté\",IF(Trimestre!$D$2>$J847,\"Terminé\",\"Courant\")))","v":""}]
[null,null,null,null,null,null,null,null,null,null,{"$f":"IF($J848=\"\",\"\",IF($L848=\"Courant\",Donnees!$A$3,IF($L848=\"terminé\",Donnees!$A$4,IF($L849=\"Non débuté\",\"\"))))","v":""},{"$f":"IF($J848=\"\",\"\",IF($I848>Trimestre!$D$2,\"Non débuté\",IF(Trimestre!$D$2>$J848,\"Terminé\",\"Courant\")))","v":""}]
[null,null,null,null,null,null,null,null,null,null,{"$f":"IF($J849=\"\",\"\",IF($L849=\"Courant\",Donnees!$A$3,IF($L849=\"terminé\",Donnees!$A$4,IF($L850=\"Non débuté\",\"\"))))","v":""},{"$f":"IF($J849=\"\",\"\",IF($I849>Trimestre!$D$2,\"Non débuté\",IF(Trimestre!$D$2>$J849,\"Terminé\",\"Courant\")))","v":""}]
[null,null,null,null,null,null,null,null,null,null,{"$f":"IF($J850=\"\",\"\",IF($L850=\"Courant\",Donnees!$A$3,IF($L850=\"terminé\",Donnees!$A$4,IF($L851=\"Non débuté\",\"\"))))","v":""},{"$f":"IF($J850=\"\",\"\",IF($I850>Trimestre!$D$2,\"Non débuté\",IF(Trimestre!$D$2>$J850,\"Terminé\",\"Courant\")))","v":""}]
[null,null,null,null,null,null,null,null,null,null,{"$f":"IF($J851=\"\",\"\",IF($L851=\"Courant\",Donnees!$A$3,IF($L851=\"terminé\",Donnees!$A$4,IF($L852=\"Non débuté\",\"\"))))","v":""},{"$f":"IF($J851=\"\",\"\",IF($I851>Trimestre!$D$2,\"Non débuté\",IF(Trimestre!$D$2>$J851,\"Terminé\",\"Courant\")))","v":""}]
[null,null,null,null,null,null,null,null,null,null,{"$f":"IF($J852=\"\",\"\",IF($L852=\"Courant\",Donnees!$A$3,IF($L852=\"terminé\",Donnees!$A$4,IF($L853=\"Non débuté\",\"\"))))","v":""},{"$f":"IF($J852=\"\",\"\",IF($I852>Trimestre!$D$2,\"Non débuté\",IF(Trimestre!$D$2>$J852,\"Terminé\",\"Courant\")))","v":""}]
[null,null,null,null,null,null,null,null,null,null,{"$f":"IF($J853=\"\",\"\",IF($L853=\"Courant\",Donnees!$A$3,IF($L853=\"terminé\",Donnees!$A$4,IF($L854=\"Non débuté\",\"\"))))","v":""},{"$f":"IF($J853=\"\",\"\",IF($I853>Trimestre!$D$2,\"Non débuté\",IF(Trimestre!$D$2>$J853,\"Terminé\",\"Courant\")))","v":""}]
[null,null,null,null,null,null,null,null,null,null,{"$f":"IF($J854=\"\",\"\",IF($L854=\"Courant\",Donnees!$A$3,IF($L854=\"terminé\",Donnees!$A$4,IF($L855=\"Non débuté\",\"\"))))","v":""},{"$f":"IF($J854=\"\",\"\",IF($I854>Trimestre!$D$2,\"Non débuté\",IF(Trimestre!$D$2>$J854,\"Terminé\",\"Courant\")))","v":""}]
[null,null,null,null,null,null,null,null,null,null,{"$f":"IF($J855=\"\",\"\",IF($L855=\"Courant\",Donnees!$A$3,IF($L855=\"terminé\",Donnees!$A$4,IF($L856=\"Non débuté\",\"\"))))","v":""},{"$f":"IF($J855=\"\",\"\",IF($I855>Trimestre!$D$2,\"Non débuté\",IF(Trimestre!$D$2>$J855,\"Terminé\",\"Courant\")))","v":""}]
[null,null,null,null,null,null,null,null,null,null,{"$f":"IF($J856=\"\",\"\",IF($L856=\"Courant\",Donnees!$A$3,IF($L856=\"terminé\",Donnees!$A$4,IF($L857=\"Non débuté\",\"\"))))","v":""},{"$f":"IF($J856=\"\",\"\",IF($I856>Trimestre!$D$2,\"Non débuté\",IF(Trimestre!$D$2>$J856,\"Terminé\",\"Courant\")))","v":""}]
[null,null,null,null,null,null,null,null,null,null,{"$f":"IF($J857=\"\",\"\",IF($L857=\"Courant\",Donnees!$A$3,IF($L857=\"terminé\",Donnees!$A$4,IF($L858=\"Non débuté\",\"\"))))","v":""},{"$f":"IF($J857=\"\",\"\",IF($I857>Trimestre!$D$2,\"Non débuté\",IF(Trimestre!$D$2>$J857,\"Terminé\",\"Courant\")))","v":""}]
[null,null,null,null,null,null,null,null,null,null,{"$f":"IF($J858=\"\",\"\",IF($L858=\"Courant\",Donnees!$A$3,IF($L858=\"terminé\",Donnees!$A$4,IF($L859=\"Non débuté\",\"\"))))","v":""},{"$f":"IF($J858=\"\",\"\",IF($I858>Trimestre!$D$2,\"Non débuté\",IF(Trimestre!$D$2>$J858,\"Terminé\",\"Courant\")))","v":""}]
[null,null,null,null,null,null,null,null,null,null,{"$f":"IF($J859=\"\",\"\",IF($L859=\"Courant\",Donnees!$A$3,IF($L859=\"terminé\",Donnees!$A$4,IF($L860=\"Non débuté\",\"\"))))","v":""},{"$f":"IF($J859=\"\",\"\",IF($I859>Trimestre!$D$2,\"Non débuté\",IF(Trimestre!$D$2>$J859,\"Terminé\",\"Courant\")))","v":""}]
[null,null,null,null,null,null,null,null,null,null,{"$f":"IF($J860=\"\",\"\",IF($L860=\"Courant\",Donnees!$A$3,IF($L860=\"terminé\",Donnees!$A$4,IF($L861=\"Non débuté\",\"\"))))","v":""},{"$f":"IF($J860=\"\",\"\",IF($I860>Trimestre!$D$2,\"Non débuté\",IF(Trimestre!$D$2>$J860,\"Terminé\",\"Courant\")))","v":""}]
[null,null,null,null,null,null,null,null,null,null,{"$f":"IF($J861=\"\",\"\",IF($L861=\"Courant\",Donnees!$A$3,IF($L861=\"terminé\",Donnees!$A$4,IF($L862=\"Non débuté\",\"\"))))","v":""},{"$f":"IF($J861=\"\",\"\",IF($I861>Trimestre!$D$2,\"Non débuté\",IF(Trimestre!$D$2>$J861,\"Terminé\",\"Courant\")))","v":""}]
[null,null,null,null,null,null,null,null,null,null,{"$f":"IF($J862=\"\",\"\",IF($L862=\"Courant\",Donnees!$A$3,IF($L862=\"terminé\",Donnees!$A$4,IF($L863=\"Non débuté\",\"\"))))","v":""},{"$f":"IF($J862=\"\",\"\",IF($I862>Trimestre!$D$2,\"Non débuté\",IF(Trimestre!$D$2>$J862,\"Terminé\",\"Courant\")))","v":""}]
[null,null,null,null,null,null,null,null,null,null,{"$f":"IF($J863=\"\",\"\",IF($L863=\"Courant\",Donnees!$A$3,IF($L863=\"terminé\",Donnees!$A$4,IF($L864=\"Non débuté\",\"\"))))","v":""},{"$f":"IF($J863=\"\",\"\",IF($I863>Trimestre!$D$2,\"Non débuté\",IF(Trimestre!$D$2>$J863,\"Terminé\",\"Courant\")))","v":""}]
[null,null,null,null,null,null,null,null,null,null,{"$f":"IF($J864=\"\",\"\",IF($L864=\"Courant\",Donnees!$A$3,IF($L864=\"terminé\",Donnees!$A$4,IF($L865=\"Non débuté\",\"\"))))","v":""},{"$f":"IF($J864=\"\",\"\",IF($I864>Trimestre!$D$2,\"Non débuté\",IF(Trimestre!$D$2>$J864,\"Terminé\",\"Courant\")))","v":""}]
[null,null,null,null,null,null,null,null,null,null,{"$f":"IF($J865=\"\",\"\",IF($L865=\"Courant\",Donnees!$A$3,IF($L865=\"terminé\",Donnees!$A$4,IF($L866=\"Non débuté\",\"\"))))","v":""},{"$f":"IF($J865=\"\",\"\",IF($I865>Trimestre!$D$2,\"Non débuté\",IF(Trimestre!$D$2>$J865,\"Terminé\",\"Courant\")))","v":""}]
[null,null,null,null,null,null,null,null,null,null,{"$f":"IF($J866=\"\",\"\",IF($L866=\"Courant\",Donnees!$A$3,IF($L866=\"terminé\",Donnees!$A$4,IF($L867=\"Non débuté\",\"\"))))","v":""},{"$f":"IF($J866=\"\",\"\",IF($I866>Trimestre!$D$2,\"Non débuté\",IF(Trimestre!$D$2>$J866,\"Terminé\",\"Courant\")))","v":""}]
[null,null,null,null,null,null,null,null,null,null,{"$f":"IF($J867=\"\",\"\",IF($L867=\"Courant\",Donnees!$A$3,IF($L867=\"terminé\",Donnees!$A$4,IF($L868=\"Non débuté\",\"\"))))","v":""},{"$f":"IF($J867=\"\",\"\",IF($I867>Trimestre!$D$2,\"Non débuté\",IF(Trimestre!$D$2>$J867,\"Terminé\",\"Courant\")))","v":""}]
[null,null,null,null,null,null,null,null,null,null,{"$f":"IF($J868=\"\",\"\",IF($L868=\"Courant\",Donnees!$A$3,IF($L868=\"terminé\",Donnees!$A$4,IF($L869=\"Non débuté\",\"\"))))","v":""},{"$f":"IF($J868=\"\",\"\",IF($I868>Trimestre!$D$2,\"Non débuté\",IF(Trimestre!$D$2>$J868,\"Terminé\",\"Courant\")))","v":""}]
[null,null,null,null,null,null,null,null,null,null,{"$f":"IF($J869=\"\",\"\",IF($L869=\"Courant\",Donnees!$A$3,IF($L869=\"terminé\",Donnees!$A$4,IF($L870=\"Non débuté\",\"\"))))","v":""},{"$f":"IF($J869=\"\",\"\",IF($I869>Trimestre!$D$2,\"Non débuté\",IF(Trimestre!$D$2>$J869,\"Terminé\",\"Courant\")))","v":""}]
[null,null,null,null,null,null,null,null,null,null,{"$f":"IF($J870=\"\",\"\",IF($L870=\"Courant\",Donnees!$A$3,IF($L870=\"terminé\",Donnees!$A$4,IF($L871=\"Non débuté\",\"\"))))","v":""},{"$f":"IF($J870=\"\",\"\",IF($I870>Trimestre!$D$2,\"Non débuté\",IF(Trimestre!$D$2>$J870,\"Terminé\",\"Courant\")))","v":""}]
[null,null,null,null,null,null,null,null,null,null,{"$f":"IF($J871=\"\",\"\",IF($L871=\"Courant\",Donnees!$A$3,IF($L871=\"terminé\",Donnees!$A$4,IF($L872=\"Non débuté\",\"\"))))","v":""},{"$f":"IF($J871=\"\",\"\",IF($I871>Trimestre!$D$2,\"Non débuté\",IF(Trimestre!$D$2>$J871,\"Terminé\",\"Courant\")))","v":""}]
[null,null,null,null,null,null,null,null,null,null,{"$f":"IF($J872=\"\",\"\",IF($L872=\"Courant\",Donnees!$A$3,IF($L872=\"terminé\",Donnees!$A$4,IF($L873=\"Non débuté\",\"\"))))","v":""},{"$f":"IF($J872=\"\",\"\",IF($I872>Trimestre!$D$2,\"Non débuté\",IF(Trimestre!$D$2>$J872,\"Terminé\",\"Courant\")))","v":""}]
[null,null,null,null,null,null,null,null,null,null,{"$f":"IF($J873=\"\",\"\",IF($L873=\"Courant\",Donnees!$A$3,IF($L873=\"terminé\",Donnees!$A$4,IF($L874=\"Non débuté\",\"\"))))","v":""},{"$f":"IF($J873=\"\",\"\",IF($I873>Trimestre!$D$2,\"Non débuté\",IF(Trimestre!$D$2>$J873,\"Terminé\",\"Courant\")))","v":""}]
[null,null,null,null,null,null,null,null,null,null,{"$f":"IF($J874=\"\",\"\",IF($L874=\"Courant\",Donnees!$A$3,IF($L874=\"terminé\",Donnees!$A$4,IF($L875=\"Non débuté\",\"\"))))","v":""},{"$f":"IF($J874=\"\",\"\",IF($I874>Trimestre!$D$2,\"Non débuté\",IF(Trimestre!$D$2>$J874,\"Terminé\",\"Courant\")))","v":""}]
[null,null,null,null,null,null,null,null,null,null,{"$f":"IF($J875=\"\",\"\",IF($L875=\"Courant\",Donnees!$A$3,IF($L875=\"terminé\",Donnees!$A$4,IF($L876=\"Non débuté\",\"\"))))","v":""},{"$f":"IF($J875=\"\",\"\",IF($I875>Trimestre!$D$2,\"Non débuté\",IF(Trimestre!$D$2>$J875,\"Terminé\",\"Courant\")))","v":""}]
[null,null,null,null,null,null,null,null,null,null,{"$f":"IF($J876=\"\",\"\",IF($L876=\"Courant\",Donnees!$A$3,IF($L876=\"terminé\",Donnees!$A$4,IF($L877=\"Non débuté\",\"\"))))","v":""},{"$f":"IF($J876=\"\",\"\",IF($I876>Trimestre!$D$2,\"Non débuté\",IF(Trimestre!$D$2>$J876,\"Terminé\",\"Courant\")))","v":""}]
[null,null,null,null,null,null,null,null,null,null,{"$f":"IF($J877=\"\",\"\",IF($L877=\"Courant\",Donnees!$A$3,IF($L877=\"terminé\",Donnees!$A$4,IF($L878=\"Non débuté\",\"\"))))","v":""},{"$f":"IF($J877=\"\",\"\",IF($I877>Trimestre!$D$2,\"Non débuté\",IF(Trimestre!$D$2>$J877,\"Terminé\",\"Courant\")))","v":""}]
[null,null,null,null,null,null,null,null,null,null,{"$f":"IF($J878=\"\",\"\",IF($L878=\"Courant\",Donnees!$A$3,IF($L878=\"terminé\",Donnees!$A$4,IF($L879=\"Non débuté\",\"\"))))","v":""},{"$f":"IF($J878=\"\",\"\",IF($I878>Trimestre!$D$2,\"Non débuté\",IF(Trimestre!$D$2>$J878,\"Terminé\",\"Courant\")))","v":""}]
[null,null,null,null,null,null,null,null,null,null,{"$f":"IF($J879=\"\",\"\",IF($L879=\"Courant\",Donnees!$A$3,IF($L879=\"terminé\",Donnees!$A$4,IF($L880=\"Non débuté\",\"\"))))","v":""},{"$f":"IF($J879=\"\",\"\",IF($I879>Trimestre!$D$2,\"Non débuté\",IF(Trimestre!$D$2>$J879,\"Terminé\",\"Courant\")))","v":""}]
[null,null,null,null,null,null,null,null,null,null,{"$f":"IF($J880=\"\",\"\",IF($L880=\"Courant\",Donnees!$A$3,IF($L880=\"terminé\",Donnees!$A$4,IF($L881=\"Non débuté\",\"\"))))","v":""},{"$f":"IF($J880=\"\",\"\",IF($I880>Trimestre!$D$2,\"Non débuté\",IF(Trimestre!$D$2>$J880,\"Terminé\",\"Courant\")))","v":""}]
[null,null,null,null,null,null,null,null,null,null,{"$f":"IF($J881=\"\",\"\",IF($L881=\"Courant\",Donnees!$A$3,IF($L881=\"terminé\",Donnees!$A$4,IF($L882=\"Non débuté\",\"\"))))","v":""},{"$f":"IF($J881=\"\",\"\",IF($I881>Trimestre!$D$2,\"Non débuté\",IF(Trimestre!$D$2>$J881,\"Terminé\",\"Courant\")))","v":""}]
[null,null,null,null,null,null,null,null,null,null,{"$f":"IF($J882=\"\",\"\",IF($L882=\"Courant\",Donnees!$A$3,IF($L882=\"terminé\",Donnees!$A$4,IF($L883=\"Non débuté\",\"\"))))","v":""},{"$f":"IF($J882=\"\",\"\",IF($I882>Trimestre!$D$2,\"Non débuté\",IF(Trimestre!$D$2>$J882,\"Terminé\",\"Courant\")))","v":""}]
[null,null,null,null,null,null,null,null,null,null,{"$f":"IF($J883=\"\",\"\",IF($L883=\"Courant\",Donnees!$A$3,IF($L883=\"terminé\",Donnees!$A$4,IF($L884=\"Non débuté\",\"\"))))","v":""},{"$f":"IF($J883=\"\",\"\",IF($I883>Trimestre!$D$2,\"Non débuté\",IF(Trimestre!$D$2>$J883,\"Terminé\",\"Courant\")))","v":""}]
[null,null,null,null,null,null,null,null,null,null,{"$f":"IF($J884=\"\",\"\",IF($L884=\"Courant\",Donnees!$A$3,IF($L884=\"terminé\",Donnees!$A$4,IF($L885=\"Non débuté\",\"\"))))","v":""},{"$f":"IF($J884=\"\",\"\",IF($I884>Trimestre!$D$2,\"Non débuté\",IF(Trimestre!$D$2>$J884,\"Terminé\",\"Courant\")))","v":""}]
[null,null,null,null,null,null,null,null,null,null,{"$f":"IF($J885=\"\",\"\",IF($L885=\"Courant\",Donnees!$A$3,IF($L885=\"terminé\",Donnees!$A$4,IF($L886=\"Non débuté\",\"\"))))","v":""},{"$f":"IF($J885=\"\",\"\",IF($I885>Trimestre!$D$2,\"Non débuté\",IF(Trimestre!$D$2>$J885,\"Terminé\",\"Courant\")))","v":""}]
[null,null,null,null,null,null,null,null,null,null,{"$f":"IF($J886=\"\",\"\",IF($L886=\"Courant\",Donnees!$A$3,IF($L886=\"terminé\",Donnees!$A$4,IF($L887=\"Non débuté\",\"\"))))","v":""},{"$f":"IF($J886=\"\",\"\",IF($I886>Trimestre!$D$2,\"Non débuté\",IF(Trimestre!$D$2>$J886,\"Terminé\",\"Courant\")))","v":""}]
[null,null,null,null,null,null,null,null,null,null,{"$f":"IF($J887=\"\",\"\",IF($L887=\"Courant\",Donnees!$A$3,IF($L887=\"terminé\",Donnees!$A$4,IF($L888=\"Non débuté\",\"\"))))","v":""},{"$f":"IF($J887=\"\",\"\",IF($I887>Trimestre!$D$2,\"Non débuté\",IF(Trimestre!$D$2>$J887,\"Terminé\",\"Courant\")))","v":""}]
[null,null,null,null,null,null,null,null,null,null,{"$f":"IF($J888=\"\",\"\",IF($L888=\"Courant\",Donnees!$A$3,IF($L888=\"terminé\",Donnees!$A$4,IF($L889=\"Non débuté\",\"\"))))","v":""},{"$f":"IF($J888=\"\",\"\",IF($I888>Trimestre!$D$2,\"Non débuté\",IF(Trimestre!$D$2>$J888,\"Terminé\",\"Courant\")))","v":""}]
[null,null,null,null,null,null,null,null,null,null,{"$f":"IF($J889=\"\",\"\",IF($L889=\"Courant\",Donnees!$A$3,IF($L889=\"terminé\",Donnees!$A$4,IF($L890=\"Non débuté\",\"\"))))","v":""},{"$f":"IF($J889=\"\",\"\",IF($I889>Trimestre!$D$2,\"Non débuté\",IF(Trimestre!$D$2>$J889,\"Terminé\",\"Courant\")))","v":""}]
[null,null,null,null,null,null,null,null,null,null,{"$f":"IF($J890=\"\",\"\",IF($L890=\"Courant\",Donnees!$A$3,IF($L890=\"terminé\",Donnees!$A$4,IF($L891=\"Non débuté\",\"\"))))","v":""},{"$f":"IF($J890=\"\",\"\",IF($I890>Trimestre!$D$2,\"Non débuté\",IF(Trimestre!$D$2>$J890,\"Terminé\",\"Courant\")))","v":""}]
[null,null,null,null,null,null,null,null,null,null,{"$f":"IF($J891=\"\",\"\",IF($L891=\"Courant\",Donnees!$A$3,IF($L891=\"terminé\",Donnees!$A$4,IF($L892=\"Non débuté\",\"\"))))","v":""},{"$f":"IF($J891=\"\",\"\",IF($I891>Trimestre!$D$2,\"Non débuté\",IF(Trimestre!$D$2>$J891,\"Terminé\",\"Courant\")))","v":""}]
[null,null,null,null,null,null,null,null,null,null,{"$f":"IF($J892=\"\",\"\",IF($L892=\"Courant\",Donnees!$A$3,IF($L892=\"terminé\",Donnees!$A$4,IF($L893=\"Non débuté\",\"\"))))","v":""},{"$f":"IF($J892=\"\",\"\",IF($I892>Trimestre!$D$2,\"Non débuté\",IF(Trimestre!$D$2>$J892,\"Terminé\",\"Courant\")))","v":""}]
[null,null,null,null,null,null,null,null,null,null,{"$f":"IF($J893=\"\",\"\",IF($L893=\"Courant\",Donnees!$A$3,IF($L893=\"terminé\",Donnees!$A$4,IF($L894=\"Non débuté\",\"\"))))","v":""},{"$f":"IF($J893=\"\",\"\",IF($I893>Trimestre!$D$2,\"Non débuté\",IF(Trimestre!$D$2>$J893,\"Terminé\",\"Courant\")))","v":""}]
[null,null,null,null,null,null,null,null,null,null,{"$f":"IF($J894=\"\",\"\",IF($L894=\"Courant\",Donnees!$A$3,IF($L894=\"terminé\",Donnees!$A$4,IF($L895=\"Non débuté\",\"\"))))","v":""},{"$f":"IF($J894=\"\",\"\",IF($I894>Trimestre!$D$2,\"Non débuté\",IF(Trimestre!$D$2>$J894,\"Terminé\",\"Courant\")))","v":""}]
[null,null,null,null,null,null,null,null,null,null,{"$f":"IF($J895=\"\",\"\",IF($L895=\"Courant\",Donnees!$A$3,IF($L895=\"terminé\",Donnees!$A$4,IF($L896=\"Non débuté\",\"\"))))","v":""},{"$f":"IF($J895=\"\",\"\",IF($I895>Trimestre!$D$2,\"Non débuté\",IF(Trimestre!$D$2>$J895,\"Terminé\",\"Courant\")))","v":""}]
[null,null,null,null,null,null,null,null,null,null,{"$f":"IF($J896=\"\",\"\",IF($L896=\"Courant\",Donnees!$A$3,IF($L896=\"terminé\",Donnees!$A$4,IF($L897=\"Non débuté\",\"\"))))","v":""},{"$f":"IF($J896=\"\",\"\",IF($I896>Trimestre!$D$2,\"Non débuté\",IF(Trimestre!$D$2>$J896,\"Terminé\",\"Courant\")))","v":""}]
[null,null,null,null,null,null,null,null,null,null,{"$f":"IF($J897=\"\",\"\",IF($L897=\"Courant\",Donnees!$A$3,IF($L897=\"terminé\",Donnees!$A$4,IF($L898=\"Non débuté\",\"\"))))","v":""},{"$f":"IF($J897=\"\",\"\",IF($I897>Trimestre!$D$2,\"Non débuté\",IF(Trimestre!$D$2>$J897,\"Terminé\",\"Courant\")))","v":""}]
[null,null,null,null,null,null,null,null,null,null,{"$f":"IF($J898=\"\",\"\",IF($L898=\"Courant\",Donnees!$A$3,IF($L898=\"terminé\",Donnees!$A$4,IF($L899=\"Non débuté\",\"\"))))","v":""},{"$f":"IF($J898=\"\",\"\",IF($I898>Trimestre!$D$2,\"Non débuté\",IF(Trimestre!$D$2>$J898,\"Terminé\",\"Courant\")))","v":""}]
[null,null,null,null,null,null,null,null,null,null,{"$f":"IF($J899=\"\",\"\",IF($L899=\"Courant\",Donnees!$A$3,IF($L899=\"terminé\",Donnees!$A$4,IF($L900=\"Non débuté\",\"\"))))","v":""},{"$f":"IF($J899=\"\",\"\",IF($I899>Trimestre!$D$2,\"Non débuté\",IF(Trimestre!$D$2>$J899,\"Terminé\",\"Courant\")))","v":""}]
[null,null,null,null,null,null,null,null,null,null,{"$f":"IF($J900=\"\",\"\",IF($L900=\"Courant\",Donnees!$A$3,IF($L900=\"terminé\",Donnees!$A$4,IF($L901=\"Non débuté\",\"\"))))","v":""},{"$f":"IF($J900=\"\",\"\",IF($I900>Trimestre!$D$2,\"Non débuté\",IF(Trimestre!$D$2>$J900,\"Terminé\",\"Courant\")))","v":""}]
[null,null,null,null,null,null,null,null,null,null,{"$f":"IF($J901=\"\",\"\",IF($L901=\"Courant\",Donnees!$A$3,IF($L901=\"terminé\",Donnees!$A$4,IF($L902=\"Non débuté\",\"\"))))","v":""},{"$f":"IF($J901=\"\",\"\",IF($I901>Trimestre!$D$2,\"Non débuté\",IF(Trimestre!$D$2>$J901,\"Terminé\",\"Courant\")))","v":""}]
[null,null,null,null,null,null,null,null,null,null,{"$f":"IF($J902=\"\",\"\",IF($L902=\"Courant\",Donnees!$A$3,IF($L902=\"terminé\",Donnees!$A$4,IF($L903=\"Non débuté\",\"\"))))","v":""},{"$f":"IF($J902=\"\",\"\",IF($I902>Trimestre!$D$2,\"Non débuté\",IF(Trimestre!$D$2>$J902,\"Terminé\",\"Courant\")))","v":""}]
[null,null,null,null,null,null,null,null,null,null,{"$f":"IF($J903=\"\",\"\",IF($L903=\"Courant\",Donnees!$A$3,IF($L903=\"terminé\",Donnees!$A$4,IF($L904=\"Non débuté\",\"\"))))","v":""},{"$f":"IF($J903=\"\",\"\",IF($I903>Trimestre!$D$2,\"Non débuté\",IF(Trimestre!$D$2>$J903,\"Terminé\",\"Courant\")))","v":""}]
[null,null,null,null,null,null,null,null,null,null,{"$f":"IF($J904=\"\",\"\",IF($L904=\"Courant\",Donnees!$A$3,IF($L904=\"terminé\",Donnees!$A$4,IF($L905=\"Non débuté\",\"\"))))","v":""},{"$f":"IF($J904=\"\",\"\",IF($I904>Trimestre!$D$2,\"Non débuté\",IF(Trimestre!$D$2>$J904,\"Terminé\",\"Courant\")))","v":""}]
[null,null,null,null,null,null,null,null,null,null,{"$f":"IF($J905=\"\",\"\",IF($L905=\"Courant\",Donnees!$A$3,IF($L905=\"terminé\",Donnees!$A$4,IF($L906=\"Non débuté\",\"\"))))","v":""},{"$f":"IF($J905=\"\",\"\",IF($I905>Trimestre!$D$2,\"Non débuté\",IF(Trimestre!$D$2>$J905,\"Terminé\",\"Courant\")))","v":""}]
[null,null,null,null,null,null,null,null,null,null,{"$f":"IF($J906=\"\",\"\",IF($L906=\"Courant\",Donnees!$A$3,IF($L906=\"terminé\",Donnees!$A$4,IF($L907=\"Non débuté\",\"\"))))","v":""},{"$f":"IF($J906=\"\",\"\",IF($I906>Trimestre!$D$2,\"Non débuté\",IF(Trimestre!$D$2>$J906,\"Terminé\",\"Courant\")))","v":""}]
[null,null,null,null,null,null,null,null,null,null,{"$f":"IF($J907=\"\",\"\",IF($L907=\"Courant\",Donnees!$A$3,IF($L907=\"terminé\",Donnees!$A$4,IF($L908=\"Non débuté\",\"\"))))","v":""},{"$f":"IF($J907=\"\",\"\",IF($I907>Trimestre!$D$2,\"Non débuté\",IF(Trimestre!$D$2>$J907,\"Terminé\",\"Courant\")))","v":""}]
[null,null,null,null,null,null,null,null,null,null,{"$f":"IF($J908=\"\",\"\",IF($L908=\"Courant\",Donnees!$A$3,IF($L908=\"terminé\",Donnees!$A$4,IF($L909=\"Non débuté\",\"\"))))","v":""},{"$f":"IF($J908=\"\",\"\",IF($I908>Trimestre!$D$2,\"Non débuté\",IF(Trimestre!$D$2>$J908,\"Terminé\",\"Courant\")))","v":""}]
[null,null,null,null,null,null,null,null,null,null,{"$f":"IF($J909=\"\",\"\",IF($L909=\"Courant\",Donnees!$A$3,IF($L909=\"terminé\",Donnees!$A$4,IF($L910=\"Non débuté\",\"\"))))","v":""},{"$f":"IF($J909=\"\",\"\",IF($I909>Trimestre!$D$2,\"Non débuté\",IF(Trimestre!$D$2>$J909,\"Terminé\",\"Courant\")))","v":""}]
[null,null,null,null,null,null,null,null,null,null,{"$f":"IF($J910=\"\",\"\",IF($L910=\"Courant\",Donnees!$A$3,IF($L910=\"terminé\",Donnees!$A$4,IF($L911=\"Non débuté\",\"\"))))","v":""},{"$f":"IF($J910=\"\",\"\",IF($I910>Trimestre!$D$2,\"Non débuté\",IF(Trimestre!$D$2>$J910,\"Terminé\",\"Courant\")))","v":""}]
[null,null,null,null,null,null,null,null,null,null,{"$f":"IF($J911=\"\",\"\",IF($L911=\"Courant\",Donnees!$A$3,IF($L911=\"terminé\",Donnees!$A$4,IF($L912=\"Non débuté\",\"\"))))","v":""},{"$f":"IF($J911=\"\",\"\",IF($I911>Trimestre!$D$2,\"Non débuté\",IF(Trimestre!$D$2>$J911,\"Terminé\",\"Courant\")))","v":""}]
[null,null,null,null,null,null,null,null,null,null,{"$f":"IF($J912=\"\",\"\",IF($L912=\"Courant\",Donnees!$A$3,IF($L912=\"terminé\",Donnees!$A$4,IF($L913=\"Non débuté\",\"\"))))","v":""},{"$f":"IF($J912=\"\",\"\",IF($I912>Trimestre!$D$2,\"Non débuté\",IF(Trimestre!$D$2>$J912,\"Terminé\",\"Courant\")))","v":""}]
[null,null,null,null,null,null,null,null,null,null,{"$f":"IF($J913=\"\",\"\",IF($L913=\"Courant\",Donnees!$A$3,IF($L913=\"terminé\",Donnees!$A$4,IF($L914=\"Non débuté\",\"\"))))","v":""},{"$f":"IF($J913=\"\",\"\",IF($I913>Trimestre!$D$2,\"Non débuté\",IF(Trimestre!$D$2>$J913,\"Terminé\",\"Courant\")))","v":""}]
[null,null,null,null,null,null,null,null,null,null,{"$f":"IF($J914=\"\",\"\",IF($L914=\"Courant\",Donnees!$A$3,IF($L914=\"terminé\",Donnees!$A$4,IF($L915=\"Non débuté\",\"\"))))","v":""},{"$f":"IF($J914=\"\",\"\",IF($I914>Trimestre!$D$2,\"Non débuté\",IF(Trimestre!$D$2>$J914,\"Terminé\",\"Courant\")))","v":""}]
[null,null,null,null,null,null,null,null,null,null,{"$f":"IF($J915=\"\",\"\",IF($L915=\"Courant\",Donnees!$A$3,IF($L915=\"terminé\",Donnees!$A$4,IF($L916=\"Non débuté\",\"\"))))","v":""},{"$f":"IF($J915=\"\",\"\",IF($I915>Trimestre!$D$2,\"Non débuté\",IF(Trimestre!$D$2>$J915,\"Terminé\",\"Courant\")))","v":""}]
[null,null,null,null,null,null,null,null,null,null,{"$f":"IF($J916=\"\",\"\",IF($L916=\"Courant\",Donnees!$A$3,IF($L916=\"terminé\",Donnees!$A$4,IF($L917=\"Non débuté\",\"\"))))","v":""},{"$f":"IF($J916=\"\",\"\",IF($I916>Trimestre!$D$2,\"Non débuté\",IF(Trimestre!$D$2>$J916,\"Terminé\",\"Courant\")))","v":""}]
[null,null,null,null,null,null,null,null,null,null,{"$f":"IF($J917=\"\",\"\",IF($L917=\"Courant\",Donnees!$A$3,IF($L917=\"terminé\",Donnees!$A$4,IF($L918=\"Non débuté\",\"\"))))","v":""},{"$f":"IF($J917=\"\",\"\",IF($I917>Trimestre!$D$2,\"Non débuté\",IF(Trimestre!$D$2>$J917,\"Terminé\",\"Courant\")))","v":""}]
[null,null,null,null,null,null,null,null,null,null,{"$f":"IF($J918=\"\",\"\",IF($L918=\"Courant\",Donnees!$A$3,IF($L918=\"terminé\",Donnees!$A$4,IF($L919=\"Non débuté\",\"\"))))","v":""},{"$f":"IF($J918=\"\",\"\",IF($I918>Trimestre!$D$2,\"Non débuté\",IF(Trimestre!$D$2>$J918,\"Terminé\",\"Courant\")))","v":""}]
[null,null,null,null,null,null,null,null,null,null,{"$f":"IF($J919=\"\",\"\",IF($L919=\"Courant\",Donnees!$A$3,IF($L919=\"terminé\",Donnees!$A$4,IF($L920=\"Non débuté\",\"\"))))","v":""},{"$f":"IF($J919=\"\",\"\",IF($I919>Trimestre!$D$2,\"Non débuté\",IF(Trimestre!$D$2>$J919,\"Terminé\",\"Courant\")))","v":""}]
[null,null,null,null,null,null,null,null,null,null,{"$f":"IF($J920=\"\",\"\",IF($L920=\"Courant\",Donnees!$A$3,IF($L920=\"terminé\",Donnees!$A$4,IF($L921=\"Non débuté\",\"\"))))","v":""},{"$f":"IF($J920=\"\",\"\",IF($I920>Trimestre!$D$2,\"Non débuté\",IF(Trimestre!$D$2>$J920,\"Terminé\",\"Courant\")))","v":""}]
[null,null,null,null,null,null,null,null,null,null,{"$f":"IF($J921=\"\",\"\",IF($L921=\"Courant\",Donnees!$A$3,IF($L921=\"terminé\",Donnees!$A$4,IF($L922=\"Non débuté\",\"\"))))","v":""},{"$f":"IF($J921=\"\",\"\",IF($I921>Trimestre!$D$2,\"Non débuté\",IF(Trimestre!$D$2>$J921,\"Terminé\",\"Courant\")))","v":""}]
[null,null,null,null,null,null,null,null,null,null,{"$f":"IF($J922=\"\",\"\",IF($L922=\"Courant\",Donnees!$A$3,IF($L922=\"terminé\",Donnees!$A$4,IF($L923=\"Non débuté\",\"\"))))","v":""},{"$f":"IF($J922=\"\",\"\",IF($I922>Trimestre!$D$2,\"Non débuté\",IF(Trimestre!$D$2>$J922,\"Terminé\",\"Courant\")))","v":""}]
[null,null,null,null,null,null,null,null,null,null,{"$f":"IF($J923=\"\",\"\",IF($L923=\"Courant\",Donnees!$A$3,IF($L923=\"terminé\",Donnees!$A$4,IF($L924=\"Non débuté\",\"\"))))","v":""},{"$f":"IF($J923=\"\",\"\",IF($I923>Trimestre!$D$2,\"Non débuté\",IF(Trimestre!$D$2>$J923,\"Terminé\",\"Courant\")))","v":""}]
[null,null,null,null,null,null,null,null,null,null,{"$f":"IF($J924=\"\",\"\",IF($L924=\"Courant\",Donnees!$A$3,IF($L924=\"terminé\",Donnees!$A$4,IF($L925=\"Non débuté\",\"\"))))","v":""},{"$f":"IF($J924=\"\",\"\",IF($I924>Trimestre!$D$2,\"Non débuté\",IF(Trimestre!$D$2>$J924,\"Terminé\",\"Courant\")))","v":""}]
[null,null,null,null,null,null,null,null,null,null,{"$f":"IF($J925=\"\",\"\",IF($L925=\"Courant\",Donnees!$A$3,IF($L925=\"terminé\",Donnees!$A$4,IF($L926=\"Non débuté\",\"\"))))","v":""},{"$f":"IF($J925=\"\",\"\",IF($I925>Trimestre!$D$2,\"Non débuté\",IF(Trimestre!$D$2>$J925,\"Terminé\",\"Courant\")))","v":""}]
[null,null,null,null,null,null,null,null,null,null,{"$f":"IF($J926=\"\",\"\",IF($L926=\"Courant\",Donnees!$A$3,IF($L926=\"terminé\",Donnees!$A$4,IF($L927=\"Non débuté\",\"\"))))","v":""},{"$f":"IF($J926=\"\",\"\",IF($I926>Trimestre!$D$2,\"Non débuté\",IF(Trimestre!$D$2>$J926,\"Terminé\",\"Courant\")))","v":""}]
[null,null,null,null,null,null,null,null,null,null,{"$f":"IF($J927=\"\",\"\",IF($L927=\"Courant\",Donnees!$A$3,IF($L927=\"terminé\",Donnees!$A$4,IF($L928=\"Non débuté\",\"\"))))","v":""},{"$f":"IF($J927=\"\",\"\",IF($I927>Trimestre!$D$2,\"Non débuté\",IF(Trimestre!$D$2>$J927,\"Terminé\",\"Courant\")))","v":""}]
[null,null,null,null,null,null,null,null,null,null,{"$f":"IF($J928=\"\",\"\",IF($L928=\"Courant\",Donnees!$A$3,IF($L928=\"terminé\",Donnees!$A$4,IF($L929=\"Non débuté\",\"\"))))","v":""},{"$f":"IF($J928=\"\",\"\",IF($I928>Trimestre!$D$2,\"Non débuté\",IF(Trimestre!$D$2>$J928,\"Terminé\",\"Courant\")))","v":""}]
[null,null,null,null,null,null,null,null,null,null,{"$f":"IF($J929=\"\",\"\",IF($L929=\"Courant\",Donnees!$A$3,IF($L929=\"terminé\",Donnees!$A$4,IF($L930=\"Non débuté\",\"\"))))","v":""},{"$f":"IF($J929=\"\",\"\",IF($I929>Trimestre!$D$2,\"Non débuté\",IF(Trimestre!$D$2>$J929,\"Terminé\",\"Courant\")))","v":""}]
[null,null,null,null,null,null,null,null,null,null,{"$f":"IF($J930=\"\",\"\",IF($L930=\"Courant\",Donnees!$A$3,IF($L930=\"terminé\",Donnees!$A$4,IF($L931=\"Non débuté\",\"\"))))","v":""},{"$f":"IF($J930=\"\",\"\",IF($I930>Trimestre!$D$2,\"Non débuté\",IF(Trimestre!$D$2>$J930,\"Terminé\",\"Courant\")))","v":""}]
[null,null,null,null,null,null,null,null,null,null,{"$f":"IF($J931=\"\",\"\",IF($L931=\"Courant\",Donnees!$A$3,IF($L931=\"terminé\",Donnees!$A$4,IF($L932=\"Non débuté\",\"\"))))","v":""},{"$f":"IF($J931=\"\",\"\",IF($I931>Trimestre!$D$2,\"Non débuté\",IF(Trimestre!$D$2>$J931,\"Terminé\",\"Courant\")))","v":""}]
[null,null,null,null,null,null,null,null,null,null,{"$f":"IF($J932=\"\",\"\",IF($L932=\"Courant\",Donnees!$A$3,IF($L932=\"terminé\",Donnees!$A$4,IF($L933=\"Non débuté\",\"\"))))","v":""},{"$f":"IF($J932=\"\",\"\",IF($I932>Trimestre!$D$2,\"Non débuté\",IF(Trimestre!$D$2>$J932,\"Terminé\",\"Courant\")))","v":""}]
[null,null,null,null,null,null,null,null,null,null,{"$f":"IF($J933=\"\",\"\",IF($L933=\"Courant\",Donnees!$A$3,IF($L933=\"terminé\",Donnees!$A$4,IF($L934=\"Non débuté\",\"\"))))","v":""},{"$f":"IF($J933=\"\",\"\",IF($I933>Trimestre!$D$2,\"Non débuté\",IF(Trimestre!$D$2>$J933,\"Terminé\",\"Courant\")))","v":""}]
[null,null,null,null,null,null,null,null,null,null,{"$f":"IF($J934=\"\",\"\",IF($L934=\"Courant\",Donnees!$A$3,IF($L934=\"terminé\",Donnees!$A$4,IF($L935=\"Non débuté\",\"\"))))","v":""},{"$f":"IF($J934=\"\",\"\",IF($I934>Trimestre!$D$2,\"Non débuté\",IF(Trimestre!$D$2>$J934,\"Terminé\",\"Courant\")))","v":""}]
[null,null,null,null,null,null,null,null,null,null,{"$f":"IF($J935=\"\",\"\",IF($L935=\"Courant\",Donnees!$A$3,IF($L935=\"terminé\",Donnees!$A$4,IF($L936=\"Non débuté\",\"\"))))","v":""},{"$f":"IF($J935=\"\",\"\",IF($I935>Trimestre!$D$2,\"Non débuté\",IF(Trimestre!$D$2>$J935,\"Terminé\",\"Courant\")))","v":""}]
[null,null,null,null,null,null,null,null,null,null,{"$f":"IF($J936=\"\",\"\",IF($L936=\"Courant\",Donnees!$A$3,IF($L936=\"terminé\",Donnees!$A$4,IF($L937=\"Non débuté\",\"\"))))","v":""},{"$f":"IF($J936=\"\",\"\",IF($I936>Trimestre!$D$2,\"Non débuté\",IF(Trimestre!$D$2>$J936,\"Terminé\",\"Courant\")))","v":""}]
[null,null,null,null,null,null,null,null,null,null,{"$f":"IF($J937=\"\",\"\",IF($L937=\"Courant\",Donnees!$A$3,IF($L937=\"terminé\",Donnees!$A$4,IF($L938=\"Non débuté\",\"\"))))","v":""},{"$f":"IF($J937=\"\",\"\",IF($I937>Trimestre!$D$2,\"Non débuté\",IF(Trimestre!$D$2>$J937,\"Terminé\",\"Courant\")))","v":""}]
[null,null,null,null,null,null,null,null,null,null,{"$f":"IF($J938=\"\",\"\",IF($L938=\"Courant\",Donnees!$A$3,IF($L938=\"terminé\",Donnees!$A$4,IF($L939=\"Non débuté\",\"\"))))","v":""},{"$f":"IF($J938=\"\",\"\",IF($I938>Trimestre!$D$2,\"Non débuté\",IF(Trimestre!$D$2>$J938,\"Terminé\",\"Courant\")))","v":""}]
[null,null,null,null,null,null,null,null,null,null,{"$f":"IF($J939=\"\",\"\",IF($L939=\"Courant\",Donnees!$A$3,IF($L939=\"terminé\",Donnees!$A$4,IF($L940=\"Non débuté\",\"\"))))","v":""},{"$f":"IF($J939=\"\",\"\",IF($I939>Trimestre!$D$2,\"Non débuté\",IF(Trimestre!$D$2>$J939,\"Terminé\",\"Courant\")))","v":""}]
[null,null,null,null,null,null,null,null,null,null,{"$f":"IF($J940=\"\",\"\",IF($L940=\"Courant\",Donnees!$A$3,IF($L940=\"terminé\",Donnees!$A$4,IF($L941=\"Non débuté\",\"\"))))","v":""},{"$f":"IF($J940=\"\",\"\",IF($I940>Trimestre!$D$2,\"Non débuté\",IF(Trimestre!$D$2>$J940,\"Terminé\",\"Courant\")))","v":""}]
[null,null,null,null,null,null,null,null,null,null,{"$f":"IF($J941=\"\",\"\",IF($L941=\"Courant\",Donnees!$A$3,IF($L941=\"terminé\",Donnees!$A$4,IF($L942=\"Non débuté\",\"\"))))","v":""},{"$f":"IF($J941=\"\",\"\",IF($I941>Trimestre!$D$2,\"Non débuté\",IF(Trimestre!$D$2>$J941,\"Terminé\",\"Courant\")))","v":""}]
[null,null,null,null,null,null,null,null,null,null,{"$f":"IF($J942=\"\",\"\",IF($L942=\"Courant\",Donnees!$A$3,IF($L942=\"terminé\",Donnees!$A$4,IF($L943=\"Non débuté\",\"\"))))","v":""},{"$f":"IF($J942=\"\",\"\",IF($I942>Trimestre!$D$2,\"Non débuté\",IF(Trimestre!$D$2>$J942,\"Terminé\",\"Courant\")))","v":""}]
[null,null,null,null,null,null,null,null,null,null,{"$f":"IF($J943=\"\",\"\",IF($L943=\"Courant\",Donnees!$A$3,IF($L943=\"terminé\",Donnees!$A$4,IF($L944=\"Non débuté\",\"\"))))","v":""},{"$f":"IF($J943=\"\",\"\",IF($I943>Trimestre!$D$2,\"Non débuté\",IF(Trimestre!$D$2>$J943,\"Terminé\",\"Courant\")))","v":""}]
[null,null,null,null,null,null,null,null,null,null,{"$f":"IF($J944=\"\",\"\",IF($L944=\"Courant\",Donnees!$A$3,IF($L944=\"terminé\",Donnees!$A$4,IF($L945=\"Non débuté\",\"\"))))","v":""},{"$f":"IF($J944=\"\",\"\",IF($I944>Trimestre!$D$2,\"Non débuté\",IF(Trimestre!$D$2>$J944,\"Terminé\",\"Courant\")))","v":""}]
[null,null,null,null,null,null,null,null,null,null,{"$f":"IF($J945=\"\",\"\",IF($L945=\"Courant\",Donnees!$A$3,IF($L945=\"terminé\",Donnees!$A$4,IF($L946=\"Non débuté\",\"\"))))","v":""},{"$f":"IF($J945=\"\",\"\",IF($I945>Trimestre!$D$2,\"Non débuté\",IF(Trimestre!$D$2>$J945,\"Terminé\",\"Courant\")))","v":""}]
[null,null,null,null,null,null,null,null,null,null,{"$f":"IF($J946=\"\",\"\",IF($L946=\"Courant\",Donnees!$A$3,IF($L946=\"terminé\",Donnees!$A$4,IF($L947=\"Non débuté\",\"\"))))","v":""},{"$f":"IF($J946=\"\",\"\",IF($I946>Trimestre!$D$2,\"Non débuté\",IF(Trimestre!$D$2>$J946,\"Terminé\",\"Courant\")))","v":""}]
[null,null,null,null,null,null,null,null,null,null,{"$f":"IF($J947=\"\",\"\",IF($L947=\"Courant\",Donnees!$A$3,IF($L947=\"terminé\",Donnees!$A$4,IF($L948=\"Non débuté\",\"\"))))","v":""},{"$f":"IF($J947=\"\",\"\",IF($I947>Trimestre!$D$2,\"Non débuté\",IF(Trimestre!$D$2>$J947,\"Terminé\",\"Courant\")))","v":""}]
[null,null,null,null,null,null,null,null,null,null,{"$f":"IF($J948=\"\",\"\",IF($L948=\"Courant\",Donnees!$A$3,IF($L948=\"terminé\",Donnees!$A$4,IF($L949=\"Non débuté\",\"\"))))","v":""},{"$f":"IF($J948=\"\",\"\",IF($I948>Trimestre!$D$2,\"Non débuté\",IF(Trimestre!$D$2>$J948,\"Terminé\",\"Courant\")))","v":""}]
[null,null,null,null,null,null,null,null,null,null,{"$f":"IF($J949=\"\",\"\",IF($L949=\"Courant\",Donnees!$A$3,IF($L949=\"terminé\",Donnees!$A$4,IF($L950=\"Non débuté\",\"\"))))","v":""},{"$f":"IF($J949=\"\",\"\",IF($I949>Trimestre!$D$2,\"Non débuté\",IF(Trimestre!$D$2>$J949,\"Terminé\",\"Courant\")))","v":""}]
[null,null,null,null,null,null,null,null,null,null,{"$f":"IF($J950=\"\",\"\",IF($L950=\"Courant\",Donnees!$A$3,IF($L950=\"terminé\",Donnees!$A$4,IF($L951=\"Non débuté\",\"\"))))","v":""},{"$f":"IF($J950=\"\",\"\",IF($I950>Trimestre!$D$2,\"Non débuté\",IF(Trimestre!$D$2>$J950,\"Terminé\",\"Courant\")))","v":""}]
[null,null,null,null,null,null,null,null,null,null,{"$f":"IF($J951=\"\",\"\",IF($L951=\"Courant\",Donnees!$A$3,IF($L951=\"terminé\",Donnees!$A$4,IF($L952=\"Non débuté\",\"\"))))","v":""},{"$f":"IF($J951=\"\",\"\",IF($I951>Trimestre!$D$2,\"Non débuté\",IF(Trimestre!$D$2>$J951,\"Terminé\",\"Courant\")))","v":""}]
[null,null,null,null,null,null,null,null,null,null,{"$f":"IF($J952=\"\",\"\",IF($L952=\"Courant\",Donnees!$A$3,IF($L952=\"terminé\",Donnees!$A$4,IF($L953=\"Non débuté\",\"\"))))","v":""},{"$f":"IF($J952=\"\",\"\",IF($I952>Trimestre!$D$2,\"Non débuté\",IF(Trimestre!$D$2>$J952,\"Terminé\",\"Courant\")))","v":""}]
[null,null,null,null,null,null,null,null,null,null,{"$f":"IF($J953=\"\",\"\",IF($L953=\"Courant\",Donnees!$A$3,IF($L953=\"terminé\",Donnees!$A$4,IF($L954=\"Non débuté\",\"\"))))","v":""},{"$f":"IF($J953=\"\",\"\",IF($I953>Trimestre!$D$2,\"Non débuté\",IF(Trimestre!$D$2>$J953,\"Terminé\",\"Courant\")))","v":""}]
[null,null,null,null,null,null,null,null,null,null,{"$f":"IF($J954=\"\",\"\",IF($L954=\"Courant\",Donnees!$A$3,IF($L954=\"terminé\",Donnees!$A$4,IF($L955=\"Non débuté\",\"\"))))","v":""},{"$f":"IF($J954=\"\",\"\",IF($I954>Trimestre!$D$2,\"Non débuté\",IF(Trimestre!$D$2>$J954,\"Terminé\",\"Courant\")))","v":""}]
[null,null,null,null,null,null,null,null,null,null,{"$f":"IF($J955=\"\",\"\",IF($L955=\"Courant\",Donnees!$A$3,IF($L955=\"terminé\",Donnees!$A$4,IF($L956=\"Non débuté\",\"\"))))","v":""},{"$f":"IF($J955=\"\",\"\",IF($I955>Trimestre!$D$2,\"Non débuté\",IF(Trimestre!$D$2>$J955,\"Terminé\",\"Courant\")))","v":""}]
[null,null,null,null,null,null,null,null,null,null,{"$f":"IF($J956=\"\",\"\",IF($L956=\"Courant\",Donnees!$A$3,IF($L956=\"terminé\",Donnees!$A$4,IF($L957=\"Non débuté\",\"\"))))","v":""},{"$f":"IF($J956=\"\",\"\",IF($I956>Trimestre!$D$2,\"Non débuté\",IF(Trimestre!$D$2>$J956,\"Terminé\",\"Courant\")))","v":""}]
[null,null,null,null,null,null,null,null,null,null,{"$f":"IF($J957=\"\",\"\",IF($L957=\"Courant\",Donnees!$A$3,IF($L957=\"terminé\",Donnees!$A$4,IF($L958=\"Non débuté\",\"\"))))","v":""},{"$f":"IF($J957=\"\",\"\",IF($I957>Trimestre!$D$2,\"Non débuté\",IF(Trimestre!$D$2>$J957,\"Terminé\",\"Courant\")))","v":""}]
[null,null,null,null,null,null,null,null,null,null,{"$f":"IF($J958=\"\",\"\",IF($L958=\"Courant\",Donnees!$A$3,IF($L958=\"terminé\",Donnees!$A$4,IF($L959=\"Non débuté\",\"\"))))","v":""},{"$f":"IF($J958=\"\",\"\",IF($I958>Trimestre!$D$2,\"Non débuté\",IF(Trimestre!$D$2>$J958,\"Terminé\",\"Courant\")))","v":""}]
[null,null,null,null,null,null,null,null,null,null,{"$f":"IF($J959=\"\",\"\",IF($L959=\"Courant\",Donnees!$A$3,IF($L959=\"terminé\",Donnees!$A$4,IF($L960=\"Non débuté\",\"\"))))","v":""},{"$f":"IF($J959=\"\",\"\",IF($I959>Trimestre!$D$2,\"Non débuté\",IF(Trimestre!$D$2>$J959,\"Terminé\",\"Courant\")))","v":""}]
[null,null,null,null,null,null,null,null,null,null,{"$f":"IF($J960=\"\",\"\",IF($L960=\"Courant\",Donnees!$A$3,IF($L960=\"terminé\",Donnees!$A$4,IF($L961=\"Non débuté\",\"\"))))","v":""},{"$f":"IF($J960=\"\",\"\",IF($I960>Trimestre!$D$2,\"Non débuté\",IF(Trimestre!$D$2>$J960,\"Terminé\",\"Courant\")))","v":""}]
[null,null,null,null,null,null,null,null,null,null,{"$f":"IF($J961=\"\",\"\",IF($L961=\"Courant\",Donnees!$A$3,IF($L961=\"terminé\",Donnees!$A$4,IF($L962=\"Non débuté\",\"\"))))","v":""},{"$f":"IF($J961=\"\",\"\",IF($I961>Trimestre!$D$2,\"Non débuté\",IF(Trimestre!$D$2>$J961,\"Terminé\",\"Courant\")))","v":""}]
[null,null,null,null,null,null,null,null,null,null,{"$f":"IF($J962=\"\",\"\",IF($L962=\"Courant\",Donnees!$A$3,IF($L962=\"terminé\",Donnees!$A$4,IF($L963=\"Non débuté\",\"\"))))","v":""},{"$f":"IF($J962=\"\",\"\",IF($I962>Trimestre!$D$2,\"Non débuté\",IF(Trimestre!$D$2>$J962,\"Terminé\",\"Courant\")))","v":""}]
[null,null,null,null,null,null,null,null,null,null,{"$f":"IF($J963=\"\",\"\",IF($L963=\"Courant\",Donnees!$A$3,IF($L963=\"terminé\",Donnees!$A$4,IF($L964=\"Non débuté\",\"\"))))","v":""},{"$f":"IF($J963=\"\",\"\",IF($I963>Trimestre!$D$2,\"Non débuté\",IF(Trimestre!$D$2>$J963,\"Terminé\",\"Courant\")))","v":""}]
[null,null,null,null,null,null,null,null,null,null,{"$f":"IF($J964=\"\",\"\",IF($L964=\"Courant\",Donnees!$A$3,IF($L964=\"terminé\",Donnees!$A$4,IF($L965=\"Non débuté\",\"\"))))","v":""},{"$f":"IF($J964=\"\",\"\",IF($I964>Trimestre!$D$2,\"Non débuté\",IF(Trimestre!$D$2>$J964,\"Terminé\",\"Courant\")))","v":""}]
[null,null,null,null,null,null,null,null,null,null,{"$f":"IF($J965=\"\",\"\",IF($L965=\"Courant\",Donnees!$A$3,IF($L965=\"terminé\",Donnees!$A$4,IF($L966=\"Non débuté\",\"\"))))","v":""},{"$f":"IF($J965=\"\",\"\",IF($I965>Trimestre!$D$2,\"Non débuté\",IF(Trimestre!$D$2>$J965,\"Terminé\",\"Courant\")))","v":""}]
[null,null,null,null,null,null,null,null,null,null,{"$f":"IF($J966=\"\",\"\",IF($L966=\"Courant\",Donnees!$A$3,IF($L966=\"terminé\",Donnees!$A$4,IF($L967=\"Non débuté\",\"\"))))","v":""},{"$f":"IF($J966=\"\",\"\",IF($I966>Trimestre!$D$2,\"Non débuté\",IF(Trimestre!$D$2>$J966,\"Terminé\",\"Courant\")))","v":""}]
[null,null,null,null,null,null,null,null,null,null,{"$f":"IF($J967=\"\",\"\",IF($L967=\"Courant\",Donnees!$A$3,IF($L967=\"terminé\",Donnees!$A$4,IF($L968=\"Non débuté\",\"\"))))","v":""},{"$f":"IF($J967=\"\",\"\",IF($I967>Trimestre!$D$2,\"Non débuté\",IF(Trimestre!$D$2>$J967,\"Terminé\",\"Courant\")))","v":""}]
[null,null,null,null,null,null,null,null,null,null,{"$f":"IF($J968=\"\",\"\",IF($L968=\"Courant\",Donnees!$A$3,IF($L968=\"terminé\",Donnees!$A$4,IF($L969=\"Non débuté\",\"\"))))","v":""},{"$f":"IF($J968=\"\",\"\",IF($I968>Trimestre!$D$2,\"Non débuté\",IF(Trimestre!$D$2>$J968,\"Terminé\",\"Courant\")))","v":""}]
[null,null,null,null,null,null,null,null,null,null,{"$f":"IF($J969=\"\",\"\",IF($L969=\"Courant\",Donnees!$A$3,IF($L969=\"terminé\",Donnees!$A$4,IF($L970=\"Non débuté\",\"\"))))","v":""},{"$f":"IF($J969=\"\",\"\",IF($I969>Trimestre!$D$2,\"Non débuté\",IF(Trimestre!$D$2>$J969,\"Terminé\",\"Courant\")))","v":""}]
[null,null,null,null,null,null,null,null,null,null,{"$f":"IF($J970=\"\",\"\",IF($L970=\"Courant\",Donnees!$A$3,IF($L970=\"terminé\",Donnees!$A$4,IF($L971=\"Non débuté\",\"\"))))","v":""},{"$f":"IF($J970=\"\",\"\",IF($I970>Trimestre!$D$2,\"Non débuté\",IF(Trimestre!$D$2>$J970,\"Terminé\",\"Courant\")))","v":""}]
[null,null,null,null,null,null,null,null,null,null,{"$f":"IF($J971=\"\",\"\",IF($L971=\"Courant\",Donnees!$A$3,IF($L971=\"terminé\",Donnees!$A$4,IF($L972=\"Non débuté\",\"\"))))","v":""},{"$f":"IF($J971=\"\",\"\",IF($I971>Trimestre!$D$2,\"Non débuté\",IF(Trimestre!$D$2>$J971,\"Terminé\",\"Courant\")))","v":""}]
[null,null,null,null,null,null,null,null,null,null,{"$f":"IF($J972=\"\",\"\",IF($L972=\"Courant\",Donnees!$A$3,IF($L972=\"terminé\",Donnees!$A$4,IF($L973=\"Non débuté\",\"\"))))","v":""},{"$f":"IF($J972=\"\",\"\",IF($I972>Trimestre!$D$2,\"Non débuté\",IF(Trimestre!$D$2>$J972,\"Terminé\",\"Courant\")))","v":""}]
[null,null,null,null,null,null,null,null,null,null,{"$f":"IF($J973=\"\",\"\",IF($L973=\"Courant\",Donnees!$A$3,IF($L973=\"terminé\",Donnees!$A$4,IF($L974=\"Non débuté\",\"\"))))","v":""},{"$f":"IF($J973=\"\",\"\",IF($I973>Trimestre!$D$2,\"Non débuté\",IF(Trimestre!$D$2>$J973,\"Terminé\",\"Courant\")))","v":""}]
[null,null,null,null,null,null,null,null,null,null,{"$f":"IF($J974=\"\",\"\",IF($L974=\"Courant\",Donnees!$A$3,IF($L974=\"terminé\",Donnees!$A$4,IF($L975=\"Non débuté\",\"\"))))","v":""},{"$f":"IF($J974=\"\",\"\",IF($I974>Trimestre!$D$2,\"Non débuté\",IF(Trimestre!$D$2>$J974,\"Terminé\",\"Courant\")))","v":""}]
[null,null,null,null,null,null,null,null,null,null,{"$f":"IF($J975=\"\",\"\",IF($L975=\"Courant\",Donnees!$A$3,IF($L975=\"terminé\",Donnees!$A$4,IF($L976=\"Non débuté\",\"\"))))","v":""},{"$f":"IF($J975=\"\",\"\",IF($I975>Trimestre!$D$2,\"Non débuté\",IF(Trimestre!$D$2>$J975,\"Terminé\",\"Courant\")))","v":""}]
[null,null,null,null,null,null,null,null,null,null,{"$f":"IF($J976=\"\",\"\",IF($L976=\"Courant\",Donnees!$A$3,IF($L976=\"terminé\",Donnees!$A$4,IF($L977=\"Non débuté\",\"\"))))","v":""},{"$f":"IF($J976=\"\",\"\",IF($I976>Trimestre!$D$2,\"Non débuté\",IF(Trimestre!$D$2>$J976,\"Terminé\",\"Courant\")))","v":""}]
[null,null,null,null,null,null,null,null,null,null,{"$f":"IF($J977=\"\",\"\",IF($L977=\"Courant\",Donnees!$A$3,IF($L977=\"terminé\",Donnees!$A$4,IF($L978=\"Non débuté\",\"\"))))","v":""},{"$f":"IF($J977=\"\",\"\",IF($I977>Trimestre!$D$2,\"Non débuté\",IF(Trimestre!$D$2>$J977,\"Terminé\",\"Courant\")))","v":""}]
[null,null,null,null,null,null,null,null,null,null,{"$f":"IF($J978=\"\",\"\",IF($L978=\"Courant\",Donnees!$A$3,IF($L978=\"terminé\",Donnees!$A$4,IF($L979=\"Non débuté\",\"\"))))","v":""},{"$f":"IF($J978=\"\",\"\",IF($I978>Trimestre!$D$2,\"Non débuté\",IF(Trimestre!$D$2>$J978,\"Terminé\",\"Courant\")))","v":""}]
[null,null,null,null,null,null,null,null,null,null,{"$f":"IF($J979=\"\",\"\",IF($L979=\"Courant\",Donnees!$A$3,IF($L979=\"terminé\",Donnees!$A$4,IF($L980=\"Non débuté\",\"\"))))","v":""},{"$f":"IF($J979=\"\",\"\",IF($I979>Trimestre!$D$2,\"Non débuté\",IF(Trimestre!$D$2>$J979,\"Terminé\",\"Courant\")))","v":""}]
[null,null,null,null,null,null,null,null,null,null,{"$f":"IF($J980=\"\",\"\",IF($L980=\"Courant\",Donnees!$A$3,IF($L980=\"terminé\",Donnees!$A$4,IF($L981=\"Non débuté\",\"\"))))","v":""},{"$f":"IF($J980=\"\",\"\",IF($I980>Trimestre!$D$2,\"Non débuté\",IF(Trimestre!$D$2>$J980,\"Terminé\",\"Courant\")))","v":""}]
[null,null,null,null,null,null,null,null,null,null,{"$f":"IF($J981=\"\",\"\",IF($L981=\"Courant\",Donnees!$A$3,IF($L981=\"terminé\",Donnees!$A$4,IF($L982=\"Non débuté\",\"\"))))","v":""},{"$f":"IF($J981=\"\",\"\",IF($I981>Trimestre!$D$2,\"Non débuté\",IF(Trimestre!$D$2>$J981,\"Terminé\",\"Courant\")))","v":""}]
[null,null,null,null,null,null,null,null,null,null,{"$f":"IF($J982=\"\",\"\",IF($L982=\"Courant\",Donnees!$A$3,IF($L982=\"terminé\",Donnees!$A$4,IF($L983=\"Non débuté\",\"\"))))","v":""},{"$f":"IF($J982=\"\",\"\",IF($I982>Trimestre!$D$2,\"Non débuté\",IF(Trimestre!$D$2>$J982,\"Terminé\",\"Courant\")))","v":""}]
[null,null,null,null,null,null,null,null,null,null,{"$f":"IF($J983=\"\",\"\",IF($L983=\"Courant\",Donnees!$A$3,IF($L983=\"terminé\",Donnees!$A$4,IF($L984=\"Non débuté\",\"\"))))","v":""},{"$f":"IF($J983=\"\",\"\",IF($I983>Trimestre!$D$2,\"Non débuté\",IF(Trimestre!$D$2>$J983,\"Terminé\",\"Courant\")))","v":""}]
[null,null,null,null,null,null,null,null,null,null,{"$f":"IF($J984=\"\",\"\",IF($L984=\"Courant\",Donnees!$A$3,IF($L984=\"terminé\",Donnees!$A$4,IF($L985=\"Non débuté\",\"\"))))","v":""},{"$f":"IF($J984=\"\",\"\",IF($I984>Trimestre!$D$2,\"Non débuté\",IF(Trimestre!$D$2>$J984,\"Terminé\",\"Courant\")))","v":""}]
[null,null,null,null,null,null,null,null,null,null,{"$f":"IF($J985=\"\",\"\",IF($L985=\"Courant\",Donnees!$A$3,IF($L985=\"terminé\",Donnees!$A$4,IF($L986=\"Non débuté\",\"\"))))","v":""},{"$f":"IF($J985=\"\",\"\",IF($I985>Trimestre!$D$2,\"Non débuté\",IF(Trimestre!$D$2>$J985,\"Terminé\",\"Courant\")))","v":""}]
[null,null,null,null,null,null,null,null,null,null,{"$f":"IF($J986=\"\",\"\",IF($L986=\"Courant\",Donnees!$A$3,IF($L986=\"terminé\",Donnees!$A$4,IF($L987=\"Non débuté\",\"\"))))","v":""},{"$f":"IF($J986=\"\",\"\",IF($I986>Trimestre!$D$2,\"Non débuté\",IF(Trimestre!$D$2>$J986,\"Terminé\",\"Courant\")))","v":""}]
[null,null,null,null,null,null,null,null,null,null,{"$f":"IF($J987=\"\",\"\",IF($L987=\"Courant\",Donnees!$A$3,IF($L987=\"terminé\",Donnees!$A$4,IF($L988=\"Non débuté\",\"\"))))","v":""},{"$f":"IF($J987=\"\",\"\",IF($I987>Trimestre!$D$2,\"Non débuté\",IF(Trimestre!$D$2>$J987,\"Terminé\",\"Courant\")))","v":""}]
[null,null,null,null,null,null,null,null,null,null,{"$f":"IF($J988=\"\",\"\",IF($L988=\"Courant\",Donnees!$A$3,IF($L988=\"terminé\",Donnees!$A$4,IF($L989=\"Non débuté\",\"\"))))","v":""},{"$f":"IF($J988=\"\",\"\",IF($I988>Trimestre!$D$2,\"Non débuté\",IF(Trimestre!$D$2>$J988,\"Terminé\",\"Courant\")))","v":""}]
[null,null,null,null,null,null,null,null,null,null,{"$f":"IF($J989=\"\",\"\",IF($L989=\"Courant\",Donnees!$A$3,IF($L989=\"terminé\",Donnees!$A$4,IF($L990=\"Non débuté\",\"\"))))","v":""},{"$f":"IF($J989=\"\",\"\",IF($I989>Trimestre!$D$2,\"Non débuté\",IF(Trimestre!$D$2>$J989,\"Terminé\",\"Courant\")))","v":""}]
[null,null,null,null,null,null,null,null,null,null,{"$f":"IF($J990=\"\",\"\",IF($L990=\"Courant\",Donnees!$A$3,IF($L990=\"terminé\",Donnees!$A$4,IF($L991=\"Non débuté\",\"\"))))","v":""},{"$f":"IF($J990=\"\",\"\",IF($I990>Trimestre!$D$2,\"Non débuté\",IF(Trimestre!$D$2>$J990,\"Terminé\",\"Courant\")))","v":""}]
[null,null,null,null,null,null,null,null,null,null,{"$f":"IF($J991=\"\",\"\",IF($L991=\"Courant\",Donnees!$A$3,IF($L991=\"terminé\",Donnees!$A$4,IF($L992=\"Non débuté\",\"\"))))","v":""},{"$f":"IF($J991=\"\",\"\",IF($I991>Trimestre!$D$2,\"Non débuté\",IF(Trimestre!$D$2>$J991,\"Terminé\",\"Courant\")))","v":""}]
[null,null,null,null,null,null,null,null,null,null,{"$f":"IF($J992=\"\",\"\",IF($L992=\"Courant\",Donnees!$A$3,IF($L992=\"terminé\",Donnees!$A$4,IF($L993=\"Non débuté\",\"\"))))","v":""},{"$f":"IF($J992=\"\",\"\",IF($I992>Trimestre!$D$2,\"Non débuté\",IF(Trimestre!$D$2>$J992,\"Terminé\",\"Courant\")))","v":""}]
[null,null,null,null,null,null,null,null,null,null,{"$f":"IF($J993=\"\",\"\",IF($L993=\"Courant\",Donnees!$A$3,IF($L993=\"terminé\",Donnees!$A$4,IF($L994=\"Non débuté\",\"\"))))","v":""},{"$f":"IF($J993=\"\",\"\",IF($I993>Trimestre!$D$2,\"Non débuté\",IF(Trimestre!$D$2>$J993,\"Terminé\",\"Courant\")))","v":""}]
[null,null,null,null,null,null,null,null,null,null,{"$f":"IF($J994=\"\",\"\",IF($L994=\"Courant\",Donnees!$A$3,IF($L994=\"terminé\",Donnees!$A$4,IF($L995=\"Non débuté\",\"\"))))","v":""},{"$f":"IF($J994=\"\",\"\",IF($I994>Trimestre!$D$2,\"Non débuté\",IF(Trimestre!$D$2>$J994,\"Terminé\",\"Courant\")))","v":""}]
[null,null,null,null,null,null,null,null,null,null,{"$f":"IF($J995=\"\",\"\",IF($L995=\"Courant\",Donnees!$A$3,IF($L995=\"terminé\",Donnees!$A$4,IF($L996=\"Non débuté\",\"\"))))","v":""},{"$f":"IF($J995=\"\",\"\",IF($I995>Trimestre!$D$2,\"Non débuté\",IF(Trimestre!$D$2>$J995,\"Terminé\",\"Courant\")))","v":""}]
[null,null,null,null,null,null,null,null,null,null,{"$f":"IF($J996=\"\",\"\",IF($L996=\"Courant\",Donnees!$A$3,IF($L996=\"terminé\",Donnees!$A$4,IF($L997=\"Non débuté\",\"\"))))","v":""},{"$f":"IF($J996=\"\",\"\",IF($I996>Trimestre!$D$2,\"Non débuté\",IF(Trimestre!$D$2>$J996,\"Terminé\",\"Courant\")))","v":""}]
[null,null,null,null,null,null,null,null,null,null,{"$f":"IF($J997=\"\",\"\",IF($L997=\"Courant\",Donnees!$A$3,IF($L997=\"terminé\",Donnees!$A$4,IF($L998=\"Non débuté\",\"\"))))","v":""},{"$f":"IF($J997=\"\",\"\",IF($I997>Trimestre!$D$2,\"Non débuté\",IF(Trimestre!$D$2>$J997,\"Terminé\",\"Courant\")))","v":""}]
[null,null,null,null,null,null,null,null,null,null,{"$f":"IF($J998=\"\",\"\",IF($L998=\"Courant\",Donnees!$A$3,IF($L998=\"terminé\",Donnees!$A$4,IF($L999=\"Non débuté\",\"\"))))","v":""},{"$f":"IF($J998=\"\",\"\",IF($I998>Trimestre!$D$2,\"Non débuté\",IF(Trimestre!$D$2>$J998,\"Terminé\",\"Courant\")))","v":""}]
[null,null,null,null,null,null,null,null,null,null,{"$f":"IF($J999=\"\",\"\",IF($L999=\"Courant\",Donnees!$A$3,IF($L999=\"terminé\",Donnees!$A$4,IF($L1000=\"Non débuté\",\"\"))))","v":""},{"$f":"IF($J999=\"\",\"\",IF($I999>Trimestre!$D$2,\"Non débuté\",IF(Trimestre!$D$2>$J999,\"Terminé\",\"Courant\")))","v":""}]
[null,null,null,null,null,null,null,null,null,null,{"$f":"IF($J1000=\"\",\"\",IF($L1000=\"Courant\",Donnees!$A$3,IF($L1000=\"terminé\",Donnees!$A$4,IF($L1001=\"Non débuté\",\"\"))))","v":""},{"$f":"IF($J1000=\"\",\"\",IF($I1000>Trimestre!$D$2,\"Non débuté\",IF(Trimestre!$D$2>$J1000,\"Terminé\",\"Courant\")))","v":""}]

{"sheet":"Trimestre","index":1,"n_rows":5,"n_cols":5,"rows_kept":5,"cut":false,"hidden":false,"merged":[[0,0,0,2],[1,3,4,3],[1,4,4,4]]}
["TRIMESTRES",null,null,"Trimestre actuel","Date"]
["T1","2019-07-01","2019-09-30",{"$f":"IF(AND(E2>=$B$2,E2<=$C$2),$A$2,IF(AND(E2>=$B$3,E2<=$C$3),$A$3,IF(AND(E2>=$B$4,E2<=$C$4),$A$4,IF(AND(E2>=$B$5,E2<=$C$5),$A$5,\"\"))))","v":"T2"},{"$f":"TODAY()","v":"2019-10-07"}]
["T2","2019-10-01","2019-12-31"]
["T3","2020-01-01","2020-03-31"]
["T4","2020-04-01","2020-06-30"]

{"sheet":"Donnees","index":2,"n_rows":22,"n_cols":11,"rows_kept":22,"cut":false,"hidden":false,"merged":[]}
["Statut",null,"Directions","Directeurs",null,"Cadres ","Direction","Secteur","Fonction",null,"Trimestre"]
["Réalisé",null,"DG","Denis Deschamps",null,"Christian Héon","Études","Études","Directeur des études",null,"T1"]
["En cours",null,"Études","Christian Héon",null,"Chantal Guimond","Finances","Finances","Coordonnatrice du Service des finances",null,"T2"]
["En retard",null,"RH","Mélanie Bélanger",null,"Claire Boisclair","RH","RH","Coordonnatrice du Service des ressources humaines",null,"T3"]
["Reporté",null,"Admin","François St-Cyr",null,"Claude Boucher","Admin","Admin","Contremaître d’entretien général",null,"T4"]
["Annulé",null,"FC","Frédérick Michaud",null,"Daniel Cloutier","Études","Informatique","Coordonnateur de l’informatique"]
[null,null,"ENME","Martin Demers",null,"Denis Deschamps","DG","DG","Directeur général"]
[null,null,"INAB","Normand Poniewiera",null,"François St-Cyr","Admin","Admin","Directeur des services administratifs et secrétaire général"]
[null,null,null,null,null,"Frédérick Michaud","FC","FC","Directeur du Service de la formation continue"]
[null,null,null,null,null,"Jean Duval","INAB","CETAB+","Coordonnateur du Centre d’expertise et de transfert en agriculture biologique et de proximité (CETAB+)"]
[null,null,null,null,null,"Julie Crevier","ENME","ENME Montréal","Coordonnatrice du campus de Montréal"]
[null,null,null,null,null,"Karl Castonguay","Études","Affaires étudiantes","Directeur adjoint aux affaires étudiantes"]
[null,null,null,null,null,"Mariannick Paris","Études","Organisation scolaire","Directrice adjointe à l’organisation scolaire"]
[null,null,null,null,null,"Marie-Claude Hardy","Études","Dév. pédago.","Directrice adjointe à la pédagogie"]
[null,null,null,null,null,"Martin Demers","ENME  ","ENME  ","Directeur de l’École nationale du meuble et de l’ébénisterie (ENME)"]
[null,null,null,null,null,"Mélanie Bélanger","RH","RH","Directrice du Service des ressources humaines"]
[null,null,null,null,null,"Nicolas Pearson","ENME","Inovem","Coordonnateur du Centre d’innovation en ébénisterie et meuble (Inovem) par intérim"]
[null,null,null,null,null,"Nicolas St-Pierre","INAB","INAB","Coordonnateur technique de l’Institut national d’agriculture biologique (INAB)"]
[null,null,null,null,null,"Normand Poniewiera","INAB","INAB","Directeur de l’Institut national d’agriculture biologique (INAB)"]
[null,null,null,null,null,"Pierre Nourry","ENME","ENME","Coordonnateur des ateliers des campus de Victoriaville et Montréal de l’École nationale du meuble et de l’ébénisterie (ENME)"]
[null,null,null,null,null,"Simon Dugré","INAB","CISA","Coordonnateur Centre d’innovation sociale en agriculture (CISA)"]
[null,null,null,null,null,"Stéphane Jacques","Admin","Ress. mat.","Coordonnateur du Service des ressources matérielles"]

{"sheet":"PageMaitre","index":3,"n_rows":39,"n_cols":10,"rows_kept":39,"cut":false,"hidden":false,"merged":[]}
["No","Objectifs stratégiques","Objectifs annuels","Actions","Cadre responsable","Cadre soutien1","Cadre soutien2","Cadre soutien3","Début","Fin"]
["1.1","Texte1","Texte1",{"$f":"VLOOKUP(E2,Donnees!$F$2:$G$22,2)","v":"ENME"},"Karl  "]
["1.2","Texte1","Texte1",{"$f":"VLOOKUP(E3,Donnees!$F$2:$G$22,2)","v":"ENME"},"Karl  "]
["1.3","Texte1","Texte1",{"$f":"VLOOKUP(E4,Donnees!$F$2:$G$22,2)","v":"Études"},"Mariannick  "]
["2.2","Texte1","Texte1",{"$f":"VLOOKUP(E5,Donnees!$F$2:$G$22,2)","v":"Études"},"Marie-Claude  "]
["2.4","Texte1","Texte1",{"$f":"VLOOKUP(E6,Donnees!$F$2:$G$22,2)","v":"Études"},"Denis  "]
["2.4","Texte1","Texte1",{"$f":"VLOOKUP(E7,Donnees!$F$2:$G$22,2)","v":"Études"},"Marie-Claude"]
["2.4","Texte1","Texte1",{"$f":"VLOOKUP(E8,Donnees!$F$2:$G$22,2)","v":"Admin"},"Fred "]
["2.4","Texte1","Texte1",{"$f":"VLOOKUP(E9,Donnees!$F$2:$G$22,2)","v":"Admin"},"Fred "]
["2.4","Texte1","Texte1",{"$f":"VLOOKUP(E10,Donnees!$F$2:$G$22,2)","v":"INAB"},"Normand  "]
["2.4","Texte1","Texte1",{"$f":"VLOOKUP(E11,Donnees!$F$2:$G$22,2)","v":"Études"},"Marie"]
["2.5","Texte1","Texte1",{"$f":"VLOOKUP(E12,Donnees!$F$2:$G$22,2)","v":"Études"},"Mariannick"]
["2.5","Texte1","Texte1",{"$f":"VLOOKUP(E13,Donnees!$F$2:$G$22,2)","v":"Études"},"Mariannick"]
["2.6","Texte1","Texte1",{"$f":"VLOOKUP(E14,Donnees!$F$2:$G$22,2)","v":"DG"},"Francois "]
["3.1","Texte1","Texte1",{"$f":"VLOOKUP(E15,Donnees!$F$2:$G$22,2)","v":"Admin"},"Fred "]
["3.2","Texte1","Texte1",{"$f":"VLOOKUP(E16,Donnees!$F$2:$G$22,2)","v":"Études"},"Martin"]
["3.2","Texte1","Texte1",{"$f":"VLOOKUP(E17,Donnees!$F$2:$G$22,2)","v":"INAB"},"Normand"]
["3.3","Texte1","Texte1",{"$f":"VLOOKUP(E18,Donnees!$F$2:$G$22,2)","v":"INAB"},"Normand"]
["3.3","Texte1","Texte1",{"$f":"VLOOKUP(E19,Donnees!$F$2:$G$22,2)","v":"ENME"},"Simon"]
["3.3","Texte1","Texte1",{"$f":"VLOOKUP(E20,Donnees!$F$2:$G$22,2)","v":"INAB"},"Normand"]
["3.4","Texte1","Texte1",{"$f":"VLOOKUP(E21,Donnees!$F$2:$G$22,2)","v":"FC"},"Jean"]
["3.5","Texte1","Texte1",{"$f":"VLOOKUP(E22,Donnees!$F$2:$G$22,2)","v":"Admin"},"Fred "]
["4.1","Texte1","Texte1",{"$f":"VLOOKUP(E23,Donnees!$F$2:$G$22,2)","v":"Finances"},"Claire  "]
["4.1","Texte1","Texte1",{"$f":"VLOOKUP(E24,Donnees!$F$2:$G$22,2)","v":"Études"},"Mariannick"]
["4.2","Texte1","Texte1",{"$f":"VLOOKUP(E25,Donnees!$F$2:$G$22,2)","v":"ENME  "},"Melanie"]
["4.3","Texte1","Texte1",{"$f":"VLOOKUP(E26,Donnees!$F$2:$G$22,2)","v":"DG"},"Francois "]
["4.3","Texte1","Texte1",{"$f":"VLOOKUP(E27,Donnees!$F$2:$G$22,2)","v":"Finances"},"Claire"]
["4.4","Texte1","Texte1",{"$f":"VLOOKUP(E28,Donnees!$F$2:$G$22,2)","v":"Finances"},"Claire  "]
["4.4","Texte1","Texte1",{"$f":"VLOOKUP(E29,Donnees!$F$2:$G$22,2)","v":"ENME  "},"Melanie"]
["5.1","Texte1","Texte1",{"$f":"VLOOKUP(E30,Donnees!$F$2:$G$22,2)","v":"Études"},"Denis "]
["5.1","Texte1","Texte1",{"$f":"VLOOKUP(E31,Donnees!$F$2:$G$22,2)","v":"DG"},"Francois "]
["5.1","Texte1","Texte1",{"$f":"VLOOKUP(E32,Donnees!$F$2:$G$22,2)","v":"DG"},"Francois "]
["5.2","Texte1","Texte1",{"$f":"VLOOKUP(E33,Donnees!$F$2:$G$22,2)","v":"Finances"},"Christian"]
["5.2","Texte1","Texte1",{"$f":"VLOOKUP(E34,Donnees!$F$2:$G$22,2)","v":"Études"},"Denis"]
["5.2","Texte1","Texte1",{"$f":"VLOOKUP(E35,Donnees!$F$2:$G$22,2)","v":"ENME  "},"Melanie"]
["5.3","Texte1","Texte1",{"$f":"VLOOKUP(E36,Donnees!$F$2:$G$22,2)","v":"Études"},"Denis"]
["5.4","Texte1","Texte1",{"$f":"VLOOKUP(E37,Donnees!$F$2:$G$22,2)","v":"Admin"},"Daniel  "]
["5.4","Texte1","Texte1",{"$f":"VLOOKUP(E38,Donnees!$F$2:$G$22,2)","v":"RH"},"Nicolas"]
["5.5","Texte1","Texte1",{"$f":"VLOOKUP(E39,Donnees!$F$2:$G$22,2)","v":"Admin"},"Daniel  "]