{"text_format":"1","workbook":"xlsx","n_sheets":4,"sheets":["DG","Trimestre","Donnees","PageMaitre"],"not_rendered":{"charts":0,"images":1,"macros":1,"external_links":0,"defined_names":25,"comments":0,"pivot_tables":0},"unopened":[],"bounds":{"document_bytes":16777216,"sheet_cells":100000,"rows_first":2000,"rows_last":500,"rows_between":2000,"halvings":0,"cell_chars":16384,"cell_head_chars":4096},"cells_cut":0,"cells_raw":0,"read":"whole","date_system":"1900"}

{"sheet":"DG","index":0,"n_rows":1000,"n_cols":13,"rows_kept":1000,"cut":false,"hidden":false,"merged":[[5,12,11,12],[4,0,4,2],[5,10,11,11],[13,0,13,9]]}
[null,null,null,"ZONE DE CRITÈRES"]
["No","Objectifs stratégiques","Objectifs annuels","Actions","Cadre responsable","Cadre soutien1","Cadre soutien2","Cadre soutien3","Début","Fin"]
[null,null,null,"DG"]
[]
[null,null,null," "]
[null,null,null,null,null,null,null,null,null,null,{"$f":"Trimestre!D2","v":"T2"}]
[]
[]
[]
[]
[]
[]
[]
[{"$f":"IF($D$3=\"\", \"MODÈLE\",$D$3)","v":"DG"}]
["No","Objectifs stratégiques","Objectifs annuels","Actions","Cadre responsable","Cadre soutien1","Cadre soutien2","Cadre soutien3","Début","Fin","Statut","Trimestre","COMMENTAIRES"]
["2.4","Faire évoluer de façon cohérente l'ensemble de l'offre de formation au régulier et à la formation continue.","Texte1","DG","Denis  ",null,null,null,"T1","T2","Réalisé",{"$f":"IF($J16=\"\",\"\",IF($I16>Trimestre!$D$2,\"Non débuté\",IF(Trimestre!$D$2>$J16,\"Terminé\",\"Courant\")))","v":"Courant"}]
["5.1","Mieux structurer les projets de développement.","Texte1","DG","Denis ",null,null,null,"T1","T2",{"$f":"IF($J17=\"\",\"\",IF($L17=\"Courant\",Donnees!$A$3,IF($L17=\"terminé\",Donnees!$A$4,IF($L18=\"Non débuté\",\"\"))))","v":"En cours"},{"$f":"IF($J17=\"\",\"\",IF($I17>Trimestre!$D$2,\"Non débuté\",IF(Trimestre!$D$2>$J17,\"Terminé\",\"Courant\")))","v":"Courant"}]
["5.2","Analyser régulièrement l'efficacité des processus stratégiques.","Texte 2","DG","Denis",null,null,null,"T1","T2",{"$f":"IF($J18=\"\",\"\",IF($L18=\"Courant\",Donnees!$A$3,IF($L18=\"terminé\",Donnees!$A$4,IF($L19=\"Non débuté\",\"\"))))","v":"En cours"},{"$f":"IF($J18=\"\",\"\",IF($I18>Trimestre!$D$2,\"Non débuté\",IF(Trimestre!$D$2>$J18,\"Terminé\",\"Courant\")))","v":"Courant"}]
["5.3","Revoir les rôles et responsabilités au regard des objectifs du présent plan stratégique.","Texte 3","DG","Denis",null,null,null,"T1","T2",{"$f":"IF($J19=\"\",\"\",IF($L19=\"Courant\",Donnees!$A$3,IF($L19=\"terminé\",Donnees!$A$4,IF($L20=\"Non débuté\",\"\"))))","v":"En cours"},{"$f":"IF($J19=\"\",\"\",IF($I19>Trimestre!$D$2,\"Non débuté\",IF(Trimestre!$D$2>$J19,\"Terminé\",\"Courant\")))","v":"Courant"}]
[null,null,null,null,null,null,null,null,null,null,{"$f":"IF($J20=\"\",\"\",IF($L20=\"Courant\",Donnees!$A$3,IF($L20=\"terminé\",Donnees!$A$4,IF($L21=\"Non débuté\",\"\"))))","v":""},{"$f":"IF($J20=\"\",\"\",IF($I20>Trimestre!$D$2,\"Non débuté\",IF(Trimestre!$D$2>$J20,\"Terminé\",\"Courant\")))","v":""},{"$f":"COUNTIF($K$15:$K$100000,\"><\")","v":5}]
[null,null,null,null,null,null,null,null,null,null,{"$f":"IF($J21=\"\",\"\",IF($L21=\"Courant\",Donnees!$A$3,IF($L21=\"terminé\",Donnees!$A$4,IF($L22=\"Non débuté\",\"\"))))","v":""},{"$f":"IF($J21=\"\",\"\",IF($I21>Trimestre!$D$2,\"Non débuté\",IF(Trimestre!$D$2>$J21,\"Terminé\",\"Courant\")))","v":""},{"$f":"OFFSET(DG!$A$1:$L$1,,,COUNTIF($K$15:$K$100000,\"><\")+14)","v":{"$error":"#VALUE!"}}]
[null,null,null,null,null,null,null,null,null,null,{"$f":"IF($J22=\"\",\"\",IF($L22=\"Courant\",Donnees!$A$3,IF($L22=\"terminé\",Donnees!$A$4,IF($L23=\"Non débuté\",\"\"))))","v":""},{"$f":"IF($J22=\"\",\"\",IF($I22>Trimestre!$D$2,\"Non débuté\",IF(Trimestre!$D$2>$J22,\"Terminé\",\"Courant\")))","v":""}]
[null,null,null,null,null,null,null,null,null,null,{"$f":"IF($J23=\"\",\"\",IF($L23=\"Courant\",Donnees!$A$3,IF($L23=\"terminé\",Donnees!$A$4,IF($L24=\"Non débuté\",\"\"))))","v":""},{"$f":"IF($J23=\"\",\"\",IF($I23>Trimestre!$D$2,\"Non débuté\",IF(Trimestre!$D$2>$J23,\"Terminé\",\"Courant\")))","v":""}]
[null,null,null,null,null,null,null,null,null,null,{"$f":"IF($J24=\"\",\"\",IF($L24=\"Courant\",Donnees!$A$3,IF($L24=\"terminé\",Donnees!$A$4,IF($L25=\"Non débuté\",\"\"))))","v":""},{"$f":"IF($J24=\"\",\"\",IF($I24>Trimestre!$D$2,\"Non débuté\",IF(Trimestre!$D$2>$J24,\"Terminé\",\"Courant\")))","v":""}]
[null,null,null,null,null,null,null,null,null,null,{"$f":"IF($J25=\"\",\"\",IF($L25=\"Courant\",Donnees!$A$3,IF($L25=\"terminé\",Donnees!$A$4,IF($L26=\"Non débuté\",\"\"))))","v":""},{"$f":"IF($J25=\"\",\"\",IF($I25>Trimestre!$D$2,\"Non débuté\",IF(Trimestre!$D$2>$J25,\"Terminé\",\"Courant\")))","v":""}]
[null,null,null,null,null,null,null,null,null,null,{"$f":"IF($J26=\"\",\"\",IF($L26=\"Courant\",Donnees!$A$3,IF($L26=\"terminé\",Donnees!$A$4,IF($L27=\"Non débuté\",\"\"))))","v":""},{"$f":"IF($J26=\"\",\"\",IF($I26>Trimestre!$D$2,\"Non débuté\",IF(Trimestre!$D$2>$J26,\"Terminé\",\"Courant\")))","v":""}]
[null,null,null,null,null,null,null,null,null,null,{"$f":"IF($J27=\"\",\"\",IF($L27=\"Courant\",Donnees!$A$3,IF($L27=\"terminé\",Donnees!$A$4,IF($L28=\"Non débuté\",\"\"))))","v":""},{"$f":"IF($J27=\"\",\"\",IF($I27>Trimestre!$D$2,\"Non débuté\",IF(Trimestre!$D$2>$J27,\"Terminé\",\"Courant\")))","v":""}]
[null,null,null,null,null,null,null,null,null,null,{"$f":"IF($J28=\"\",\"\",IF($L28=\"Courant\",Donnees!$A$3,IF($L28=\"terminé\",Donnees!$A$4,IF($L29=\"Non débuté\",\"\"))))","v":""},{"$f":"IF($J28=\"\",\"\",IF($I28>Trimestre!$D$2,\"Non débuté\",IF(Trimestre!$D$2>$J28,\"Terminé\",\"Courant\")))","v":""}]
[null,null,null,null,null,null,null,null,null,null,{"$f":"IF($J29=\"\",\"\",IF($L29=\"Courant\",Donnees!$A$3,IF($L29=\"terminé\",Donnees!$A$4,IF($L30=\"Non débuté\",\"\"))))","v":""},{"$f":"IF($J29=\"\",\"\",IF($I29>Trimestre!$D$2,\"Non débuté\",IF(Trimestre!$D$2>$J29,\"Terminé\",\"Courant\")))","v":""}]
[null,null,null,null,null,null,null,null,null,null,{"$f":"IF($J30=\"\",\"\",IF($L30=\"Courant\",Donnees!$A$3,IF($L30=\"terminé\",Donnees!$A$4,IF($L31=\"Non débuté\",\"\"))))","v":""},{"$f":"IF($J30=\"\",\"\",IF($I30>Trimestre!$D$2,\"Non débuté\",IF(Trimestre!$D$2>$J30,\"Terminé\",\"Courant\")))","v":""}]
[null,null,null,null,null,null,null,null,null,null,{"$f":"IF($J31=\"\",\"\",IF($L31=\"Courant\",Donnees!$A$3,IF($L31=\"terminé\",Donnees!$A$4,IF($L32=\"Non débuté\",\"\"))))","v":""},{"$f":"IF($J31=\"\",\"\",IF($I31>Trimestre!$D$2,\"Non débuté\",IF(Trimestre!$D$2>$J31,\"Terminé\",\"Courant\")))","v":""}]
[null,null,null,null,null,null,null,null,null,null,{"$f":"IF($J32=\"\",\"\",IF($L32=\"Courant\",Donnees!$A$3,IF($L32=\"terminé\",Donnees!$A$4,IF($L33=\"Non débuté\",\"\"))))","v":""},{"$f":"IF($J32=\"\",\"\",IF($I32>Trimestre!$D$2,\"Non débuté\",IF(Trimestre!$D$2>$J32,\"Terminé\",\"Courant\")))","v":""}]
[null,null,null,null,null,null,null,null,null,null,{"$f":"IF($J33=\"\",\"\",IF($L33=\"Courant\",Donnees!$A$3,IF($L33=\"terminé\",Donnees!$A$4,IF($L34=\"Non débuté\",\"\"))))","v":""},{"$f":"IF($J33=\"\",\"\",IF($I33>Trimestre!$D$2,\"Non débuté\",IF(Trimestre!$D$2>$J33,\"Terminé\",\"Courant\")))","v":""}]
[null,null,null,null,null,null,null,null,null,null,{"$f":"IF($J34=\"\",\"\",IF($L34=\"Courant\",Donnees!$A$3,IF($L34=\"terminé\",Donnees!$A$4,IF($L35=\"Non débuté\",\"\"))))","v":""},{"$f":"IF($J34=\"\",\"\",IF($I34>Trimestre!$D$2,\"Non débuté\",IF(Trimestre!$D$2>$J34,\"Terminé\",\"Courant\")))","v":""}]
[null,null,null,null,null,null,null,null,null,null,{"$f":"IF($J35=\"\",\"\",IF($L35=\"Courant\",Donnees!$A$3,IF($L35=\"terminé\",Donnees!$A$4,IF($L36=\"Non débuté\",\"\"))))","v":""},{"$f":"IF($J35=\"\",\"\",IF($I35>Trimestre!$D$2,\"Non débuté\",IF(Trimestre!$D$2>$J35,\"Terminé\",\"Courant\")))","v":""}]
[null,null,null,null,null,null,null,null,null,null,{"$f":"IF($J36=\"\",\"\",IF($L36=\"Courant\",Donnees!$A$3,IF($L36=\"terminé\",Donnees!$A$4,IF($L37=\"Non débuté\",\"\"))))","v":""},{"$f":"IF($J36=\"\",\"\",IF($I36>Trimestre!$D$2,\"Non débuté\",IF(Trimestre!$D$2>$J36,\"Terminé\",\"Courant\")))","v":""}]
[null,null,null,null,null,null,null,null,null,null,{"$f":"IF($J37=\"\",\"\",IF($L37=\"Courant\",Donnees!$A$3,IF($L37=\"terminé\",Donnees!$A$4,IF($L38=\"Non débuté\",\"\"))))","v":""},{"$f":"IF($J37=\"\",\"\",IF($I37>Trimestre!$D$2,\"Non débuté\",IF(Trimestre!$D$2>$J37,\"Terminé\",\"Courant\")))","v":""}]
[null,null,null,null,null,null,null,null,null,null,{"$f":"IF($J38=\"\",\"\",IF($L38=\"Courant\",Donnees!$A$3,IF($L38=\"terminé\",Donnees!$A$4,IF($L39=\"Non débuté\",\"\"))))","v":""},{"$f":"IF($J38=\"\",\"\",IF($I38>Trimestre!$D$2,\"Non débuté\",IF(Trimestre!$D$2>$J38,\"Terminé\",\"Courant\")))","v":""}]
[null,null,null,null,null,null,null,null,null,null,{"$f":"IF($J39=\"\",\"\",IF($L39=\"Courant\",Donnees!$A$3,IF($L39=\"terminé\",Donnees!$A$4,IF($L40=\"Non débuté\",\"\"))))","v":""},{"$f":"IF($J39=\"\",\"\",IF($I39>Trimestre!$D$2,\"Non débuté\",IF(Trimestre!$D$2>$J39,\"Terminé\",\"Courant\")))","v":""}]
[null,null,null,null,null,null,null,null,null,null,{"$f":"IF($J40=\"\",\"\",IF($L40=\"Courant\",Donnees!$A$3,IF($L40=\"terminé\",Donnees!$A$4,IF($L41=\"Non débuté\",\"\"))))","v":""},{"$f":"IF($J40=\"\",\"\",IF($I40>Trimestre!$D$2,\"Non débuté\",IF(Trimestre!$D$2>$J40,\"Terminé\",\"Courant\")))","v":""}]
[null,null,null,null,null,null,null,null,null,null,{"$f":"IF($J41=\"\",\"\",IF($L41=\"Courant\",Donnees!$A$3,IF($L41=\"terminé\",Donnees!$A$4,IF($L42=\"Non débuté\",\"\"))))","v":""},{"$f":"IF($J41=\"\",\"\",IF($I41>Trimestre!$D$2,\"Non débuté\",IF(Trimestre!$D$2>$J41,\"Terminé\",\"Courant\")))","v":""}]
[null,null,null,null,null,null,null,null,null,null,{"$f":"IF($J42=\"\",\"\",IF($L42=\"Courant\",Donnees!$A$3,IF($L42=\"terminé\",Donnees!$A$4,IF($L43=\"Non débuté\",\"\"))))","v":""},{"$f":"IF($J42=\"\",\"\",IF($I42>Trimestre!$D$2,\"Non débuté\",IF(Trimestre!$D$2>$J42,\"Terminé\",\"Courant\")))","v":""}]
[null,null,null,null,null,null,null,null,null,null,{"$f":"IF($J43=\"\",\"\",IF($L43=\"Courant\",Donnees!$A$3,IF($L43=\"terminé\",Donnees!$A$4,IF($L44=\"Non débuté\",\"\"))))","v":""},{"$f":"IF($J43=\"\",\"\",IF($I43>Trimestre!$D$2,\"Non débuté\",IF(Trimestre!$D$2>$J43,\"Terminé\",\"Courant\")))","v":""}]
[null,null,null,null,null,null,null,null,null,null,{"$f":"IF($J44=\"\",\"\",IF($L44=\"Courant\",Donnees!$A$3,IF($L44=\"terminé\",Donnees!$A$4,IF($L45=\"Non débuté\",\"\"))))","v":""},{"$f":"IF($J44=\"\",\"\",IF($I44>Trimestre!$D$2,\"Non débuté\",IF(Trimestre!$D$2>$J44,\"Terminé\",\"Courant\")))","v":""}]
[null,null,null,null,null,null,null,null,null,null,{"$f":"IF($J45=\"\",\"\",IF($L45=\"Courant\",Donnees!$A$3,IF($L45=\"terminé\",Donnees!$A$4,IF($L46=\"Non débuté\",\"\"))))","v":""},{"$f":"IF($J45=\"\",\"\",IF($I45>Trimestre!$D$2,\"Non débuté\",IF(Trimestre!$D$2>$J45,\"Terminé\",\"Courant\")))","v":""}]
[null,null,null,null,null,null,null,null,null,null,{"$f":"IF($J46=\"\",\"\",IF($L46=\"Courant\",Donnees!$A$3,IF($L46=\"terminé\",Donnees!$A$4,IF($L47=\"Non débuté\",\"\"))))","v":""},{"$f":"IF($J46=\"\",\"\",IF($I46>Trimestre!$D$2,\"Non débuté\",IF(Trimestre!$D$2>$J46,\"Terminé\",\"Courant\")))","v":""}]
[null,null,null,null,null,null,null,null,null,null,{"$f":"IF($J47=\"\",\"\",IF($L47=\"Courant\",Donnees!$A$3,IF($L47=\"terminé\",Donnees!$A$4,IF($L48=\"Non débuté\",\"\"))))","v":""},{"$f":"IF($J47=\"\",\"\",IF($I47>Trimestre!$D$2,\"Non débuté\",IF(Trimestre!$D$2>$J47,\"Terminé\",\"Courant\")))","v":""}]
[null,null,null,null,null,null,null,null,null,null,{"$f":"IF($J48=\"\",\"\",IF($L48=\"Courant\",Donnees!$A$3,IF($L48=\"terminé\",Donnees!$A$4,IF($L49=\"Non débuté\",\"\"))))","v":""},{"$f":"IF($J48=\"\",\"\",IF($I48>Trimestre!$D$2,\"Non débuté\",IF(Trimestre!$D$2>$J48,\"Terminé\",\"Courant\")))","v":""}]
[null,null,null,null,null,null,null,null,null,null,{"$f":"IF($J49=\"\",\"\",IF($L49=\"Courant\",Donnees!$A$3,IF($L49=\"terminé\",Donnees!$A$4,IF($L50=\"Non débuté\",\"\"))))","v":""},{"$f":"IF($J49=\"\",\"\",IF($I49>Trimestre!$D$2,\"Non débuté\",IF(Trimestre!$D$2>$J49,\"Terminé\",\"Courant\")))","v":""}]
[null,null,null,null,null,null,null,null,null,null,{"$f":"IF($J50=\"\",\"\",IF($L50=\"Courant\",Donnees!$A$3,IF($L50=\"terminé\",Donnees!$A$4,IF($L51=\"Non débuté\",\"\"))))","v":""},{"$f":"IF($J50=\"\",\"\",IF($I50>Trimestre!$D$2,\"Non débuté\",IF(Trimestre!$D$2>$J50,\"Terminé\",\"Courant\")))","v":""}]
[null,null,null,null,null,null,null,null,null,null,{"$f":"IF($J51=\"\",\"\",IF($L51=\"Courant\",Donnees!$A$3,IF($L51=\"terminé\",Donnees!$A$4,IF($L52=\"Non débuté\",\"\"))))","v":""},{"$f":"IF($J51=\"\",\"\",IF($I51>Trimestre!$D$2,\"Non débuté\",IF(Trimestre!$D$2>$J51,\"Terminé\",\"Courant\")))","v":""}]
[null,null,null,null,null,null,null,null,null,null,{"$f":"IF($J52=\"\",\"\",IF($L52=\"Courant\",Donnees!$A$3,IF($L52=\"terminé\",Donnees!$A$4,IF($L53=\"Non débuté\",\"\"))))","v":""},{"$f":"IF($J52=\"\",\"\",IF($I52>Trimestre!$D$2,\"Non débuté\",IF(Trimestre!$D$2>$J52,\"Terminé\",\"Courant\")))","v":""}]
[null,null,null,null,null,null,null,null,null,null,{"$f":"IF($J53=\"\",\"\",IF($L53=\"Courant\",Donnees!$A$3,IF($L53=\"terminé\",Donnees!$A$4,IF($L54=\"Non débuté\",\"\"))))","v":""},{"$f":"IF($J53=\"\",\"\",IF($I53>Trimestre!$D$2,\"Non débuté\",IF(Trimestre!$D$2>$J53,\"Terminé\",\"Courant\")))","v":""}]
[null,null,null,null,null,null,null,null,null,null,{"$f":"IF($J54=\"\",\"\",IF($L54=\"Courant\",Donnees!$A$3,IF($L54=\"terminé\",Donnees!$A$4,IF($L55=\"Non débuté\",\"\"))))","v":""},{"$f":"IF($J54=\"\",\"\",IF($I54>Trimestre!$D$2,\"Non débuté\",IF(Trimestre!$D$2>$J54,\"Terminé\",\"Courant\")))","v":""}]
[null,null,null,null,null,null,null,null,null,null,{"$f":"IF($J55=\"\",\"\",IF($L55=\"Courant\",Donnees!$A$3,IF($L55=\"terminé\",Donnees!$A$4,IF($L56=\"Non débuté\",\"\"))))","v":""},{"$f":"IF($J55=\"\",\"\",IF($I55>Trimestre!$D$2,\"Non débuté\",IF(Trimestre!$D$2>$J55,\"Terminé\",\"Courant\")))","v":""}]
[null,null,null,null,null,null,null,null,null,null,{"$f":"IF($J56=\"\",\"\",IF($L56=\"Courant\",Donnees!$A$3,IF($L56=\"terminé\",Donnees!$A$4,IF($L57=\"Non débuté\",\"\"))))","v":""},{"$f":"IF($J56=\"\",\"\",IF($I56>Trimestre!$D$2,\"Non débuté\",IF(Trimestre!$D$2>$J56,\"Terminé\",\"Courant\")))","v":""}]
[null,null,null,null,null,null,null,null,null,null,{"$f":"IF($J57=\"\",\"\",IF($L57=\"Courant\",Donnees!$A$3,IF($L57=\"terminé\",Donnees!$A$4,IF($L58=\"Non débuté\",\"\"))))","v":""},{"$f":"IF($J57=\"\",\"\",IF($I57>Trimestre!$D$2,\"Non débuté\",IF(Trimestre!$D$2>$J57,\"Terminé\",\"Courant\")))","v":""}]
[null,null,null,null,null,null,null,null,null,null,{"$f":"IF($J58=\"\",\"\",IF($L58=\"Courant\",Donnees!$A$3,IF($L58=\"terminé\",Donnees!$A$4,IF($L59=\"Non débuté\",\"\"))))","v":""},{"$f":"IF($J58=\"\",\"\",IF($I58>Trimestre!$D$2,\"Non débuté\",IF(Trimestre!$D$2>$J58,\"Terminé\",\"Courant\")))","v":""}]
[null,null,null,null,null,null,null,null,null,null,{"$f":"IF($J59=\"\",\"\",IF($L59=\"Courant\",Donnees!$A$3,IF($L59=\"terminé\",Donnees!$A$4,IF($L60=\"Non débuté\",\"\"))))","v":""},{"$f":"IF($J59=\"\",\"\",IF($I59>Trimestre!$D$2,\"Non débuté\",IF(Trimestre!$D$2>$J59,\"Terminé\",\"Courant\")))","v":""}]
[null,null,null,null,null,null,null,null,null,null,{"$f":"IF($J60=\"\",\"\",IF($L60=\"Courant\",Donnees!$A$3,IF($L60=\"terminé\",Donnees!$A$4,IF($L61=\"Non débuté\",\"\"))))","v":""},{"$f":"IF($J60=\"\",\"\",IF($I60>Trimestre!$D$2,\"Non débuté\",IF(Trimestre!$D$2>$J60,\"Terminé\",\"Courant\")))","v":""}]
{"$rows_left_out":941}
{"sheet":"Trimestre","index":1,"n_rows":5,"n_cols":5,"rows_kept":5,"cut":false,"hidden":false,"merged":[[0,0,0,2],[1,3,4,3],[1,4,4,4]]}
["TRIMESTRES",null,null,"Trimestre actuel","Date"]
["T1","2019-07-01","2019-09-30",{"$f":"IF(AND(E2>=$B$2,E2<=$C$2),$A$2,IF(AND(E2>=$B$3,E2<=$C$3),$A$3,IF(AND(E2>=$B$4,E2<=$C$4),$A$4,IF(AND(E2>=$B$5,E2<=$C$5),$A$5,\"\"))))","v":"T2"},{"$f":"TODAY()","v":"2019-10-07"}]
["T2","2019-10-01","2019-12-31"]
["T3","2020-01-01","2020-03-31"]
["T4","2020-04-01","2020-06-30"]

{"sheet":"Donnees","index":2,"n_rows":22,"n_cols":11,"rows_kept":22,"cut":false,"hidden":false,"merged":[]}
["Statut",null,"Directions","Directeurs",null,"Cadres ","Direction","Secteur","Fonction",null,"Trimestre"]
["Réalisé",null,"DG","Denis Deschamps",null,"Christian Héon","Études","Études","Directeur des études",null,"T1"]
["En cours",null,"Études","Christian Héon",null,"Chantal Guimond","Finances","Finances","Coordonnatrice du Service des finances",null,"T2"]
["En retard",null,"RH","Mélanie Bélanger",null,"Claire Boisclair","RH","RH","Coordonnatrice du Service des ressources humaines",null,"T3"]
["Reporté",null,"Admin","François St-Cyr",null,"Claude Boucher","Admin","Admin","Contremaître d’entretien général",null,"T4"]
["Annulé",null,"FC","Frédérick Michaud",null,"Daniel Cloutier","Études","Informatique","Coordonnateur de l’informatique"]
[null,null,"ENME","Martin Demers",null,"Denis Deschamps","DG","DG","Directeur général"]
[null,null,"INAB","Normand Poniewiera",null,"François St-Cyr","Admin","Admin","Directeur des services administratifs et secrétaire général"]
[null,null,null,null,null,"Frédérick Michaud","FC","FC","Directeur du Service de la formation continue"]
[null,null,null,null,null,"Jean Duval","INAB","CETAB+","Coordonnateur du Centre d’expertise et de transfert en agriculture biologique et de proximité (CETAB+)"]
[null,null,null,null,null,"Julie Crevier","ENME","ENME Montréal","Coordonnatrice du campus de Montréal"]
[null,null,null,null,null,"Karl Castonguay","Études","Affaires étudiantes","Directeur adjoint aux affaires étudiantes"]
[null,null,null,null,null,"Mariannick Paris","Études","Organisation scolaire","Directrice adjointe à l’organisation scolaire"]
[null,null,null,null,null,"Marie-Claude Hardy","Études","Dév. pédago.","Directrice adjointe à la pédagogie"]
[null,null,null,null,null,"Martin Demers","ENME  ","ENME  ","Directeur de l’École nationale du meuble et de l’ébénisterie (ENME)"]
[null,null,null,null,null,"Mélanie Bélanger","RH","RH","Directrice du Service des ressources humaines"]
[null,null,null,null,null,"Nicolas Pearson","ENME","Inovem","Coordonnateur du Centre d’innovation en ébénisterie et meuble (Inovem) par intérim"]
[null,null,null,null,null,"Nicolas St-Pierre","INAB","INAB","Coordonnateur technique de l’Institut national d’agriculture biologique (INAB)"]
[null,null,null,null,null,"Normand Poniewiera","INAB","INAB","Directeur de l’Institut national d’agriculture biologique (INAB)"]
[null,null,null,null,null,"Pierre Nourry","ENME","ENME","Coordonnateur des ateliers des campus de Victoriaville et Montréal de l’École nationale du meuble et de l’ébénisterie (ENME)"]
[null,null,null,null,null,"Simon Dugré","INAB","CISA","Coordonnateur Centre d’innovation sociale en agriculture (CISA)"]
[null,null,null,null,null,"Stéphane Jacques","Admin","Ress. mat.","Coordonnateur du Service des ressources matérielles"]

{"sheet":"PageMaitre","index":3,"n_rows":39,"n_cols":10,"rows_kept":39,"cut":false,"hidden":false,"merged":[]}
["No","Objectifs stratégiques","Objectifs annuels","Actions","Cadre responsable","Cadre soutien1","Cadre soutien2","Cadre soutien3","Début","Fin"]
["1.1","Texte1","Texte1",{"$f":"VLOOKUP(E2,Donnees!$F$2:$G$22,2)","v":"ENME"},"Karl  "]
["1.2","Texte1","Texte1",{"$f":"VLOOKUP(E3,Donnees!$F$2:$G$22,2)","v":"ENME"},"Karl  "]
["1.3","Texte1","Texte1",{"$f":"VLOOKUP(E4,Donnees!$F$2:$G$22,2)","v":"Études"},"Mariannick  "]
["2.2","Texte1","Texte1",{"$f":"VLOOKUP(E5,Donnees!$F$2:$G$22,2)","v":"Études"},"Marie-Claude  "]
["2.4","Texte1","Texte1",{"$f":"VLOOKUP(E6,Donnees!$F$2:$G$22,2)","v":"Études"},"Denis  "]
["2.4","Texte1","Texte1",{"$f":"VLOOKUP(E7,Donnees!$F$2:$G$22,2)","v":"Études"},"Marie-Claude"]
["2.4","Texte1","Texte1",{"$f":"VLOOKUP(E8,Donnees!$F$2:$G$22,2)","v":"Admin"},"Fred "]
["2.4","Texte1","Texte1",{"$f":"VLOOKUP(E9,Donnees!$F$2:$G$22,2)","v":"Admin"},"Fred "]
["2.4","Texte1","Texte1",{"$f":"VLOOKUP(E10,Donnees!$F$2:$G$22,2)","v":"INAB"},"Normand  "]
["2.4","Texte1","Texte1",{"$f":"VLOOKUP(E11,Donnees!$F$2:$G$22,2)","v":"Études"},"Marie"]
["2.5","Texte1","Texte1",{"$f":"VLOOKUP(E12,Donnees!$F$2:$G$22,2)","v":"Études"},"Mariannick"]
["2.5","Texte1","Texte1",{"$f":"VLOOKUP(E13,Donnees!$F$2:$G$22,2)","v":"Études"},"Mariannick"]
["2.6","Texte1","Texte1",{"$f":"VLOOKUP(E14,Donnees!$F$2:$G$22,2)","v":"DG"},"Francois "]
["3.1","Texte1","Texte1",{"$f":"VLOOKUP(E15,Donnees!$F$2:$G$22,2)","v":"Admin"},"Fred "]
["3.2","Texte1","Texte1",{"$f":"VLOOKUP(E16,Donnees!$F$2:$G$22,2)","v":"Études"},"Martin"]
["3.2","Texte1","Texte1",{"$f":"VLOOKUP(E17,Donnees!$F$2:$G$22,2)","v":"INAB"},"Normand"]
["3.3","Texte1","Texte1",{"$f":"VLOOKUP(E18,Donnees!$F$2:$G$22,2)","v":"INAB"},"Normand"]
["3.3","Texte1","Texte1",{"$f":"VLOOKUP(E19,Donnees!$F$2:$G$22,2)","v":"ENME"},"Simon"]
["3.3","Texte1","Texte1",{"$f":"VLOOKUP(E20,Donnees!$F$2:$G$22,2)","v":"INAB"},"Normand"]
["3.4","Texte1","Texte1",{"$f":"VLOOKUP(E21,Donnees!$F$2:$G$22,2)","v":"FC"},"Jean"]
["3.5","Texte1","Texte1",{"$f":"VLOOKUP(E22,Donnees!$F$2:$G$22,2)","v":"Admin"},"Fred "]
["4.1","Texte1","Texte1",{"$f":"VLOOKUP(E23,Donnees!$F$2:$G$22,2)","v":"Finances"},"Claire  "]
["4.1","Texte1","Texte1",{"$f":"VLOOKUP(E24,Donnees!$F$2:$G$22,2)","v":"Études"},"Mariannick"]
["4.2","Texte1","Texte1",{"$f":"VLOOKUP(E25,Donnees!$F$2:$G$22,2)","v":"ENME  "},"Melanie"]
["4.3","Texte1","Texte1",{"$f":"VLOOKUP(E26,Donnees!$F$2:$G$22,2)","v":"DG"},"Francois "]
["4.3","Texte1","Texte1",{"$f":"VLOOKUP(E27,Donnees!$F$2:$G$22,2)","v":"Finances"},"Claire"]
["4.4","Texte1","Texte1",{"$f":"VLOOKUP(E28,Donnees!$F$2:$G$22,2)","v":"Finances"},"Claire  "]
["4.4","Texte1","Texte1",{"$f":"VLOOKUP(E29,Donnees!$F$2:$G$22,2)","v":"ENME  "},"Melanie"]
["5.1","Texte1","Texte1",{"$f":"VLOOKUP(E30,Donnees!$F$2:$G$22,2)","v":"Études"},"Denis "]
["5.1","Texte1","Texte1",{"$f":"VLOOKUP(E31,Donnees!$F$2:$G$22,2)","v":"DG"},"Francois "]
["5.1","Texte1","Texte1",{"$f":"VLOOKUP(E32,Donnees!$F$2:$G$22,2)","v":"DG"},"Francois "]
["5.2","Texte1","Texte1",{"$f":"VLOOKUP(E33,Donnees!$F$2:$G$22,2)","v":"Finances"},"Christian"]
["5.2","Texte1","Texte1",{"$f":"VLOOKUP(E34,Donnees!$F$2:$G$22,2)","v":"Études"},"Denis"]
["5.2","Texte1","Texte1",{"$f":"VLOOKUP(E35,Donnees!$F$2:$G$22,2)","v":"ENME  "},"Melanie"]
["5.3","Texte1","Texte1",{"$f":"VLOOKUP(E36,Donnees!$F$2:$G$22,2)","v":"Études"},"Denis"]
["5.4","Texte1","Texte1",{"$f":"VLOOKUP(E37,Donnees!$F$2:$G$22,2)","v":"Admin"},"Daniel  "]
["5.4","Texte1","Texte1",{"$f":"VLOOKUP(E38,Donnees!$F$2:$G$22,2)","v":"RH"},"Nicolas"]
["5.5","Texte1","Texte1",{"$f":"VLOOKUP(E39,Donnees!$F$2:$G$22,2)","v":"Admin"},"Daniel  "]