{"text_format":"1","workbook":"xlsx","n_sheets":3,"sheets":["Plan Comptable ","Grand Livre Journal","Budget Subvention"],"not_rendered":{"charts":0,"images":0,"macros":1,"external_links":0,"defined_names":12,"comments":1,"pivot_tables":0},"unopened":[],"bounds":{"document_bytes":16777216,"sheet_cells":100000,"rows_first":2000,"rows_last":500,"rows_between":2000,"halvings":0,"cell_chars":16384,"cell_head_chars":4096},"cells_cut":0,"cells_raw":0,"read":"whole","date_system":"1900"}

{"sheet":"Plan Comptable ","index":0,"n_rows":554,"n_cols":39,"rows_kept":554,"cut":false,"hidden":false,"merged":[[3,0,3,1]]}
[]
["PLAN COMPTABLE"]
[]
["Imputations",null,null,"Libellés","Commentaires",null,null,10,13,15,16,21,27,28,35,40,41,44,46,48,51,53,58,60,61,62,63,64,65,66,67,68,70,74,75,76,77,78,79]
[null,null,null,"Classe 1 : Comptes de capitaux",null,null,null,100,"000","000","000","000","000","000","000","000","000","000","000","600","000","000","000","000","000","000","000","000","000","000","000","000","000","000","000","000","000","000","000"]
[null,null,null,null,null,null,null,null,null,100,null,100,400,100,null,100,100,700,800,700,100,null,null,100,100,100,500,null,"100","100",100,100,100,"",null,500,100,100,"100"]
["10","100",{"$f":"CONCATENATE(A7,B7)","v":"10100"},"Fonds associatifs et réserves","Dons (financiers ou matériels)",null,null,null,null,800,null,110,600,120,null,110,110,null,"860",null,110,null,null,200,300,110,"510",null,"180","110",120,110,110,null,null,700,170,110,"600"]
[null,null,null,null,null,null,null,"",null,null,null,120,680,130,null,120,120,null,870,null,120,"",null,210,320,140,"512",null,"400","160",130,120,120,"",null,800,180,150]
["13","000",{"$f":"CONCATENATE(A9,B9)","v":"13000"},"Subvention d'investissements",null,null,null,null,null,null,null,130,null,140,null,800,130,null,null,null,130,null,null,220,350,200,"518",null,"410","180",140,150,130,null,null,810,200,"160"]
[null,null,"",null,null,null,null,null,null,null,null,140,null,150,null,900,140,null,null,null,140,null,null,221,"360","260",520,null,"440",500,180,"160",140,null,null,null,500,170]
["15","000","15000","Provisions pour Risques et Charges",null,null,null,null,null,null,null,150,null,180,null,null,150,null,null,null,null,null,null,222,"400",270,700,null,"800",700,200,170,"600",null,null,null,520,174]
[null,null,null,null,null,null,null,null,null,null,null,180,null,null,null,null,160,null,null,null,null,null,null,223,500,280,null,null,null,800,500,174,800,"",null,null,"560","600"]
["15","100",15100,"Provisions pour risques",null,null,null,null,null,null,null,null,null,null,null,null,170,null,null,null,null,null,null,224,520,300,"",null,null,"",520,"600",830,null,null,null,"580",650]
[null,null,null,null,null,null,null,null,null,null,null,null,null,"",null,"",180,null,null,null,null,null,null,225,550,310,null,null,null,null,"560",650,850,null,null,null,800,"660"]
["15","800",15800,"Autres provisions pour charges",null,null,null,null,null,null,null,null,null,null,null,null,190,null,null,null,null,null,null,300,"560",340,"",null,null,null,"580","660",880,null,null,null,null,"662"]
[null,null,null,null,null,null,null,"",null,null,null,null,null,null,null,null,600,null,null,null,null,null,null,400,"600","360",null,null,null,null,800,"662",900,null,null,null,null,665]
["16","000","16000","Emprunt et dettes assimilés","Emprunt en banque au crédit et remboursement du capital (mensualité sans les intérêts) au débit",null,null,null,null,null,null,null,null,null,null,null,"",null,null,null,null,null,null,500,"610",370,"",null,null,null,880,665,null,null,null,null,null,700]
[null,null,"",null,null,null,null,null,null,null,null,null,null,null,null,null,null,null,null,null,null,null,null,null,"620",380,null,null,null,null,null,"680",null,null,null,null,null,720]
[null,null,null,"Classe 2 : Comptes d'immobilisations",null,null,null,null,null,null,null,null,null,null,null,null,null,null,null,null,null,null,null,"600","630",400,null,null,null,null,null,700,null,null,null,null,null,740]
[null,null,null,null,null,null,null,null,null,null,null,null,null,null,null,null,null,null,null,null,null,null,null,"610",640,500,null,null,null,null,null,710,null,null,null,null,null,750]
["21","000","21000","IMMOBILISATIONS",null,null,null,null,null,null,null,null,null,null,null,null,null,null,null,null,null,null,null,"630",650,"510",null,null,null,null,null,740,null,null,null,null,null,"760"]
[null,null,null,null,null,null,null,null,null,null,null,null,null,null,null,null,null,null,null,null,null,null,null,640,680,550,null,null,null,null,null,750]
["21","100","21100","Immobilisations corporelles","Investissement en matériel",null,null,null,null,null,null,null,null,null,null,null,null,null,null,null,null,null,null,650,700,570,null,null,null,null,null,"760"]
["21","110","21110","Terrain",null,null,null,null,null,null,null,null,null,null,null,null,null,null,null,null,null,null,null,680,800,"600"]
["21","120","21120","Agencement",null,null,null,null,null,null,null,null,null,null,null,null,null,null,null,null,null,null,null,700,810,"610"]
["21","130","21130","Constructions",null,null,null,null,null,null,null,null,null,null,null,null,null,null,null,null,null,null,null,800,830,"630"]
["21","140","21140","Constructions sur sol d'autrui",null,null,null,null,null,null,null,null,null,null,null,null,null,null,null,null,null,null,null,900,850,650]
["21","150","21150","Installation",null,null,null,"",null,null,null,null,null,null,null,null,null,null,null,null,null,null,null,null,900,700]
["21","180","21180","Autres immobilisations corporelles",null,null,null,null,null,null,null,null,null,null,null,null,null,null,null,null,null,null,null,null,null,800]
[null,null,"",null,null,null,null,null,null,null,null,null,null,null,null,null,null,null,null,null,null,null,null,null,null,810]
{"$rows_left_out":525}
{"sheet":"Grand Livre Journal","index":1,"n_rows":1001,"n_cols":15,"rows_kept":1001,"cut":false,"hidden":false,"merged":[[8,0,9,0],[8,1,9,1],[8,2,9,2],[8,3,8,4],[8,8,9,8],[8,9,9,9],[8,10,9,10],[8,11,9,11],[8,6,9,6],[8,7,9,7]]}
[]
[]
[null,null,null,null,null,null,"ANNEE"]
[]
["FEUILLE DE SAISIE",null,null,null,null,null,null,null,null,"SOUS TOTAL",{"$f":"SUBTOTAL(9,K12:K999)","v":80506.83},{"$f":"SUBTOTAL(9,L12:L999)","v":81539.039999999994}]
[]
[null,null,null,null,null,null,null,null,null,"SOLDE",{"$f":"L5-K5","v":1032.2099999999919}]
[]
["Dates"," B – C – OD","N° Pièces","Imputations",null,null,"Libellés Compte","N° CPT Analytique","Libéllé comptes analytiques","Libellé Pièces","Débit","Crédit"]
[null,null,null," ( 2 premiers chiffres)"," ( 3 derniers chiffres)"]
[]
["2015-02-18","B3",null,78,120,{"$f":"CONCATENATE(D12,E12)","v":"78120"},{"$f":"IF(D12=\"\",\"\",VLOOKUP(F12,'Plan Comptable '!$C$5:$D$554,2,0))","v":{"$error":"#N/A"}},"CC",{"$f":"IF(H12=\"\",\"\",VLOOKUP(H12,#REF!,2,0))","v":{"$error":"#REF!"}},null,2600,null,"-",10,"000"]
["2016-04-30","B4",null,62,"260","62260",{"$f":"IF(D13=\"\",\"\",VLOOKUP(F13,'Plan Comptable '!$C$5:$D$554,2,0))","v":"Honoraires"},"FAC",{"$f":"IF(H13=\"\",\"\",VLOOKUP(H13,#REF!,2,0))","v":{"$error":"#REF!"}},null,576,null,"B1",13,"100"]
["2016-06-19","B4",null,61,"350","61350",{"$f":"IF(D14=\"\",\"\",VLOOKUP(F14,'Plan Comptable '!$C$5:$D$554,2,0))","v":"Locations mobilières"},"FAC",{"$f":"IF(H14=\"\",\"\",VLOOKUP(H14,#REF!,2,0))","v":{"$error":"#REF!"}},null,65,null,"B2",15,"110"]
["2016-07-05","B4",null,61,"560","61560",{"$f":"IF(D15=\"\",\"\",VLOOKUP(F15,'Plan Comptable '!$C$5:$D$554,2,0))","v":"Maintenance"},"FAC",{"$f":"IF(H15=\"\",\"\",VLOOKUP(H15,#REF!,2,0))","v":{"$error":"#REF!"}},null,588,null,"B3",16,"111"]
["2016-07-26","B4",null,62,"260","62260",{"$f":"IF(D16=\"\",\"\",VLOOKUP(F16,'Plan Comptable '!$C$5:$D$554,2,0))","v":"Honoraires"},"FAC",{"$f":"IF(H16=\"\",\"\",VLOOKUP(H16,#REF!,2,0))","v":{"$error":"#REF!"}},null,1752,null,"B4",20,"120"]
["2016-09-07","B4",null,62,"260","62260",{"$f":"IF(D17=\"\",\"\",VLOOKUP(F17,'Plan Comptable '!$C$5:$D$554,2,0))","v":"Honoraires"},"FAC",{"$f":"IF(H17=\"\",\"\",VLOOKUP(H17,#REF!,2,0))","v":{"$error":"#REF!"}},null,267.2,null,"C",21,"130"]
["2016-11-21","B4",null,62,"260","62260",{"$f":"IF(D18=\"\",\"\",VLOOKUP(F18,'Plan Comptable '!$C$5:$D$554,2,0))","v":"Honoraires"},"FAC",{"$f":"IF(H18=\"\",\"\",VLOOKUP(H18,#REF!,2,0))","v":{"$error":"#REF!"}},null,267.2,null,"OD",27,140]
["2017-01-02","B4",null,61,"560","61560",{"$f":"IF(D19=\"\",\"\",VLOOKUP(F19,'Plan Comptable '!$C$5:$D$554,2,0))","v":"Maintenance"},"FAC",{"$f":"IF(H19=\"\",\"\",VLOOKUP(H19,#REF!,2,0))","v":{"$error":"#REF!"}},null,1092,null,null,28,150]
["2017-02-16","B4",null,61,"560","61560",{"$f":"IF(D20=\"\",\"\",VLOOKUP(F20,'Plan Comptable '!$C$5:$D$554,2,0))","v":"Maintenance"},"FAC",{"$f":"IF(H20=\"\",\"\",VLOOKUP(H20,#REF!,2,0))","v":{"$error":"#REF!"}},null,1464,null,null,35]
["2017-11-10","B1",null,62,"260","62260",{"$f":"IF(D21=\"\",\"\",VLOOKUP(F21,'Plan Comptable '!$C$5:$D$554,2,0))","v":"Honoraires"},"ACC",{"$f":"IF(H21=\"\",\"\",VLOOKUP(H21,#REF!,2,0))","v":{"$error":"#REF!"}},null,825,null,null,40]
["2018-01-25","B3",null,62,"260","62260",{"$f":"IF(D22=\"\",\"\",VLOOKUP(F22,'Plan Comptable '!$C$5:$D$554,2,0))","v":"Honoraires"},"ACC",{"$f":"IF(H22=\"\",\"\",VLOOKUP(H22,#REF!,2,0))","v":{"$error":"#REF!"}},null,1320,null,null,41,160]
["2018-02-07","B1",null,62,"260","62260",{"$f":"IF(D23=\"\",\"\",VLOOKUP(F23,'Plan Comptable '!$C$5:$D$554,2,0))","v":"Honoraires"},"ACC",{"$f":"IF(H23=\"\",\"\",VLOOKUP(H23,#REF!,2,0))","v":{"$error":"#REF!"}},null,150]
["2018-02-20","B1",null,62,"260","62260",{"$f":"IF(D24=\"\",\"\",VLOOKUP(F24,'Plan Comptable '!$C$5:$D$554,2,0))","v":"Honoraires"},"ACC",{"$f":"IF(H24=\"\",\"\",VLOOKUP(H24,#REF!,2,0))","v":{"$error":"#REF!"}},null,1848]
["2018-03-05","B1",null,62,"260","62260",{"$f":"IF(D25=\"\",\"\",VLOOKUP(F25,'Plan Comptable '!$C$5:$D$554,2,0))","v":"Honoraires"},"ACC",{"$f":"IF(H25=\"\",\"\",VLOOKUP(H25,#REF!,2,0))","v":{"$error":"#REF!"}},null,366,null,null,44,170]
["2018-03-06","B1",null,62,"260","62260",{"$f":"IF(D26=\"\",\"\",VLOOKUP(F26,'Plan Comptable '!$C$5:$D$554,2,0))","v":"Honoraires"},"ACC",{"$f":"IF(H26=\"\",\"\",VLOOKUP(H26,#REF!,2,0))","v":{"$error":"#REF!"}},null,480,null,null,46]
["2018-03-14","B1",null,62,"260","62260",{"$f":"IF(D27=\"\",\"\",VLOOKUP(F27,'Plan Comptable '!$C$5:$D$554,2,0))","v":"Honoraires"},"ACC",{"$f":"IF(H27=\"\",\"\",VLOOKUP(H27,#REF!,2,0))","v":{"$error":"#REF!"}},null,120,null,null,48,"174"]
["2018-04-14","B1",null,62,"260","62260",{"$f":"IF(D28=\"\",\"\",VLOOKUP(F28,'Plan Comptable '!$C$5:$D$554,2,0))","v":"Honoraires"},"ACC",{"$f":"IF(H28=\"\",\"\",VLOOKUP(H28,#REF!,2,0))","v":{"$error":"#REF!"}},null,792,null,null,51,"180"]
["2018-04-14","B3",null,21,"130","21130",{"$f":"IF(D29=\"\",\"\",VLOOKUP(F29,'Plan Comptable '!$C$5:$D$554,2,0))","v":"Constructions"},"CC",{"$f":"IF(H29=\"\",\"\",VLOOKUP(H29,#REF!,2,0))","v":{"$error":"#REF!"}},null,1000,null,null,53,"190"]
["2018-05-30","B1",null,62,"260","62260",{"$f":"IF(D30=\"\",\"\",VLOOKUP(F30,'Plan Comptable '!$C$5:$D$554,2,0))","v":"Honoraires"},"ACC",{"$f":"IF(H30=\"\",\"\",VLOOKUP(H30,#REF!,2,0))","v":{"$error":"#REF!"}},null,1062,null,null,58,"200"]
{"$rows_left_out":972}
{"sheet":"Budget Subvention","index":2,"n_rows":56,"n_cols":38,"rows_kept":56,"cut":false,"hidden":true,"merged":[[0,0,0,23],[0,24,1,28],[1,0,1,6],[1,7,1,23],[8,19,8,27],[7,19,7,27],[6,28,6,32],[6,14,6,18],[2,1,2,37],[3,1,3,37],[4,1,4,8],[5,1,5,5],[5,12,5,17],[8,1,8,8],[8,9,8,12],[8,28,8,31],[5,22,5,25],[6,33,6,37],[7,1,7,8],[7,9,7,12],[7,14,7,17],[7,33,7,36],[6,1,6,8],[6,9,6,13],[9,9,9,12],[9,14,9,17],[9,19,9,27],[6,19,6,27],[9,28,9,31],[8,14,8,17],[9,33,9,36],[9,1,9,8],[8,33,8,36],[11,1,11,8],[11,9,11,12],[12,1,12,8],[12,9,12,12],[16,1,16,8],[10,33,10,36],[10,1,10,8],[10,9,10,12],[12,33,12,36],[12,19,12,27],[12,14,12,17],[10,28,10,31],[10,14,10,17],[10,19,10,27],[12,28,12,31],[11,14,11,17],[11,19,11,27],[11,28,11,31],[11,33,11,36],[13,19,13,27],[13,1,13,8],[16,33,16,36],[15,1,15,8],[15,9,15,12],[15,14,15,17],[16,9,16,12],[16,28,16,31],[15,19,15,27],[13,33,13,36],[13,28,13,31],[15,28,15,31],[15,33,15,36],[14,1,14,8],[14,19,14,27],[14,28,14,31],[14,33,14,36],[13,9,13,12],[13,14,13,17],[16,14,16,17],[16,19,16,27],[17,9,17,12],[17,33,17,36],[19,14,19,17],[19,28,19,31],[19,33,19,36],[20,1,20,8],[20,9,20,12],[20,14,20,17],[20,19,20,27],[18,28,18,31],[17,14,17,17],[17,19,17,27],[18,14,18,17],[18,19,18,27],[17,28,17,31],[20,33,20,36],[19,19,19,27],[19,1,19,8],[19,9,19,12],[18,1,18,8],[18,9,18,12],[18,33,18,36],[17,1,17,8],[23,1,23,8],[21,1,21,8],[21,19,21,27],[22,1,22,8],[20,28,20,31],[23,28,23,31],[22,28,22,31],[22,19,22,27],[22,9,22,12],[21,28,21,31],[26,33,26,36],[24,33,24,36],[25,28,25,31],[25,33,25,36],[22,14,22,17],[23,9,23,12],[23,14,23,17],[25,9,25,12],[24,28,24,31],[23,33,23,36],[22,33,22,36],[23,19,23,27],[26,1,26,8],[26,9,26,12],[27,19,27,27],[26,14,26,17],[26,19,26,27],[26,28,26,31],[25,1,25,8],[24,14,24,17],[24,19,24,27],[25,14,25,17],[25,19,25,27],[24,1,24,8],[24,9,24,12],[28,28,28,31],[28,33,28,36],[29,28,29,31],[29,33,29,36],[27,33,27,36],[29,1,29,8],[29,9,29,12],[29,14,29,17],[29,19,29,27],[28,1,28,8],[28,19,28,27],[27,1,27,8],[27,9,27,12],[27,14,27,17],[27,28,27,31],[32,1,32,8],[32,19,32,27],[32,28,32,31],[32,33,32,36],[30,28,30,31],[30,33,30,36],[31,1,31,8],[31,19,31,27],[31,28,31,31],[31,33,31,36],[30,1,30,8],[30,9,30,12],[30,14,30,17],[30,19,30,27],[34,1,34,8],[34,9,34,12],[34,14,34,17],[34,19,34,27],[38,33,38,36],[35,19,35,27],[36,33,36,36],[33,19,33,27],[33,28,33,31],[33,33,33,36],[34,28,34,31],[34,33,34,36],[38,19,38,27],[36,19,36,27],[37,19,37,27],[38,28,38,31],[35,33,35,36],[36,28,36,31],[36,14,36,17],[36,9,36,12],[35,28,35,31],[35,1,35,8],[35,9,35,12],[35,14,35,17],[40,28,40,31],[42,28,42,31],[40,33,40,36],[41,33,41,36],[40,14,40,17],[40,19,40,23],[41,19,41,27],[42,33,42,36],[39,1,39,8],[39,9,39,12],[39,14,39,17],[39,33,39,36],[39,19,39,27],[39,28,39,31],[42,1,42,8],[42,19,42,27],[40,9,40,12],[41,9,41,12],[41,14,41,17],[41,1,41,8],[40,1,40,8],[40,24,40,27],[38,1,38,8],[45,1,45,8],[36,1,36,8],[46,1,46,8],[46,9,46,12],[47,1,47,8],[44,1,44,8],[44,19,44,27],[46,14,46,17],[45,19,45,27],[43,1,43,8],[43,9,43,12],[43,19,43,27],[43,14,43,17],[44,28,44,31],[44,33,44,36],[43,28,43,31],[43,33,43,36],[47,19,47,27],[45,28,45,31],[45,33,45,36],[46,28,46,31],[46,33,46,36],[46,19,46,27],[51,33,51,36],[48,28,48,31],[48,33,48,36],[50,28,50,31],[50,33,50,36],[49,28,49,31],[49,33,49,36],[48,1,48,8],[48,9,48,12],[48,14,48,17],[48,19,48,27],[49,1,49,8],[49,9,49,12],[49,14,49,17],[49,19,49,27],[51,14,51,17],[51,19,51,27],[50,14,50,17],[50,19,50,27],[50,1,50,8],[50,9,50,12],[51,1,51,8],[51,9,51,12],[51,28,51,31]]}
["Modèle de budget prévisionnel(1)"]
["Nom de l'association:",null,null,null,null,null,null,{"$f":"#REF!","v":{"$error":"#REF!"}}]
[null,"Budget prévisionnel de l'association approuvé par les instances statutaires pour l'exercice."]
[null,"Si votre association est soumise aux obligations du plan comptable, vous n'avez pas besoin de remplir cette partie, mais vous joindrez une copie de votre budget prévisionnel approuvé par les instances statutaires, si celui-ci est établi en respectant la nomenclature du plan comptable associatif."]
[]
[null,"EXERCICE",null,null,null,null,"Date début exercice:",null,null,null,null,null,null,null,null,null,null,null,"Date fin exercice:"]
[null,"DEPENSES",null,null,null,null,null,null,null,"COMPTE DE RESULTAT     N    MONTANT(3) EN EUROS",null,null,null,null,"BUDGET N+1 MONTANT(3)\nEN EUROS",null,null,null,null,"RECETTES(2)",null,null,null,null,null,null,null,null,"COMPTE DE RESULTAT    N     MONTANT(3) EN EUROS",null,null,null,null,"BUDGET N+1 MONTANT(3)\nEN EUROS"]
[null,"60-Achats",null,null,null,null,null,null,null,null,null,null,null,null,null,null,null,null,null,"70-Ventes de produits finis, prestations"]
[null,"Achats d'études et de prestations de services",null,null,null,null,null,null,null,{"$f":"#REF!","v":{"$error":"#REF!"}},null,null,null,"€",null,null,null,null,"€","Marchandises",null,null,null,null,null,null,null,null,{"$f":"#REF!","v":{"$error":"#REF!"}},null,null,null,"€",null,null,null,null,"€"]
[null,"Achats non stockés de matières et fournitures",null,null,null,null,null,null,null,{"$f":"#REF!","v":{"$error":"#REF!"}},null,null,null,"€",null,null,null,null,"€","Prestations de services",null,null,null,null,null,null,null,null,{"$f":"#REF!","v":{"$error":"#REF!"}},null,null,null,"€",null,null,null,null,"€"]
[null,"Fournitures non stockables (eau, énergie)",null,null,null,null,null,null,null,{"$f":"#REF!","v":{"$error":"#REF!"}},null,null,null,"€",null,null,null,null,"€","Produits des activités annexes",null,null,null,null,null,null,null,null,{"$f":"SUM(#REF!:#REF!)-AC9-AC10","v":{"$error":"#REF!"}},null,null,null,"€",null,null,null,null,"€"]
[null,"Fournitures d'entretien et de petit équipement",null,null,null,null,null,null,null,{"$f":"#REF!","v":{"$error":"#REF!"}},null,null,null,"€",null,null,null,null,"€","74-Subventions d'exploitation",null,null,null,null,null,null,null,null,{"$f":"SUM(#REF!)","v":{"$error":"#REF!"}},null,null,null,"€",null,null,null,null,"€"]
[null,"Fournitures administratives",null,null,null,null,null,null,null,{"$f":"#REF!","v":{"$error":"#REF!"}},null,null,null,"€",null,null,null,null,"€"]
[null,"Autres fournitures",null,null,null,null,null,null,null,{"$f":"SUM(#REF!)-J9-J10-J11-J12-J13","v":{"$error":"#REF!"}},null,null,null,"€",null,null,null,null,"€","CNDS Subvention sollicitée",null,null,null,null,null,null,null,null,null,null,null,null,"€",null,null,null,null,"€"]
[null,"61-Services extérieurs",null,null,null,null,null,null,null,null,null,null,null,null,null,null,null,null,null,"Etat (à détailler)",null,null,null,null,null,null,null,null,null,null,null,null,"€",null,null,null,null,"€"]
[null,"Sous traitance générale",null,null,null,null,null,null,null,{"$f":"#REF!","v":{"$error":"#REF!"}},null,null,null,"€",null,null,null,null,"€",null,null,null,null,null,null,null,null,null,null,null,null,null,"€",null,null,null,null,"€"]
[null,"Locations mobilières et immobilières",null,null,null,null,null,null,null,{"$f":"#REF!+#REF!+#REF!","v":{"$error":"#REF!"}},null,null,null,"€",null,null,null,null,"€",null,null,null,null,null,null,null,null,null,null,null,null,null,"€",null,null,null,null,"€"]
[null,"Entretien et réparation",null,null,null,null,null,null,null,{"$f":"#REF!","v":{"$error":"#REF!"}},null,null,null,"€",null,null,null,null,"€",null,null,null,null,null,null,null,null,null,null,null,null,null,"€",null,null,null,null,"€"]
[null,"Assurances",null,null,null,null,null,null,null,{"$f":"#REF!+#REF!+#REF!+#REF!+#REF!+#REF!+#REF!","v":{"$error":"#REF!"}},null,null,null,"€",null,null,null,null,"€",null,null,null,null,null,null,null,null,null,null,null,null,null,"€",null,null,null,null,"€"]
[null,"Documentation",null,null,null,null,null,null,null,{"$f":"#REF!+#REF!","v":{"$error":"#REF!"}},null,null,null,"€",null,null,null,null,"€","Région(s)"]
[null,"Divers",null,null,null,null,null,null,null,{"$f":"SUM(#REF!)-J16-J17-J18-J19-J20","v":{"$error":"#REF!"}},null,null,null,"€",null,null,null,null,"€",null,null,null,null,null,null,null,null,null,null,null,null,null,"€",null,null,null,null,"€"]
[null,"62-Autres services extérieurs",null,null,null,null,null,null,null,null,null,null,null,null,null,null,null,null,null,"Département(s)"]
[null,"Rémunérations intermédiaires et honoraires",null,null,null,null,null,null,null,{"$f":"#REF!","v":{"$error":"#REF!"}},null,null,null,"€",null,null,null,null,"€",null,null,null,null,null,null,null,null,null,null,null,null,null,"€",null,null,null,null,"€"]
[null,"Publicité, publications",null,null,null,null,null,null,null,{"$f":"#REF!","v":{"$error":"#REF!"}},null,null,null,"€",null,null,null,null,"€","Commune(s)"]
[null,"Déplacements, missions et réceptions",null,null,null,null,null,null,null,{"$f":"#REF!+#REF!+#REF!+#REF!","v":{"$error":"#REF!"}},null,null,null,"€",null,null,null,null,"€",null,null,null,null,null,null,null,null,null,null,null,null,null,"€",null,null,null,null,"€"]
[null,"Frais postaux et de télécommunication",null,null,null,null,null,null,null,{"$f":"#REF!","v":{"$error":"#REF!"}},null,null,null,"€",null,null,null,null,"€","Organismes sociaux (à détailler)"]
[null,"Services bancaires",null,null,null,null,null,null,null,{"$f":"#REF!","v":{"$error":"#REF!"}},null,null,null,"€",null,null,null,null,"€",null,null,null,null,null,null,null,null,null,null,null,null,null,"€",null,null,null,null,"€"]
[null,"Divers",null,null,null,null,null,null,null,{"$f":"SUM(#REF!)-J23-J24-J25-J26-J27","v":{"$error":"#REF!"}},null,null,null,"€",null,null,null,null,"€",null,null,null,null,null,null,null,null,null,null,null,null,null,"€",null,null,null,null,"€"]
[null,"63-Impôts et taxes",null,null,null,null,null,null,null,null,null,null,null,null,null,null,null,null,null,null,null,null,null,null,null,null,null,null,null,null,null,null,"€",null,null,null,null,"€"]
[null,"Impôts et taxes sur rémunérations",null,null,null,null,null,null,null,{"$f":"#REF!+#REF!+#REF!+#REF!+#REF!+#REF!","v":{"$error":"#REF!"}},null,null,null,"€",null,null,null,null,"€",null,null,null,null,null,null,null,null,null,null,null,null,null,"€",null,null,null,null,"€"]
{"$rows_left_out":26}