{"text_format":"1","workbook":"xlsx","n_sheets":3,"sheets":["Plan Comptable ","Grand Livre Journal","Budget Subvention"],"not_rendered":{"charts":0,"images":0,"macros":1,"external_links":0,"defined_names":12,"comments":1,"pivot_tables":0},"unopened":[],"bounds":{"document_bytes":16777216,"sheet_cells":100000,"rows_first":2000,"rows_last":500,"rows_between":2000,"halvings":0,"cell_chars":16384,"cell_head_chars":4096},"cells_cut":0,"cells_raw":0,"read":"whole","date_system":"1900"}

{"sheet":"Plan Comptable ","index":0,"n_rows":554,"n_cols":39,"rows_kept":554,"cut":false,"hidden":false,"merged":[[3,0,3,1]]}
[]
["PLAN COMPTABLE"]
[]
["Imputations",null,null,"Libellés","Commentaires",null,null,10,13,15,16,21,27,28,35,40,41,44,46,48,51,53,58,60,61,62,63,64,65,66,67,68,70,74,75,76,77,78,79]
[null,null,null,"Classe 1 : Comptes de capitaux",null,null,null,100,"000","000","000","000","000","000","000","000","000","000","000","600","000","000","000","000","000","000","000","000","000","000","000","000","000","000","000","000","000","000","000"]
[null,null,null,null,null,null,null,null,null,100,null,100,400,100,null,100,100,700,800,700,100,null,null,100,100,100,500,null,"100","100",100,100,100,"",null,500,100,100,"100"]
["10","100",{"$f":"CONCATENATE(A7,B7)","v":"10100"},"Fonds associatifs et réserves","Dons (financiers ou matériels)",null,null,null,null,800,null,110,600,120,null,110,110,null,"860",null,110,null,null,200,300,110,"510",null,"180","110",120,110,110,null,null,700,170,110,"600"]
[null,null,null,null,null,null,null,"",null,null,null,120,680,130,null,120,120,null,870,null,120,"",null,210,320,140,"512",null,"400","160",130,120,120,"",null,800,180,150]
["13","000",{"$f":"CONCATENATE(A9,B9)","v":"13000"},"Subvention d'investissements",null,null,null,null,null,null,null,130,null,140,null,800,130,null,null,null,130,null,null,220,350,200,"518",null,"410","180",140,150,130,null,null,810,200,"160"]
[null,null,"",null,null,null,null,null,null,null,null,140,null,150,null,900,140,null,null,null,140,null,null,221,"360","260",520,null,"440",500,180,"160",140,null,null,null,500,170]
["15","000","15000","Provisions pour Risques et Charges",null,null,null,null,null,null,null,150,null,180,null,null,150,null,null,null,null,null,null,222,"400",270,700,null,"800",700,200,170,"600",null,null,null,520,174]
[null,null,null,null,null,null,null,null,null,null,null,180,null,null,null,null,160,null,null,null,null,null,null,223,500,280,null,null,null,800,500,174,800,"",null,null,"560","600"]
["15","100",15100,"Provisions pour risques",null,null,null,null,null,null,null,null,null,null,null,null,170,null,null,null,null,null,null,224,520,300,"",null,null,"",520,"600",830,null,null,null,"580",650]
[null,null,null,null,null,null,null,null,null,null,null,null,null,"",null,"",180,null,null,null,null,null,null,225,550,310,null,null,null,null,"560",650,850,null,null,null,800,"660"]
["15","800",15800,"Autres provisions pour charges",null,null,null,null,null,null,null,null,null,null,null,null,190,null,null,null,null,null,null,300,"560",340,"",null,null,null,"580","660",880,null,null,null,null,"662"]
[null,null,null,null,null,null,null,"",null,null,null,null,null,null,null,null,600,null,null,null,null,null,null,400,"600","360",null,null,null,null,800,"662",900,null,null,null,null,665]
["16","000","16000","Emprunt et dettes assimilés","Emprunt en banque au crédit et remboursement du capital (mensualité sans les intérêts) au débit",null,null,null,null,null,null,null,null,null,null,null,"",null,null,null,null,null,null,500,"610",370,"",null,null,null,880,665,null,null,null,null,null,700]
[null,null,"",null,null,null,null,null,null,null,null,null,null,null,null,null,null,null,null,null,null,null,null,null,"620",380,null,null,null,null,null,"680",null,null,null,null,null,720]
[null,null,null,"Classe 2 : Comptes d'immobilisations",null,null,null,null,null,null,null,null,null,null,null,null,null,null,null,null,null,null,null,"600","630",400,null,null,null,null,null,700,null,null,null,null,null,740]
[null,null,null,null,null,null,null,null,null,null,null,null,null,null,null,null,null,null,null,null,null,null,null,"610",640,500,null,null,null,null,null,710,null,null,null,null,null,750]
["21","000","21000","IMMOBILISATIONS",null,null,null,null,null,null,null,null,null,null,null,null,null,null,null,null,null,null,null,"630",650,"510",null,null,null,null,null,740,null,null,null,null,null,"760"]
[null,null,null,null,null,null,null,null,null,null,null,null,null,null,null,null,null,null,null,null,null,null,null,640,680,550,null,null,null,null,null,750]
["21","100","21100","Immobilisations corporelles","Investissement en matériel",null,null,null,null,null,null,null,null,null,null,null,null,null,null,null,null,null,null,650,700,570,null,null,null,null,null,"760"]
["21","110","21110","Terrain",null,null,null,null,null,null,null,null,null,null,null,null,null,null,null,null,null,null,null,680,800,"600"]
["21","120","21120","Agencement",null,null,null,null,null,null,null,null,null,null,null,null,null,null,null,null,null,null,null,700,810,"610"]
["21","130","21130","Constructions",null,null,null,null,null,null,null,null,null,null,null,null,null,null,null,null,null,null,null,800,830,"630"]
["21","140","21140","Constructions sur sol d'autrui",null,null,null,null,null,null,null,null,null,null,null,null,null,null,null,null,null,null,null,900,850,650]
["21","150","21150","Installation",null,null,null,"",null,null,null,null,null,null,null,null,null,null,null,null,null,null,null,null,900,700]
["21","180","21180","Autres immobilisations corporelles",null,null,null,null,null,null,null,null,null,null,null,null,null,null,null,null,null,null,null,null,null,800]
[null,null,"",null,null,null,null,null,null,null,null,null,null,null,null,null,null,null,null,null,null,null,null,null,null,810]
["27","000","27000","IMMOBILISATIONS FINANCIERES","Cautions",null,null,null,null,null,null,null,null,null,null,null,null,null,null,null,null,null,null,null,null,900]
[]
["27","400","27400","Prêts"]
[]
["27","600","27600","Autres créances Immobilisées",null,null,null,""]
["27","680","27680","Intérêts courus"]
[null,null,"",null,null,null,null,null,null,null,null,null,null,null,null,null,null,null,null,null,null,null,null,null,""]
["28","000","28000","AMORTISSEMENTS",null,null,null,null,null,null,null,null,null,null,null,null,null,null,null,null,null,null,null,null,null,""]
[]
["28","100","28100","Amortissemnts des Immo corporelles",null,null,null,null,null,null,null,null,null,null,null,null,null,null,null,null,null,null,null,null,null,""]
["28","120","28120","Amortissements des agencements"]
["28","130","28130","Amortissements des constructions",null,null,null,null,null,null,null,null,null,null,null,null,null,null,null,null,null,""]
["28","140","28140","Amortissements des constructions sur sol d'autrui",null,null,null,null,null,null,null,null,null,null,null,""]
["28","150 ","28150 ","Amortissements des installations"]
["28","180","28180","Amortissements des autres immobilisations corporelles"]
[]
[null,null,"","Classe 3 : Comptes de Stocks et en cours"]
[null,null,null,null,null,null,null,""]
["35","000","35000","STOCK DE PRODUITS"]
[null,null,""]
[null,null,null,"Classe 4 : Comptes de Tiers"]
[]
["40","000",{"$f":"CONCATENATE(A53,B53)","v":"40000"},"FOURNISSEURS ET COMPTES RATTACHES"]
[]
["40","100","40100","fournisseurs"]
["40","110","40110","fournisseurs (autres que des immobilisation)"]
["40","120","40120","fournisseurs d'immobilisattions"]
[null,null,null,null,null,null,null,null,null,null,null,null,null,null,null,null,null,null,null,null,null,null,null,null,null,null,null,null,null,""]
["40","800","40800","fournisseurs factures non parvenues",null,null,null,null,null,null,null,null,null,null,null,null,null,null,null,null,null,null,null,null,null,null,null,null,null,""]
[]
["40","900","40900","fournisseurs débiteurs",null,null,null,null,null,null,null,null,null,null,null,null,null,null,null,null,null,null,null,null,null,null,null,null,null,""]
[null,null,"",null,null,null,null,null,null,null,null,null,null,null,null,null,null,null,null,null,null,null,null,null,null,null,null,null,null,""]
["41","000","41000","CLIENTS ET COMPTES RATTACHES"]
[]
["41","100","41100","Clients"]
["41","110","41110","Haute saison"]
["41","120","41120","Moyenne saison"]
["41","130","41130","Basse saison"]
["41","140","41140","Longue durée"]
["41","150","41150","Cours séjours"]
["41","160","41160","client 6"]
["41","170","41170","client 7"]
["41","180","41180","client 8"]
["41","190","41190","client 9"]
[null,null,""]
["41","600","41600","créances douteuses ou litigieuses"]
[]
["44","000",{"$f":"CONCATENATE(A,B)","v":{"$error":"#NAME?"}},"ETAT ET AUTRES COLLECTIVITES"]
[null,null,"",null,null,null,null,null,null,null,null,null,null,null,null,null,null,null,null,null,null,null,null,null,null,null,null,null,null,""]
["44","700","44700","Etat impôts et taxes et versements assimilés"]
[]
["46","000",{"$f":"CONCATENATE(A82,B82)","v":"46000"},"DEBITEURS ET CREDITEURS DIVERS"]
[null,null,""]
["46","800","46800","Divers charges à payer et produits à recevoir"]
["46","860","46860","Charges à payer"]
["46","870","46870","Produits à recevoir","Valeur à l'encaissement…."]
[]
["48","600",{"$f":"CONCATENATE(A88,B88)","v":"48600"},"Charges constatées d'avance"]
[]
["48","700","48700","Produits constatés d'avance"]
[null,null,""]
[null,null,null,"Classe 5 : Comptes financiers"]
[]
["51","000","51000","BANQUES ET ETABLISSEMENTS FINANCIERS"]
[]
["51","100","51100","Banques"]
["51","110","51110","Banque 1"]
["51","120","51120","Banque 2 "]
["51","130","51130","Banque 3"]
["51","140","51140","Banque 4"]
[]
["53","000","53000","Caisse"]
[]
["58","000","58000","Virements internes"]
[null,null,"",null,"Dépenses"]
[null,null,null,"Classe 6 : Comptes de Charges"]
[]
[60,"000","60000","ACHATS"]
[]
["60","100","60100","Achats stockés ­ Matières premières et fournitures"]
[]
["60","200","60200","Achats Stockés ­ Autres approvisionnements"]
["60","210",{"$f":"CONCATENATE(A113,B113)","v":"60210"},"Matières consommables"]
["60","220","60220","Fournitures consommables"]
["60","221","60221","Combustibles"]
["60","222","60222","Produits d'entretien"]
["60","223","60223","Fournitures d'atelier"]
["60","224","60224","Fournitures de magasin"]
["60","225","60225","Fournitures de bureau"]
[]
["60","300","60300","Variations de stocks (approvisionnements et marchandises) "]
[]
["60","400","60400","Achats d'études et prestations de services"]
[]
["60","500","60500","Achats de matériels, équipements et travaux"]
[]
["60","600","60600","Achats non stockés de matières et fournitures"]
["60","610","60610","Fournitures non stockables (eau, énergie...)","Électricité"]
["60","630","60630","Fournitures d'entretien et de petit équipement","Petit matériel et outillage"]
["60","640","60640","Fournitures administratives","papier, enveloppes …"]
["60","650","60650","Emballages"]
["60","680","60680","Autres matières et fournitures"]
[]
["60","700","60700","Achats de marchandises",null,null,null,null,null,null,null,null,null,null,null,null,null,null,null,null,null,""]
[]
["60","800","60800","Frais accessoires d'achats"]
[]
["60","900","60900","Rabais, remises et ristournes obtenus sur achats "]
[null,null,""]
[61,"000","61000","SERVICES EXTERIEURS"]
[]
["61","100","61100","Sous traitance générale","prestations d'animation"]
[null,null,""]
["61","300","61300","Locations","Locations de salles, matériel, voiture …"]
["61","320","61320","Locations immobilières"]
["61","350","61350","Locations mobilières","Locations de matériel"]
["61","360","61360","Malis sur emballages"]
[]
["61","400","61400","Charges locatives et de copropriété"]
[]
["61","500","61500","Entretien et réparations"]
["61","520","61520","Entretien et réparations sur biens immobiliers"]
["61","550","61550","Entretien et réparations sur biens mobiliers"]
["61","560","61560","Maintenance"]
[]
["61","600","61600","Primes d'assurance"]
["61","610","61610","Multirisque"]
["61","620","61620","Assurance obligatoire dommage construction"]
["61","630","61630","Assurance Transport"]
["61","640","61640","Risque d'exploitation"]
["61","650","61650","Insolvabilité usagers"]
["61","680","61680","Autres assurances"]
[]
["61","700","61700","Études et recherches"]
[]
["61","800","61800","Divers"]
["61","810","61810","Documentation générale"]
["61","830","61830","Documentation technique"]
["61","850","61850","Frais de colloques, séminaires, conférences"]
[]
["61","900","61900","R.R.R. obtenus sur services extérieurs "]
[null,null,""]
["62","000","62000","AUTRES SERVICES EXTERIEURS"]
[]
["62","100","62100","Personnel extérieur "]
["62","110","62110","Personnel intérimaire"]
["62","140","62140","Personnel détaché ou prêté à l'association"]
[]
["62","200","62200","Rémunération d'intermédiaires et honoraires"]
["62","260","62260","Honoraires","Comptable, architecte, notaire…."]
["62","270","62270","Frais d'actes et de contentieux"]
["62","280","62280","Divers"]
[]
["62","300","62300","Publicité, publication, relations publiques"]
["62","310","62310","Annonces et insertions","Annonces dans un journal"]
["62","340","62340","Cadeaux"]
["62","360","62360","Catalogues et imprimés"]
["62","370","62370","Publications"]
["62","380","62380","Divers (pourboires, dons courants...)"]
[]
["62","400","62400","Transports de biens et transports collectifs du personnel"]
[]
["62","500","62500","Déplacements, missions et réceptions","Frais de déplacement, frais d'hôtel, billets de train"]
["62","510","62510","Voyages et déplacements"]
["62","550",{"$f":"CONCATENATE(A195,B195)","v":"62550"},"Frais de déménagements"]
["62","570","62570","Réceptions"]
["62","600","62600","Frais postaux et frais de télécommunications","Téléphone, Internet …"]
["62","610","62610","Liaisons informatiques ou spécialisées"]
["62","630","62630","Affranchissements","Achats de timbres, recommandés"]
["62","650","62650","Téléphone"]
[]
["62","700","62700","Services bancaires et assimilés"]
[]
["62","800","62800","Divers"]
["62","810","62810","Cotisations (liées à l'activité économique)","Licences, cotisations, adhésions"]
[null,null,""]
["62","900",{"$f":"CONCATENATE(A207,B207)","v":"62900"},"R. R.R. obtenus sur autres services extérieurs"]
[null,null,""]
["63","000","63000","IMPOTS, TAXES ET VERSEMENTS ASSIMILES"]
[null,null,""]
["63","500","63500","Autres impôts, taxes et versmts assimilés (adm. des impôts)"]
["63","510","63510","Impôts directs (sauf impôts sur les bénéfices)"]
["63","512","63512","Taxe foncière, taxe d'habitation"]
["63","518","63518","Autres impôts directs"]
["63","520","63520","Taxe Frais de séjour"]
["63","540","63540","Droits d'enregistrement et de timbre","PV"]
[null,null,""]
["63","700","63700","Autres impôts, taxes et versmts assimilés (autres organismes)"]
[null,null,""]
["64","000","64000","CHARGES DE PERSONNEL"]
[null,null,""]
["65","000","65000","AUTRES CHARGES DE GESTION COURANTE"]
[]
["65","100","65100","Redevances pour, brevets, licences, logiciels"]
["65","180","65180","Autres droits et valeurs similaires"]
["65","400","65400","Pertes sur créances irrécouvrables"]
["65","410","65410","Créances de l'exercice"]
["65","440","65440","Créances des exercices antérieurs"]
[]
["65","800","65800","Charges diverses de gestion courante"]
[null,null,""]
["66","000","66000","CHARGES FINANCIERES"]
[]
["66","100","66100","Charges d'intérêts"]
["66","110","66110","Intérêts des emprunts et dettes"]
["66","160","66160","Intérêts bancaires"]
["66","180","66180","Intérêts des autres dettes"]
[null,null,""]
["66","500","66500","Escomptes accordés"]
[null,null,""]
["66","700","66700","Charges nettes sur cessions de VMP"]
[]
["66","800",{"$f":"CONCATENATE(A243,B243)","v":"66800"},"Autres charges financières"]
[]
["67","000","67000","CHARGES EXCEPTIONNELLES"]
[]
["67","100","67100","Charges except. sur opérations de gestion"]
["67","120","67120","Pénalités, amendes fiscales ou pénales"]
["67","130","67130","Dons, libéralités","Don (Téléthon, carnaval de l'école …)"]
["67","140","67140","Créances devenues irrécouvrables dans l'exercice"]
["67","180","67180","Autres charges exceptionnelles sur opérations de gestion"]
[]
["67","200","67200","Charges sur exercices antérieurs (à reclasser)"]
[]
["67","500","67500","Valeurs comptables des éléments d'actifs cédés"]
["67","520","67520","Immobilisations corporelles"]
["67","560","67560","Immobilisations financières"]
["67","580","67580","Autres éléments d'actif"]
[]
["67","800","67800","Autres charges exceptionnelles"]
["67","880","67880","Charges exceptionnelles diverses"]
[]
["68","000",{"$f":"CONCATENATE(A263,B263)","v":"68000"},"DOTATIONS AUX AMORTISSEMTS, PROVISIONS "]
[]
["68","100","68100","Dotations aux Amort.et Prov. : charges d'exploitation"]
["68","110","68110","Dotations aux amortissements des immobilisations corporelles"]
["68","120","68120","Dotations aux amortissements des charges d'exploitation à répartir"]
["68","150","68150","Dotations aux provisions pour risques et charges d'exploitation"]
["68","160","68160"," Dotations aux provisions pour dépréciation des immobilisations corporelles"]
["68","170","68170","Dotations aux provisions pour dépréciation des actifs circulants"]
["68","174","68174","Dotations aux provisions pour dépriciation des créances"]
[]
["68","600","68600","Dotations aux amort. et provisions : charges financières"]
["68","650","68650","Dotations aux provisions pour risques et charges financiers"]
["68","660","68660","Dotations aux provisions pour dépréciation des éléments financiers"]
["68","662","68662","Dotations aux provisions sur Immo. financières"]
["68","665","68665","Dotations aux provisions sur VMP"]
["68","680",{"$f":"CONCATENATE(A2,B2)","v":"PLAN COMPTABLE"},"Autres dotations aux provisions"]
[]
["68","700","68700","Dotations aux amortissements et provisions : charges except."]
["68","710","68710","Dotations aux amortissements exceptionnels des immobilisations"]
["68","740","68740","Dotations aux autres provisions réglementées"]
["68","750","68750","Dotations aux provisions pour risques et charges exceptionnelles"]
["68","760","68760","Dotations aux provisions pour dépréciations exceptionnelles"]
[null,null,""]
[null,null,{"$f":"CONCATENATE(A286,B286)","v":""}]
[]
[null,null,"","Classe 7 : Comptes de Produits"]
[null,null,""]
["70","000","70000","VENTES DE PRESTATION ET SERVICES"]
[]
["70","100",{"$f":"CONCATENATE(A292,B292)","v":"70100"},"Prestation location "]
["70","110",{"$f":"CONCATENATE(A293,B293)","v":"70110"},"Prestation location Haute saison"]
["70","120","70120","Prestation location Myoyenne saison"]
["70","130","70130","Prestation location Basse saison"]
["70","140","70140","Prestation location Longue durée"]
[]
["70","600","70600","Prestations de services"]
[null,null,""]
["70","800","70800","Produits des activités annexes"]
["70","830","70830","Locations diverses"]
["70","850",{"$f":"CONCATENATE(A302,B302)","v":"70850"},"Ports et frais accessoires facturés"]
["70","880","70880","Autres produits d'activités annexes"]
[]
["70","900","70900","R. R. R. accordés "]
[null,null,""]
["74","000","74000","SUBVENTIONS D'EXPLOITATION","Subv communes, Conseil Général, JS..."]
[null,null,""]
["75","000","75000","AUTRES PRODUITS DE GESTION COURANTE"]
[null,null,""]
["76","000","76000","PRODUITS FINANCIERS"]
[]
["76","500","76500","Escomptes obtenus"]
[null,null,""]
["76","700","76700","Produits nets sur cessions de VMP"]
[]
["76","800",{"$f":"CONCATENATE(A317,B317)","v":"76800"},"Autres produits financiers"]
["76","810",{"$f":"CONCATENATE(A318,B318)","v":"76810"},"Intérêts des comptes financiers débiteurs","Intérêt livret A, Caisse Epargne"]
[]
["77","000",{"$f":"CONCATENATE(A320,B320)","v":"77000"},"PRODUITS EXCEPTIONNELS"]
[]
["77","100",{"$f":"CONCATENATE(A322,B322)","v":"77100"},"Produits exceptionnels sur opérations de gestion","Dons"]
["77","170","77170","Dégrèvements d'impôts (autres qu'impôts sur les bénéfices)"]
["77","180","77180","Autres produits exceptionnels sur opérations de gestion"]
[]
["77","200","77200","Produits sur exercices antérieurs (à reclasser)"]
[]
["77","500","77500","Produits des cessions d'éléments d'actif"]
["77","520",{"$f":"CONCATENATE(A329,B329)","v":"77520"},"Immobilisations corporelles"]
["77","560",{"$f":"CONCATENATE(A330,B330)","v":"77560"},"Immobilisations financières"]
["77","580",{"$f":"CONCATENATE(A331,B331)","v":"77580"},"Autres éléments d'actif"]
[]
["77","800",{"$f":"CONCATENATE(A333,B333)","v":"77800"},"Autres produits exceptionnels"]
[]
[null,"000","000","REPRISES SUR AMORTISSEMENTS ET PROVISIONS"]
[]
[null,"100","100","Reprises sur amort. et provisions (produits d'exploitation)"]
[null,"110","110","Reprises sur amort. des immo. corporelles"]
[null,"150","150","Reprises sur prov. pour risques et charges d'exploitation"]
[null,"160","160","Reprises sur prov. pour dép. des immob.corporelles"]
[null,"170",{"$f":"CONCATENATE(A341,B341)","v":"170"},"Reprises sur prov. pour dép. des actifs circulants (autres VMP)"]
[null,"174",{"$f":"CONCATENATE(A342,B342)","v":"174"},"Reprises sur provisions des Créances"]
[]
[null,"600",{"$f":"CONCATENATE(A344,B344)","v":"600"},"Reprises sur provisions pour risques (produits financiers.)"]
[null,"650",{"$f":"CONCATENATE(A345,B345)","v":"650"},"Reprises sur provisions pour risques et charges financières"]
[null,"660",{"$f":"CONCATENATE(A346,B346)","v":"660"},"Reprises sur provisions pour dépréciation des éléments financiers"]
[null,"662",{"$f":"CONCATENATE(A347,B347)","v":"662"},"Reprises sur provisions sur Immobilisations financières"]
[null,"665",{"$f":"CONCATENATE(A348,B348)","v":"665"},"Reprises sur provisions sur VMP"]
[]
[null,"700",{"$f":"CONCATENATE(A350,B350)","v":"700"},"Reprises sur provisions (produits exceptionnels)"]
[null,"720",{"$f":"CONCATENATE(A351,B351)","v":"720"},"Reprises sur provisions réglementées (immobilisations)"]
[null,"740",{"$f":"CONCATENATE(A352,B352)","v":"740"},"Reprises sur autres provisions réglementées"]
[null,"750",{"$f":"CONCATENATE(A353,B353)","v":"750"},"Reprises sur provisions pour risques et charges except."]
[null,"760",{"$f":"CONCATENATE(A354,B354)","v":"760"},"Reprise sur provisions pour dépréciations except."]
[]
["79","000",{"$f":"CONCATENATE(A356,B356)","v":"79000"},"TRANSFERTS DE CHARGES"]
[]
["79","100",{"$f":"CONCATENATE(A358,B358)","v":"79100"},"Transferts de charges d'exploitation"]
["79","600",{"$f":"CONCATENATE(A359,B359)","v":"79600"},"Transferts de charges financières"]
[]
[null,null,{"$f":"CONCATENATE(A361,B361)","v":""}]
[null,null,""]
[null,null,""]
[null,null,""]
[null,null,""]
[null,null,""]
[null,null,""]
[null,null,""]
[null,null,""]
[null,null,""]
[null,null,{"$f":"CONCATENATE(A371,B371)","v":""}]
[null,null,""]
[null,null,""]
[null,null,""]
[null,null,""]
[null,null,""]
[null,null,""]
[null,null,{"$f":"CONCATENATE(A3,B3)","v":""}]
[null,null,""]
[null,null,""]
[null,null,""]
[null,null,""]
[null,null,""]
[null,null,""]
[null,null,""]
[null,null,""]
[null,null,""]
[null,null,""]
[null,null,""]
[null,null,""]
[null,null,""]
[null,null,""]
[null,null,""]
[null,null,""]
[null,null,""]
[null,null,""]
[null,null,""]
[null,null,""]
[null,null,{"$f":"CONCATENATE(A399,B399)","v":""}]
[null,null,""]
[null,null,""]
[null,null,""]
[null,null,""]
[null,null,""]
[null,null,""]
[null,null,""]
[null,null,""]
[null,null,""]
[null,null,""]
[null,null,""]
[null,null,""]
[null,null,""]
[null,null,""]
[null,null,""]
[null,null,""]
[null,null,""]
[null,null,""]
[null,null,""]
[null,null,""]
[null,null,""]
[null,null,""]
[null,null,""]
[null,null,""]
[null,null,""]
[null,null,""]
[null,null,""]
[null,null,""]
[null,null,""]
[null,null,""]
[null,null,""]
[null,null,{"$f":"CONCATENATE(A431,B431)","v":""}]
[null,null,""]
[null,null,""]
[null,null,""]
[null,null,""]
[null,null,""]
[null,null,""]
[null,null,""]
[null,null,""]
[null,null,""]
[null,null,""]
[null,null,""]
[null,null,""]
[null,null,""]
[null,null,""]
[null,null,""]
[null,null,""]
[null,null,""]
[null,null,""]
[null,null,""]
[null,null,""]
[null,null,""]
[null,null,""]
[null,null,""]
[null,null,""]
[null,null,""]
[null,null,""]
[null,null,""]
[null,null,""]
[null,null,""]
[null,null,""]
[null,null,""]
[null,null,{"$f":"CONCATENATE(A463,B463)","v":""}]
[null,null,""]
[null,null,""]
[null,null,""]
[null,null,""]
[null,null,""]
[null,null,""]
[null,null,""]
[null,null,""]
[null,null,""]
[null,null,""]
[null,null,""]
[null,null,""]
[null,null,""]
[null,null,""]
[null,null,{"$f":"CONCATENATE(A4,B4)","v":"Imputations"}]
[null,null,""]
[null,null,""]
[null,null,""]
[null,null,""]
[null,null,""]
[null,null,""]
[null,null,""]
[null,null,""]
[null,null,""]
[null,null,""]
[null,null,""]
[null,null,""]
[null,null,""]
[null,null,""]
[null,null,""]
[null,null,""]
[null,null,{"$f":"CONCATENATE(A495,B495)","v":""}]
[null,null,""]
[null,null,""]
[null,null,""]
[null,null,""]
[null,null,""]
[null,null,""]
[null,null,""]
[null,null,""]
[null,null,""]
[null,null,""]
[null,null,""]
[null,null,""]
[null,null,""]
[null,null,""]
[null,null,""]
[null,null,""]
[null,null,""]
[null,null,""]
[null,null,""]
[null,null,""]
[null,null,""]
[null,null,""]
[null,null,""]
[null,null,""]
[null,null,""]
[null,null,""]
[null,null,""]
[null,null,""]
[null,null,""]
[null,null,""]
[null,null,""]
[null,null,{"$f":"CONCATENATE(A527,B527)","v":""}]
[null,null,""]
[null,null,""]
[null,null,""]
[null,null,""]
[null,null,""]
[null,null,""]
[null,null,""]
[null,null,""]
[null,null,""]
[null,null,""]
[null,null,""]
[null,null,""]
[null,null,""]
[null,null,""]
[null,null,""]
[null,null,""]
[null,null,""]
[null,null,""]
[null,null,""]
[null,null,""]
[null,null,""]
[null,null,""]
[null,null,""]
[null,null,""]
[null,null,""]
[null,null,""]
[null,null,""]

{"sheet":"Grand Livre Journal","index":1,"n_rows":1001,"n_cols":15,"rows_kept":1001,"cut":false,"hidden":false,"merged":[[8,0,9,0],[8,1,9,1],[8,2,9,2],[8,3,8,4],[8,8,9,8],[8,9,9,9],[8,10,9,10],[8,11,9,11],[8,6,9,6],[8,7,9,7]]}
[]
[]
[null,null,null,null,null,null,"ANNEE"]
[]
["FEUILLE DE SAISIE",null,null,null,null,null,null,null,null,"SOUS TOTAL",{"$f":"SUBTOTAL(9,K12:K999)","v":80506.83},{"$f":"SUBTOTAL(9,L12:L999)","v":81539.039999999994}]
[]
[null,null,null,null,null,null,null,null,null,"SOLDE",{"$f":"L5-K5","v":1032.2099999999919}]
[]
["Dates"," B – C – OD","N° Pièces","Imputations",null,null,"Libellés Compte","N° CPT Analytique","Libéllé comptes analytiques","Libellé Pièces","Débit","Crédit"]
[null,null,null," ( 2 premiers chiffres)"," ( 3 derniers chiffres)"]
[]
["2015-02-18","B3",null,78,120,{"$f":"CONCATENATE(D12,E12)","v":"78120"},{"$f":"IF(D12=\"\",\"\",VLOOKUP(F12,'Plan Comptable '!$C$5:$D$554,2,0))","v":{"$error":"#N/A"}},"CC",{"$f":"IF(H12=\"\",\"\",VLOOKUP(H12,#REF!,2,0))","v":{"$error":"#REF!"}},null,2600,null,"-",10,"000"]
["2016-04-30","B4",null,62,"260","62260",{"$f":"IF(D13=\"\",\"\",VLOOKUP(F13,'Plan Comptable '!$C$5:$D$554,2,0))","v":"Honoraires"},"FAC",{"$f":"IF(H13=\"\",\"\",VLOOKUP(H13,#REF!,2,0))","v":{"$error":"#REF!"}},null,576,null,"B1",13,"100"]
["2016-06-19","B4",null,61,"350","61350",{"$f":"IF(D14=\"\",\"\",VLOOKUP(F14,'Plan Comptable '!$C$5:$D$554,2,0))","v":"Locations mobilières"},"FAC",{"$f":"IF(H14=\"\",\"\",VLOOKUP(H14,#REF!,2,0))","v":{"$error":"#REF!"}},null,65,null,"B2",15,"110"]
["2016-07-05","B4",null,61,"560","61560",{"$f":"IF(D15=\"\",\"\",VLOOKUP(F15,'Plan Comptable '!$C$5:$D$554,2,0))","v":"Maintenance"},"FAC",{"$f":"IF(H15=\"\",\"\",VLOOKUP(H15,#REF!,2,0))","v":{"$error":"#REF!"}},null,588,null,"B3",16,"111"]
["2016-07-26","B4",null,62,"260","62260",{"$f":"IF(D16=\"\",\"\",VLOOKUP(F16,'Plan Comptable '!$C$5:$D$554,2,0))","v":"Honoraires"},"FAC",{"$f":"IF(H16=\"\",\"\",VLOOKUP(H16,#REF!,2,0))","v":{"$error":"#REF!"}},null,1752,null,"B4",20,"120"]
["2016-09-07","B4",null,62,"260","62260",{"$f":"IF(D17=\"\",\"\",VLOOKUP(F17,'Plan Comptable '!$C$5:$D$554,2,0))","v":"Honoraires"},"FAC",{"$f":"IF(H17=\"\",\"\",VLOOKUP(H17,#REF!,2,0))","v":{"$error":"#REF!"}},null,267.2,null,"C",21,"130"]
["2016-11-21","B4",null,62,"260","62260",{"$f":"IF(D18=\"\",\"\",VLOOKUP(F18,'Plan Comptable '!$C$5:$D$554,2,0))","v":"Honoraires"},"FAC",{"$f":"IF(H18=\"\",\"\",VLOOKUP(H18,#REF!,2,0))","v":{"$error":"#REF!"}},null,267.2,null,"OD",27,140]
["2017-01-02","B4",null,61,"560","61560",{"$f":"IF(D19=\"\",\"\",VLOOKUP(F19,'Plan Comptable '!$C$5:$D$554,2,0))","v":"Maintenance"},"FAC",{"$f":"IF(H19=\"\",\"\",VLOOKUP(H19,#REF!,2,0))","v":{"$error":"#REF!"}},null,1092,null,null,28,150]
["2017-02-16","B4",null,61,"560","61560",{"$f":"IF(D20=\"\",\"\",VLOOKUP(F20,'Plan Comptable '!$C$5:$D$554,2,0))","v":"Maintenance"},"FAC",{"$f":"IF(H20=\"\",\"\",VLOOKUP(H20,#REF!,2,0))","v":{"$error":"#REF!"}},null,1464,null,null,35]
["2017-11-10","B1",null,62,"260","62260",{"$f":"IF(D21=\"\",\"\",VLOOKUP(F21,'Plan Comptable '!$C$5:$D$554,2,0))","v":"Honoraires"},"ACC",{"$f":"IF(H21=\"\",\"\",VLOOKUP(H21,#REF!,2,0))","v":{"$error":"#REF!"}},null,825,null,null,40]
["2018-01-25","B3",null,62,"260","62260",{"$f":"IF(D22=\"\",\"\",VLOOKUP(F22,'Plan Comptable '!$C$5:$D$554,2,0))","v":"Honoraires"},"ACC",{"$f":"IF(H22=\"\",\"\",VLOOKUP(H22,#REF!,2,0))","v":{"$error":"#REF!"}},null,1320,null,null,41,160]
["2018-02-07","B1",null,62,"260","62260",{"$f":"IF(D23=\"\",\"\",VLOOKUP(F23,'Plan Comptable '!$C$5:$D$554,2,0))","v":"Honoraires"},"ACC",{"$f":"IF(H23=\"\",\"\",VLOOKUP(H23,#REF!,2,0))","v":{"$error":"#REF!"}},null,150]
["2018-02-20","B1",null,62,"260","62260",{"$f":"IF(D24=\"\",\"\",VLOOKUP(F24,'Plan Comptable '!$C$5:$D$554,2,0))","v":"Honoraires"},"ACC",{"$f":"IF(H24=\"\",\"\",VLOOKUP(H24,#REF!,2,0))","v":{"$error":"#REF!"}},null,1848]
["2018-03-05","B1",null,62,"260","62260",{"$f":"IF(D25=\"\",\"\",VLOOKUP(F25,'Plan Comptable '!$C$5:$D$554,2,0))","v":"Honoraires"},"ACC",{"$f":"IF(H25=\"\",\"\",VLOOKUP(H25,#REF!,2,0))","v":{"$error":"#REF!"}},null,366,null,null,44,170]
["2018-03-06","B1",null,62,"260","62260",{"$f":"IF(D26=\"\",\"\",VLOOKUP(F26,'Plan Comptable '!$C$5:$D$554,2,0))","v":"Honoraires"},"ACC",{"$f":"IF(H26=\"\",\"\",VLOOKUP(H26,#REF!,2,0))","v":{"$error":"#REF!"}},null,480,null,null,46]
["2018-03-14","B1",null,62,"260","62260",{"$f":"IF(D27=\"\",\"\",VLOOKUP(F27,'Plan Comptable '!$C$5:$D$554,2,0))","v":"Honoraires"},"ACC",{"$f":"IF(H27=\"\",\"\",VLOOKUP(H27,#REF!,2,0))","v":{"$error":"#REF!"}},null,120,null,null,48,"174"]
["2018-04-14","B1",null,62,"260","62260",{"$f":"IF(D28=\"\",\"\",VLOOKUP(F28,'Plan Comptable '!$C$5:$D$554,2,0))","v":"Honoraires"},"ACC",{"$f":"IF(H28=\"\",\"\",VLOOKUP(H28,#REF!,2,0))","v":{"$error":"#REF!"}},null,792,null,null,51,"180"]
["2018-04-14","B3",null,21,"130","21130",{"$f":"IF(D29=\"\",\"\",VLOOKUP(F29,'Plan Comptable '!$C$5:$D$554,2,0))","v":"Constructions"},"CC",{"$f":"IF(H29=\"\",\"\",VLOOKUP(H29,#REF!,2,0))","v":{"$error":"#REF!"}},null,1000,null,null,53,"190"]
["2018-05-30","B1",null,62,"260","62260",{"$f":"IF(D30=\"\",\"\",VLOOKUP(F30,'Plan Comptable '!$C$5:$D$554,2,0))","v":"Honoraires"},"ACC",{"$f":"IF(H30=\"\",\"\",VLOOKUP(H30,#REF!,2,0))","v":{"$error":"#REF!"}},null,1062,null,null,58,"200"]
["2018-07-11","B1",null,62,"260","62260",{"$f":"IF(D31=\"\",\"\",VLOOKUP(F31,'Plan Comptable '!$C$5:$D$554,2,0))","v":"Honoraires"},"ACC",{"$f":"IF(H31=\"\",\"\",VLOOKUP(H31,#REF!,2,0))","v":{"$error":"#REF!"}},null,1062,null,null,60,"210"]
["2018-10-17","B1",null,62,"260","62260",{"$f":"IF(D32=\"\",\"\",VLOOKUP(F32,'Plan Comptable '!$C$5:$D$554,2,0))","v":"Honoraires"},"ACC",{"$f":"IF(H32=\"\",\"\",VLOOKUP(H32,#REF!,2,0))","v":{"$error":"#REF!"}},null,1980,null,null,61,"220"]
["2018-12-18","B1",null,62,"260","62260",{"$f":"IF(D33=\"\",\"\",VLOOKUP(F33,'Plan Comptable '!$C$5:$D$554,2,0))","v":"Honoraires"},"ACC",{"$f":"IF(H33=\"\",\"\",VLOOKUP(H33,#REF!,2,0))","v":{"$error":"#REF!"}},null,5330.16,null,null,62,"221"]
["2019-03-10","B1",null,62,"260","62260",{"$f":"IF(D34=\"\",\"\",VLOOKUP(F34,'Plan Comptable '!$C$5:$D$554,2,0))","v":"Honoraires"},"ACC",{"$f":"IF(H34=\"\",\"\",VLOOKUP(H34,#REF!,2,0))","v":{"$error":"#REF!"}},null,1954.22,null,null,63,"222"]
["2019-04-03","B3",null,62,"260","62260",{"$f":"IF(D35=\"\",\"\",VLOOKUP(F35,'Plan Comptable '!$C$5:$D$554,2,0))","v":"Honoraires"},"ACC",{"$f":"IF(H35=\"\",\"\",VLOOKUP(H35,#REF!,2,0))","v":{"$error":"#REF!"}},null,150,null,null,64,"223"]
["2019-04-25","B3",null,21,"120","21120",{"$f":"IF(D36=\"\",\"\",VLOOKUP(F36,'Plan Comptable '!$C$5:$D$554,2,0))","v":"Agencement"},"CC",{"$f":"IF(H36=\"\",\"\",VLOOKUP(H36,#REF!,2,0))","v":{"$error":"#REF!"}},null,1960,null,null,65,"224"]
["2019-05-05","B3",null,21,"130","21130",{"$f":"IF(D37=\"\",\"\",VLOOKUP(F37,'Plan Comptable '!$C$5:$D$554,2,0))","v":"Constructions"},"CC",{"$f":"IF(H37=\"\",\"\",VLOOKUP(H37,#REF!,2,0))","v":{"$error":"#REF!"}},null,1560,null,null,66,"225"]
["2019-05-11","B3",null,62,"260","62260",{"$f":"IF(D38=\"\",\"\",VLOOKUP(F38,'Plan Comptable '!$C$5:$D$554,2,0))","v":"Honoraires"},"ACC",{"$f":"IF(H38=\"\",\"\",VLOOKUP(H38,#REF!,2,0))","v":{"$error":"#REF!"}},null,336,null,null,67]
["2019-05-31","B3",null,61,"520","61520",{"$f":"IF(D39=\"\",\"\",VLOOKUP(F39,'Plan Comptable '!$C$5:$D$554,2,0))","v":"Entretien et réparations sur biens immobiliers"},"CC",{"$f":"IF(H39=\"\",\"\",VLOOKUP(H39,#REF!,2,0))","v":{"$error":"#REF!"}},null,284.47000000000003,null,null,68]
["2019-06-07","B1",null,61,"680","61680",{"$f":"IF(D40=\"\",\"\",VLOOKUP(F40,'Plan Comptable '!$C$5:$D$554,2,0))","v":"Autres assurances"},null,{"$f":"IF(H40=\"\",\"\",VLOOKUP(H40,#REF!,2,0))","v":""},null,113.06,null,null,null,"260"]
["2019-06-26","B1",null,21,"130","21130",{"$f":"IF(D41=\"\",\"\",VLOOKUP(F41,'Plan Comptable '!$C$5:$D$554,2,0))","v":"Constructions"},"CC",{"$f":"IF(H41=\"\",\"\",VLOOKUP(H41,#REF!,2,0))","v":{"$error":"#REF!"}},null,23117.82,null,null,70,"270"]
["2019-06-26","B1",null,16,"000","16000",{"$f":"IF(D42=\"\",\"\",VLOOKUP(F42,'Plan Comptable '!$C$5:$D$554,2,0))","v":"Emprunt et dettes assimilés"},null,{"$f":"IF(H42=\"\",\"\",VLOOKUP(H42,#REF!,2,0))","v":""},null,null,23117.82,null,null,"280"]
["2019-07-05","B1",null,62,"270","62270",{"$f":"IF(D43=\"\",\"\",VLOOKUP(F43,'Plan Comptable '!$C$5:$D$554,2,0))","v":"Frais d'actes et de contentieux"},null,{"$f":"IF(H43=\"\",\"\",VLOOKUP(H43,#REF!,2,0))","v":""},null,500,null,null,72,"300"]
["2019-07-08","B1",null,61,"680","61680",{"$f":"IF(D44=\"\",\"\",VLOOKUP(F44,'Plan Comptable '!$C$5:$D$554,2,0))","v":"Autres assurances"},null,{"$f":"IF(H44=\"\",\"\",VLOOKUP(H44,#REF!,2,0))","v":""},null,132.54,null,null,74,"310"]
["2019-07-13","B3",null,62,"260","62260",{"$f":"IF(D45=\"\",\"\",VLOOKUP(F45,'Plan Comptable '!$C$5:$D$554,2,0))","v":"Honoraires"},"ACC",{"$f":"IF(H45=\"\",\"\",VLOOKUP(H45,#REF!,2,0))","v":{"$error":"#REF!"}},null,1031.5899999999999,null,null,75,"320"]
["2019-07-13","B3",null,63,"518","63518",{"$f":"IF(D46=\"\",\"\",VLOOKUP(F46,'Plan Comptable '!$C$5:$D$554,2,0))","v":"Autres impôts directs"},"ACC",{"$f":"IF(H46=\"\",\"\",VLOOKUP(H46,#REF!,2,0))","v":{"$error":"#REF!"}},null,379,null,null,76]
["2019-07-13","B3",null,63,"518","63518",{"$f":"IF(D47=\"\",\"\",VLOOKUP(F47,'Plan Comptable '!$C$5:$D$554,2,0))","v":"Autres impôts directs"},"ACC",{"$f":"IF(H47=\"\",\"\",VLOOKUP(H47,#REF!,2,0))","v":{"$error":"#REF!"}},null,1422,null,null,77,"340"]
["2019-07-16","B3",null,21,"130","21130",{"$f":"IF(D48=\"\",\"\",VLOOKUP(F48,'Plan Comptable '!$C$5:$D$554,2,0))","v":"Constructions"},"CC",{"$f":"IF(H48=\"\",\"\",VLOOKUP(H48,#REF!,2,0))","v":{"$error":"#REF!"}},null,1494,null,null,78,"350"]
["2019-07-31","B1",null,21,"130","21130",{"$f":"IF(D49=\"\",\"\",VLOOKUP(F49,'Plan Comptable '!$C$5:$D$554,2,0))","v":"Constructions"},"CC",{"$f":"IF(H49=\"\",\"\",VLOOKUP(H49,#REF!,2,0))","v":{"$error":"#REF!"}},null,19612.07,null,null,79,"360"]
["2019-07-31","B1",null,16,"000","16000",{"$f":"IF(D50=\"\",\"\",VLOOKUP(F50,'Plan Comptable '!$C$5:$D$554,2,0))","v":"Emprunt et dettes assimilés"},null,{"$f":"IF(H50=\"\",\"\",VLOOKUP(H50,#REF!,2,0))","v":""},null,null,20644.28,null,null,"370"]
["2019-08-07","B1",null,61,"680","61680",{"$f":"IF(D51=\"\",\"\",VLOOKUP(F51,'Plan Comptable '!$C$5:$D$554,2,0))","v":"Autres assurances"},null,{"$f":"IF(H51=\"\",\"\",VLOOKUP(H51,#REF!,2,0))","v":""},null,124.54,null,null,null,"380"]
["2019-09-06","B3",null,62,"260","62260",{"$f":"IF(D52=\"\",\"\",VLOOKUP(F52,'Plan Comptable '!$C$5:$D$554,2,0))","v":"Honoraires"},"ACC",{"$f":"IF(H52=\"\",\"\",VLOOKUP(H52,#REF!,2,0))","v":{"$error":"#REF!"}},null,1178.96,null,null,null,"400"]
["2019-09-30","B2",null,60,"610","60610",{"$f":"IF(D53=\"\",\"\",VLOOKUP(F53,'Plan Comptable '!$C$5:$D$554,2,0))","v":"Fournitures non stockables (eau, énergie...)"},"AA",{"$f":"IF(H53=\"\",\"\",VLOOKUP(H53,#REF!,2,0))","v":{"$error":"#REF!"}},null,150,null,null,null,"410"]
["2019-09-30","B1",null,77,"000","77000",{"$f":"IF(D54=\"\",\"\",VLOOKUP(F54,'Plan Comptable '!$C$5:$D$554,2,0))","v":"PRODUITS EXCEPTIONNELS"},null,{"$f":"IF(H54=\"\",\"\",VLOOKUP(H54,#REF!,2,0))","v":""},null,null,16839.52,null,null,"440"]
["2019-09-30","B2",null,77,"000","77000",{"$f":"IF(D55=\"\",\"\",VLOOKUP(F55,'Plan Comptable '!$C$5:$D$554,2,0))","v":"PRODUITS EXCEPTIONNELS"},null,{"$f":"IF(H55=\"\",\"\",VLOOKUP(H55,#REF!,2,0))","v":""},null,null,150,null,null,"500"]
["2019-09-30","B3",null,77,"000","77000",{"$f":"IF(D56=\"\",\"\",VLOOKUP(F56,'Plan Comptable '!$C$5:$D$554,2,0))","v":"PRODUITS EXCEPTIONNELS"},null,{"$f":"IF(H56=\"\",\"\",VLOOKUP(H56,#REF!,2,0))","v":""},null,null,14716.02,null,null,"510"]
["2019-09-30","B4",null,77,"000","77000",{"$f":"IF(D57=\"\",\"\",VLOOKUP(F57,'Plan Comptable '!$C$5:$D$554,2,0))","v":"PRODUITS EXCEPTIONNELS"},null,{"$f":"IF(H57=\"\",\"\",VLOOKUP(H57,#REF!,2,0))","v":""},null,null,6071.4]
[null,null,null,null,null,"",{"$f":"IF(D58=\"\",\"\",VLOOKUP(F58,'Plan Comptable '!$C$5:$D$554,2,0))","v":""},null,{"$f":"IF(H58=\"\",\"\",VLOOKUP(H58,#REF!,2,0))","v":""},null,null,null,null,null,"512"]
[null,null,null,null,null,"",{"$f":"IF(D59=\"\",\"\",VLOOKUP(F59,'Plan Comptable '!$C$5:$D$554,2,0))","v":""},null,{"$f":"IF(H59=\"\",\"\",VLOOKUP(H59,#REF!,2,0))","v":""}]
[null,null,null,null,null,"",{"$f":"IF(D60=\"\",\"\",VLOOKUP(F60,'Plan Comptable '!$C$5:$D$554,2,0))","v":""},null,{"$f":"IF(H60=\"\",\"\",VLOOKUP(H60,#REF!,2,0))","v":""},null,null,null,null,null,"518"]
[null,null,null,null,null,"",{"$f":"IF(D61=\"\",\"\",VLOOKUP(F61,'Plan Comptable '!$C$5:$D$554,2,0))","v":""},null,{"$f":"IF(H61=\"\",\"\",VLOOKUP(H61,#REF!,2,0))","v":""},null,null,null,null,null,"520"]
[null,null,null,null,null,"",{"$f":"IF(D62=\"\",\"\",VLOOKUP(F62,'Plan Comptable '!$C$5:$D$554,2,0))","v":""},null,{"$f":"IF(H62=\"\",\"\",VLOOKUP(H62,#REF!,2,0))","v":""}]
[null,null,null,null,null,"",{"$f":"IF(D63=\"\",\"\",VLOOKUP(F63,'Plan Comptable '!$C$5:$D$554,2,0))","v":""},null,{"$f":"IF(H63=\"\",\"\",VLOOKUP(H63,#REF!,2,0))","v":""},null,null,null,null,null,"540"]
[null,null,null,null,null,"",{"$f":"IF(D64=\"\",\"\",VLOOKUP(F64,'Plan Comptable '!$C$5:$D$554,2,0))","v":""},null,{"$f":"IF(H64=\"\",\"\",VLOOKUP(H64,#REF!,2,0))","v":""}]
[null,null,null,null,null,"",{"$f":"IF(D65=\"\",\"\",VLOOKUP(F65,'Plan Comptable '!$C$5:$D$554,2,0))","v":""},null,{"$f":"IF(H65=\"\",\"\",VLOOKUP(H65,#REF!,2,0))","v":""},null,null,null,null,null,"550"]
[null,null,null,null,null,"",{"$f":"IF(D66=\"\",\"\",VLOOKUP(F66,'Plan Comptable '!$C$5:$D$554,2,0))","v":""},null,{"$f":"IF(H66=\"\",\"\",VLOOKUP(H66,#REF!,2,0))","v":""},null,null,null,null,null,"560"]
[null,null,null,null,null,"",{"$f":"IF(D67=\"\",\"\",VLOOKUP(F67,'Plan Comptable '!$C$5:$D$554,2,0))","v":""},null,{"$f":"IF(H67=\"\",\"\",VLOOKUP(H67,#REF!,2,0))","v":""},null,null,null,null,null,"570"]
[null,null,null,null,null,"",{"$f":"IF(D68=\"\",\"\",VLOOKUP(F68,'Plan Comptable '!$C$5:$D$554,2,0))","v":""},null,{"$f":"IF(H68=\"\",\"\",VLOOKUP(H68,#REF!,2,0))","v":""},null,null,null,null,null,"580"]
[null,null,null,null,null,"",{"$f":"IF(D69=\"\",\"\",VLOOKUP(F69,'Plan Comptable '!$C$5:$D$554,2,0))","v":""},null,{"$f":"IF(H69=\"\",\"\",VLOOKUP(H69,#REF!,2,0))","v":""},null,null,null,null,null,"600"]
[null,null,null,null,null,"",{"$f":"IF(D70=\"\",\"\",VLOOKUP(F70,'Plan Comptable '!$C$5:$D$554,2,0))","v":""},null,{"$f":"IF(H70=\"\",\"\",VLOOKUP(H70,#REF!,2,0))","v":""},null,null,null,null,null,"610"]
[null,null,null,null,null,"",{"$f":"IF(D71=\"\",\"\",VLOOKUP(F71,'Plan Comptable '!$C$5:$D$554,2,0))","v":""},null,{"$f":"IF(H71=\"\",\"\",VLOOKUP(H71,#REF!,2,0))","v":""},null,null,null,null,null,"620"]
[null,null,null,null,null,"",{"$f":"IF(D72=\"\",\"\",VLOOKUP(F72,'Plan Comptable '!$C$5:$D$554,2,0))","v":""},null,{"$f":"IF(H72=\"\",\"\",VLOOKUP(H72,#REF!,2,0))","v":""},null,null,null,null,null,"630"]
[null,null,null,null,null,"",{"$f":"IF(D73=\"\",\"\",VLOOKUP(F73,'Plan Comptable '!$C$5:$D$554,2,0))","v":""},null,{"$f":"IF(H73=\"\",\"\",VLOOKUP(H73,#REF!,2,0))","v":""},null,null,null,null,null,"640"]
[null,null,null,null,null,"",{"$f":"IF(D74=\"\",\"\",VLOOKUP(F74,'Plan Comptable '!$C$5:$D$554,2,0))","v":""},null,{"$f":"IF(H74=\"\",\"\",VLOOKUP(H74,#REF!,2,0))","v":""},null,null,null,null,null,"650"]
[null,null,null,null,null,"",{"$f":"IF(D75=\"\",\"\",VLOOKUP(F75,'Plan Comptable '!$C$5:$D$554,2,0))","v":""},null,{"$f":"IF(H75=\"\",\"\",VLOOKUP(H75,#REF!,2,0))","v":""},null,null,null,null,null,"660"]
[null,null,null,null,null,{"$f":"CONCATENATE(D76,E76)","v":""},{"$f":"IF(D76=\"\",\"\",VLOOKUP(F76,'Plan Comptable '!$C$5:$D$554,2,0))","v":""},null,{"$f":"IF(H76=\"\",\"\",VLOOKUP(H76,#REF!,2,0))","v":""},null,null,null,null,null,"662"]
[null,null,null,null,null,"",{"$f":"IF(D77=\"\",\"\",VLOOKUP(F77,'Plan Comptable '!$C$5:$D$554,2,0))","v":""},null,{"$f":"IF(H77=\"\",\"\",VLOOKUP(H77,#REF!,2,0))","v":""},null,null,null,null,null,"665"]
[null,null,null,null,null,"",{"$f":"IF(D78=\"\",\"\",VLOOKUP(F78,'Plan Comptable '!$C$5:$D$554,2,0))","v":""},null,{"$f":"IF(H78=\"\",\"\",VLOOKUP(H78,#REF!,2,0))","v":""},null,null,null,null,null,"680"]
[null,null,null,null,null,"",{"$f":"IF(D79=\"\",\"\",VLOOKUP(F79,'Plan Comptable '!$C$5:$D$554,2,0))","v":""},null,{"$f":"IF(H79=\"\",\"\",VLOOKUP(H79,#REF!,2,0))","v":""},null,null,null,null,null,"700"]
[null,null,null,null,null,"",{"$f":"IF(D80=\"\",\"\",VLOOKUP(F80,'Plan Comptable '!$C$5:$D$554,2,0))","v":""},null,{"$f":"IF(H80=\"\",\"\",VLOOKUP(H80,#REF!,2,0))","v":""},null,null,null,null,null,"710"]
[null,null,null,null,null,"",{"$f":"IF(D81=\"\",\"\",VLOOKUP(F81,'Plan Comptable '!$C$5:$D$554,2,0))","v":""},null,{"$f":"IF(H81=\"\",\"\",VLOOKUP(H81,#REF!,2,0))","v":""},null,null,null,null,null,"720"]
[null,null,null,null,null,"",{"$f":"IF(D82=\"\",\"\",VLOOKUP(F82,'Plan Comptable '!$C$5:$D$554,2,0))","v":""},null,{"$f":"IF(H82=\"\",\"\",VLOOKUP(H82,#REF!,2,0))","v":""}]
[null,null,null,null,null,"",{"$f":"IF(D83=\"\",\"\",VLOOKUP(F83,'Plan Comptable '!$C$5:$D$554,2,0))","v":""},null,{"$f":"IF(H83=\"\",\"\",VLOOKUP(H83,#REF!,2,0))","v":""},null,null,null,null,null,"740"]
[null,null,null,null,null,"",{"$f":"IF(D84=\"\",\"\",VLOOKUP(F84,'Plan Comptable '!$C$5:$D$554,2,0))","v":""},null,{"$f":"IF(H84=\"\",\"\",VLOOKUP(H84,#REF!,2,0))","v":""},null,null,null,null,null,"750"]
[null,null,null,null,null,"",{"$f":"IF(D85=\"\",\"\",VLOOKUP(F85,'Plan Comptable '!$C$5:$D$554,2,0))","v":""},null,{"$f":"IF(H85=\"\",\"\",VLOOKUP(H85,#REF!,2,0))","v":""},null,null,null,null,null,"760"]
[null,null,null,null,null,"",{"$f":"IF(D86=\"\",\"\",VLOOKUP(F86,'Plan Comptable '!$C$5:$D$554,2,0))","v":""},null,{"$f":"IF(H86=\"\",\"\",VLOOKUP(H86,#REF!,2,0))","v":""},null,null,null,null,null,"800"]
[null,null,null,null,null,"",{"$f":"IF(D87=\"\",\"\",VLOOKUP(F87,'Plan Comptable '!$C$5:$D$554,2,0))","v":""},null,{"$f":"IF(H87=\"\",\"\",VLOOKUP(H87,#REF!,2,0))","v":""},null,null,null,null,null,"810"]
[null,null,null,null,null,"",{"$f":"IF(D88=\"\",\"\",VLOOKUP(F88,'Plan Comptable '!$C$5:$D$554,2,0))","v":""},null,{"$f":"IF(H88=\"\",\"\",VLOOKUP(H88,#REF!,2,0))","v":""},null,null,null,null,null,"830"]
[null,null,null,null,null,"",{"$f":"IF(D89=\"\",\"\",VLOOKUP(F89,'Plan Comptable '!$C$5:$D$554,2,0))","v":""},null,{"$f":"IF(H89=\"\",\"\",VLOOKUP(H89,#REF!,2,0))","v":""},null,null,null,null,null,"840"]
[null,null,null,null,null,"",{"$f":"IF(D90=\"\",\"\",VLOOKUP(F90,'Plan Comptable '!$C$5:$D$554,2,0))","v":""},null,{"$f":"IF(H90=\"\",\"\",VLOOKUP(H90,#REF!,2,0))","v":""},null,null,null,null,null,"850"]
[null,null,null,null,null,"",{"$f":"IF(D91=\"\",\"\",VLOOKUP(F91,'Plan Comptable '!$C$5:$D$554,2,0))","v":""},null,{"$f":"IF(H91=\"\",\"\",VLOOKUP(H91,#REF!,2,0))","v":""},null,null,null,null,null,"860"]
[null,null,null,null,null,"",{"$f":"IF(D92=\"\",\"\",VLOOKUP(F92,'Plan Comptable '!$C$5:$D$554,2,0))","v":""},null,{"$f":"IF(H92=\"\",\"\",VLOOKUP(H92,#REF!,2,0))","v":""},null,null,null,null,null,"870"]
[null,null,null,null,null,"",{"$f":"IF(D93=\"\",\"\",VLOOKUP(F93,'Plan Comptable '!$C$5:$D$554,2,0))","v":""},null,{"$f":"IF(H93=\"\",\"\",VLOOKUP(H93,#REF!,2,0))","v":""},null,null,null,null,null,"880"]
[null,null,null,null,null,"",{"$f":"IF(D94=\"\",\"\",VLOOKUP(F94,'Plan Comptable '!$C$5:$D$554,2,0))","v":""},null,{"$f":"IF(H94=\"\",\"\",VLOOKUP(H94,#REF!,2,0))","v":""},null,null,null,null,null,"900"]
[null,null,null,null,null,"",{"$f":"IF(D95=\"\",\"\",VLOOKUP(F95,'Plan Comptable '!$C$5:$D$554,2,0))","v":""},null,{"$f":"IF(H95=\"\",\"\",VLOOKUP(H95,#REF!,2,0))","v":""}]
[null,null,null,null,null,"",{"$f":"IF(D96=\"\",\"\",VLOOKUP(F96,'Plan Comptable '!$C$5:$D$554,2,0))","v":""},null,{"$f":"IF(H96=\"\",\"\",VLOOKUP(H96,#REF!,2,0))","v":""}]
[null,null,null,null,null,"",{"$f":"IF(D97=\"\",\"\",VLOOKUP(F97,'Plan Comptable '!$C$5:$D$554,2,0))","v":""},null,{"$f":"IF(H97=\"\",\"\",VLOOKUP(H97,#REF!,2,0))","v":""}]
[null,null,null,null,null,"",{"$f":"IF(D98=\"\",\"\",VLOOKUP(F98,'Plan Comptable '!$C$5:$D$554,2,0))","v":""},null,{"$f":"IF(H98=\"\",\"\",VLOOKUP(H98,#REF!,2,0))","v":""}]
[null,null,null,null,null,"",{"$f":"IF(D99=\"\",\"\",VLOOKUP(F99,'Plan Comptable '!$C$5:$D$554,2,0))","v":""},null,{"$f":"IF(H99=\"\",\"\",VLOOKUP(H99,#REF!,2,0))","v":""}]
[null,null,null,null,null,"",{"$f":"IF(D100=\"\",\"\",VLOOKUP(F100,'Plan Comptable '!$C$5:$D$554,2,0))","v":""},null,{"$f":"IF(H100=\"\",\"\",VLOOKUP(H100,#REF!,2,0))","v":""}]
[null,null,null,null,null,"",{"$f":"IF(D101=\"\",\"\",VLOOKUP(F101,'Plan Comptable '!$C$5:$D$554,2,0))","v":""},null,{"$f":"IF(H101=\"\",\"\",VLOOKUP(H101,#REF!,2,0))","v":""}]
[null,null,null,null,null,"",{"$f":"IF(D102=\"\",\"\",VLOOKUP(F102,'Plan Comptable '!$C$5:$D$554,2,0))","v":""},null,{"$f":"IF(H102=\"\",\"\",VLOOKUP(H102,#REF!,2,0))","v":""}]
[null,null,null,null,null,"",{"$f":"IF(D103=\"\",\"\",VLOOKUP(F103,'Plan Comptable '!$C$5:$D$554,2,0))","v":""},null,{"$f":"IF(H103=\"\",\"\",VLOOKUP(H103,#REF!,2,0))","v":""}]
[null,null,null,null,null,"",{"$f":"IF(D104=\"\",\"\",VLOOKUP(F104,'Plan Comptable '!$C$5:$D$554,2,0))","v":""},null,{"$f":"IF(H104=\"\",\"\",VLOOKUP(H104,#REF!,2,0))","v":""}]
[null,null,null,null,null,"",{"$f":"IF(D105=\"\",\"\",VLOOKUP(F105,'Plan Comptable '!$C$5:$D$554,2,0))","v":""},null,{"$f":"IF(H105=\"\",\"\",VLOOKUP(H105,#REF!,2,0))","v":""}]
[null,null,null,null,null,"",{"$f":"IF(D106=\"\",\"\",VLOOKUP(F106,'Plan Comptable '!$C$5:$D$554,2,0))","v":""},null,{"$f":"IF(H106=\"\",\"\",VLOOKUP(H106,#REF!,2,0))","v":""}]
[null,null,null,null,null,"",{"$f":"IF(D107=\"\",\"\",VLOOKUP(F107,'Plan Comptable '!$C$5:$D$554,2,0))","v":""},null,{"$f":"IF(H107=\"\",\"\",VLOOKUP(H107,#REF!,2,0))","v":""}]
[null,null,null,null,null,"",{"$f":"IF(D108=\"\",\"\",VLOOKUP(F108,'Plan Comptable '!$C$5:$D$554,2,0))","v":""},null,{"$f":"IF(H108=\"\",\"\",VLOOKUP(H108,#REF!,2,0))","v":""}]
[null,null,null,null,null,"",{"$f":"IF(D109=\"\",\"\",VLOOKUP(F109,'Plan Comptable '!$C$5:$D$554,2,0))","v":""},null,{"$f":"IF(H109=\"\",\"\",VLOOKUP(H109,#REF!,2,0))","v":""}]
[null,null,null,null,null,"",{"$f":"IF(D110=\"\",\"\",VLOOKUP(F110,'Plan Comptable '!$C$5:$D$554,2,0))","v":""},null,{"$f":"IF(H110=\"\",\"\",VLOOKUP(H110,#REF!,2,0))","v":""}]
[null,null,null,null,null,"",{"$f":"IF(D111=\"\",\"\",VLOOKUP(F111,'Plan Comptable '!$C$5:$D$554,2,0))","v":""},null,{"$f":"IF(H111=\"\",\"\",VLOOKUP(H111,#REF!,2,0))","v":""}]
[null,null,null,null,null,"",{"$f":"IF(D112=\"\",\"\",VLOOKUP(F112,'Plan Comptable '!$C$5:$D$554,2,0))","v":""},null,{"$f":"IF(H112=\"\",\"\",VLOOKUP(H112,#REF!,2,0))","v":""}]
[null,null,null,null,null,"",{"$f":"IF(D113=\"\",\"\",VLOOKUP(F113,'Plan Comptable '!$C$5:$D$554,2,0))","v":""},null,{"$f":"IF(H113=\"\",\"\",VLOOKUP(H113,#REF!,2,0))","v":""}]
[null,null,null,null,null,"",{"$f":"IF(D114=\"\",\"\",VLOOKUP(F114,'Plan Comptable '!$C$5:$D$554,2,0))","v":""},null,{"$f":"IF(H114=\"\",\"\",VLOOKUP(H114,#REF!,2,0))","v":""}]
[null,null,null,null,null,"",{"$f":"IF(D115=\"\",\"\",VLOOKUP(F115,'Plan Comptable '!$C$5:$D$554,2,0))","v":""},null,{"$f":"IF(H115=\"\",\"\",VLOOKUP(H115,#REF!,2,0))","v":""}]
[null,null,null,null,null,"",{"$f":"IF(D116=\"\",\"\",VLOOKUP(F116,'Plan Comptable '!$C$5:$D$554,2,0))","v":""},null,{"$f":"IF(H116=\"\",\"\",VLOOKUP(H116,#REF!,2,0))","v":""}]
[null,null,null,null,null,"",{"$f":"IF(D117=\"\",\"\",VLOOKUP(F117,'Plan Comptable '!$C$5:$D$554,2,0))","v":""},null,{"$f":"IF(H117=\"\",\"\",VLOOKUP(H117,#REF!,2,0))","v":""}]
[null,null,null,null,null,"",{"$f":"IF(D118=\"\",\"\",VLOOKUP(F118,'Plan Comptable '!$C$5:$D$554,2,0))","v":""},null,{"$f":"IF(H118=\"\",\"\",VLOOKUP(H118,#REF!,2,0))","v":""}]
[null,null,null,null,null,"",{"$f":"IF(D119=\"\",\"\",VLOOKUP(F119,'Plan Comptable '!$C$5:$D$554,2,0))","v":""},null,{"$f":"IF(H119=\"\",\"\",VLOOKUP(H119,#REF!,2,0))","v":""}]
[null,null,null,null,null,"",{"$f":"IF(D120=\"\",\"\",VLOOKUP(F120,'Plan Comptable '!$C$5:$D$554,2,0))","v":""},null,{"$f":"IF(H120=\"\",\"\",VLOOKUP(H120,#REF!,2,0))","v":""}]
[null,null,null,null,null,"",{"$f":"IF(D121=\"\",\"\",VLOOKUP(F121,'Plan Comptable '!$C$5:$D$554,2,0))","v":""},null,{"$f":"IF(H121=\"\",\"\",VLOOKUP(H121,#REF!,2,0))","v":""}]
[null,null,null,null,null,"",{"$f":"IF(D122=\"\",\"\",VLOOKUP(F122,'Plan Comptable '!$C$5:$D$554,2,0))","v":""},null,{"$f":"IF(H122=\"\",\"\",VLOOKUP(H122,#REF!,2,0))","v":""}]
[null,null,null,null,null,"",{"$f":"IF(D123=\"\",\"\",VLOOKUP(F123,'Plan Comptable '!$C$5:$D$554,2,0))","v":""},null,{"$f":"IF(H123=\"\",\"\",VLOOKUP(H123,#REF!,2,0))","v":""}]
[null,null,null,null,null,"",{"$f":"IF(D124=\"\",\"\",VLOOKUP(F124,'Plan Comptable '!$C$5:$D$554,2,0))","v":""},null,{"$f":"IF(H124=\"\",\"\",VLOOKUP(H124,#REF!,2,0))","v":""}]
[null,null,null,null,null,"",{"$f":"IF(D125=\"\",\"\",VLOOKUP(F125,'Plan Comptable '!$C$5:$D$554,2,0))","v":""},null,{"$f":"IF(H125=\"\",\"\",VLOOKUP(H125,#REF!,2,0))","v":""}]
[null,null,null,null,null,"",{"$f":"IF(D126=\"\",\"\",VLOOKUP(F126,'Plan Comptable '!$C$5:$D$554,2,0))","v":""},null,{"$f":"IF(H126=\"\",\"\",VLOOKUP(H126,#REF!,2,0))","v":""}]
[null,null,null,null,null,"",{"$f":"IF(D127=\"\",\"\",VLOOKUP(F127,'Plan Comptable '!$C$5:$D$554,2,0))","v":""},null,{"$f":"IF(H127=\"\",\"\",VLOOKUP(H127,#REF!,2,0))","v":""}]
[null,null,null,null,null,"",{"$f":"IF(D128=\"\",\"\",VLOOKUP(F128,'Plan Comptable '!$C$5:$D$554,2,0))","v":""},null,{"$f":"IF(H128=\"\",\"\",VLOOKUP(H128,#REF!,2,0))","v":""}]
[null,null,null,null,null,"",{"$f":"IF(D129=\"\",\"\",VLOOKUP(F129,'Plan Comptable '!$C$5:$D$554,2,0))","v":""},null,{"$f":"IF(H129=\"\",\"\",VLOOKUP(H129,#REF!,2,0))","v":""}]
[null,null,null,null,null,"",{"$f":"IF(D130=\"\",\"\",VLOOKUP(F130,'Plan Comptable '!$C$5:$D$554,2,0))","v":""},null,{"$f":"IF(H130=\"\",\"\",VLOOKUP(H130,#REF!,2,0))","v":""}]
[null,null,null,null,null,"",{"$f":"IF(D131=\"\",\"\",VLOOKUP(F131,'Plan Comptable '!$C$5:$D$554,2,0))","v":""},null,{"$f":"IF(H131=\"\",\"\",VLOOKUP(H131,#REF!,2,0))","v":""}]
[null,null,null,null,null,"",{"$f":"IF(D132=\"\",\"\",VLOOKUP(F132,'Plan Comptable '!$C$5:$D$554,2,0))","v":""},null,{"$f":"IF(H132=\"\",\"\",VLOOKUP(H132,#REF!,2,0))","v":""}]
[null,null,null,null,null,"",{"$f":"IF(D133=\"\",\"\",VLOOKUP(F133,'Plan Comptable '!$C$5:$D$554,2,0))","v":""},null,{"$f":"IF(H133=\"\",\"\",VLOOKUP(H133,#REF!,2,0))","v":""}]
[null,null,null,null,null,"",{"$f":"IF(D134=\"\",\"\",VLOOKUP(F134,'Plan Comptable '!$C$5:$D$554,2,0))","v":""},null,{"$f":"IF(H134=\"\",\"\",VLOOKUP(H134,#REF!,2,0))","v":""}]
[null,null,null,null,null,"",{"$f":"IF(D135=\"\",\"\",VLOOKUP(F135,'Plan Comptable '!$C$5:$D$554,2,0))","v":""},null,{"$f":"IF(H135=\"\",\"\",VLOOKUP(H135,#REF!,2,0))","v":""}]
[null,null,null,null,null,"",{"$f":"IF(D136=\"\",\"\",VLOOKUP(F136,'Plan Comptable '!$C$5:$D$554,2,0))","v":""},null,{"$f":"IF(H136=\"\",\"\",VLOOKUP(H136,#REF!,2,0))","v":""}]
[null,null,null,null,null,"",{"$f":"IF(D137=\"\",\"\",VLOOKUP(F137,'Plan Comptable '!$C$5:$D$554,2,0))","v":""},null,{"$f":"IF(H137=\"\",\"\",VLOOKUP(H137,#REF!,2,0))","v":""}]
[null,null,null,null,null,"",{"$f":"IF(D138=\"\",\"\",VLOOKUP(F138,'Plan Comptable '!$C$5:$D$554,2,0))","v":""},null,{"$f":"IF(H138=\"\",\"\",VLOOKUP(H138,#REF!,2,0))","v":""}]
[null,null,null,null,null,"",{"$f":"IF(D139=\"\",\"\",VLOOKUP(F139,'Plan Comptable '!$C$5:$D$554,2,0))","v":""},null,{"$f":"IF(H139=\"\",\"\",VLOOKUP(H139,#REF!,2,0))","v":""}]
[null,null,null,null,null,{"$f":"CONCATENATE(D140,E140)","v":""},{"$f":"IF(D140=\"\",\"\",VLOOKUP(F140,'Plan Comptable '!$C$5:$D$554,2,0))","v":""},null,{"$f":"IF(H140=\"\",\"\",VLOOKUP(H140,#REF!,2,0))","v":""}]
[null,null,null,null,null,"",{"$f":"IF(D141=\"\",\"\",VLOOKUP(F141,'Plan Comptable '!$C$5:$D$554,2,0))","v":""},null,{"$f":"IF(H141=\"\",\"\",VLOOKUP(H141,#REF!,2,0))","v":""}]
[null,null,null,null,null,"",{"$f":"IF(D142=\"\",\"\",VLOOKUP(F142,'Plan Comptable '!$C$5:$D$554,2,0))","v":""},null,{"$f":"IF(H142=\"\",\"\",VLOOKUP(H142,#REF!,2,0))","v":""}]
[null,null,null,null,null,"",{"$f":"IF(D143=\"\",\"\",VLOOKUP(F143,'Plan Comptable '!$C$5:$D$554,2,0))","v":""},null,{"$f":"IF(H143=\"\",\"\",VLOOKUP(H143,#REF!,2,0))","v":""}]
[null,null,null,null,null,"",{"$f":"IF(D144=\"\",\"\",VLOOKUP(F144,'Plan Comptable '!$C$5:$D$554,2,0))","v":""},null,{"$f":"IF(H144=\"\",\"\",VLOOKUP(H144,#REF!,2,0))","v":""}]
[null,null,null,null,null,"",{"$f":"IF(D145=\"\",\"\",VLOOKUP(F145,'Plan Comptable '!$C$5:$D$554,2,0))","v":""},null,{"$f":"IF(H145=\"\",\"\",VLOOKUP(H145,#REF!,2,0))","v":""}]
[null,null,null,null,null,"",{"$f":"IF(D146=\"\",\"\",VLOOKUP(F146,'Plan Comptable '!$C$5:$D$554,2,0))","v":""},null,{"$f":"IF(H146=\"\",\"\",VLOOKUP(H146,#REF!,2,0))","v":""}]
[null,null,null,null,null,"",{"$f":"IF(D147=\"\",\"\",VLOOKUP(F147,'Plan Comptable '!$C$5:$D$554,2,0))","v":""},null,{"$f":"IF(H147=\"\",\"\",VLOOKUP(H147,#REF!,2,0))","v":""}]
[null,null,null,null,null,"",{"$f":"IF(D148=\"\",\"\",VLOOKUP(F148,'Plan Comptable '!$C$5:$D$554,2,0))","v":""},null,{"$f":"IF(H148=\"\",\"\",VLOOKUP(H148,#REF!,2,0))","v":""}]
[null,null,null,null,null,"",{"$f":"IF(D149=\"\",\"\",VLOOKUP(F149,'Plan Comptable '!$C$5:$D$554,2,0))","v":""},null,{"$f":"IF(H149=\"\",\"\",VLOOKUP(H149,#REF!,2,0))","v":""}]
[null,null,null,null,null,"",{"$f":"IF(D150=\"\",\"\",VLOOKUP(F150,'Plan Comptable '!$C$5:$D$554,2,0))","v":""},null,{"$f":"IF(H150=\"\",\"\",VLOOKUP(H150,#REF!,2,0))","v":""}]
[null,null,null,null,null,"",{"$f":"IF(D151=\"\",\"\",VLOOKUP(F151,'Plan Comptable '!$C$5:$D$554,2,0))","v":""},null,{"$f":"IF(H151=\"\",\"\",VLOOKUP(H151,#REF!,2,0))","v":""}]
[null,null,null,null,null,"",{"$f":"IF(D152=\"\",\"\",VLOOKUP(F152,'Plan Comptable '!$C$5:$D$554,2,0))","v":""},null,{"$f":"IF(H152=\"\",\"\",VLOOKUP(H152,#REF!,2,0))","v":""}]
[null,null,null,null,null,"",{"$f":"IF(D153=\"\",\"\",VLOOKUP(F153,'Plan Comptable '!$C$5:$D$554,2,0))","v":""},null,{"$f":"IF(H153=\"\",\"\",VLOOKUP(H153,#REF!,2,0))","v":""}]
[null,null,null,null,null,"",{"$f":"IF(D154=\"\",\"\",VLOOKUP(F154,'Plan Comptable '!$C$5:$D$554,2,0))","v":""},null,{"$f":"IF(H154=\"\",\"\",VLOOKUP(H154,#REF!,2,0))","v":""}]
[null,null,null,null,null,"",{"$f":"IF(D155=\"\",\"\",VLOOKUP(F155,'Plan Comptable '!$C$5:$D$554,2,0))","v":""},null,{"$f":"IF(H155=\"\",\"\",VLOOKUP(H155,#REF!,2,0))","v":""}]
[null,null,null,null,null,"",{"$f":"IF(D156=\"\",\"\",VLOOKUP(F156,'Plan Comptable '!$C$5:$D$554,2,0))","v":""},null,{"$f":"IF(H156=\"\",\"\",VLOOKUP(H156,#REF!,2,0))","v":""}]
[null,null,null,null,null,"",{"$f":"IF(D157=\"\",\"\",VLOOKUP(F157,'Plan Comptable '!$C$5:$D$554,2,0))","v":""},null,{"$f":"IF(H157=\"\",\"\",VLOOKUP(H157,#REF!,2,0))","v":""}]
[null,null,null,null,null,"",{"$f":"IF(D158=\"\",\"\",VLOOKUP(F158,'Plan Comptable '!$C$5:$D$554,2,0))","v":""},null,{"$f":"IF(H158=\"\",\"\",VLOOKUP(H158,#REF!,2,0))","v":""}]
[null,null,null,null,null,"",{"$f":"IF(D159=\"\",\"\",VLOOKUP(F159,'Plan Comptable '!$C$5:$D$554,2,0))","v":""},null,{"$f":"IF(H159=\"\",\"\",VLOOKUP(H159,#REF!,2,0))","v":""}]
[null,null,null,null,null,"",{"$f":"IF(D160=\"\",\"\",VLOOKUP(F160,'Plan Comptable '!$C$5:$D$554,2,0))","v":""},null,{"$f":"IF(H160=\"\",\"\",VLOOKUP(H160,#REF!,2,0))","v":""}]
[null,null,null,null,null,"",{"$f":"IF(D161=\"\",\"\",VLOOKUP(F161,'Plan Comptable '!$C$5:$D$554,2,0))","v":""},null,{"$f":"IF(H161=\"\",\"\",VLOOKUP(H161,#REF!,2,0))","v":""}]
[null,null,null,null,null,"",{"$f":"IF(D162=\"\",\"\",VLOOKUP(F162,'Plan Comptable '!$C$5:$D$554,2,0))","v":""},null,{"$f":"IF(H162=\"\",\"\",VLOOKUP(H162,#REF!,2,0))","v":""}]
[null,null,null,null,null,"",{"$f":"IF(D163=\"\",\"\",VLOOKUP(F163,'Plan Comptable '!$C$5:$D$554,2,0))","v":""},null,{"$f":"IF(H163=\"\",\"\",VLOOKUP(H163,#REF!,2,0))","v":""}]
[null,null,null,null,null,"",{"$f":"IF(D164=\"\",\"\",VLOOKUP(F164,'Plan Comptable '!$C$5:$D$554,2,0))","v":""},null,{"$f":"IF(H164=\"\",\"\",VLOOKUP(H164,#REF!,2,0))","v":""}]
[null,null,null,null,null,"",{"$f":"IF(D165=\"\",\"\",VLOOKUP(F165,'Plan Comptable '!$C$5:$D$554,2,0))","v":""},null,{"$f":"IF(H165=\"\",\"\",VLOOKUP(H165,#REF!,2,0))","v":""}]
[null,null,null,null,null,"",{"$f":"IF(D166=\"\",\"\",VLOOKUP(F166,'Plan Comptable '!$C$5:$D$554,2,0))","v":""},null,{"$f":"IF(H166=\"\",\"\",VLOOKUP(H166,#REF!,2,0))","v":""}]
[null,null,null,null,null,"",{"$f":"IF(D167=\"\",\"\",VLOOKUP(F167,'Plan Comptable '!$C$5:$D$554,2,0))","v":""},null,{"$f":"IF(H167=\"\",\"\",VLOOKUP(H167,#REF!,2,0))","v":""}]
[null,null,null,null,null,"",{"$f":"IF(D168=\"\",\"\",VLOOKUP(F168,'Plan Comptable '!$C$5:$D$554,2,0))","v":""},null,{"$f":"IF(H168=\"\",\"\",VLOOKUP(H168,#REF!,2,0))","v":""}]
[null,null,null,null,null,"",{"$f":"IF(D169=\"\",\"\",VLOOKUP(F169,'Plan Comptable '!$C$5:$D$554,2,0))","v":""},null,{"$f":"IF(H169=\"\",\"\",VLOOKUP(H169,#REF!,2,0))","v":""}]
[null,null,null,null,null,"",{"$f":"IF(D170=\"\",\"\",VLOOKUP(F170,'Plan Comptable '!$C$5:$D$554,2,0))","v":""},null,{"$f":"IF(H170=\"\",\"\",VLOOKUP(H170,#REF!,2,0))","v":""}]
[null,null,null,null,null,"",{"$f":"IF(D171=\"\",\"\",VLOOKUP(F171,'Plan Comptable '!$C$5:$D$554,2,0))","v":""},null,{"$f":"IF(H171=\"\",\"\",VLOOKUP(H171,#REF!,2,0))","v":""}]
[null,null,null,null,null,"",{"$f":"IF(D172=\"\",\"\",VLOOKUP(F172,'Plan Comptable '!$C$5:$D$554,2,0))","v":""},null,{"$f":"IF(H172=\"\",\"\",VLOOKUP(H172,#REF!,2,0))","v":""}]
[null,null,null,null,null,"",{"$f":"IF(D173=\"\",\"\",VLOOKUP(F173,'Plan Comptable '!$C$5:$D$554,2,0))","v":""},null,{"$f":"IF(H173=\"\",\"\",VLOOKUP(H173,#REF!,2,0))","v":""}]
[null,null,null,null,null,"",{"$f":"IF(D174=\"\",\"\",VLOOKUP(F174,'Plan Comptable '!$C$5:$D$554,2,0))","v":""},null,{"$f":"IF(H174=\"\",\"\",VLOOKUP(H174,#REF!,2,0))","v":""}]
[null,null,null,null,null,"",{"$f":"IF(D175=\"\",\"\",VLOOKUP(F175,'Plan Comptable '!$C$5:$D$554,2,0))","v":""},null,{"$f":"IF(H175=\"\",\"\",VLOOKUP(H175,#REF!,2,0))","v":""}]
[null,null,null,null,null,"",{"$f":"IF(D176=\"\",\"\",VLOOKUP(F176,'Plan Comptable '!$C$5:$D$554,2,0))","v":""},null,{"$f":"IF(H176=\"\",\"\",VLOOKUP(H176,#REF!,2,0))","v":""}]
[null,null,null,null,null,"",{"$f":"IF(D177=\"\",\"\",VLOOKUP(F177,'Plan Comptable '!$C$5:$D$554,2,0))","v":""},null,{"$f":"IF(H177=\"\",\"\",VLOOKUP(H177,#REF!,2,0))","v":""}]
[null,null,null,null,null,"",{"$f":"IF(D178=\"\",\"\",VLOOKUP(F178,'Plan Comptable '!$C$5:$D$554,2,0))","v":""},null,{"$f":"IF(H178=\"\",\"\",VLOOKUP(H178,#REF!,2,0))","v":""}]
[null,null,null,null,null,"",{"$f":"IF(D179=\"\",\"\",VLOOKUP(F179,'Plan Comptable '!$C$5:$D$554,2,0))","v":""},null,{"$f":"IF(H179=\"\",\"\",VLOOKUP(H179,#REF!,2,0))","v":""}]
[null,null,null,null,null,"",{"$f":"IF(D180=\"\",\"\",VLOOKUP(F180,'Plan Comptable '!$C$5:$D$554,2,0))","v":""},null,{"$f":"IF(H180=\"\",\"\",VLOOKUP(H180,#REF!,2,0))","v":""}]
[null,null,null,null,null,"",{"$f":"IF(D181=\"\",\"\",VLOOKUP(F181,'Plan Comptable '!$C$5:$D$554,2,0))","v":""},null,{"$f":"IF(H181=\"\",\"\",VLOOKUP(H181,#REF!,2,0))","v":""}]
[null,null,null,null,null,"",{"$f":"IF(D182=\"\",\"\",VLOOKUP(F182,'Plan Comptable '!$C$5:$D$554,2,0))","v":""},null,{"$f":"IF(H182=\"\",\"\",VLOOKUP(H182,#REF!,2,0))","v":""}]
[null,null,null,null,null,"",{"$f":"IF(D183=\"\",\"\",VLOOKUP(F183,'Plan Comptable '!$C$5:$D$554,2,0))","v":""},null,{"$f":"IF(H183=\"\",\"\",VLOOKUP(H183,#REF!,2,0))","v":""}]
[null,null,null,null,null,"",{"$f":"IF(D184=\"\",\"\",VLOOKUP(F184,'Plan Comptable '!$C$5:$D$554,2,0))","v":""},null,{"$f":"IF(H184=\"\",\"\",VLOOKUP(H184,#REF!,2,0))","v":""}]
[null,null,null,null,null,"",{"$f":"IF(D185=\"\",\"\",VLOOKUP(F185,'Plan Comptable '!$C$5:$D$554,2,0))","v":""},null,{"$f":"IF(H185=\"\",\"\",VLOOKUP(H185,#REF!,2,0))","v":""}]
[null,null,null,null,null,"",{"$f":"IF(D186=\"\",\"\",VLOOKUP(F186,'Plan Comptable '!$C$5:$D$554,2,0))","v":""},null,{"$f":"IF(H186=\"\",\"\",VLOOKUP(H186,#REF!,2,0))","v":""}]
[null,null,null,null,null,"",{"$f":"IF(D187=\"\",\"\",VLOOKUP(F187,'Plan Comptable '!$C$5:$D$554,2,0))","v":""},null,{"$f":"IF(H187=\"\",\"\",VLOOKUP(H187,#REF!,2,0))","v":""}]
[null,null,null,null,null,"",{"$f":"IF(D188=\"\",\"\",VLOOKUP(F188,'Plan Comptable '!$C$5:$D$554,2,0))","v":""},null,{"$f":"IF(H188=\"\",\"\",VLOOKUP(H188,#REF!,2,0))","v":""}]
[null,null,null,null,null,"",{"$f":"IF(D189=\"\",\"\",VLOOKUP(F189,'Plan Comptable '!$C$5:$D$554,2,0))","v":""},null,{"$f":"IF(H189=\"\",\"\",VLOOKUP(H189,#REF!,2,0))","v":""}]
[null,null,null,null,null,"",{"$f":"IF(D190=\"\",\"\",VLOOKUP(F190,'Plan Comptable '!$C$5:$D$554,2,0))","v":""},null,{"$f":"IF(H190=\"\",\"\",VLOOKUP(H190,#REF!,2,0))","v":""}]
[null,null,null,null,null,"",{"$f":"IF(D191=\"\",\"\",VLOOKUP(F191,'Plan Comptable '!$C$5:$D$554,2,0))","v":""},null,{"$f":"IF(H191=\"\",\"\",VLOOKUP(H191,#REF!,2,0))","v":""}]
[null,null,null,null,null,"",{"$f":"IF(D192=\"\",\"\",VLOOKUP(F192,'Plan Comptable '!$C$5:$D$554,2,0))","v":""},null,{"$f":"IF(H192=\"\",\"\",VLOOKUP(H192,#REF!,2,0))","v":""}]
[null,null,null,null,null,"",{"$f":"IF(D193=\"\",\"\",VLOOKUP(F193,'Plan Comptable '!$C$5:$D$554,2,0))","v":""},null,{"$f":"IF(H193=\"\",\"\",VLOOKUP(H193,#REF!,2,0))","v":""}]
[null,null,null,null,null,"",{"$f":"IF(D194=\"\",\"\",VLOOKUP(F194,'Plan Comptable '!$C$5:$D$554,2,0))","v":""},null,{"$f":"IF(H194=\"\",\"\",VLOOKUP(H194,#REF!,2,0))","v":""}]
[null,null,null,null,null,"",{"$f":"IF(D195=\"\",\"\",VLOOKUP(F195,'Plan Comptable '!$C$5:$D$554,2,0))","v":""},null,{"$f":"IF(H195=\"\",\"\",VLOOKUP(H195,#REF!,2,0))","v":""}]
[null,null,null,null,null,"",{"$f":"IF(D196=\"\",\"\",VLOOKUP(F196,'Plan Comptable '!$C$5:$D$554,2,0))","v":""},null,{"$f":"IF(H196=\"\",\"\",VLOOKUP(H196,#REF!,2,0))","v":""}]
[null,null,null,null,null,"",{"$f":"IF(D197=\"\",\"\",VLOOKUP(F197,'Plan Comptable '!$C$5:$D$554,2,0))","v":""},null,{"$f":"IF(H197=\"\",\"\",VLOOKUP(H197,#REF!,2,0))","v":""}]
[null,null,null,null,null,"",{"$f":"IF(D198=\"\",\"\",VLOOKUP(F198,'Plan Comptable '!$C$5:$D$554,2,0))","v":""},null,{"$f":"IF(H198=\"\",\"\",VLOOKUP(H198,#REF!,2,0))","v":""}]
[null,null,null,null,null,"",{"$f":"IF(D199=\"\",\"\",VLOOKUP(F199,'Plan Comptable '!$C$5:$D$554,2,0))","v":""},null,{"$f":"IF(H199=\"\",\"\",VLOOKUP(H199,#REF!,2,0))","v":""}]
[null,null,null,null,null,"",{"$f":"IF(D200=\"\",\"\",VLOOKUP(F200,'Plan Comptable '!$C$5:$D$554,2,0))","v":""},null,{"$f":"IF(H200=\"\",\"\",VLOOKUP(H200,#REF!,2,0))","v":""}]
[null,null,null,null,null,"",{"$f":"IF(D201=\"\",\"\",VLOOKUP(F201,'Plan Comptable '!$C$5:$D$554,2,0))","v":""},null,{"$f":"IF(H201=\"\",\"\",VLOOKUP(H201,#REF!,2,0))","v":""}]
[null,null,null,null,null,"",{"$f":"IF(D202=\"\",\"\",VLOOKUP(F202,'Plan Comptable '!$C$5:$D$554,2,0))","v":""},null,{"$f":"IF(H202=\"\",\"\",VLOOKUP(H202,#REF!,2,0))","v":""}]
[null,null,null,null,null,"",{"$f":"IF(D203=\"\",\"\",VLOOKUP(F203,'Plan Comptable '!$C$5:$D$554,2,0))","v":""},null,{"$f":"IF(H203=\"\",\"\",VLOOKUP(H203,#REF!,2,0))","v":""}]
[null,null,null,null,null,{"$f":"CONCATENATE(D204,E204)","v":""},{"$f":"IF(D204=\"\",\"\",VLOOKUP(F204,'Plan Comptable '!$C$5:$D$554,2,0))","v":""},null,{"$f":"IF(H204=\"\",\"\",VLOOKUP(H204,#REF!,2,0))","v":""}]
[null,null,null,null,null,"",{"$f":"IF(D205=\"\",\"\",VLOOKUP(F205,'Plan Comptable '!$C$5:$D$554,2,0))","v":""},null,{"$f":"IF(H205=\"\",\"\",VLOOKUP(H205,#REF!,2,0))","v":""}]
[null,null,null,null,null,"",{"$f":"IF(D206=\"\",\"\",VLOOKUP(F206,'Plan Comptable '!$C$5:$D$554,2,0))","v":""},null,{"$f":"IF(H206=\"\",\"\",VLOOKUP(H206,#REF!,2,0))","v":""}]
[null,null,null,null,null,"",{"$f":"IF(D207=\"\",\"\",VLOOKUP(F207,'Plan Comptable '!$C$5:$D$554,2,0))","v":""},null,{"$f":"IF(H207=\"\",\"\",VLOOKUP(H207,#REF!,2,0))","v":""}]
[null,null,null,null,null,"",{"$f":"IF(D208=\"\",\"\",VLOOKUP(F208,'Plan Comptable '!$C$5:$D$554,2,0))","v":""},null,{"$f":"IF(H208=\"\",\"\",VLOOKUP(H208,#REF!,2,0))","v":""}]
[null,null,null,null,null,"",{"$f":"IF(D209=\"\",\"\",VLOOKUP(F209,'Plan Comptable '!$C$5:$D$554,2,0))","v":""},null,{"$f":"IF(H209=\"\",\"\",VLOOKUP(H209,#REF!,2,0))","v":""}]
[null,null,null,null,null,"",{"$f":"IF(D210=\"\",\"\",VLOOKUP(F210,'Plan Comptable '!$C$5:$D$554,2,0))","v":""},null,{"$f":"IF(H210=\"\",\"\",VLOOKUP(H210,#REF!,2,0))","v":""}]
[null,null,null,null,null,"",{"$f":"IF(D211=\"\",\"\",VLOOKUP(F211,'Plan Comptable '!$C$5:$D$554,2,0))","v":""},null,{"$f":"IF(H211=\"\",\"\",VLOOKUP(H211,#REF!,2,0))","v":""}]
[null,null,null,null,null,"",{"$f":"IF(D212=\"\",\"\",VLOOKUP(F212,'Plan Comptable '!$C$5:$D$554,2,0))","v":""},null,{"$f":"IF(H212=\"\",\"\",VLOOKUP(H212,#REF!,2,0))","v":""}]
[null,null,null,null,null,"",{"$f":"IF(D213=\"\",\"\",VLOOKUP(F213,'Plan Comptable '!$C$5:$D$554,2,0))","v":""},null,{"$f":"IF(H213=\"\",\"\",VLOOKUP(H213,#REF!,2,0))","v":""}]
[null,null,null,null,null,"",{"$f":"IF(D214=\"\",\"\",VLOOKUP(F214,'Plan Comptable '!$C$5:$D$554,2,0))","v":""},null,{"$f":"IF(H214=\"\",\"\",VLOOKUP(H214,#REF!,2,0))","v":""}]
[null,null,null,null,null,"",{"$f":"IF(D215=\"\",\"\",VLOOKUP(F215,'Plan Comptable '!$C$5:$D$554,2,0))","v":""},null,{"$f":"IF(H215=\"\",\"\",VLOOKUP(H215,#REF!,2,0))","v":""}]
[null,null,null,null,null,"",{"$f":"IF(D216=\"\",\"\",VLOOKUP(F216,'Plan Comptable '!$C$5:$D$554,2,0))","v":""},null,{"$f":"IF(H216=\"\",\"\",VLOOKUP(H216,#REF!,2,0))","v":""}]
[null,null,null,null,null,"",{"$f":"IF(D217=\"\",\"\",VLOOKUP(F217,'Plan Comptable '!$C$5:$D$554,2,0))","v":""},null,{"$f":"IF(H217=\"\",\"\",VLOOKUP(H217,#REF!,2,0))","v":""}]
[null,null,null,null,null,"",{"$f":"IF(D218=\"\",\"\",VLOOKUP(F218,'Plan Comptable '!$C$5:$D$554,2,0))","v":""},null,{"$f":"IF(H218=\"\",\"\",VLOOKUP(H218,#REF!,2,0))","v":""}]
[null,null,null,null,null,"",{"$f":"IF(D219=\"\",\"\",VLOOKUP(F219,'Plan Comptable '!$C$5:$D$554,2,0))","v":""},null,{"$f":"IF(H219=\"\",\"\",VLOOKUP(H219,#REF!,2,0))","v":""}]
[null,null,null,null,null,"",{"$f":"IF(D220=\"\",\"\",VLOOKUP(F220,'Plan Comptable '!$C$5:$D$554,2,0))","v":""},null,{"$f":"IF(H220=\"\",\"\",VLOOKUP(H220,#REF!,2,0))","v":""}]
[null,null,null,null,null,"",{"$f":"IF(D221=\"\",\"\",VLOOKUP(F221,'Plan Comptable '!$C$5:$D$554,2,0))","v":""},null,{"$f":"IF(H221=\"\",\"\",VLOOKUP(H221,#REF!,2,0))","v":""}]
[null,null,null,null,null,"",{"$f":"IF(D222=\"\",\"\",VLOOKUP(F222,'Plan Comptable '!$C$5:$D$554,2,0))","v":""},null,{"$f":"IF(H222=\"\",\"\",VLOOKUP(H222,#REF!,2,0))","v":""}]
[null,null,null,null,null,"",{"$f":"IF(D223=\"\",\"\",VLOOKUP(F223,'Plan Comptable '!$C$5:$D$554,2,0))","v":""},null,{"$f":"IF(H223=\"\",\"\",VLOOKUP(H223,#REF!,2,0))","v":""}]
[null,null,null,null,null,"",{"$f":"IF(D224=\"\",\"\",VLOOKUP(F224,'Plan Comptable '!$C$5:$D$554,2,0))","v":""},null,{"$f":"IF(H224=\"\",\"\",VLOOKUP(H224,#REF!,2,0))","v":""}]
[null,null,null,null,null,"",{"$f":"IF(D225=\"\",\"\",VLOOKUP(F225,'Plan Comptable '!$C$5:$D$554,2,0))","v":""},null,{"$f":"IF(H225=\"\",\"\",VLOOKUP(H225,#REF!,2,0))","v":""}]
[null,null,null,null,null,"",{"$f":"IF(D226=\"\",\"\",VLOOKUP(F226,'Plan Comptable '!$C$5:$D$554,2,0))","v":""},null,{"$f":"IF(H226=\"\",\"\",VLOOKUP(H226,#REF!,2,0))","v":""}]
[null,null,null,null,null,"",{"$f":"IF(D227=\"\",\"\",VLOOKUP(F227,'Plan Comptable '!$C$5:$D$554,2,0))","v":""},null,{"$f":"IF(H227=\"\",\"\",VLOOKUP(H227,#REF!,2,0))","v":""}]
[null,null,null,null,null,"",{"$f":"IF(D228=\"\",\"\",VLOOKUP(F228,'Plan Comptable '!$C$5:$D$554,2,0))","v":""},null,{"$f":"IF(H228=\"\",\"\",VLOOKUP(H228,#REF!,2,0))","v":""}]
[null,null,null,null,null,"",{"$f":"IF(D229=\"\",\"\",VLOOKUP(F229,'Plan Comptable '!$C$5:$D$554,2,0))","v":""},null,{"$f":"IF(H229=\"\",\"\",VLOOKUP(H229,#REF!,2,0))","v":""}]
[null,null,null,null,null,"",{"$f":"IF(D230=\"\",\"\",VLOOKUP(F230,'Plan Comptable '!$C$5:$D$554,2,0))","v":""},null,{"$f":"IF(H230=\"\",\"\",VLOOKUP(H230,#REF!,2,0))","v":""}]
[null,null,null,null,null,"",{"$f":"IF(D231=\"\",\"\",VLOOKUP(F231,'Plan Comptable '!$C$5:$D$554,2,0))","v":""},null,{"$f":"IF(H231=\"\",\"\",VLOOKUP(H231,#REF!,2,0))","v":""}]
[null,null,null,null,null,"",{"$f":"IF(D232=\"\",\"\",VLOOKUP(F232,'Plan Comptable '!$C$5:$D$554,2,0))","v":""},null,{"$f":"IF(H232=\"\",\"\",VLOOKUP(H232,#REF!,2,0))","v":""}]
[null,null,null,null,null,"",{"$f":"IF(D233=\"\",\"\",VLOOKUP(F233,'Plan Comptable '!$C$5:$D$554,2,0))","v":""},null,{"$f":"IF(H233=\"\",\"\",VLOOKUP(H233,#REF!,2,0))","v":""}]
[null,null,null,null,null,"",{"$f":"IF(D234=\"\",\"\",VLOOKUP(F234,'Plan Comptable '!$C$5:$D$554,2,0))","v":""},null,{"$f":"IF(H234=\"\",\"\",VLOOKUP(H234,#REF!,2,0))","v":""}]
[null,null,null,null,null,"",{"$f":"IF(D235=\"\",\"\",VLOOKUP(F235,'Plan Comptable '!$C$5:$D$554,2,0))","v":""},null,{"$f":"IF(H235=\"\",\"\",VLOOKUP(H235,#REF!,2,0))","v":""}]
[null,null,null,null,null,"",{"$f":"IF(D236=\"\",\"\",VLOOKUP(F236,'Plan Comptable '!$C$5:$D$554,2,0))","v":""},null,{"$f":"IF(H236=\"\",\"\",VLOOKUP(H236,#REF!,2,0))","v":""}]
[null,null,null,null,null,"",{"$f":"IF(D237=\"\",\"\",VLOOKUP(F237,'Plan Comptable '!$C$5:$D$554,2,0))","v":""},null,{"$f":"IF(H237=\"\",\"\",VLOOKUP(H237,#REF!,2,0))","v":""}]
[null,null,null,null,null,"",{"$f":"IF(D238=\"\",\"\",VLOOKUP(F238,'Plan Comptable '!$C$5:$D$554,2,0))","v":""},null,{"$f":"IF(H238=\"\",\"\",VLOOKUP(H238,#REF!,2,0))","v":""}]
[null,null,null,null,null,"",{"$f":"IF(D239=\"\",\"\",VLOOKUP(F239,'Plan Comptable '!$C$5:$D$554,2,0))","v":""},null,{"$f":"IF(H239=\"\",\"\",VLOOKUP(H239,#REF!,2,0))","v":""}]
[null,null,null,null,null,"",{"$f":"IF(D240=\"\",\"\",VLOOKUP(F240,'Plan Comptable '!$C$5:$D$554,2,0))","v":""},null,{"$f":"IF(H240=\"\",\"\",VLOOKUP(H240,#REF!,2,0))","v":""}]
[null,null,null,null,null,"",{"$f":"IF(D241=\"\",\"\",VLOOKUP(F241,'Plan Comptable '!$C$5:$D$554,2,0))","v":""},null,{"$f":"IF(H241=\"\",\"\",VLOOKUP(H241,#REF!,2,0))","v":""}]
[null,null,null,null,null,"",{"$f":"IF(D242=\"\",\"\",VLOOKUP(F242,'Plan Comptable '!$C$5:$D$554,2,0))","v":""},null,{"$f":"IF(H242=\"\",\"\",VLOOKUP(H242,#REF!,2,0))","v":""}]
[null,null,null,null,null,"",{"$f":"IF(D243=\"\",\"\",VLOOKUP(F243,'Plan Comptable '!$C$5:$D$554,2,0))","v":""},null,{"$f":"IF(H243=\"\",\"\",VLOOKUP(H243,#REF!,2,0))","v":""}]
[null,null,null,null,null,"",{"$f":"IF(D244=\"\",\"\",VLOOKUP(F244,'Plan Comptable '!$C$5:$D$554,2,0))","v":""},null,{"$f":"IF(H244=\"\",\"\",VLOOKUP(H244,#REF!,2,0))","v":""}]
[null,null,null,null,null,"",{"$f":"IF(D245=\"\",\"\",VLOOKUP(F245,'Plan Comptable '!$C$5:$D$554,2,0))","v":""},null,{"$f":"IF(H245=\"\",\"\",VLOOKUP(H245,#REF!,2,0))","v":""}]
[null,null,null,null,null,"",{"$f":"IF(D246=\"\",\"\",VLOOKUP(F246,'Plan Comptable '!$C$5:$D$554,2,0))","v":""},null,{"$f":"IF(H246=\"\",\"\",VLOOKUP(H246,#REF!,2,0))","v":""}]
[null,null,null,null,null,"",{"$f":"IF(D247=\"\",\"\",VLOOKUP(F247,'Plan Comptable '!$C$5:$D$554,2,0))","v":""},null,{"$f":"IF(H247=\"\",\"\",VLOOKUP(H247,#REF!,2,0))","v":""}]
[null,null,null,null,null,"",{"$f":"IF(D248=\"\",\"\",VLOOKUP(F248,'Plan Comptable '!$C$5:$D$554,2,0))","v":""},null,{"$f":"IF(H248=\"\",\"\",VLOOKUP(H248,#REF!,2,0))","v":""}]
[null,null,null,null,null,"",{"$f":"IF(D249=\"\",\"\",VLOOKUP(F249,'Plan Comptable '!$C$5:$D$554,2,0))","v":""},null,{"$f":"IF(H249=\"\",\"\",VLOOKUP(H249,#REF!,2,0))","v":""}]
[null,null,null,null,null,"",{"$f":"IF(D250=\"\",\"\",VLOOKUP(F250,'Plan Comptable '!$C$5:$D$554,2,0))","v":""},null,{"$f":"IF(H250=\"\",\"\",VLOOKUP(H250,#REF!,2,0))","v":""}]
[null,null,null,null,null,"",{"$f":"IF(D251=\"\",\"\",VLOOKUP(F251,'Plan Comptable '!$C$5:$D$554,2,0))","v":""},null,{"$f":"IF(H251=\"\",\"\",VLOOKUP(H251,#REF!,2,0))","v":""}]
[null,null,null,null,null,"",{"$f":"IF(D252=\"\",\"\",VLOOKUP(F252,'Plan Comptable '!$C$5:$D$554,2,0))","v":""},null,{"$f":"IF(H252=\"\",\"\",VLOOKUP(H252,#REF!,2,0))","v":""}]
[null,null,null,null,null,"",{"$f":"IF(D253=\"\",\"\",VLOOKUP(F253,'Plan Comptable '!$C$5:$D$554,2,0))","v":""},null,{"$f":"IF(H253=\"\",\"\",VLOOKUP(H253,#REF!,2,0))","v":""}]
[null,null,null,null,null,"",{"$f":"IF(D254=\"\",\"\",VLOOKUP(F254,'Plan Comptable '!$C$5:$D$554,2,0))","v":""},null,{"$f":"IF(H254=\"\",\"\",VLOOKUP(H254,#REF!,2,0))","v":""}]
[null,null,null,null,null,"",{"$f":"IF(D255=\"\",\"\",VLOOKUP(F255,'Plan Comptable '!$C$5:$D$554,2,0))","v":""},null,{"$f":"IF(H255=\"\",\"\",VLOOKUP(H255,#REF!,2,0))","v":""}]
[null,null,null,null,null,"",{"$f":"IF(D256=\"\",\"\",VLOOKUP(F256,'Plan Comptable '!$C$5:$D$554,2,0))","v":""},null,{"$f":"IF(H256=\"\",\"\",VLOOKUP(H256,#REF!,2,0))","v":""}]
[null,null,null,null,null,"",{"$f":"IF(D257=\"\",\"\",VLOOKUP(F257,'Plan Comptable '!$C$5:$D$554,2,0))","v":""},null,{"$f":"IF(H257=\"\",\"\",VLOOKUP(H257,#REF!,2,0))","v":""}]
[null,null,null,null,null,"",{"$f":"IF(D258=\"\",\"\",VLOOKUP(F258,'Plan Comptable '!$C$5:$D$554,2,0))","v":""},null,{"$f":"IF(H258=\"\",\"\",VLOOKUP(H258,#REF!,2,0))","v":""}]
[null,null,null,null,null,"",{"$f":"IF(D259=\"\",\"\",VLOOKUP(F259,'Plan Comptable '!$C$5:$D$554,2,0))","v":""},null,{"$f":"IF(H259=\"\",\"\",VLOOKUP(H259,#REF!,2,0))","v":""}]
[null,null,null,null,null,"",{"$f":"IF(D260=\"\",\"\",VLOOKUP(F260,'Plan Comptable '!$C$5:$D$554,2,0))","v":""},null,{"$f":"IF(H260=\"\",\"\",VLOOKUP(H260,#REF!,2,0))","v":""}]
[null,null,null,null,null,"",{"$f":"IF(D261=\"\",\"\",VLOOKUP(F261,'Plan Comptable '!$C$5:$D$554,2,0))","v":""},null,{"$f":"IF(H261=\"\",\"\",VLOOKUP(H261,#REF!,2,0))","v":""}]
[null,null,null,null,null,"",{"$f":"IF(D262=\"\",\"\",VLOOKUP(F262,'Plan Comptable '!$C$5:$D$554,2,0))","v":""},null,{"$f":"IF(H262=\"\",\"\",VLOOKUP(H262,#REF!,2,0))","v":""}]
[null,null,null,null,null,"",{"$f":"IF(D263=\"\",\"\",VLOOKUP(F263,'Plan Comptable '!$C$5:$D$554,2,0))","v":""},null,{"$f":"IF(H263=\"\",\"\",VLOOKUP(H263,#REF!,2,0))","v":""}]
[null,null,null,null,null,"",{"$f":"IF(D264=\"\",\"\",VLOOKUP(F264,'Plan Comptable '!$C$5:$D$554,2,0))","v":""},null,{"$f":"IF(H264=\"\",\"\",VLOOKUP(H264,#REF!,2,0))","v":""}]
[null,null,null,null,null,"",{"$f":"IF(D265=\"\",\"\",VLOOKUP(F265,'Plan Comptable '!$C$5:$D$554,2,0))","v":""},null,{"$f":"IF(H265=\"\",\"\",VLOOKUP(H265,#REF!,2,0))","v":""}]
[null,null,null,null,null,"",{"$f":"IF(D266=\"\",\"\",VLOOKUP(F266,'Plan Comptable '!$C$5:$D$554,2,0))","v":""},null,{"$f":"IF(H266=\"\",\"\",VLOOKUP(H266,#REF!,2,0))","v":""}]
[null,null,null,null,null,"",{"$f":"IF(D267=\"\",\"\",VLOOKUP(F267,'Plan Comptable '!$C$5:$D$554,2,0))","v":""},null,{"$f":"IF(H267=\"\",\"\",VLOOKUP(H267,#REF!,2,0))","v":""}]
[null,null,null,null,null,{"$f":"CONCATENATE(D268,E268)","v":""},{"$f":"IF(D268=\"\",\"\",VLOOKUP(F268,'Plan Comptable '!$C$5:$D$554,2,0))","v":""},null,{"$f":"IF(H268=\"\",\"\",VLOOKUP(H268,#REF!,2,0))","v":""}]
[null,null,null,null,null,"",{"$f":"IF(D269=\"\",\"\",VLOOKUP(F269,'Plan Comptable '!$C$5:$D$554,2,0))","v":""},null,{"$f":"IF(H269=\"\",\"\",VLOOKUP(H269,#REF!,2,0))","v":""}]
[null,null,null,null,null,"",{"$f":"IF(D270=\"\",\"\",VLOOKUP(F270,'Plan Comptable '!$C$5:$D$554,2,0))","v":""},null,{"$f":"IF(H270=\"\",\"\",VLOOKUP(H270,#REF!,2,0))","v":""}]
[null,null,null,null,null,"",{"$f":"IF(D271=\"\",\"\",VLOOKUP(F271,'Plan Comptable '!$C$5:$D$554,2,0))","v":""},null,{"$f":"IF(H271=\"\",\"\",VLOOKUP(H271,#REF!,2,0))","v":""}]
[null,null,null,null,null,"",{"$f":"IF(D272=\"\",\"\",VLOOKUP(F272,'Plan Comptable '!$C$5:$D$554,2,0))","v":""},null,{"$f":"IF(H272=\"\",\"\",VLOOKUP(H272,#REF!,2,0))","v":""}]
[null,null,null,null,null,"",{"$f":"IF(D273=\"\",\"\",VLOOKUP(F273,'Plan Comptable '!$C$5:$D$554,2,0))","v":""},null,{"$f":"IF(H273=\"\",\"\",VLOOKUP(H273,#REF!,2,0))","v":""}]
[null,null,null,null,null,"",{"$f":"IF(D274=\"\",\"\",VLOOKUP(F274,'Plan Comptable '!$C$5:$D$554,2,0))","v":""},null,{"$f":"IF(H274=\"\",\"\",VLOOKUP(H274,#REF!,2,0))","v":""}]
[null,null,null,null,null,"",{"$f":"IF(D275=\"\",\"\",VLOOKUP(F275,'Plan Comptable '!$C$5:$D$554,2,0))","v":""},null,{"$f":"IF(H275=\"\",\"\",VLOOKUP(H275,#REF!,2,0))","v":""}]
[null,null,null,null,null,"",{"$f":"IF(D276=\"\",\"\",VLOOKUP(F276,'Plan Comptable '!$C$5:$D$554,2,0))","v":""},null,{"$f":"IF(H276=\"\",\"\",VLOOKUP(H276,#REF!,2,0))","v":""}]
[null,null,null,null,null,"",{"$f":"IF(D277=\"\",\"\",VLOOKUP(F277,'Plan Comptable '!$C$5:$D$554,2,0))","v":""},null,{"$f":"IF(H277=\"\",\"\",VLOOKUP(H277,#REF!,2,0))","v":""}]
[null,null,null,null,null,"",{"$f":"IF(D278=\"\",\"\",VLOOKUP(F278,'Plan Comptable '!$C$5:$D$554,2,0))","v":""},null,{"$f":"IF(H278=\"\",\"\",VLOOKUP(H278,#REF!,2,0))","v":""}]
[null,null,null,null,null,"",{"$f":"IF(D279=\"\",\"\",VLOOKUP(F279,'Plan Comptable '!$C$5:$D$554,2,0))","v":""},null,{"$f":"IF(H279=\"\",\"\",VLOOKUP(H279,#REF!,2,0))","v":""}]
[null,null,null,null,null,"",{"$f":"IF(D280=\"\",\"\",VLOOKUP(F280,'Plan Comptable '!$C$5:$D$554,2,0))","v":""},null,{"$f":"IF(H280=\"\",\"\",VLOOKUP(H280,#REF!,2,0))","v":""}]
[null,null,null,null,null,"",{"$f":"IF(D281=\"\",\"\",VLOOKUP(F281,'Plan Comptable '!$C$5:$D$554,2,0))","v":""},null,{"$f":"IF(H281=\"\",\"\",VLOOKUP(H281,#REF!,2,0))","v":""}]
[null,null,null,null,null,"",{"$f":"IF(D282=\"\",\"\",VLOOKUP(F282,'Plan Comptable '!$C$5:$D$554,2,0))","v":""},null,{"$f":"IF(H282=\"\",\"\",VLOOKUP(H282,#REF!,2,0))","v":""}]
[null,null,null,null,null,"",{"$f":"IF(D283=\"\",\"\",VLOOKUP(F283,'Plan Comptable '!$C$5:$D$554,2,0))","v":""},null,{"$f":"IF(H283=\"\",\"\",VLOOKUP(H283,#REF!,2,0))","v":""}]
[null,null,null,null,null,"",{"$f":"IF(D284=\"\",\"\",VLOOKUP(F284,'Plan Comptable '!$C$5:$D$554,2,0))","v":""},null,{"$f":"IF(H284=\"\",\"\",VLOOKUP(H284,#REF!,2,0))","v":""}]
[null,null,null,null,null,"",{"$f":"IF(D285=\"\",\"\",VLOOKUP(F285,'Plan Comptable '!$C$5:$D$554,2,0))","v":""},null,{"$f":"IF(H285=\"\",\"\",VLOOKUP(H285,#REF!,2,0))","v":""}]
[null,null,null,null,null,"",{"$f":"IF(D286=\"\",\"\",VLOOKUP(F286,'Plan Comptable '!$C$5:$D$554,2,0))","v":""},null,{"$f":"IF(H286=\"\",\"\",VLOOKUP(H286,#REF!,2,0))","v":""}]
[null,null,null,null,null,"",{"$f":"IF(D287=\"\",\"\",VLOOKUP(F287,'Plan Comptable '!$C$5:$D$554,2,0))","v":""},null,{"$f":"IF(H287=\"\",\"\",VLOOKUP(H287,#REF!,2,0))","v":""}]
[null,null,null,null,null,"",{"$f":"IF(D288=\"\",\"\",VLOOKUP(F288,'Plan Comptable '!$C$5:$D$554,2,0))","v":""},null,{"$f":"IF(H288=\"\",\"\",VLOOKUP(H288,#REF!,2,0))","v":""}]
[null,null,null,null,null,"",{"$f":"IF(D289=\"\",\"\",VLOOKUP(F289,'Plan Comptable '!$C$5:$D$554,2,0))","v":""},null,{"$f":"IF(H289=\"\",\"\",VLOOKUP(H289,#REF!,2,0))","v":""}]
[null,null,null,null,null,"",{"$f":"IF(D290=\"\",\"\",VLOOKUP(F290,'Plan Comptable '!$C$5:$D$554,2,0))","v":""},null,{"$f":"IF(H290=\"\",\"\",VLOOKUP(H290,#REF!,2,0))","v":""}]
[null,null,null,null,null,"",{"$f":"IF(D291=\"\",\"\",VLOOKUP(F291,'Plan Comptable '!$C$5:$D$554,2,0))","v":""},null,{"$f":"IF(H291=\"\",\"\",VLOOKUP(H291,#REF!,2,0))","v":""}]
[null,null,null,null,null,"",{"$f":"IF(D292=\"\",\"\",VLOOKUP(F292,'Plan Comptable '!$C$5:$D$554,2,0))","v":""},null,{"$f":"IF(H292=\"\",\"\",VLOOKUP(H292,#REF!,2,0))","v":""}]
[null,null,null,null,null,"",{"$f":"IF(D293=\"\",\"\",VLOOKUP(F293,'Plan Comptable '!$C$5:$D$554,2,0))","v":""},null,{"$f":"IF(H293=\"\",\"\",VLOOKUP(H293,#REF!,2,0))","v":""}]
[null,null,null,null,null,"",{"$f":"IF(D294=\"\",\"\",VLOOKUP(F294,'Plan Comptable '!$C$5:$D$554,2,0))","v":""},null,{"$f":"IF(H294=\"\",\"\",VLOOKUP(H294,#REF!,2,0))","v":""}]
[null,null,null,null,null,"",{"$f":"IF(D295=\"\",\"\",VLOOKUP(F295,'Plan Comptable '!$C$5:$D$554,2,0))","v":""},null,{"$f":"IF(H295=\"\",\"\",VLOOKUP(H295,#REF!,2,0))","v":""}]
[null,null,null,null,null,"",{"$f":"IF(D296=\"\",\"\",VLOOKUP(F296,'Plan Comptable '!$C$5:$D$554,2,0))","v":""},null,{"$f":"IF(H296=\"\",\"\",VLOOKUP(H296,#REF!,2,0))","v":""}]
[null,null,null,null,null,"",{"$f":"IF(D297=\"\",\"\",VLOOKUP(F297,'Plan Comptable '!$C$5:$D$554,2,0))","v":""},null,{"$f":"IF(H297=\"\",\"\",VLOOKUP(H297,#REF!,2,0))","v":""}]
[null,null,null,null,null,"",{"$f":"IF(D298=\"\",\"\",VLOOKUP(F298,'Plan Comptable '!$C$5:$D$554,2,0))","v":""},null,{"$f":"IF(H298=\"\",\"\",VLOOKUP(H298,#REF!,2,0))","v":""}]
[null,null,null,null,null,"",{"$f":"IF(D299=\"\",\"\",VLOOKUP(F299,'Plan Comptable '!$C$5:$D$554,2,0))","v":""},null,{"$f":"IF(H299=\"\",\"\",VLOOKUP(H299,#REF!,2,0))","v":""}]
[null,null,null,null,null,"",{"$f":"IF(D300=\"\",\"\",VLOOKUP(F300,'Plan Comptable '!$C$5:$D$554,2,0))","v":""},null,{"$f":"IF(H300=\"\",\"\",VLOOKUP(H300,#REF!,2,0))","v":""}]
[null,null,null,null,null,"",{"$f":"IF(D301=\"\",\"\",VLOOKUP(F301,'Plan Comptable '!$C$5:$D$554,2,0))","v":""},null,{"$f":"IF(H301=\"\",\"\",VLOOKUP(H301,#REF!,2,0))","v":""}]
[null,null,null,null,null,"",{"$f":"IF(D302=\"\",\"\",VLOOKUP(F302,'Plan Comptable '!$C$5:$D$554,2,0))","v":""},null,{"$f":"IF(H302=\"\",\"\",VLOOKUP(H302,#REF!,2,0))","v":""}]
[null,null,null,null,null,"",{"$f":"IF(D303=\"\",\"\",VLOOKUP(F303,'Plan Comptable '!$C$5:$D$554,2,0))","v":""},null,{"$f":"IF(H303=\"\",\"\",VLOOKUP(H303,#REF!,2,0))","v":""}]
[null,null,null,null,null,"",{"$f":"IF(D304=\"\",\"\",VLOOKUP(F304,'Plan Comptable '!$C$5:$D$554,2,0))","v":""},null,{"$f":"IF(H304=\"\",\"\",VLOOKUP(H304,#REF!,2,0))","v":""}]
[null,null,null,null,null,"",{"$f":"IF(D305=\"\",\"\",VLOOKUP(F305,'Plan Comptable '!$C$5:$D$554,2,0))","v":""},null,{"$f":"IF(H305=\"\",\"\",VLOOKUP(H305,#REF!,2,0))","v":""}]
[null,null,null,null,null,"",{"$f":"IF(D306=\"\",\"\",VLOOKUP(F306,'Plan Comptable '!$C$5:$D$554,2,0))","v":""},null,{"$f":"IF(H306=\"\",\"\",VLOOKUP(H306,#REF!,2,0))","v":""}]
[null,null,null,null,null,"",{"$f":"IF(D307=\"\",\"\",VLOOKUP(F307,'Plan Comptable '!$C$5:$D$554,2,0))","v":""},null,{"$f":"IF(H307=\"\",\"\",VLOOKUP(H307,#REF!,2,0))","v":""}]
[null,null,null,null,null,"",{"$f":"IF(D308=\"\",\"\",VLOOKUP(F308,'Plan Comptable '!$C$5:$D$554,2,0))","v":""},null,{"$f":"IF(H308=\"\",\"\",VLOOKUP(H308,#REF!,2,0))","v":""}]
[null,null,null,null,null,"",{"$f":"IF(D309=\"\",\"\",VLOOKUP(F309,'Plan Comptable '!$C$5:$D$554,2,0))","v":""},null,{"$f":"IF(H309=\"\",\"\",VLOOKUP(H309,#REF!,2,0))","v":""}]
[null,null,null,null,null,"",{"$f":"IF(D310=\"\",\"\",VLOOKUP(F310,'Plan Comptable '!$C$5:$D$554,2,0))","v":""},null,{"$f":"IF(H310=\"\",\"\",VLOOKUP(H310,#REF!,2,0))","v":""}]
[null,null,null,null,null,"",{"$f":"IF(D311=\"\",\"\",VLOOKUP(F311,'Plan Comptable '!$C$5:$D$554,2,0))","v":""},null,{"$f":"IF(H311=\"\",\"\",VLOOKUP(H311,#REF!,2,0))","v":""}]
[null,null,null,null,null,"",{"$f":"IF(D312=\"\",\"\",VLOOKUP(F312,'Plan Comptable '!$C$5:$D$554,2,0))","v":""},null,{"$f":"IF(H312=\"\",\"\",VLOOKUP(H312,#REF!,2,0))","v":""}]
[null,null,null,null,null,"",{"$f":"IF(D313=\"\",\"\",VLOOKUP(F313,'Plan Comptable '!$C$5:$D$554,2,0))","v":""},null,{"$f":"IF(H313=\"\",\"\",VLOOKUP(H313,#REF!,2,0))","v":""}]
[null,null,null,null,null,"",{"$f":"IF(D314=\"\",\"\",VLOOKUP(F314,'Plan Comptable '!$C$5:$D$554,2,0))","v":""},null,{"$f":"IF(H314=\"\",\"\",VLOOKUP(H314,#REF!,2,0))","v":""}]
[null,null,null,null,null,"",{"$f":"IF(D315=\"\",\"\",VLOOKUP(F315,'Plan Comptable '!$C$5:$D$554,2,0))","v":""},null,{"$f":"IF(H315=\"\",\"\",VLOOKUP(H315,#REF!,2,0))","v":""}]
[null,null,null,null,null,"",{"$f":"IF(D316=\"\",\"\",VLOOKUP(F316,'Plan Comptable '!$C$5:$D$554,2,0))","v":""},null,{"$f":"IF(H316=\"\",\"\",VLOOKUP(H316,#REF!,2,0))","v":""}]
[null,null,null,null,null,"",{"$f":"IF(D317=\"\",\"\",VLOOKUP(F317,'Plan Comptable '!$C$5:$D$554,2,0))","v":""},null,{"$f":"IF(H317=\"\",\"\",VLOOKUP(H317,#REF!,2,0))","v":""}]
[null,null,null,null,null,"",{"$f":"IF(D318=\"\",\"\",VLOOKUP(F318,'Plan Comptable '!$C$5:$D$554,2,0))","v":""},null,{"$f":"IF(H318=\"\",\"\",VLOOKUP(H318,#REF!,2,0))","v":""}]
[null,null,null,null,null,"",{"$f":"IF(D319=\"\",\"\",VLOOKUP(F319,'Plan Comptable '!$C$5:$D$554,2,0))","v":""},null,{"$f":"IF(H319=\"\",\"\",VLOOKUP(H319,#REF!,2,0))","v":""}]
[null,null,null,null,null,"",{"$f":"IF(D320=\"\",\"\",VLOOKUP(F320,'Plan Comptable '!$C$5:$D$554,2,0))","v":""},null,{"$f":"IF(H320=\"\",\"\",VLOOKUP(H320,#REF!,2,0))","v":""}]
[null,null,null,null,null,"",{"$f":"IF(D321=\"\",\"\",VLOOKUP(F321,'Plan Comptable '!$C$5:$D$554,2,0))","v":""},null,{"$f":"IF(H321=\"\",\"\",VLOOKUP(H321,#REF!,2,0))","v":""}]
[null,null,null,null,null,"",{"$f":"IF(D322=\"\",\"\",VLOOKUP(F322,'Plan Comptable '!$C$5:$D$554,2,0))","v":""},null,{"$f":"IF(H322=\"\",\"\",VLOOKUP(H322,#REF!,2,0))","v":""}]
[null,null,null,null,null,"",{"$f":"IF(D323=\"\",\"\",VLOOKUP(F323,'Plan Comptable '!$C$5:$D$554,2,0))","v":""},null,{"$f":"IF(H323=\"\",\"\",VLOOKUP(H323,#REF!,2,0))","v":""}]
[null,null,null,null,null,"",{"$f":"IF(D324=\"\",\"\",VLOOKUP(F324,'Plan Comptable '!$C$5:$D$554,2,0))","v":""},null,{"$f":"IF(H324=\"\",\"\",VLOOKUP(H324,#REF!,2,0))","v":""}]
[null,null,null,null,null,"",{"$f":"IF(D325=\"\",\"\",VLOOKUP(F325,'Plan Comptable '!$C$5:$D$554,2,0))","v":""},null,{"$f":"IF(H325=\"\",\"\",VLOOKUP(H325,#REF!,2,0))","v":""}]
[null,null,null,null,null,"",{"$f":"IF(D326=\"\",\"\",VLOOKUP(F326,'Plan Comptable '!$C$5:$D$554,2,0))","v":""},null,{"$f":"IF(H326=\"\",\"\",VLOOKUP(H326,#REF!,2,0))","v":""}]
[null,null,null,null,null,"",{"$f":"IF(D327=\"\",\"\",VLOOKUP(F327,'Plan Comptable '!$C$5:$D$554,2,0))","v":""},null,{"$f":"IF(H327=\"\",\"\",VLOOKUP(H327,#REF!,2,0))","v":""}]
[null,null,null,null,null,"",{"$f":"IF(D328=\"\",\"\",VLOOKUP(F328,'Plan Comptable '!$C$5:$D$554,2,0))","v":""},null,{"$f":"IF(H328=\"\",\"\",VLOOKUP(H328,#REF!,2,0))","v":""}]
[null,null,null,null,null,"",{"$f":"IF(D329=\"\",\"\",VLOOKUP(F329,'Plan Comptable '!$C$5:$D$554,2,0))","v":""},null,{"$f":"IF(H329=\"\",\"\",VLOOKUP(H329,#REF!,2,0))","v":""}]
[null,null,null,null,null,"",{"$f":"IF(D330=\"\",\"\",VLOOKUP(F330,'Plan Comptable '!$C$5:$D$554,2,0))","v":""},null,{"$f":"IF(H330=\"\",\"\",VLOOKUP(H330,#REF!,2,0))","v":""}]
[null,null,null,null,null,"",{"$f":"IF(D331=\"\",\"\",VLOOKUP(F331,'Plan Comptable '!$C$5:$D$554,2,0))","v":""},null,{"$f":"IF(H331=\"\",\"\",VLOOKUP(H331,#REF!,2,0))","v":""}]
[null,null,null,null,null,{"$f":"CONCATENATE(D332,E332)","v":""},{"$f":"IF(D332=\"\",\"\",VLOOKUP(F332,'Plan Comptable '!$C$5:$D$554,2,0))","v":""},null,{"$f":"IF(H332=\"\",\"\",VLOOKUP(H332,#REF!,2,0))","v":""}]
[null,null,null,null,null,"",{"$f":"IF(D333=\"\",\"\",VLOOKUP(F333,'Plan Comptable '!$C$5:$D$554,2,0))","v":""},null,{"$f":"IF(H333=\"\",\"\",VLOOKUP(H333,#REF!,2,0))","v":""}]
[null,null,null,null,null,"",{"$f":"IF(D334=\"\",\"\",VLOOKUP(F334,'Plan Comptable '!$C$5:$D$554,2,0))","v":""},null,{"$f":"IF(H334=\"\",\"\",VLOOKUP(H334,#REF!,2,0))","v":""}]
[null,null,null,null,null,"",{"$f":"IF(D335=\"\",\"\",VLOOKUP(F335,'Plan Comptable '!$C$5:$D$554,2,0))","v":""},null,{"$f":"IF(H335=\"\",\"\",VLOOKUP(H335,#REF!,2,0))","v":""}]
[null,null,null,null,null,"",{"$f":"IF(D336=\"\",\"\",VLOOKUP(F336,'Plan Comptable '!$C$5:$D$554,2,0))","v":""},null,{"$f":"IF(H336=\"\",\"\",VLOOKUP(H336,#REF!,2,0))","v":""}]
[null,null,null,null,null,"",{"$f":"IF(D337=\"\",\"\",VLOOKUP(F337,'Plan Comptable '!$C$5:$D$554,2,0))","v":""},null,{"$f":"IF(H337=\"\",\"\",VLOOKUP(H337,#REF!,2,0))","v":""}]
[null,null,null,null,null,"",{"$f":"IF(D338=\"\",\"\",VLOOKUP(F338,'Plan Comptable '!$C$5:$D$554,2,0))","v":""},null,{"$f":"IF(H338=\"\",\"\",VLOOKUP(H338,#REF!,2,0))","v":""}]
[null,null,null,null,null,"",{"$f":"IF(D339=\"\",\"\",VLOOKUP(F339,'Plan Comptable '!$C$5:$D$554,2,0))","v":""},null,{"$f":"IF(H339=\"\",\"\",VLOOKUP(H339,#REF!,2,0))","v":""}]
[null,null,null,null,null,"",{"$f":"IF(D340=\"\",\"\",VLOOKUP(F340,'Plan Comptable '!$C$5:$D$554,2,0))","v":""},null,{"$f":"IF(H340=\"\",\"\",VLOOKUP(H340,#REF!,2,0))","v":""}]
[null,null,null,null,null,"",{"$f":"IF(D341=\"\",\"\",VLOOKUP(F341,'Plan Comptable '!$C$5:$D$554,2,0))","v":""},null,{"$f":"IF(H341=\"\",\"\",VLOOKUP(H341,#REF!,2,0))","v":""}]
[null,null,null,null,null,"",{"$f":"IF(D342=\"\",\"\",VLOOKUP(F342,'Plan Comptable '!$C$5:$D$554,2,0))","v":""},null,{"$f":"IF(H342=\"\",\"\",VLOOKUP(H342,#REF!,2,0))","v":""}]
[null,null,null,null,null,"",{"$f":"IF(D343=\"\",\"\",VLOOKUP(F343,'Plan Comptable '!$C$5:$D$554,2,0))","v":""},null,{"$f":"IF(H343=\"\",\"\",VLOOKUP(H343,#REF!,2,0))","v":""}]
[null,null,null,null,null,"",{"$f":"IF(D344=\"\",\"\",VLOOKUP(F344,'Plan Comptable '!$C$5:$D$554,2,0))","v":""},null,{"$f":"IF(H344=\"\",\"\",VLOOKUP(H344,#REF!,2,0))","v":""}]
[null,null,null,null,null,"",{"$f":"IF(D345=\"\",\"\",VLOOKUP(F345,'Plan Comptable '!$C$5:$D$554,2,0))","v":""},null,{"$f":"IF(H345=\"\",\"\",VLOOKUP(H345,#REF!,2,0))","v":""}]
[null,null,null,null,null,"",{"$f":"IF(D346=\"\",\"\",VLOOKUP(F346,'Plan Comptable '!$C$5:$D$554,2,0))","v":""},null,{"$f":"IF(H346=\"\",\"\",VLOOKUP(H346,#REF!,2,0))","v":""}]
[null,null,null,null,null,"",{"$f":"IF(D347=\"\",\"\",VLOOKUP(F347,'Plan Comptable '!$C$5:$D$554,2,0))","v":""},null,{"$f":"IF(H347=\"\",\"\",VLOOKUP(H347,#REF!,2,0))","v":""}]
[null,null,null,null,null,"",{"$f":"IF(D348=\"\",\"\",VLOOKUP(F348,'Plan Comptable '!$C$5:$D$554,2,0))","v":""},null,{"$f":"IF(H348=\"\",\"\",VLOOKUP(H348,#REF!,2,0))","v":""}]
[null,null,null,null,null,"",{"$f":"IF(D349=\"\",\"\",VLOOKUP(F349,'Plan Comptable '!$C$5:$D$554,2,0))","v":""},null,{"$f":"IF(H349=\"\",\"\",VLOOKUP(H349,#REF!,2,0))","v":""}]
[null,null,null,null,null,"",{"$f":"IF(D350=\"\",\"\",VLOOKUP(F350,'Plan Comptable '!$C$5:$D$554,2,0))","v":""},null,{"$f":"IF(H350=\"\",\"\",VLOOKUP(H350,#REF!,2,0))","v":""}]
[null,null,null,null,null,"",{"$f":"IF(D351=\"\",\"\",VLOOKUP(F351,'Plan Comptable '!$C$5:$D$554,2,0))","v":""},null,{"$f":"IF(H351=\"\",\"\",VLOOKUP(H351,#REF!,2,0))","v":""}]
[null,null,null,null,null,"",{"$f":"IF(D352=\"\",\"\",VLOOKUP(F352,'Plan Comptable '!$C$5:$D$554,2,0))","v":""},null,{"$f":"IF(H352=\"\",\"\",VLOOKUP(H352,#REF!,2,0))","v":""}]
[null,null,null,null,null,"",{"$f":"IF(D353=\"\",\"\",VLOOKUP(F353,'Plan Comptable '!$C$5:$D$554,2,0))","v":""},null,{"$f":"IF(H353=\"\",\"\",VLOOKUP(H353,#REF!,2,0))","v":""}]
[null,null,null,null,null,"",{"$f":"IF(D354=\"\",\"\",VLOOKUP(F354,'Plan Comptable '!$C$5:$D$554,2,0))","v":""},null,{"$f":"IF(H354=\"\",\"\",VLOOKUP(H354,#REF!,2,0))","v":""}]
[null,null,null,null,null,"",{"$f":"IF(D355=\"\",\"\",VLOOKUP(F355,'Plan Comptable '!$C$5:$D$554,2,0))","v":""},null,{"$f":"IF(H355=\"\",\"\",VLOOKUP(H355,#REF!,2,0))","v":""}]
[null,null,null,null,null,"",{"$f":"IF(D356=\"\",\"\",VLOOKUP(F356,'Plan Comptable '!$C$5:$D$554,2,0))","v":""},null,{"$f":"IF(H356=\"\",\"\",VLOOKUP(H356,#REF!,2,0))","v":""}]
[null,null,null,null,null,"",{"$f":"IF(D357=\"\",\"\",VLOOKUP(F357,'Plan Comptable '!$C$5:$D$554,2,0))","v":""},null,{"$f":"IF(H357=\"\",\"\",VLOOKUP(H357,#REF!,2,0))","v":""}]
[null,null,null,null,null,"",{"$f":"IF(D358=\"\",\"\",VLOOKUP(F358,'Plan Comptable '!$C$5:$D$554,2,0))","v":""},null,{"$f":"IF(H358=\"\",\"\",VLOOKUP(H358,#REF!,2,0))","v":""}]
[null,null,null,null,null,"",{"$f":"IF(D359=\"\",\"\",VLOOKUP(F359,'Plan Comptable '!$C$5:$D$554,2,0))","v":""},null,{"$f":"IF(H359=\"\",\"\",VLOOKUP(H359,#REF!,2,0))","v":""}]
[null,null,null,null,null,"",{"$f":"IF(D360=\"\",\"\",VLOOKUP(F360,'Plan Comptable '!$C$5:$D$554,2,0))","v":""},null,{"$f":"IF(H360=\"\",\"\",VLOOKUP(H360,#REF!,2,0))","v":""}]
[null,null,null,null,null,"",{"$f":"IF(D361=\"\",\"\",VLOOKUP(F361,'Plan Comptable '!$C$5:$D$554,2,0))","v":""},null,{"$f":"IF(H361=\"\",\"\",VLOOKUP(H361,#REF!,2,0))","v":""}]
[null,null,null,null,null,"",{"$f":"IF(D362=\"\",\"\",VLOOKUP(F362,'Plan Comptable '!$C$5:$D$554,2,0))","v":""},null,{"$f":"IF(H362=\"\",\"\",VLOOKUP(H362,#REF!,2,0))","v":""}]
[null,null,null,null,null,"",{"$f":"IF(D363=\"\",\"\",VLOOKUP(F363,'Plan Comptable '!$C$5:$D$554,2,0))","v":""},null,{"$f":"IF(H363=\"\",\"\",VLOOKUP(H363,#REF!,2,0))","v":""}]
[null,null,null,null,null,"",{"$f":"IF(D364=\"\",\"\",VLOOKUP(F364,'Plan Comptable '!$C$5:$D$554,2,0))","v":""},null,{"$f":"IF(H364=\"\",\"\",VLOOKUP(H364,#REF!,2,0))","v":""}]
[null,null,null,null,null,"",{"$f":"IF(D365=\"\",\"\",VLOOKUP(F365,'Plan Comptable '!$C$5:$D$554,2,0))","v":""},null,{"$f":"IF(H365=\"\",\"\",VLOOKUP(H365,#REF!,2,0))","v":""}]
[null,null,null,null,null,"",{"$f":"IF(D366=\"\",\"\",VLOOKUP(F366,'Plan Comptable '!$C$5:$D$554,2,0))","v":""},null,{"$f":"IF(H366=\"\",\"\",VLOOKUP(H366,#REF!,2,0))","v":""}]
[null,null,null,null,null,"",{"$f":"IF(D367=\"\",\"\",VLOOKUP(F367,'Plan Comptable '!$C$5:$D$554,2,0))","v":""},null,{"$f":"IF(H367=\"\",\"\",VLOOKUP(H367,#REF!,2,0))","v":""}]
[null,null,null,null,null,"",{"$f":"IF(D368=\"\",\"\",VLOOKUP(F368,'Plan Comptable '!$C$5:$D$554,2,0))","v":""},null,{"$f":"IF(H368=\"\",\"\",VLOOKUP(H368,#REF!,2,0))","v":""}]
[null,null,null,null,null,"",{"$f":"IF(D369=\"\",\"\",VLOOKUP(F369,'Plan Comptable '!$C$5:$D$554,2,0))","v":""},null,{"$f":"IF(H369=\"\",\"\",VLOOKUP(H369,#REF!,2,0))","v":""}]
[null,null,null,null,null,"",{"$f":"IF(D370=\"\",\"\",VLOOKUP(F370,'Plan Comptable '!$C$5:$D$554,2,0))","v":""},null,{"$f":"IF(H370=\"\",\"\",VLOOKUP(H370,#REF!,2,0))","v":""}]
[null,null,null,null,null,"",{"$f":"IF(D371=\"\",\"\",VLOOKUP(F371,'Plan Comptable '!$C$5:$D$554,2,0))","v":""},null,{"$f":"IF(H371=\"\",\"\",VLOOKUP(H371,#REF!,2,0))","v":""}]
[null,null,null,null,null,"",{"$f":"IF(D372=\"\",\"\",VLOOKUP(F372,'Plan Comptable '!$C$5:$D$554,2,0))","v":""},null,{"$f":"IF(H372=\"\",\"\",VLOOKUP(H372,#REF!,2,0))","v":""}]
[null,null,null,null,null,"",{"$f":"IF(D373=\"\",\"\",VLOOKUP(F373,'Plan Comptable '!$C$5:$D$554,2,0))","v":""},null,{"$f":"IF(H373=\"\",\"\",VLOOKUP(H373,#REF!,2,0))","v":""}]
[null,null,null,null,null,"",{"$f":"IF(D374=\"\",\"\",VLOOKUP(F374,'Plan Comptable '!$C$5:$D$554,2,0))","v":""},null,{"$f":"IF(H374=\"\",\"\",VLOOKUP(H374,#REF!,2,0))","v":""}]
[null,null,null,null,null,"",{"$f":"IF(D375=\"\",\"\",VLOOKUP(F375,'Plan Comptable '!$C$5:$D$554,2,0))","v":""},null,{"$f":"IF(H375=\"\",\"\",VLOOKUP(H375,#REF!,2,0))","v":""}]
[null,null,null,null,null,"",{"$f":"IF(D376=\"\",\"\",VLOOKUP(F376,'Plan Comptable '!$C$5:$D$554,2,0))","v":""},null,{"$f":"IF(H376=\"\",\"\",VLOOKUP(H376,#REF!,2,0))","v":""}]
[null,null,null,null,null,"",{"$f":"IF(D377=\"\",\"\",VLOOKUP(F377,'Plan Comptable '!$C$5:$D$554,2,0))","v":""},null,{"$f":"IF(H377=\"\",\"\",VLOOKUP(H377,#REF!,2,0))","v":""}]
[null,null,null,null,null,"",{"$f":"IF(D378=\"\",\"\",VLOOKUP(F378,'Plan Comptable '!$C$5:$D$554,2,0))","v":""},null,{"$f":"IF(H378=\"\",\"\",VLOOKUP(H378,#REF!,2,0))","v":""}]
[null,null,null,null,null,"",{"$f":"IF(D379=\"\",\"\",VLOOKUP(F379,'Plan Comptable '!$C$5:$D$554,2,0))","v":""},null,{"$f":"IF(H379=\"\",\"\",VLOOKUP(H379,#REF!,2,0))","v":""}]
[null,null,null,null,null,"",{"$f":"IF(D380=\"\",\"\",VLOOKUP(F380,'Plan Comptable '!$C$5:$D$554,2,0))","v":""},null,{"$f":"IF(H380=\"\",\"\",VLOOKUP(H380,#REF!,2,0))","v":""}]
[null,null,null,null,null,"",{"$f":"IF(D381=\"\",\"\",VLOOKUP(F381,'Plan Comptable '!$C$5:$D$554,2,0))","v":""},null,{"$f":"IF(H381=\"\",\"\",VLOOKUP(H381,#REF!,2,0))","v":""}]
[null,null,null,null,null,"",{"$f":"IF(D382=\"\",\"\",VLOOKUP(F382,'Plan Comptable '!$C$5:$D$554,2,0))","v":""},null,{"$f":"IF(H382=\"\",\"\",VLOOKUP(H382,#REF!,2,0))","v":""}]
[null,null,null,null,null,"",{"$f":"IF(D383=\"\",\"\",VLOOKUP(F383,'Plan Comptable '!$C$5:$D$554,2,0))","v":""},null,{"$f":"IF(H383=\"\",\"\",VLOOKUP(H383,#REF!,2,0))","v":""}]
[null,null,null,null,null,"",{"$f":"IF(D384=\"\",\"\",VLOOKUP(F384,'Plan Comptable '!$C$5:$D$554,2,0))","v":""},null,{"$f":"IF(H384=\"\",\"\",VLOOKUP(H384,#REF!,2,0))","v":""}]
[null,null,null,null,null,"",{"$f":"IF(D385=\"\",\"\",VLOOKUP(F385,'Plan Comptable '!$C$5:$D$554,2,0))","v":""},null,{"$f":"IF(H385=\"\",\"\",VLOOKUP(H385,#REF!,2,0))","v":""}]
[null,null,null,null,null,"",{"$f":"IF(D386=\"\",\"\",VLOOKUP(F386,'Plan Comptable '!$C$5:$D$554,2,0))","v":""},null,{"$f":"IF(H386=\"\",\"\",VLOOKUP(H386,#REF!,2,0))","v":""}]
[null,null,null,null,null,"",{"$f":"IF(D387=\"\",\"\",VLOOKUP(F387,'Plan Comptable '!$C$5:$D$554,2,0))","v":""},null,{"$f":"IF(H387=\"\",\"\",VLOOKUP(H387,#REF!,2,0))","v":""}]
[null,null,null,null,null,"",{"$f":"IF(D388=\"\",\"\",VLOOKUP(F388,'Plan Comptable '!$C$5:$D$554,2,0))","v":""},null,{"$f":"IF(H388=\"\",\"\",VLOOKUP(H388,#REF!,2,0))","v":""}]
[null,null,null,null,null,"",{"$f":"IF(D389=\"\",\"\",VLOOKUP(F389,'Plan Comptable '!$C$5:$D$554,2,0))","v":""},null,{"$f":"IF(H389=\"\",\"\",VLOOKUP(H389,#REF!,2,0))","v":""}]
[null,null,null,null,null,"",{"$f":"IF(D390=\"\",\"\",VLOOKUP(F390,'Plan Comptable '!$C$5:$D$554,2,0))","v":""},null,{"$f":"IF(H390=\"\",\"\",VLOOKUP(H390,#REF!,2,0))","v":""}]
[null,null,null,null,null,"",{"$f":"IF(D391=\"\",\"\",VLOOKUP(F391,'Plan Comptable '!$C$5:$D$554,2,0))","v":""},null,{"$f":"IF(H391=\"\",\"\",VLOOKUP(H391,#REF!,2,0))","v":""}]
[null,null,null,null,null,"",{"$f":"IF(D392=\"\",\"\",VLOOKUP(F392,'Plan Comptable '!$C$5:$D$554,2,0))","v":""},null,{"$f":"IF(H392=\"\",\"\",VLOOKUP(H392,#REF!,2,0))","v":""}]
[null,null,null,null,null,"",{"$f":"IF(D393=\"\",\"\",VLOOKUP(F393,'Plan Comptable '!$C$5:$D$554,2,0))","v":""},null,{"$f":"IF(H393=\"\",\"\",VLOOKUP(H393,#REF!,2,0))","v":""}]
[null,null,null,null,null,"",{"$f":"IF(D394=\"\",\"\",VLOOKUP(F394,'Plan Comptable '!$C$5:$D$554,2,0))","v":""},null,{"$f":"IF(H394=\"\",\"\",VLOOKUP(H394,#REF!,2,0))","v":""}]
[null,null,null,null,null,"",{"$f":"IF(D395=\"\",\"\",VLOOKUP(F395,'Plan Comptable '!$C$5:$D$554,2,0))","v":""},null,{"$f":"IF(H395=\"\",\"\",VLOOKUP(H395,#REF!,2,0))","v":""}]
[null,null,null,null,null,{"$f":"CONCATENATE(D396,E396)","v":""},{"$f":"IF(D396=\"\",\"\",VLOOKUP(F396,'Plan Comptable '!$C$5:$D$554,2,0))","v":""},null,{"$f":"IF(H396=\"\",\"\",VLOOKUP(H396,#REF!,2,0))","v":""}]
[null,null,null,null,null,"",{"$f":"IF(D397=\"\",\"\",VLOOKUP(F397,'Plan Comptable '!$C$5:$D$554,2,0))","v":""},null,{"$f":"IF(H397=\"\",\"\",VLOOKUP(H397,#REF!,2,0))","v":""}]
[null,null,null,null,null,"",{"$f":"IF(D398=\"\",\"\",VLOOKUP(F398,'Plan Comptable '!$C$5:$D$554,2,0))","v":""},null,{"$f":"IF(H398=\"\",\"\",VLOOKUP(H398,#REF!,2,0))","v":""}]
[null,null,null,null,null,"",{"$f":"IF(D399=\"\",\"\",VLOOKUP(F399,'Plan Comptable '!$C$5:$D$554,2,0))","v":""},null,{"$f":"IF(H399=\"\",\"\",VLOOKUP(H399,#REF!,2,0))","v":""}]
[null,null,null,null,null,"",{"$f":"IF(D400=\"\",\"\",VLOOKUP(F400,'Plan Comptable '!$C$5:$D$554,2,0))","v":""},null,{"$f":"IF(H400=\"\",\"\",VLOOKUP(H400,#REF!,2,0))","v":""}]
[null,null,null,null,null,"",{"$f":"IF(D401=\"\",\"\",VLOOKUP(F401,'Plan Comptable '!$C$5:$D$554,2,0))","v":""},null,{"$f":"IF(H401=\"\",\"\",VLOOKUP(H401,#REF!,2,0))","v":""}]
[null,null,null,null,null,"",{"$f":"IF(D402=\"\",\"\",VLOOKUP(F402,'Plan Comptable '!$C$5:$D$554,2,0))","v":""},null,{"$f":"IF(H402=\"\",\"\",VLOOKUP(H402,#REF!,2,0))","v":""}]
[null,null,null,null,null,"",{"$f":"IF(D403=\"\",\"\",VLOOKUP(F403,'Plan Comptable '!$C$5:$D$554,2,0))","v":""},null,{"$f":"IF(H403=\"\",\"\",VLOOKUP(H403,#REF!,2,0))","v":""}]
[null,null,null,null,null,"",{"$f":"IF(D404=\"\",\"\",VLOOKUP(F404,'Plan Comptable '!$C$5:$D$554,2,0))","v":""},null,{"$f":"IF(H404=\"\",\"\",VLOOKUP(H404,#REF!,2,0))","v":""}]
[null,null,null,null,null,"",{"$f":"IF(D405=\"\",\"\",VLOOKUP(F405,'Plan Comptable '!$C$5:$D$554,2,0))","v":""},null,{"$f":"IF(H405=\"\",\"\",VLOOKUP(H405,#REF!,2,0))","v":""}]
[null,null,null,null,null,"",{"$f":"IF(D406=\"\",\"\",VLOOKUP(F406,'Plan Comptable '!$C$5:$D$554,2,0))","v":""},null,{"$f":"IF(H406=\"\",\"\",VLOOKUP(H406,#REF!,2,0))","v":""}]
[null,null,null,null,null,"",{"$f":"IF(D407=\"\",\"\",VLOOKUP(F407,'Plan Comptable '!$C$5:$D$554,2,0))","v":""},null,{"$f":"IF(H407=\"\",\"\",VLOOKUP(H407,#REF!,2,0))","v":""}]
[null,null,null,null,null,"",{"$f":"IF(D408=\"\",\"\",VLOOKUP(F408,'Plan Comptable '!$C$5:$D$554,2,0))","v":""},null,{"$f":"IF(H408=\"\",\"\",VLOOKUP(H408,#REF!,2,0))","v":""}]
[null,null,null,null,null,"",{"$f":"IF(D409=\"\",\"\",VLOOKUP(F409,'Plan Comptable '!$C$5:$D$554,2,0))","v":""},null,{"$f":"IF(H409=\"\",\"\",VLOOKUP(H409,#REF!,2,0))","v":""}]
[null,null,null,null,null,"",{"$f":"IF(D410=\"\",\"\",VLOOKUP(F410,'Plan Comptable '!$C$5:$D$554,2,0))","v":""},null,{"$f":"IF(H410=\"\",\"\",VLOOKUP(H410,#REF!,2,0))","v":""}]
[null,null,null,null,null,"",{"$f":"IF(D411=\"\",\"\",VLOOKUP(F411,'Plan Comptable '!$C$5:$D$554,2,0))","v":""},null,{"$f":"IF(H411=\"\",\"\",VLOOKUP(H411,#REF!,2,0))","v":""}]
[null,null,null,null,null,"",{"$f":"IF(D412=\"\",\"\",VLOOKUP(F412,'Plan Comptable '!$C$5:$D$554,2,0))","v":""},null,{"$f":"IF(H412=\"\",\"\",VLOOKUP(H412,#REF!,2,0))","v":""}]
[null,null,null,null,null,"",{"$f":"IF(D413=\"\",\"\",VLOOKUP(F413,'Plan Comptable '!$C$5:$D$554,2,0))","v":""},null,{"$f":"IF(H413=\"\",\"\",VLOOKUP(H413,#REF!,2,0))","v":""}]
[null,null,null,null,null,"",{"$f":"IF(D414=\"\",\"\",VLOOKUP(F414,'Plan Comptable '!$C$5:$D$554,2,0))","v":""},null,{"$f":"IF(H414=\"\",\"\",VLOOKUP(H414,#REF!,2,0))","v":""}]
[null,null,null,null,null,"",{"$f":"IF(D415=\"\",\"\",VLOOKUP(F415,'Plan Comptable '!$C$5:$D$554,2,0))","v":""},null,{"$f":"IF(H415=\"\",\"\",VLOOKUP(H415,#REF!,2,0))","v":""}]
[null,null,null,null,null,"",{"$f":"IF(D416=\"\",\"\",VLOOKUP(F416,'Plan Comptable '!$C$5:$D$554,2,0))","v":""},null,{"$f":"IF(H416=\"\",\"\",VLOOKUP(H416,#REF!,2,0))","v":""}]
[null,null,null,null,null,"",{"$f":"IF(D417=\"\",\"\",VLOOKUP(F417,'Plan Comptable '!$C$5:$D$554,2,0))","v":""},null,{"$f":"IF(H417=\"\",\"\",VLOOKUP(H417,#REF!,2,0))","v":""}]
[null,null,null,null,null,"",{"$f":"IF(D418=\"\",\"\",VLOOKUP(F418,'Plan Comptable '!$C$5:$D$554,2,0))","v":""},null,{"$f":"IF(H418=\"\",\"\",VLOOKUP(H418,#REF!,2,0))","v":""}]
[null,null,null,null,null,"",{"$f":"IF(D419=\"\",\"\",VLOOKUP(F419,'Plan Comptable '!$C$5:$D$554,2,0))","v":""},null,{"$f":"IF(H419=\"\",\"\",VLOOKUP(H419,#REF!,2,0))","v":""}]
[null,null,null,null,null,"",{"$f":"IF(D420=\"\",\"\",VLOOKUP(F420,'Plan Comptable '!$C$5:$D$554,2,0))","v":""},null,{"$f":"IF(H420=\"\",\"\",VLOOKUP(H420,#REF!,2,0))","v":""}]
[null,null,null,null,null,"",{"$f":"IF(D421=\"\",\"\",VLOOKUP(F421,'Plan Comptable '!$C$5:$D$554,2,0))","v":""},null,{"$f":"IF(H421=\"\",\"\",VLOOKUP(H421,#REF!,2,0))","v":""}]
[null,null,null,null,null,"",{"$f":"IF(D422=\"\",\"\",VLOOKUP(F422,'Plan Comptable '!$C$5:$D$554,2,0))","v":""},null,{"$f":"IF(H422=\"\",\"\",VLOOKUP(H422,#REF!,2,0))","v":""}]
[null,null,null,null,null,"",{"$f":"IF(D423=\"\",\"\",VLOOKUP(F423,'Plan Comptable '!$C$5:$D$554,2,0))","v":""},null,{"$f":"IF(H423=\"\",\"\",VLOOKUP(H423,#REF!,2,0))","v":""}]
[null,null,null,null,null,"",{"$f":"IF(D424=\"\",\"\",VLOOKUP(F424,'Plan Comptable '!$C$5:$D$554,2,0))","v":""},null,{"$f":"IF(H424=\"\",\"\",VLOOKUP(H424,#REF!,2,0))","v":""}]
[null,null,null,null,null,"",{"$f":"IF(D425=\"\",\"\",VLOOKUP(F425,'Plan Comptable '!$C$5:$D$554,2,0))","v":""},null,{"$f":"IF(H425=\"\",\"\",VLOOKUP(H425,#REF!,2,0))","v":""}]
[null,null,null,null,null,"",{"$f":"IF(D426=\"\",\"\",VLOOKUP(F426,'Plan Comptable '!$C$5:$D$554,2,0))","v":""},null,{"$f":"IF(H426=\"\",\"\",VLOOKUP(H426,#REF!,2,0))","v":""}]
[null,null,null,null,null,"",{"$f":"IF(D427=\"\",\"\",VLOOKUP(F427,'Plan Comptable '!$C$5:$D$554,2,0))","v":""},null,{"$f":"IF(H427=\"\",\"\",VLOOKUP(H427,#REF!,2,0))","v":""}]
[null,null,null,null,null,"",{"$f":"IF(D428=\"\",\"\",VLOOKUP(F428,'Plan Comptable '!$C$5:$D$554,2,0))","v":""},null,{"$f":"IF(H428=\"\",\"\",VLOOKUP(H428,#REF!,2,0))","v":""}]
[null,null,null,null,null,"",{"$f":"IF(D429=\"\",\"\",VLOOKUP(F429,'Plan Comptable '!$C$5:$D$554,2,0))","v":""},null,{"$f":"IF(H429=\"\",\"\",VLOOKUP(H429,#REF!,2,0))","v":""}]
[null,null,null,null,null,"",{"$f":"IF(D430=\"\",\"\",VLOOKUP(F430,'Plan Comptable '!$C$5:$D$554,2,0))","v":""},null,{"$f":"IF(H430=\"\",\"\",VLOOKUP(H430,#REF!,2,0))","v":""}]
[null,null,null,null,null,"",{"$f":"IF(D431=\"\",\"\",VLOOKUP(F431,'Plan Comptable '!$C$5:$D$554,2,0))","v":""},null,{"$f":"IF(H431=\"\",\"\",VLOOKUP(H431,#REF!,2,0))","v":""}]
[null,null,null,null,null,"",{"$f":"IF(D432=\"\",\"\",VLOOKUP(F432,'Plan Comptable '!$C$5:$D$554,2,0))","v":""},null,{"$f":"IF(H432=\"\",\"\",VLOOKUP(H432,#REF!,2,0))","v":""}]
[null,null,null,null,null,"",{"$f":"IF(D433=\"\",\"\",VLOOKUP(F433,'Plan Comptable '!$C$5:$D$554,2,0))","v":""},null,{"$f":"IF(H433=\"\",\"\",VLOOKUP(H433,#REF!,2,0))","v":""}]
[null,null,null,null,null,"",{"$f":"IF(D434=\"\",\"\",VLOOKUP(F434,'Plan Comptable '!$C$5:$D$554,2,0))","v":""},null,{"$f":"IF(H434=\"\",\"\",VLOOKUP(H434,#REF!,2,0))","v":""}]
[null,null,null,null,null,"",{"$f":"IF(D435=\"\",\"\",VLOOKUP(F435,'Plan Comptable '!$C$5:$D$554,2,0))","v":""},null,{"$f":"IF(H435=\"\",\"\",VLOOKUP(H435,#REF!,2,0))","v":""}]
[null,null,null,null,null,"",{"$f":"IF(D436=\"\",\"\",VLOOKUP(F436,'Plan Comptable '!$C$5:$D$554,2,0))","v":""},null,{"$f":"IF(H436=\"\",\"\",VLOOKUP(H436,#REF!,2,0))","v":""}]
[null,null,null,null,null,"",{"$f":"IF(D437=\"\",\"\",VLOOKUP(F437,'Plan Comptable '!$C$5:$D$554,2,0))","v":""},null,{"$f":"IF(H437=\"\",\"\",VLOOKUP(H437,#REF!,2,0))","v":""}]
[null,null,null,null,null,"",{"$f":"IF(D438=\"\",\"\",VLOOKUP(F438,'Plan Comptable '!$C$5:$D$554,2,0))","v":""},null,{"$f":"IF(H438=\"\",\"\",VLOOKUP(H438,#REF!,2,0))","v":""}]
[null,null,null,null,null,"",{"$f":"IF(D439=\"\",\"\",VLOOKUP(F439,'Plan Comptable '!$C$5:$D$554,2,0))","v":""},null,{"$f":"IF(H439=\"\",\"\",VLOOKUP(H439,#REF!,2,0))","v":""}]
[null,null,null,null,null,"",{"$f":"IF(D440=\"\",\"\",VLOOKUP(F440,'Plan Comptable '!$C$5:$D$554,2,0))","v":""},null,{"$f":"IF(H440=\"\",\"\",VLOOKUP(H440,#REF!,2,0))","v":""}]
[null,null,null,null,null,"",{"$f":"IF(D441=\"\",\"\",VLOOKUP(F441,'Plan Comptable '!$C$5:$D$554,2,0))","v":""},null,{"$f":"IF(H441=\"\",\"\",VLOOKUP(H441,#REF!,2,0))","v":""}]
[null,null,null,null,null,"",{"$f":"IF(D442=\"\",\"\",VLOOKUP(F442,'Plan Comptable '!$C$5:$D$554,2,0))","v":""},null,{"$f":"IF(H442=\"\",\"\",VLOOKUP(H442,#REF!,2,0))","v":""}]
[null,null,null,null,null,"",{"$f":"IF(D443=\"\",\"\",VLOOKUP(F443,'Plan Comptable '!$C$5:$D$554,2,0))","v":""},null,{"$f":"IF(H443=\"\",\"\",VLOOKUP(H443,#REF!,2,0))","v":""}]
[null,null,null,null,null,"",{"$f":"IF(D444=\"\",\"\",VLOOKUP(F444,'Plan Comptable '!$C$5:$D$554,2,0))","v":""},null,{"$f":"IF(H444=\"\",\"\",VLOOKUP(H444,#REF!,2,0))","v":""}]
[null,null,null,null,null,"",{"$f":"IF(D445=\"\",\"\",VLOOKUP(F445,'Plan Comptable '!$C$5:$D$554,2,0))","v":""},null,{"$f":"IF(H445=\"\",\"\",VLOOKUP(H445,#REF!,2,0))","v":""}]
[null,null,null,null,null,"",{"$f":"IF(D446=\"\",\"\",VLOOKUP(F446,'Plan Comptable '!$C$5:$D$554,2,0))","v":""},null,{"$f":"IF(H446=\"\",\"\",VLOOKUP(H446,#REF!,2,0))","v":""}]
[null,null,null,null,null,"",{"$f":"IF(D447=\"\",\"\",VLOOKUP(F447,'Plan Comptable '!$C$5:$D$554,2,0))","v":""},null,{"$f":"IF(H447=\"\",\"\",VLOOKUP(H447,#REF!,2,0))","v":""}]
[null,null,null,null,null,"",{"$f":"IF(D448=\"\",\"\",VLOOKUP(F448,'Plan Comptable '!$C$5:$D$554,2,0))","v":""},null,{"$f":"IF(H448=\"\",\"\",VLOOKUP(H448,#REF!,2,0))","v":""}]
[null,null,null,null,null,"",{"$f":"IF(D449=\"\",\"\",VLOOKUP(F449,'Plan Comptable '!$C$5:$D$554,2,0))","v":""},null,{"$f":"IF(H449=\"\",\"\",VLOOKUP(H449,#REF!,2,0))","v":""}]
[null,null,null,null,null,"",{"$f":"IF(D450=\"\",\"\",VLOOKUP(F450,'Plan Comptable '!$C$5:$D$554,2,0))","v":""},null,{"$f":"IF(H450=\"\",\"\",VLOOKUP(H450,#REF!,2,0))","v":""}]
[null,null,null,null,null,"",{"$f":"IF(D451=\"\",\"\",VLOOKUP(F451,'Plan Comptable '!$C$5:$D$554,2,0))","v":""},null,{"$f":"IF(H451=\"\",\"\",VLOOKUP(H451,#REF!,2,0))","v":""}]
[null,null,null,null,null,"",{"$f":"IF(D452=\"\",\"\",VLOOKUP(F452,'Plan Comptable '!$C$5:$D$554,2,0))","v":""},null,{"$f":"IF(H452=\"\",\"\",VLOOKUP(H452,#REF!,2,0))","v":""}]
[null,null,null,null,null,"",{"$f":"IF(D453=\"\",\"\",VLOOKUP(F453,'Plan Comptable '!$C$5:$D$554,2,0))","v":""},null,{"$f":"IF(H453=\"\",\"\",VLOOKUP(H453,#REF!,2,0))","v":""}]
[null,null,null,null,null,"",{"$f":"IF(D454=\"\",\"\",VLOOKUP(F454,'Plan Comptable '!$C$5:$D$554,2,0))","v":""},null,{"$f":"IF(H454=\"\",\"\",VLOOKUP(H454,#REF!,2,0))","v":""}]
[null,null,null,null,null,"",{"$f":"IF(D455=\"\",\"\",VLOOKUP(F455,'Plan Comptable '!$C$5:$D$554,2,0))","v":""},null,{"$f":"IF(H455=\"\",\"\",VLOOKUP(H455,#REF!,2,0))","v":""}]
[null,null,null,null,null,"",{"$f":"IF(D456=\"\",\"\",VLOOKUP(F456,'Plan Comptable '!$C$5:$D$554,2,0))","v":""},null,{"$f":"IF(H456=\"\",\"\",VLOOKUP(H456,#REF!,2,0))","v":""}]
[null,null,null,null,null,"",{"$f":"IF(D457=\"\",\"\",VLOOKUP(F457,'Plan Comptable '!$C$5:$D$554,2,0))","v":""},null,{"$f":"IF(H457=\"\",\"\",VLOOKUP(H457,#REF!,2,0))","v":""}]
[null,null,null,null,null,"",{"$f":"IF(D458=\"\",\"\",VLOOKUP(F458,'Plan Comptable '!$C$5:$D$554,2,0))","v":""},null,{"$f":"IF(H458=\"\",\"\",VLOOKUP(H458,#REF!,2,0))","v":""}]
[null,null,null,null,null,"",{"$f":"IF(D459=\"\",\"\",VLOOKUP(F459,'Plan Comptable '!$C$5:$D$554,2,0))","v":""},null,{"$f":"IF(H459=\"\",\"\",VLOOKUP(H459,#REF!,2,0))","v":""}]
[null,null,null,null,null,{"$f":"CONCATENATE(D460,E460)","v":""},{"$f":"IF(D460=\"\",\"\",VLOOKUP(F460,'Plan Comptable '!$C$5:$D$554,2,0))","v":""},null,{"$f":"IF(H460=\"\",\"\",VLOOKUP(H460,#REF!,2,0))","v":""}]
[null,null,null,null,null,"",{"$f":"IF(D461=\"\",\"\",VLOOKUP(F461,'Plan Comptable '!$C$5:$D$554,2,0))","v":""},null,{"$f":"IF(H461=\"\",\"\",VLOOKUP(H461,#REF!,2,0))","v":""}]
[null,null,null,null,null,"",{"$f":"IF(D462=\"\",\"\",VLOOKUP(F462,'Plan Comptable '!$C$5:$D$554,2,0))","v":""},null,{"$f":"IF(H462=\"\",\"\",VLOOKUP(H462,#REF!,2,0))","v":""}]
[null,null,null,null,null,"",{"$f":"IF(D463=\"\",\"\",VLOOKUP(F463,'Plan Comptable '!$C$5:$D$554,2,0))","v":""},null,{"$f":"IF(H463=\"\",\"\",VLOOKUP(H463,#REF!,2,0))","v":""}]
[null,null,null,null,null,"",{"$f":"IF(D464=\"\",\"\",VLOOKUP(F464,'Plan Comptable '!$C$5:$D$554,2,0))","v":""},null,{"$f":"IF(H464=\"\",\"\",VLOOKUP(H464,#REF!,2,0))","v":""}]
[null,null,null,null,null,"",{"$f":"IF(D465=\"\",\"\",VLOOKUP(F465,'Plan Comptable '!$C$5:$D$554,2,0))","v":""},null,{"$f":"IF(H465=\"\",\"\",VLOOKUP(H465,#REF!,2,0))","v":""}]
[null,null,null,null,null,"",{"$f":"IF(D466=\"\",\"\",VLOOKUP(F466,'Plan Comptable '!$C$5:$D$554,2,0))","v":""},null,{"$f":"IF(H466=\"\",\"\",VLOOKUP(H466,#REF!,2,0))","v":""}]
[null,null,null,null,null,"",{"$f":"IF(D467=\"\",\"\",VLOOKUP(F467,'Plan Comptable '!$C$5:$D$554,2,0))","v":""},null,{"$f":"IF(H467=\"\",\"\",VLOOKUP(H467,#REF!,2,0))","v":""}]
[null,null,null,null,null,"",{"$f":"IF(D468=\"\",\"\",VLOOKUP(F468,'Plan Comptable '!$C$5:$D$554,2,0))","v":""},null,{"$f":"IF(H468=\"\",\"\",VLOOKUP(H468,#REF!,2,0))","v":""}]
[null,null,null,null,null,"",{"$f":"IF(D469=\"\",\"\",VLOOKUP(F469,'Plan Comptable '!$C$5:$D$554,2,0))","v":""},null,{"$f":"IF(H469=\"\",\"\",VLOOKUP(H469,#REF!,2,0))","v":""}]
[null,null,null,null,null,"",{"$f":"IF(D470=\"\",\"\",VLOOKUP(F470,'Plan Comptable '!$C$5:$D$554,2,0))","v":""},null,{"$f":"IF(H470=\"\",\"\",VLOOKUP(H470,#REF!,2,0))","v":""}]
[null,null,null,null,null,"",{"$f":"IF(D471=\"\",\"\",VLOOKUP(F471,'Plan Comptable '!$C$5:$D$554,2,0))","v":""},null,{"$f":"IF(H471=\"\",\"\",VLOOKUP(H471,#REF!,2,0))","v":""}]
[null,null,null,null,null,"",{"$f":"IF(D472=\"\",\"\",VLOOKUP(F472,'Plan Comptable '!$C$5:$D$554,2,0))","v":""},null,{"$f":"IF(H472=\"\",\"\",VLOOKUP(H472,#REF!,2,0))","v":""}]
[null,null,null,null,null,"",{"$f":"IF(D473=\"\",\"\",VLOOKUP(F473,'Plan Comptable '!$C$5:$D$554,2,0))","v":""},null,{"$f":"IF(H473=\"\",\"\",VLOOKUP(H473,#REF!,2,0))","v":""}]
[null,null,null,null,null,"",{"$f":"IF(D474=\"\",\"\",VLOOKUP(F474,'Plan Comptable '!$C$5:$D$554,2,0))","v":""},null,{"$f":"IF(H474=\"\",\"\",VLOOKUP(H474,#REF!,2,0))","v":""}]
[null,null,null,null,null,"",{"$f":"IF(D475=\"\",\"\",VLOOKUP(F475,'Plan Comptable '!$C$5:$D$554,2,0))","v":""},null,{"$f":"IF(H475=\"\",\"\",VLOOKUP(H475,#REF!,2,0))","v":""}]
[null,null,null,null,null,"",{"$f":"IF(D476=\"\",\"\",VLOOKUP(F476,'Plan Comptable '!$C$5:$D$554,2,0))","v":""},null,{"$f":"IF(H476=\"\",\"\",VLOOKUP(H476,#REF!,2,0))","v":""}]
[null,null,null,null,null,"",{"$f":"IF(D477=\"\",\"\",VLOOKUP(F477,'Plan Comptable '!$C$5:$D$554,2,0))","v":""},null,{"$f":"IF(H477=\"\",\"\",VLOOKUP(H477,#REF!,2,0))","v":""}]
[null,null,null,null,null,"",{"$f":"IF(D478=\"\",\"\",VLOOKUP(F478,'Plan Comptable '!$C$5:$D$554,2,0))","v":""},null,{"$f":"IF(H478=\"\",\"\",VLOOKUP(H478,#REF!,2,0))","v":""}]
[null,null,null,null,null,"",{"$f":"IF(D479=\"\",\"\",VLOOKUP(F479,'Plan Comptable '!$C$5:$D$554,2,0))","v":""},null,{"$f":"IF(H479=\"\",\"\",VLOOKUP(H479,#REF!,2,0))","v":""}]
[null,null,null,null,null,"",{"$f":"IF(D480=\"\",\"\",VLOOKUP(F480,'Plan Comptable '!$C$5:$D$554,2,0))","v":""},null,{"$f":"IF(H480=\"\",\"\",VLOOKUP(H480,#REF!,2,0))","v":""}]
[null,null,null,null,null,"",{"$f":"IF(D481=\"\",\"\",VLOOKUP(F481,'Plan Comptable '!$C$5:$D$554,2,0))","v":""},null,{"$f":"IF(H481=\"\",\"\",VLOOKUP(H481,#REF!,2,0))","v":""}]
[null,null,null,null,null,"",{"$f":"IF(D482=\"\",\"\",VLOOKUP(F482,'Plan Comptable '!$C$5:$D$554,2,0))","v":""},null,{"$f":"IF(H482=\"\",\"\",VLOOKUP(H482,#REF!,2,0))","v":""}]
[null,null,null,null,null,"",{"$f":"IF(D483=\"\",\"\",VLOOKUP(F483,'Plan Comptable '!$C$5:$D$554,2,0))","v":""},null,{"$f":"IF(H483=\"\",\"\",VLOOKUP(H483,#REF!,2,0))","v":""}]
[null,null,null,null,null,"",{"$f":"IF(D484=\"\",\"\",VLOOKUP(F484,'Plan Comptable '!$C$5:$D$554,2,0))","v":""},null,{"$f":"IF(H484=\"\",\"\",VLOOKUP(H484,#REF!,2,0))","v":""}]
[null,null,null,null,null,"",{"$f":"IF(D485=\"\",\"\",VLOOKUP(F485,'Plan Comptable '!$C$5:$D$554,2,0))","v":""},null,{"$f":"IF(H485=\"\",\"\",VLOOKUP(H485,#REF!,2,0))","v":""}]
[null,null,null,null,null,"",{"$f":"IF(D486=\"\",\"\",VLOOKUP(F486,'Plan Comptable '!$C$5:$D$554,2,0))","v":""},null,{"$f":"IF(H486=\"\",\"\",VLOOKUP(H486,#REF!,2,0))","v":""}]
[null,null,null,null,null,"",{"$f":"IF(D487=\"\",\"\",VLOOKUP(F487,'Plan Comptable '!$C$5:$D$554,2,0))","v":""},null,{"$f":"IF(H487=\"\",\"\",VLOOKUP(H487,#REF!,2,0))","v":""}]
[null,null,null,null,null,"",{"$f":"IF(D488=\"\",\"\",VLOOKUP(F488,'Plan Comptable '!$C$5:$D$554,2,0))","v":""},null,{"$f":"IF(H488=\"\",\"\",VLOOKUP(H488,#REF!,2,0))","v":""}]
[null,null,null,null,null,"",{"$f":"IF(D489=\"\",\"\",VLOOKUP(F489,'Plan Comptable '!$C$5:$D$554,2,0))","v":""},null,{"$f":"IF(H489=\"\",\"\",VLOOKUP(H489,#REF!,2,0))","v":""}]
[null,null,null,null,null,"",{"$f":"IF(D490=\"\",\"\",VLOOKUP(F490,'Plan Comptable '!$C$5:$D$554,2,0))","v":""},null,{"$f":"IF(H490=\"\",\"\",VLOOKUP(H490,#REF!,2,0))","v":""}]
[null,null,null,null,null,"",{"$f":"IF(D491=\"\",\"\",VLOOKUP(F491,'Plan Comptable '!$C$5:$D$554,2,0))","v":""},null,{"$f":"IF(H491=\"\",\"\",VLOOKUP(H491,#REF!,2,0))","v":""}]
[null,null,null,null,null,"",{"$f":"IF(D492=\"\",\"\",VLOOKUP(F492,'Plan Comptable '!$C$5:$D$554,2,0))","v":""},null,{"$f":"IF(H492=\"\",\"\",VLOOKUP(H492,#REF!,2,0))","v":""}]
[null,null,null,null,null,"",{"$f":"IF(D493=\"\",\"\",VLOOKUP(F493,'Plan Comptable '!$C$5:$D$554,2,0))","v":""},null,{"$f":"IF(H493=\"\",\"\",VLOOKUP(H493,#REF!,2,0))","v":""}]
[null,null,null,null,null,"",{"$f":"IF(D494=\"\",\"\",VLOOKUP(F494,'Plan Comptable '!$C$5:$D$554,2,0))","v":""},null,{"$f":"IF(H494=\"\",\"\",VLOOKUP(H494,#REF!,2,0))","v":""}]
[null,null,null,null,null,"",{"$f":"IF(D495=\"\",\"\",VLOOKUP(F495,'Plan Comptable '!$C$5:$D$554,2,0))","v":""},null,{"$f":"IF(H495=\"\",\"\",VLOOKUP(H495,#REF!,2,0))","v":""}]
[null,null,null,null,null,"",{"$f":"IF(D496=\"\",\"\",VLOOKUP(F496,'Plan Comptable '!$C$5:$D$554,2,0))","v":""},null,{"$f":"IF(H496=\"\",\"\",VLOOKUP(H496,#REF!,2,0))","v":""}]
[null,null,null,null,null,"",{"$f":"IF(D497=\"\",\"\",VLOOKUP(F497,'Plan Comptable '!$C$5:$D$554,2,0))","v":""},null,{"$f":"IF(H497=\"\",\"\",VLOOKUP(H497,#REF!,2,0))","v":""}]
[null,null,null,null,null,"",{"$f":"IF(D498=\"\",\"\",VLOOKUP(F498,'Plan Comptable '!$C$5:$D$554,2,0))","v":""},null,{"$f":"IF(H498=\"\",\"\",VLOOKUP(H498,#REF!,2,0))","v":""}]
[null,null,null,null,null,"",{"$f":"IF(D499=\"\",\"\",VLOOKUP(F499,'Plan Comptable '!$C$5:$D$554,2,0))","v":""},null,{"$f":"IF(H499=\"\",\"\",VLOOKUP(H499,#REF!,2,0))","v":""}]
[null,null,null,null,null,"",{"$f":"IF(D500=\"\",\"\",VLOOKUP(F500,'Plan Comptable '!$C$5:$D$554,2,0))","v":""},null,{"$f":"IF(H500=\"\",\"\",VLOOKUP(H500,#REF!,2,0))","v":""}]
[null,null,null,null,null,"",{"$f":"IF(D501=\"\",\"\",VLOOKUP(F501,'Plan Comptable '!$C$5:$D$554,2,0))","v":""},null,{"$f":"IF(H501=\"\",\"\",VLOOKUP(H501,#REF!,2,0))","v":""}]
[null,null,null,null,null,"",{"$f":"IF(D502=\"\",\"\",VLOOKUP(F502,'Plan Comptable '!$C$5:$D$554,2,0))","v":""},null,{"$f":"IF(H502=\"\",\"\",VLOOKUP(H502,#REF!,2,0))","v":""}]
[null,null,null,null,null,"",{"$f":"IF(D503=\"\",\"\",VLOOKUP(F503,'Plan Comptable '!$C$5:$D$554,2,0))","v":""},null,{"$f":"IF(H503=\"\",\"\",VLOOKUP(H503,#REF!,2,0))","v":""}]
[null,null,null,null,null,"",{"$f":"IF(D504=\"\",\"\",VLOOKUP(F504,'Plan Comptable '!$C$5:$D$554,2,0))","v":""},null,{"$f":"IF(H504=\"\",\"\",VLOOKUP(H504,#REF!,2,0))","v":""}]
[null,null,null,null,null,"",{"$f":"IF(D505=\"\",\"\",VLOOKUP(F505,'Plan Comptable '!$C$5:$D$554,2,0))","v":""},null,{"$f":"IF(H505=\"\",\"\",VLOOKUP(H505,#REF!,2,0))","v":""}]
[null,null,null,null,null,"",{"$f":"IF(D506=\"\",\"\",VLOOKUP(F506,'Plan Comptable '!$C$5:$D$554,2,0))","v":""},null,{"$f":"IF(H506=\"\",\"\",VLOOKUP(H506,#REF!,2,0))","v":""}]
[null,null,null,null,null,"",{"$f":"IF(D507=\"\",\"\",VLOOKUP(F507,'Plan Comptable '!$C$5:$D$554,2,0))","v":""},null,{"$f":"IF(H507=\"\",\"\",VLOOKUP(H507,#REF!,2,0))","v":""}]
[null,null,null,null,null,"",{"$f":"IF(D508=\"\",\"\",VLOOKUP(F508,'Plan Comptable '!$C$5:$D$554,2,0))","v":""},null,{"$f":"IF(H508=\"\",\"\",VLOOKUP(H508,#REF!,2,0))","v":""}]
[null,null,null,null,null,"",{"$f":"IF(D509=\"\",\"\",VLOOKUP(F509,'Plan Comptable '!$C$5:$D$554,2,0))","v":""},null,{"$f":"IF(H509=\"\",\"\",VLOOKUP(H509,#REF!,2,0))","v":""}]
[null,null,null,null,null,"",{"$f":"IF(D510=\"\",\"\",VLOOKUP(F510,'Plan Comptable '!$C$5:$D$554,2,0))","v":""},null,{"$f":"IF(H510=\"\",\"\",VLOOKUP(H510,#REF!,2,0))","v":""}]
[null,null,null,null,null,"",{"$f":"IF(D511=\"\",\"\",VLOOKUP(F511,'Plan Comptable '!$C$5:$D$554,2,0))","v":""},null,{"$f":"IF(H511=\"\",\"\",VLOOKUP(H511,#REF!,2,0))","v":""}]
[null,null,null,null,null,"",{"$f":"IF(D512=\"\",\"\",VLOOKUP(F512,'Plan Comptable '!$C$5:$D$554,2,0))","v":""},null,{"$f":"IF(H512=\"\",\"\",VLOOKUP(H512,#REF!,2,0))","v":""}]
[null,null,null,null,null,"",{"$f":"IF(D513=\"\",\"\",VLOOKUP(F513,'Plan Comptable '!$C$5:$D$554,2,0))","v":""},null,{"$f":"IF(H513=\"\",\"\",VLOOKUP(H513,#REF!,2,0))","v":""}]
[null,null,null,null,null,"",{"$f":"IF(D514=\"\",\"\",VLOOKUP(F514,'Plan Comptable '!$C$5:$D$554,2,0))","v":""},null,{"$f":"IF(H514=\"\",\"\",VLOOKUP(H514,#REF!,2,0))","v":""}]
[null,null,null,null,null,"",{"$f":"IF(D515=\"\",\"\",VLOOKUP(F515,'Plan Comptable '!$C$5:$D$554,2,0))","v":""},null,{"$f":"IF(H515=\"\",\"\",VLOOKUP(H515,#REF!,2,0))","v":""}]
[null,null,null,null,null,"",{"$f":"IF(D516=\"\",\"\",VLOOKUP(F516,'Plan Comptable '!$C$5:$D$554,2,0))","v":""},null,{"$f":"IF(H516=\"\",\"\",VLOOKUP(H516,#REF!,2,0))","v":""}]
[null,null,null,null,null,"",{"$f":"IF(D517=\"\",\"\",VLOOKUP(F517,'Plan Comptable '!$C$5:$D$554,2,0))","v":""},null,{"$f":"IF(H517=\"\",\"\",VLOOKUP(H517,#REF!,2,0))","v":""}]
[null,null,null,null,null,"",{"$f":"IF(D518=\"\",\"\",VLOOKUP(F518,'Plan Comptable '!$C$5:$D$554,2,0))","v":""},null,{"$f":"IF(H518=\"\",\"\",VLOOKUP(H518,#REF!,2,0))","v":""}]
[null,null,null,null,null,"",{"$f":"IF(D519=\"\",\"\",VLOOKUP(F519,'Plan Comptable '!$C$5:$D$554,2,0))","v":""},null,{"$f":"IF(H519=\"\",\"\",VLOOKUP(H519,#REF!,2,0))","v":""}]
[null,null,null,null,null,"",{"$f":"IF(D520=\"\",\"\",VLOOKUP(F520,'Plan Comptable '!$C$5:$D$554,2,0))","v":""},null,{"$f":"IF(H520=\"\",\"\",VLOOKUP(H520,#REF!,2,0))","v":""}]
[null,null,null,null,null,"",{"$f":"IF(D521=\"\",\"\",VLOOKUP(F521,'Plan Comptable '!$C$5:$D$554,2,0))","v":""},null,{"$f":"IF(H521=\"\",\"\",VLOOKUP(H521,#REF!,2,0))","v":""}]
[null,null,null,null,null,"",{"$f":"IF(D522=\"\",\"\",VLOOKUP(F522,'Plan Comptable '!$C$5:$D$554,2,0))","v":""},null,{"$f":"IF(H522=\"\",\"\",VLOOKUP(H522,#REF!,2,0))","v":""}]
[null,null,null,null,null,"",{"$f":"IF(D523=\"\",\"\",VLOOKUP(F523,'Plan Comptable '!$C$5:$D$554,2,0))","v":""},null,{"$f":"IF(H523=\"\",\"\",VLOOKUP(H523,#REF!,2,0))","v":""}]
[null,null,null,null,null,{"$f":"CONCATENATE(D524,E524)","v":""},{"$f":"IF(D524=\"\",\"\",VLOOKUP(F524,'Plan Comptable '!$C$5:$D$554,2,0))","v":""},null,{"$f":"IF(H524=\"\",\"\",VLOOKUP(H524,#REF!,2,0))","v":""}]
[null,null,null,null,null,"",{"$f":"IF(D525=\"\",\"\",VLOOKUP(F525,'Plan Comptable '!$C$5:$D$554,2,0))","v":""},null,{"$f":"IF(H525=\"\",\"\",VLOOKUP(H525,#REF!,2,0))","v":""}]
[null,null,null,null,null,"",{"$f":"IF(D526=\"\",\"\",VLOOKUP(F526,'Plan Comptable '!$C$5:$D$554,2,0))","v":""},null,{"$f":"IF(H526=\"\",\"\",VLOOKUP(H526,#REF!,2,0))","v":""}]
[null,null,null,null,null,"",{"$f":"IF(D527=\"\",\"\",VLOOKUP(F527,'Plan Comptable '!$C$5:$D$554,2,0))","v":""},null,{"$f":"IF(H527=\"\",\"\",VLOOKUP(H527,#REF!,2,0))","v":""}]
[null,null,null,null,null,"",{"$f":"IF(D528=\"\",\"\",VLOOKUP(F528,'Plan Comptable '!$C$5:$D$554,2,0))","v":""},null,{"$f":"IF(H528=\"\",\"\",VLOOKUP(H528,#REF!,2,0))","v":""}]
[null,null,null,null,null,"",{"$f":"IF(D529=\"\",\"\",VLOOKUP(F529,'Plan Comptable '!$C$5:$D$554,2,0))","v":""},null,{"$f":"IF(H529=\"\",\"\",VLOOKUP(H529,#REF!,2,0))","v":""}]
[null,null,null,null,null,"",{"$f":"IF(D530=\"\",\"\",VLOOKUP(F530,'Plan Comptable '!$C$5:$D$554,2,0))","v":""},null,{"$f":"IF(H530=\"\",\"\",VLOOKUP(H530,#REF!,2,0))","v":""}]
[null,null,null,null,null,"",{"$f":"IF(D531=\"\",\"\",VLOOKUP(F531,'Plan Comptable '!$C$5:$D$554,2,0))","v":""},null,{"$f":"IF(H531=\"\",\"\",VLOOKUP(H531,#REF!,2,0))","v":""}]
[null,null,null,null,null,"",{"$f":"IF(D532=\"\",\"\",VLOOKUP(F532,'Plan Comptable '!$C$5:$D$554,2,0))","v":""},null,{"$f":"IF(H532=\"\",\"\",VLOOKUP(H532,#REF!,2,0))","v":""}]
[null,null,null,null,null,"",{"$f":"IF(D533=\"\",\"\",VLOOKUP(F533,'Plan Comptable '!$C$5:$D$554,2,0))","v":""},null,{"$f":"IF(H533=\"\",\"\",VLOOKUP(H533,#REF!,2,0))","v":""}]
[null,null,null,null,null,"",{"$f":"IF(D534=\"\",\"\",VLOOKUP(F534,'Plan Comptable '!$C$5:$D$554,2,0))","v":""},null,{"$f":"IF(H534=\"\",\"\",VLOOKUP(H534,#REF!,2,0))","v":""}]
[null,null,null,null,null,"",{"$f":"IF(D535=\"\",\"\",VLOOKUP(F535,'Plan Comptable '!$C$5:$D$554,2,0))","v":""},null,{"$f":"IF(H535=\"\",\"\",VLOOKUP(H535,#REF!,2,0))","v":""}]
[null,null,null,null,null,"",{"$f":"IF(D536=\"\",\"\",VLOOKUP(F536,'Plan Comptable '!$C$5:$D$554,2,0))","v":""},null,{"$f":"IF(H536=\"\",\"\",VLOOKUP(H536,#REF!,2,0))","v":""}]
[null,null,null,null,null,"",{"$f":"IF(D537=\"\",\"\",VLOOKUP(F537,'Plan Comptable '!$C$5:$D$554,2,0))","v":""},null,{"$f":"IF(H537=\"\",\"\",VLOOKUP(H537,#REF!,2,0))","v":""}]
[null,null,null,null,null,"",{"$f":"IF(D538=\"\",\"\",VLOOKUP(F538,'Plan Comptable '!$C$5:$D$554,2,0))","v":""},null,{"$f":"IF(H538=\"\",\"\",VLOOKUP(H538,#REF!,2,0))","v":""}]
[null,null,null,null,null,"",{"$f":"IF(D539=\"\",\"\",VLOOKUP(F539,'Plan Comptable '!$C$5:$D$554,2,0))","v":""},null,{"$f":"IF(H539=\"\",\"\",VLOOKUP(H539,#REF!,2,0))","v":""}]
[null,null,null,null,null,"",{"$f":"IF(D540=\"\",\"\",VLOOKUP(F540,'Plan Comptable '!$C$5:$D$554,2,0))","v":""},null,{"$f":"IF(H540=\"\",\"\",VLOOKUP(H540,#REF!,2,0))","v":""}]
[null,null,null,null,null,"",{"$f":"IF(D541=\"\",\"\",VLOOKUP(F541,'Plan Comptable '!$C$5:$D$554,2,0))","v":""},null,{"$f":"IF(H541=\"\",\"\",VLOOKUP(H541,#REF!,2,0))","v":""}]
[null,null,null,null,null,"",{"$f":"IF(D542=\"\",\"\",VLOOKUP(F542,'Plan Comptable '!$C$5:$D$554,2,0))","v":""},null,{"$f":"IF(H542=\"\",\"\",VLOOKUP(H542,#REF!,2,0))","v":""}]
[null,null,null,null,null,"",{"$f":"IF(D543=\"\",\"\",VLOOKUP(F543,'Plan Comptable '!$C$5:$D$554,2,0))","v":""},null,{"$f":"IF(H543=\"\",\"\",VLOOKUP(H543,#REF!,2,0))","v":""}]
[null,null,null,null,null,"",{"$f":"IF(D544=\"\",\"\",VLOOKUP(F544,'Plan Comptable '!$C$5:$D$554,2,0))","v":""},null,{"$f":"IF(H544=\"\",\"\",VLOOKUP(H544,#REF!,2,0))","v":""}]
[null,null,null,null,null,"",{"$f":"IF(D545=\"\",\"\",VLOOKUP(F545,'Plan Comptable '!$C$5:$D$554,2,0))","v":""},null,{"$f":"IF(H545=\"\",\"\",VLOOKUP(H545,#REF!,2,0))","v":""}]
[null,null,null,null,null,"",{"$f":"IF(D546=\"\",\"\",VLOOKUP(F546,'Plan Comptable '!$C$5:$D$554,2,0))","v":""},null,{"$f":"IF(H546=\"\",\"\",VLOOKUP(H546,#REF!,2,0))","v":""}]
[null,null,null,null,null,"",{"$f":"IF(D547=\"\",\"\",VLOOKUP(F547,'Plan Comptable '!$C$5:$D$554,2,0))","v":""},null,{"$f":"IF(H547=\"\",\"\",VLOOKUP(H547,#REF!,2,0))","v":""}]
[null,null,null,null,null,"",{"$f":"IF(D548=\"\",\"\",VLOOKUP(F548,'Plan Comptable '!$C$5:$D$554,2,0))","v":""},null,{"$f":"IF(H548=\"\",\"\",VLOOKUP(H548,#REF!,2,0))","v":""}]
[null,null,null,null,null,"",{"$f":"IF(D549=\"\",\"\",VLOOKUP(F549,'Plan Comptable '!$C$5:$D$554,2,0))","v":""},null,{"$f":"IF(H549=\"\",\"\",VLOOKUP(H549,#REF!,2,0))","v":""}]
[null,null,null,null,null,"",{"$f":"IF(D550=\"\",\"\",VLOOKUP(F550,'Plan Comptable '!$C$5:$D$554,2,0))","v":""},null,{"$f":"IF(H550=\"\",\"\",VLOOKUP(H550,#REF!,2,0))","v":""}]
[null,null,null,null,null,"",{"$f":"IF(D551=\"\",\"\",VLOOKUP(F551,'Plan Comptable '!$C$5:$D$554,2,0))","v":""},null,{"$f":"IF(H551=\"\",\"\",VLOOKUP(H551,#REF!,2,0))","v":""}]
[null,null,null,null,null,"",{"$f":"IF(D552=\"\",\"\",VLOOKUP(F552,'Plan Comptable '!$C$5:$D$554,2,0))","v":""},null,{"$f":"IF(H552=\"\",\"\",VLOOKUP(H552,#REF!,2,0))","v":""}]
[null,null,null,null,null,"",{"$f":"IF(D553=\"\",\"\",VLOOKUP(F553,'Plan Comptable '!$C$5:$D$554,2,0))","v":""},null,{"$f":"IF(H553=\"\",\"\",VLOOKUP(H553,#REF!,2,0))","v":""}]
[null,null,null,null,null,"",{"$f":"IF(D554=\"\",\"\",VLOOKUP(F554,'Plan Comptable '!$C$5:$D$554,2,0))","v":""},null,{"$f":"IF(H554=\"\",\"\",VLOOKUP(H554,#REF!,2,0))","v":""}]
[null,null,null,null,null,"",{"$f":"IF(D555=\"\",\"\",VLOOKUP(F555,'Plan Comptable '!$C$5:$D$554,2,0))","v":""},null,{"$f":"IF(H555=\"\",\"\",VLOOKUP(H555,#REF!,2,0))","v":""}]
[null,null,null,null,null,"",{"$f":"IF(D556=\"\",\"\",VLOOKUP(F556,'Plan Comptable '!$C$5:$D$554,2,0))","v":""},null,{"$f":"IF(H556=\"\",\"\",VLOOKUP(H556,#REF!,2,0))","v":""}]
[null,null,null,null,null,"",{"$f":"IF(D557=\"\",\"\",VLOOKUP(F557,'Plan Comptable '!$C$5:$D$554,2,0))","v":""},null,{"$f":"IF(H557=\"\",\"\",VLOOKUP(H557,#REF!,2,0))","v":""}]
[null,null,null,null,null,"",{"$f":"IF(D558=\"\",\"\",VLOOKUP(F558,'Plan Comptable '!$C$5:$D$554,2,0))","v":""},null,{"$f":"IF(H558=\"\",\"\",VLOOKUP(H558,#REF!,2,0))","v":""}]
[null,null,null,null,null,"",{"$f":"IF(D559=\"\",\"\",VLOOKUP(F559,'Plan Comptable '!$C$5:$D$554,2,0))","v":""},null,{"$f":"IF(H559=\"\",\"\",VLOOKUP(H559,#REF!,2,0))","v":""}]
[null,null,null,null,null,"",{"$f":"IF(D560=\"\",\"\",VLOOKUP(F560,'Plan Comptable '!$C$5:$D$554,2,0))","v":""},null,{"$f":"IF(H560=\"\",\"\",VLOOKUP(H560,#REF!,2,0))","v":""}]
[null,null,null,null,null,"",{"$f":"IF(D561=\"\",\"\",VLOOKUP(F561,'Plan Comptable '!$C$5:$D$554,2,0))","v":""},null,{"$f":"IF(H561=\"\",\"\",VLOOKUP(H561,#REF!,2,0))","v":""}]
[null,null,null,null,null,"",{"$f":"IF(D562=\"\",\"\",VLOOKUP(F562,'Plan Comptable '!$C$5:$D$554,2,0))","v":""},null,{"$f":"IF(H562=\"\",\"\",VLOOKUP(H562,#REF!,2,0))","v":""}]
[null,null,null,null,null,"",{"$f":"IF(D563=\"\",\"\",VLOOKUP(F563,'Plan Comptable '!$C$5:$D$554,2,0))","v":""},null,{"$f":"IF(H563=\"\",\"\",VLOOKUP(H563,#REF!,2,0))","v":""}]
[null,null,null,null,null,"",{"$f":"IF(D564=\"\",\"\",VLOOKUP(F564,'Plan Comptable '!$C$5:$D$554,2,0))","v":""},null,{"$f":"IF(H564=\"\",\"\",VLOOKUP(H564,#REF!,2,0))","v":""}]
[null,null,null,null,null,"",{"$f":"IF(D565=\"\",\"\",VLOOKUP(F565,'Plan Comptable '!$C$5:$D$554,2,0))","v":""},null,{"$f":"IF(H565=\"\",\"\",VLOOKUP(H565,#REF!,2,0))","v":""}]
[null,null,null,null,null,"",{"$f":"IF(D566=\"\",\"\",VLOOKUP(F566,'Plan Comptable '!$C$5:$D$554,2,0))","v":""},null,{"$f":"IF(H566=\"\",\"\",VLOOKUP(H566,#REF!,2,0))","v":""}]
[null,null,null,null,null,"",{"$f":"IF(D567=\"\",\"\",VLOOKUP(F567,'Plan Comptable '!$C$5:$D$554,2,0))","v":""},null,{"$f":"IF(H567=\"\",\"\",VLOOKUP(H567,#REF!,2,0))","v":""}]
[null,null,null,null,null,"",{"$f":"IF(D568=\"\",\"\",VLOOKUP(F568,'Plan Comptable '!$C$5:$D$554,2,0))","v":""},null,{"$f":"IF(H568=\"\",\"\",VLOOKUP(H568,#REF!,2,0))","v":""}]
[null,null,null,null,null,"",{"$f":"IF(D569=\"\",\"\",VLOOKUP(F569,'Plan Comptable '!$C$5:$D$554,2,0))","v":""},null,{"$f":"IF(H569=\"\",\"\",VLOOKUP(H569,#REF!,2,0))","v":""}]
[null,null,null,null,null,"",{"$f":"IF(D570=\"\",\"\",VLOOKUP(F570,'Plan Comptable '!$C$5:$D$554,2,0))","v":""},null,{"$f":"IF(H570=\"\",\"\",VLOOKUP(H570,#REF!,2,0))","v":""}]
[null,null,null,null,null,"",{"$f":"IF(D571=\"\",\"\",VLOOKUP(F571,'Plan Comptable '!$C$5:$D$554,2,0))","v":""},null,{"$f":"IF(H571=\"\",\"\",VLOOKUP(H571,#REF!,2,0))","v":""}]
[null,null,null,null,null,"",{"$f":"IF(D572=\"\",\"\",VLOOKUP(F572,'Plan Comptable '!$C$5:$D$554,2,0))","v":""},null,{"$f":"IF(H572=\"\",\"\",VLOOKUP(H572,#REF!,2,0))","v":""}]
[null,null,null,null,null,"",{"$f":"IF(D573=\"\",\"\",VLOOKUP(F573,'Plan Comptable '!$C$5:$D$554,2,0))","v":""},null,{"$f":"IF(H573=\"\",\"\",VLOOKUP(H573,#REF!,2,0))","v":""}]
[null,null,null,null,null,"",{"$f":"IF(D574=\"\",\"\",VLOOKUP(F574,'Plan Comptable '!$C$5:$D$554,2,0))","v":""},null,{"$f":"IF(H574=\"\",\"\",VLOOKUP(H574,#REF!,2,0))","v":""}]
[null,null,null,null,null,"",{"$f":"IF(D575=\"\",\"\",VLOOKUP(F575,'Plan Comptable '!$C$5:$D$554,2,0))","v":""},null,{"$f":"IF(H575=\"\",\"\",VLOOKUP(H575,#REF!,2,0))","v":""}]
[null,null,null,null,null,"",{"$f":"IF(D576=\"\",\"\",VLOOKUP(F576,'Plan Comptable '!$C$5:$D$554,2,0))","v":""},null,{"$f":"IF(H576=\"\",\"\",VLOOKUP(H576,#REF!,2,0))","v":""}]
[null,null,null,null,null,"",{"$f":"IF(D577=\"\",\"\",VLOOKUP(F577,'Plan Comptable '!$C$5:$D$554,2,0))","v":""},null,{"$f":"IF(H577=\"\",\"\",VLOOKUP(H577,#REF!,2,0))","v":""}]
[null,null,null,null,null,"",{"$f":"IF(D578=\"\",\"\",VLOOKUP(F578,'Plan Comptable '!$C$5:$D$554,2,0))","v":""},null,{"$f":"IF(H578=\"\",\"\",VLOOKUP(H578,#REF!,2,0))","v":""}]
[null,null,null,null,null,"",{"$f":"IF(D579=\"\",\"\",VLOOKUP(F579,'Plan Comptable '!$C$5:$D$554,2,0))","v":""},null,{"$f":"IF(H579=\"\",\"\",VLOOKUP(H579,#REF!,2,0))","v":""}]
[null,null,null,null,null,"",{"$f":"IF(D580=\"\",\"\",VLOOKUP(F580,'Plan Comptable '!$C$5:$D$554,2,0))","v":""},null,{"$f":"IF(H580=\"\",\"\",VLOOKUP(H580,#REF!,2,0))","v":""}]
[null,null,null,null,null,"",{"$f":"IF(D581=\"\",\"\",VLOOKUP(F581,'Plan Comptable '!$C$5:$D$554,2,0))","v":""},null,{"$f":"IF(H581=\"\",\"\",VLOOKUP(H581,#REF!,2,0))","v":""}]
[null,null,null,null,null,"",{"$f":"IF(D582=\"\",\"\",VLOOKUP(F582,'Plan Comptable '!$C$5:$D$554,2,0))","v":""},null,{"$f":"IF(H582=\"\",\"\",VLOOKUP(H582,#REF!,2,0))","v":""}]
[null,null,null,null,null,"",{"$f":"IF(D583=\"\",\"\",VLOOKUP(F583,'Plan Comptable '!$C$5:$D$554,2,0))","v":""},null,{"$f":"IF(H583=\"\",\"\",VLOOKUP(H583,#REF!,2,0))","v":""}]
[null,null,null,null,null,"",{"$f":"IF(D584=\"\",\"\",VLOOKUP(F584,'Plan Comptable '!$C$5:$D$554,2,0))","v":""},null,{"$f":"IF(H584=\"\",\"\",VLOOKUP(H584,#REF!,2,0))","v":""}]
[null,null,null,null,null,"",{"$f":"IF(D585=\"\",\"\",VLOOKUP(F585,'Plan Comptable '!$C$5:$D$554,2,0))","v":""},null,{"$f":"IF(H585=\"\",\"\",VLOOKUP(H585,#REF!,2,0))","v":""}]
[null,null,null,null,null,"",{"$f":"IF(D586=\"\",\"\",VLOOKUP(F586,'Plan Comptable '!$C$5:$D$554,2,0))","v":""},null,{"$f":"IF(H586=\"\",\"\",VLOOKUP(H586,#REF!,2,0))","v":""}]
[null,null,null,null,null,"",{"$f":"IF(D587=\"\",\"\",VLOOKUP(F587,'Plan Comptable '!$C$5:$D$554,2,0))","v":""},null,{"$f":"IF(H587=\"\",\"\",VLOOKUP(H587,#REF!,2,0))","v":""}]
[null,null,null,null,null,{"$f":"CONCATENATE(D588,E588)","v":""},{"$f":"IF(D588=\"\",\"\",VLOOKUP(F588,'Plan Comptable '!$C$5:$D$554,2,0))","v":""},null,{"$f":"IF(H588=\"\",\"\",VLOOKUP(H588,#REF!,2,0))","v":""}]
[null,null,null,null,null,"",{"$f":"IF(D589=\"\",\"\",VLOOKUP(F589,'Plan Comptable '!$C$5:$D$554,2,0))","v":""},null,{"$f":"IF(H589=\"\",\"\",VLOOKUP(H589,#REF!,2,0))","v":""}]
[null,null,null,null,null,"",{"$f":"IF(D590=\"\",\"\",VLOOKUP(F590,'Plan Comptable '!$C$5:$D$554,2,0))","v":""},null,{"$f":"IF(H590=\"\",\"\",VLOOKUP(H590,#REF!,2,0))","v":""}]
[null,null,null,null,null,"",{"$f":"IF(D591=\"\",\"\",VLOOKUP(F591,'Plan Comptable '!$C$5:$D$554,2,0))","v":""},null,{"$f":"IF(H591=\"\",\"\",VLOOKUP(H591,#REF!,2,0))","v":""}]
[null,null,null,null,null,"",{"$f":"IF(D592=\"\",\"\",VLOOKUP(F592,'Plan Comptable '!$C$5:$D$554,2,0))","v":""},null,{"$f":"IF(H592=\"\",\"\",VLOOKUP(H592,#REF!,2,0))","v":""}]
[null,null,null,null,null,"",{"$f":"IF(D593=\"\",\"\",VLOOKUP(F593,'Plan Comptable '!$C$5:$D$554,2,0))","v":""},null,{"$f":"IF(H593=\"\",\"\",VLOOKUP(H593,#REF!,2,0))","v":""}]
[null,null,null,null,null,"",{"$f":"IF(D594=\"\",\"\",VLOOKUP(F594,'Plan Comptable '!$C$5:$D$554,2,0))","v":""},null,{"$f":"IF(H594=\"\",\"\",VLOOKUP(H594,#REF!,2,0))","v":""}]
[null,null,null,null,null,"",{"$f":"IF(D595=\"\",\"\",VLOOKUP(F595,'Plan Comptable '!$C$5:$D$554,2,0))","v":""},null,{"$f":"IF(H595=\"\",\"\",VLOOKUP(H595,#REF!,2,0))","v":""}]
[null,null,null,null,null,"",{"$f":"IF(D596=\"\",\"\",VLOOKUP(F596,'Plan Comptable '!$C$5:$D$554,2,0))","v":""},null,{"$f":"IF(H596=\"\",\"\",VLOOKUP(H596,#REF!,2,0))","v":""}]
[null,null,null,null,null,"",{"$f":"IF(D597=\"\",\"\",VLOOKUP(F597,'Plan Comptable '!$C$5:$D$554,2,0))","v":""},null,{"$f":"IF(H597=\"\",\"\",VLOOKUP(H597,#REF!,2,0))","v":""}]
[null,null,null,null,null,"",{"$f":"IF(D598=\"\",\"\",VLOOKUP(F598,'Plan Comptable '!$C$5:$D$554,2,0))","v":""},null,{"$f":"IF(H598=\"\",\"\",VLOOKUP(H598,#REF!,2,0))","v":""}]
[null,null,null,null,null,"",{"$f":"IF(D599=\"\",\"\",VLOOKUP(F599,'Plan Comptable '!$C$5:$D$554,2,0))","v":""},null,{"$f":"IF(H599=\"\",\"\",VLOOKUP(H599,#REF!,2,0))","v":""}]
[null,null,null,null,null,"",{"$f":"IF(D600=\"\",\"\",VLOOKUP(F600,'Plan Comptable '!$C$5:$D$554,2,0))","v":""},null,{"$f":"IF(H600=\"\",\"\",VLOOKUP(H600,#REF!,2,0))","v":""}]
[null,null,null,null,null,"",{"$f":"IF(D601=\"\",\"\",VLOOKUP(F601,'Plan Comptable '!$C$5:$D$554,2,0))","v":""},null,{"$f":"IF(H601=\"\",\"\",VLOOKUP(H601,#REF!,2,0))","v":""}]
[null,null,null,null,null,"",{"$f":"IF(D602=\"\",\"\",VLOOKUP(F602,'Plan Comptable '!$C$5:$D$554,2,0))","v":""},null,{"$f":"IF(H602=\"\",\"\",VLOOKUP(H602,#REF!,2,0))","v":""}]
[null,null,null,null,null,"",{"$f":"IF(D603=\"\",\"\",VLOOKUP(F603,'Plan Comptable '!$C$5:$D$554,2,0))","v":""},null,{"$f":"IF(H603=\"\",\"\",VLOOKUP(H603,#REF!,2,0))","v":""}]
[null,null,null,null,null,"",{"$f":"IF(D604=\"\",\"\",VLOOKUP(F604,'Plan Comptable '!$C$5:$D$554,2,0))","v":""},null,{"$f":"IF(H604=\"\",\"\",VLOOKUP(H604,#REF!,2,0))","v":""}]
[null,null,null,null,null,"",{"$f":"IF(D605=\"\",\"\",VLOOKUP(F605,'Plan Comptable '!$C$5:$D$554,2,0))","v":""},null,{"$f":"IF(H605=\"\",\"\",VLOOKUP(H605,#REF!,2,0))","v":""}]
[null,null,null,null,null,"",{"$f":"IF(D606=\"\",\"\",VLOOKUP(F606,'Plan Comptable '!$C$5:$D$554,2,0))","v":""},null,{"$f":"IF(H606=\"\",\"\",VLOOKUP(H606,#REF!,2,0))","v":""}]
[null,null,null,null,null,"",{"$f":"IF(D607=\"\",\"\",VLOOKUP(F607,'Plan Comptable '!$C$5:$D$554,2,0))","v":""},null,{"$f":"IF(H607=\"\",\"\",VLOOKUP(H607,#REF!,2,0))","v":""}]
[null,null,null,null,null,"",{"$f":"IF(D608=\"\",\"\",VLOOKUP(F608,'Plan Comptable '!$C$5:$D$554,2,0))","v":""},null,{"$f":"IF(H608=\"\",\"\",VLOOKUP(H608,#REF!,2,0))","v":""}]
[null,null,null,null,null,"",{"$f":"IF(D609=\"\",\"\",VLOOKUP(F609,'Plan Comptable '!$C$5:$D$554,2,0))","v":""},null,{"$f":"IF(H609=\"\",\"\",VLOOKUP(H609,#REF!,2,0))","v":""}]
[null,null,null,null,null,"",{"$f":"IF(D610=\"\",\"\",VLOOKUP(F610,'Plan Comptable '!$C$5:$D$554,2,0))","v":""},null,{"$f":"IF(H610=\"\",\"\",VLOOKUP(H610,#REF!,2,0))","v":""}]
[null,null,null,null,null,"",{"$f":"IF(D611=\"\",\"\",VLOOKUP(F611,'Plan Comptable '!$C$5:$D$554,2,0))","v":""},null,{"$f":"IF(H611=\"\",\"\",VLOOKUP(H611,#REF!,2,0))","v":""}]
[null,null,null,null,null,"",{"$f":"IF(D612=\"\",\"\",VLOOKUP(F612,'Plan Comptable '!$C$5:$D$554,2,0))","v":""},null,{"$f":"IF(H612=\"\",\"\",VLOOKUP(H612,#REF!,2,0))","v":""}]
[null,null,null,null,null,"",{"$f":"IF(D613=\"\",\"\",VLOOKUP(F613,'Plan Comptable '!$C$5:$D$554,2,0))","v":""},null,{"$f":"IF(H613=\"\",\"\",VLOOKUP(H613,#REF!,2,0))","v":""}]
[null,null,null,null,null,"",{"$f":"IF(D614=\"\",\"\",VLOOKUP(F614,'Plan Comptable '!$C$5:$D$554,2,0))","v":""},null,{"$f":"IF(H614=\"\",\"\",VLOOKUP(H614,#REF!,2,0))","v":""}]
[null,null,null,null,null,"",{"$f":"IF(D615=\"\",\"\",VLOOKUP(F615,'Plan Comptable '!$C$5:$D$554,2,0))","v":""},null,{"$f":"IF(H615=\"\",\"\",VLOOKUP(H615,#REF!,2,0))","v":""}]
[null,null,null,null,null,"",{"$f":"IF(D616=\"\",\"\",VLOOKUP(F616,'Plan Comptable '!$C$5:$D$554,2,0))","v":""},null,{"$f":"IF(H616=\"\",\"\",VLOOKUP(H616,#REF!,2,0))","v":""}]
[null,null,null,null,null,"",{"$f":"IF(D617=\"\",\"\",VLOOKUP(F617,'Plan Comptable '!$C$5:$D$554,2,0))","v":""},null,{"$f":"IF(H617=\"\",\"\",VLOOKUP(H617,#REF!,2,0))","v":""}]
[null,null,null,null,null,"",{"$f":"IF(D618=\"\",\"\",VLOOKUP(F618,'Plan Comptable '!$C$5:$D$554,2,0))","v":""},null,{"$f":"IF(H618=\"\",\"\",VLOOKUP(H618,#REF!,2,0))","v":""}]
[null,null,null,null,null,"",{"$f":"IF(D619=\"\",\"\",VLOOKUP(F619,'Plan Comptable '!$C$5:$D$554,2,0))","v":""},null,{"$f":"IF(H619=\"\",\"\",VLOOKUP(H619,#REF!,2,0))","v":""}]
[null,null,null,null,null,"",{"$f":"IF(D620=\"\",\"\",VLOOKUP(F620,'Plan Comptable '!$C$5:$D$554,2,0))","v":""},null,{"$f":"IF(H620=\"\",\"\",VLOOKUP(H620,#REF!,2,0))","v":""}]
[null,null,null,null,null,"",{"$f":"IF(D621=\"\",\"\",VLOOKUP(F621,'Plan Comptable '!$C$5:$D$554,2,0))","v":""},null,{"$f":"IF(H621=\"\",\"\",VLOOKUP(H621,#REF!,2,0))","v":""}]
[null,null,null,null,null,"",{"$f":"IF(D622=\"\",\"\",VLOOKUP(F622,'Plan Comptable '!$C$5:$D$554,2,0))","v":""},null,{"$f":"IF(H622=\"\",\"\",VLOOKUP(H622,#REF!,2,0))","v":""}]
[null,null,null,null,null,"",{"$f":"IF(D623=\"\",\"\",VLOOKUP(F623,'Plan Comptable '!$C$5:$D$554,2,0))","v":""},null,{"$f":"IF(H623=\"\",\"\",VLOOKUP(H623,#REF!,2,0))","v":""}]
[null,null,null,null,null,"",{"$f":"IF(D624=\"\",\"\",VLOOKUP(F624,'Plan Comptable '!$C$5:$D$554,2,0))","v":""},null,{"$f":"IF(H624=\"\",\"\",VLOOKUP(H624,#REF!,2,0))","v":""}]
[null,null,null,null,null,"",{"$f":"IF(D625=\"\",\"\",VLOOKUP(F625,'Plan Comptable '!$C$5:$D$554,2,0))","v":""},null,{"$f":"IF(H625=\"\",\"\",VLOOKUP(H625,#REF!,2,0))","v":""}]
[null,null,null,null,null,"",{"$f":"IF(D626=\"\",\"\",VLOOKUP(F626,'Plan Comptable '!$C$5:$D$554,2,0))","v":""},null,{"$f":"IF(H626=\"\",\"\",VLOOKUP(H626,#REF!,2,0))","v":""}]
[null,null,null,null,null,"",{"$f":"IF(D627=\"\",\"\",VLOOKUP(F627,'Plan Comptable '!$C$5:$D$554,2,0))","v":""},null,{"$f":"IF(H627=\"\",\"\",VLOOKUP(H627,#REF!,2,0))","v":""}]
[null,null,null,null,null,"",{"$f":"IF(D628=\"\",\"\",VLOOKUP(F628,'Plan Comptable '!$C$5:$D$554,2,0))","v":""},null,{"$f":"IF(H628=\"\",\"\",VLOOKUP(H628,#REF!,2,0))","v":""}]
[null,null,null,null,null,"",{"$f":"IF(D629=\"\",\"\",VLOOKUP(F629,'Plan Comptable '!$C$5:$D$554,2,0))","v":""},null,{"$f":"IF(H629=\"\",\"\",VLOOKUP(H629,#REF!,2,0))","v":""}]
[null,null,null,null,null,"",{"$f":"IF(D630=\"\",\"\",VLOOKUP(F630,'Plan Comptable '!$C$5:$D$554,2,0))","v":""},null,{"$f":"IF(H630=\"\",\"\",VLOOKUP(H630,#REF!,2,0))","v":""}]
[null,null,null,null,null,"",{"$f":"IF(D631=\"\",\"\",VLOOKUP(F631,'Plan Comptable '!$C$5:$D$554,2,0))","v":""},null,{"$f":"IF(H631=\"\",\"\",VLOOKUP(H631,#REF!,2,0))","v":""}]
[null,null,null,null,null,"",{"$f":"IF(D632=\"\",\"\",VLOOKUP(F632,'Plan Comptable '!$C$5:$D$554,2,0))","v":""},null,{"$f":"IF(H632=\"\",\"\",VLOOKUP(H632,#REF!,2,0))","v":""}]
[null,null,null,null,null,"",{"$f":"IF(D633=\"\",\"\",VLOOKUP(F633,'Plan Comptable '!$C$5:$D$554,2,0))","v":""},null,{"$f":"IF(H633=\"\",\"\",VLOOKUP(H633,#REF!,2,0))","v":""}]
[null,null,null,null,null,"",{"$f":"IF(D634=\"\",\"\",VLOOKUP(F634,'Plan Comptable '!$C$5:$D$554,2,0))","v":""},null,{"$f":"IF(H634=\"\",\"\",VLOOKUP(H634,#REF!,2,0))","v":""}]
[null,null,null,null,null,"",{"$f":"IF(D635=\"\",\"\",VLOOKUP(F635,'Plan Comptable '!$C$5:$D$554,2,0))","v":""},null,{"$f":"IF(H635=\"\",\"\",VLOOKUP(H635,#REF!,2,0))","v":""}]
[null,null,null,null,null,"",{"$f":"IF(D636=\"\",\"\",VLOOKUP(F636,'Plan Comptable '!$C$5:$D$554,2,0))","v":""},null,{"$f":"IF(H636=\"\",\"\",VLOOKUP(H636,#REF!,2,0))","v":""}]
[null,null,null,null,null,"",{"$f":"IF(D637=\"\",\"\",VLOOKUP(F637,'Plan Comptable '!$C$5:$D$554,2,0))","v":""},null,{"$f":"IF(H637=\"\",\"\",VLOOKUP(H637,#REF!,2,0))","v":""}]
[null,null,null,null,null,"",{"$f":"IF(D638=\"\",\"\",VLOOKUP(F638,'Plan Comptable '!$C$5:$D$554,2,0))","v":""},null,{"$f":"IF(H638=\"\",\"\",VLOOKUP(H638,#REF!,2,0))","v":""}]
[null,null,null,null,null,"",{"$f":"IF(D639=\"\",\"\",VLOOKUP(F639,'Plan Comptable '!$C$5:$D$554,2,0))","v":""},null,{"$f":"IF(H639=\"\",\"\",VLOOKUP(H639,#REF!,2,0))","v":""}]
[null,null,null,null,null,"",{"$f":"IF(D640=\"\",\"\",VLOOKUP(F640,'Plan Comptable '!$C$5:$D$554,2,0))","v":""},null,{"$f":"IF(H640=\"\",\"\",VLOOKUP(H640,#REF!,2,0))","v":""}]
[null,null,null,null,null,"",{"$f":"IF(D641=\"\",\"\",VLOOKUP(F641,'Plan Comptable '!$C$5:$D$554,2,0))","v":""},null,{"$f":"IF(H641=\"\",\"\",VLOOKUP(H641,#REF!,2,0))","v":""}]
[null,null,null,null,null,"",{"$f":"IF(D642=\"\",\"\",VLOOKUP(F642,'Plan Comptable '!$C$5:$D$554,2,0))","v":""},null,{"$f":"IF(H642=\"\",\"\",VLOOKUP(H642,#REF!,2,0))","v":""}]
[null,null,null,null,null,"",{"$f":"IF(D643=\"\",\"\",VLOOKUP(F643,'Plan Comptable '!$C$5:$D$554,2,0))","v":""},null,{"$f":"IF(H643=\"\",\"\",VLOOKUP(H643,#REF!,2,0))","v":""}]
[null,null,null,null,null,"",{"$f":"IF(D644=\"\",\"\",VLOOKUP(F644,'Plan Comptable '!$C$5:$D$554,2,0))","v":""},null,{"$f":"IF(H644=\"\",\"\",VLOOKUP(H644,#REF!,2,0))","v":""}]
[null,null,null,null,null,"",{"$f":"IF(D645=\"\",\"\",VLOOKUP(F645,'Plan Comptable '!$C$5:$D$554,2,0))","v":""},null,{"$f":"IF(H645=\"\",\"\",VLOOKUP(H645,#REF!,2,0))","v":""}]
[null,null,null,null,null,"",{"$f":"IF(D646=\"\",\"\",VLOOKUP(F646,'Plan Comptable '!$C$5:$D$554,2,0))","v":""},null,{"$f":"IF(H646=\"\",\"\",VLOOKUP(H646,#REF!,2,0))","v":""}]
[null,null,null,null,null,"",{"$f":"IF(D647=\"\",\"\",VLOOKUP(F647,'Plan Comptable '!$C$5:$D$554,2,0))","v":""},null,{"$f":"IF(H647=\"\",\"\",VLOOKUP(H647,#REF!,2,0))","v":""}]
[null,null,null,null,null,"",{"$f":"IF(D648=\"\",\"\",VLOOKUP(F648,'Plan Comptable '!$C$5:$D$554,2,0))","v":""},null,{"$f":"IF(H648=\"\",\"\",VLOOKUP(H648,#REF!,2,0))","v":""}]
[null,null,null,null,null,"",{"$f":"IF(D649=\"\",\"\",VLOOKUP(F649,'Plan Comptable '!$C$5:$D$554,2,0))","v":""},null,{"$f":"IF(H649=\"\",\"\",VLOOKUP(H649,#REF!,2,0))","v":""}]
[null,null,null,null,null,"",{"$f":"IF(D650=\"\",\"\",VLOOKUP(F650,'Plan Comptable '!$C$5:$D$554,2,0))","v":""},null,{"$f":"IF(H650=\"\",\"\",VLOOKUP(H650,#REF!,2,0))","v":""}]
[null,null,null,null,null,"",{"$f":"IF(D651=\"\",\"\",VLOOKUP(F651,'Plan Comptable '!$C$5:$D$554,2,0))","v":""},null,{"$f":"IF(H651=\"\",\"\",VLOOKUP(H651,#REF!,2,0))","v":""}]
[null,null,null,null,null,{"$f":"CONCATENATE(D652,E652)","v":""},{"$f":"IF(D652=\"\",\"\",VLOOKUP(F652,'Plan Comptable '!$C$5:$D$554,2,0))","v":""},null,{"$f":"IF(H652=\"\",\"\",VLOOKUP(H652,#REF!,2,0))","v":""}]
[null,null,null,null,null,"",{"$f":"IF(D653=\"\",\"\",VLOOKUP(F653,'Plan Comptable '!$C$5:$D$554,2,0))","v":""},null,{"$f":"IF(H653=\"\",\"\",VLOOKUP(H653,#REF!,2,0))","v":""}]
[null,null,null,null,null,"",{"$f":"IF(D654=\"\",\"\",VLOOKUP(F654,'Plan Comptable '!$C$5:$D$554,2,0))","v":""},null,{"$f":"IF(H654=\"\",\"\",VLOOKUP(H654,#REF!,2,0))","v":""}]
[null,null,null,null,null,"",{"$f":"IF(D655=\"\",\"\",VLOOKUP(F655,'Plan Comptable '!$C$5:$D$554,2,0))","v":""},null,{"$f":"IF(H655=\"\",\"\",VLOOKUP(H655,#REF!,2,0))","v":""}]
[null,null,null,null,null,"",{"$f":"IF(D656=\"\",\"\",VLOOKUP(F656,'Plan Comptable '!$C$5:$D$554,2,0))","v":""},null,{"$f":"IF(H656=\"\",\"\",VLOOKUP(H656,#REF!,2,0))","v":""}]
[null,null,null,null,null,"",{"$f":"IF(D657=\"\",\"\",VLOOKUP(F657,'Plan Comptable '!$C$5:$D$554,2,0))","v":""},null,{"$f":"IF(H657=\"\",\"\",VLOOKUP(H657,#REF!,2,0))","v":""}]
[null,null,null,null,null,"",{"$f":"IF(D658=\"\",\"\",VLOOKUP(F658,'Plan Comptable '!$C$5:$D$554,2,0))","v":""},null,{"$f":"IF(H658=\"\",\"\",VLOOKUP(H658,#REF!,2,0))","v":""}]
[null,null,null,null,null,"",{"$f":"IF(D659=\"\",\"\",VLOOKUP(F659,'Plan Comptable '!$C$5:$D$554,2,0))","v":""},null,{"$f":"IF(H659=\"\",\"\",VLOOKUP(H659,#REF!,2,0))","v":""}]
[null,null,null,null,null,"",{"$f":"IF(D660=\"\",\"\",VLOOKUP(F660,'Plan Comptable '!$C$5:$D$554,2,0))","v":""},null,{"$f":"IF(H660=\"\",\"\",VLOOKUP(H660,#REF!,2,0))","v":""}]
[null,null,null,null,null,"",{"$f":"IF(D661=\"\",\"\",VLOOKUP(F661,'Plan Comptable '!$C$5:$D$554,2,0))","v":""},null,{"$f":"IF(H661=\"\",\"\",VLOOKUP(H661,#REF!,2,0))","v":""}]
[null,null,null,null,null,"",{"$f":"IF(D662=\"\",\"\",VLOOKUP(F662,'Plan Comptable '!$C$5:$D$554,2,0))","v":""},null,{"$f":"IF(H662=\"\",\"\",VLOOKUP(H662,#REF!,2,0))","v":""}]
[null,null,null,null,null,"",{"$f":"IF(D663=\"\",\"\",VLOOKUP(F663,'Plan Comptable '!$C$5:$D$554,2,0))","v":""},null,{"$f":"IF(H663=\"\",\"\",VLOOKUP(H663,#REF!,2,0))","v":""}]
[null,null,null,null,null,"",{"$f":"IF(D664=\"\",\"\",VLOOKUP(F664,'Plan Comptable '!$C$5:$D$554,2,0))","v":""},null,{"$f":"IF(H664=\"\",\"\",VLOOKUP(H664,#REF!,2,0))","v":""}]
[null,null,null,null,null,"",{"$f":"IF(D665=\"\",\"\",VLOOKUP(F665,'Plan Comptable '!$C$5:$D$554,2,0))","v":""},null,{"$f":"IF(H665=\"\",\"\",VLOOKUP(H665,#REF!,2,0))","v":""}]
[null,null,null,null,null,"",{"$f":"IF(D666=\"\",\"\",VLOOKUP(F666,'Plan Comptable '!$C$5:$D$554,2,0))","v":""},null,{"$f":"IF(H666=\"\",\"\",VLOOKUP(H666,#REF!,2,0))","v":""}]
[null,null,null,null,null,"",{"$f":"IF(D667=\"\",\"\",VLOOKUP(F667,'Plan Comptable '!$C$5:$D$554,2,0))","v":""},null,{"$f":"IF(H667=\"\",\"\",VLOOKUP(H667,#REF!,2,0))","v":""}]
[null,null,null,null,null,"",{"$f":"IF(D668=\"\",\"\",VLOOKUP(F668,'Plan Comptable '!$C$5:$D$554,2,0))","v":""},null,{"$f":"IF(H668=\"\",\"\",VLOOKUP(H668,#REF!,2,0))","v":""}]
[null,null,null,null,null,"",{"$f":"IF(D669=\"\",\"\",VLOOKUP(F669,'Plan Comptable '!$C$5:$D$554,2,0))","v":""},null,{"$f":"IF(H669=\"\",\"\",VLOOKUP(H669,#REF!,2,0))","v":""}]
[null,null,null,null,null,"",{"$f":"IF(D670=\"\",\"\",VLOOKUP(F670,'Plan Comptable '!$C$5:$D$554,2,0))","v":""},null,{"$f":"IF(H670=\"\",\"\",VLOOKUP(H670,#REF!,2,0))","v":""}]
[null,null,null,null,null,"",{"$f":"IF(D671=\"\",\"\",VLOOKUP(F671,'Plan Comptable '!$C$5:$D$554,2,0))","v":""},null,{"$f":"IF(H671=\"\",\"\",VLOOKUP(H671,#REF!,2,0))","v":""}]
[null,null,null,null,null,"",{"$f":"IF(D672=\"\",\"\",VLOOKUP(F672,'Plan Comptable '!$C$5:$D$554,2,0))","v":""},null,{"$f":"IF(H672=\"\",\"\",VLOOKUP(H672,#REF!,2,0))","v":""}]
[null,null,null,null,null,"",{"$f":"IF(D673=\"\",\"\",VLOOKUP(F673,'Plan Comptable '!$C$5:$D$554,2,0))","v":""},null,{"$f":"IF(H673=\"\",\"\",VLOOKUP(H673,#REF!,2,0))","v":""}]
[null,null,null,null,null,"",{"$f":"IF(D674=\"\",\"\",VLOOKUP(F674,'Plan Comptable '!$C$5:$D$554,2,0))","v":""},null,{"$f":"IF(H674=\"\",\"\",VLOOKUP(H674,#REF!,2,0))","v":""}]
[null,null,null,null,null,"",{"$f":"IF(D675=\"\",\"\",VLOOKUP(F675,'Plan Comptable '!$C$5:$D$554,2,0))","v":""},null,{"$f":"IF(H675=\"\",\"\",VLOOKUP(H675,#REF!,2,0))","v":""}]
[null,null,null,null,null,"",{"$f":"IF(D676=\"\",\"\",VLOOKUP(F676,'Plan Comptable '!$C$5:$D$554,2,0))","v":""},null,{"$f":"IF(H676=\"\",\"\",VLOOKUP(H676,#REF!,2,0))","v":""}]
[null,null,null,null,null,"",{"$f":"IF(D677=\"\",\"\",VLOOKUP(F677,'Plan Comptable '!$C$5:$D$554,2,0))","v":""},null,{"$f":"IF(H677=\"\",\"\",VLOOKUP(H677,#REF!,2,0))","v":""}]
[null,null,null,null,null,"",{"$f":"IF(D678=\"\",\"\",VLOOKUP(F678,'Plan Comptable '!$C$5:$D$554,2,0))","v":""},null,{"$f":"IF(H678=\"\",\"\",VLOOKUP(H678,#REF!,2,0))","v":""}]
[null,null,null,null,null,"",{"$f":"IF(D679=\"\",\"\",VLOOKUP(F679,'Plan Comptable '!$C$5:$D$554,2,0))","v":""},null,{"$f":"IF(H679=\"\",\"\",VLOOKUP(H679,#REF!,2,0))","v":""}]
[null,null,null,null,null,"",{"$f":"IF(D680=\"\",\"\",VLOOKUP(F680,'Plan Comptable '!$C$5:$D$554,2,0))","v":""},null,{"$f":"IF(H680=\"\",\"\",VLOOKUP(H680,#REF!,2,0))","v":""}]
[null,null,null,null,null,"",{"$f":"IF(D681=\"\",\"\",VLOOKUP(F681,'Plan Comptable '!$C$5:$D$554,2,0))","v":""},null,{"$f":"IF(H681=\"\",\"\",VLOOKUP(H681,#REF!,2,0))","v":""}]
[null,null,null,null,null,"",{"$f":"IF(D682=\"\",\"\",VLOOKUP(F682,'Plan Comptable '!$C$5:$D$554,2,0))","v":""},null,{"$f":"IF(H682=\"\",\"\",VLOOKUP(H682,#REF!,2,0))","v":""}]
[null,null,null,null,null,"",{"$f":"IF(D683=\"\",\"\",VLOOKUP(F683,'Plan Comptable '!$C$5:$D$554,2,0))","v":""},null,{"$f":"IF(H683=\"\",\"\",VLOOKUP(H683,#REF!,2,0))","v":""}]
[null,null,null,null,null,"",{"$f":"IF(D684=\"\",\"\",VLOOKUP(F684,'Plan Comptable '!$C$5:$D$554,2,0))","v":""},null,{"$f":"IF(H684=\"\",\"\",VLOOKUP(H684,#REF!,2,0))","v":""}]
[null,null,null,null,null,"",{"$f":"IF(D685=\"\",\"\",VLOOKUP(F685,'Plan Comptable '!$C$5:$D$554,2,0))","v":""},null,{"$f":"IF(H685=\"\",\"\",VLOOKUP(H685,#REF!,2,0))","v":""}]
[null,null,null,null,null,"",{"$f":"IF(D686=\"\",\"\",VLOOKUP(F686,'Plan Comptable '!$C$5:$D$554,2,0))","v":""},null,{"$f":"IF(H686=\"\",\"\",VLOOKUP(H686,#REF!,2,0))","v":""}]
[null,null,null,null,null,"",{"$f":"IF(D687=\"\",\"\",VLOOKUP(F687,'Plan Comptable '!$C$5:$D$554,2,0))","v":""},null,{"$f":"IF(H687=\"\",\"\",VLOOKUP(H687,#REF!,2,0))","v":""}]
[null,null,null,null,null,"",{"$f":"IF(D688=\"\",\"\",VLOOKUP(F688,'Plan Comptable '!$C$5:$D$554,2,0))","v":""},null,{"$f":"IF(H688=\"\",\"\",VLOOKUP(H688,#REF!,2,0))","v":""}]
[null,null,null,null,null,"",{"$f":"IF(D689=\"\",\"\",VLOOKUP(F689,'Plan Comptable '!$C$5:$D$554,2,0))","v":""},null,{"$f":"IF(H689=\"\",\"\",VLOOKUP(H689,#REF!,2,0))","v":""}]
[null,null,null,null,null,"",{"$f":"IF(D690=\"\",\"\",VLOOKUP(F690,'Plan Comptable '!$C$5:$D$554,2,0))","v":""},null,{"$f":"IF(H690=\"\",\"\",VLOOKUP(H690,#REF!,2,0))","v":""}]
[null,null,null,null,null,"",{"$f":"IF(D691=\"\",\"\",VLOOKUP(F691,'Plan Comptable '!$C$5:$D$554,2,0))","v":""},null,{"$f":"IF(H691=\"\",\"\",VLOOKUP(H691,#REF!,2,0))","v":""}]
[null,null,null,null,null,"",{"$f":"IF(D692=\"\",\"\",VLOOKUP(F692,'Plan Comptable '!$C$5:$D$554,2,0))","v":""},null,{"$f":"IF(H692=\"\",\"\",VLOOKUP(H692,#REF!,2,0))","v":""}]
[null,null,null,null,null,"",{"$f":"IF(D693=\"\",\"\",VLOOKUP(F693,'Plan Comptable '!$C$5:$D$554,2,0))","v":""},null,{"$f":"IF(H693=\"\",\"\",VLOOKUP(H693,#REF!,2,0))","v":""}]
[null,null,null,null,null,"",{"$f":"IF(D694=\"\",\"\",VLOOKUP(F694,'Plan Comptable '!$C$5:$D$554,2,0))","v":""},null,{"$f":"IF(H694=\"\",\"\",VLOOKUP(H694,#REF!,2,0))","v":""}]
[null,null,null,null,null,"",{"$f":"IF(D695=\"\",\"\",VLOOKUP(F695,'Plan Comptable '!$C$5:$D$554,2,0))","v":""},null,{"$f":"IF(H695=\"\",\"\",VLOOKUP(H695,#REF!,2,0))","v":""}]
[null,null,null,null,null,"",{"$f":"IF(D696=\"\",\"\",VLOOKUP(F696,'Plan Comptable '!$C$5:$D$554,2,0))","v":""},null,{"$f":"IF(H696=\"\",\"\",VLOOKUP(H696,#REF!,2,0))","v":""}]
[null,null,null,null,null,"",{"$f":"IF(D697=\"\",\"\",VLOOKUP(F697,'Plan Comptable '!$C$5:$D$554,2,0))","v":""},null,{"$f":"IF(H697=\"\",\"\",VLOOKUP(H697,#REF!,2,0))","v":""}]
[null,null,null,null,null,"",{"$f":"IF(D698=\"\",\"\",VLOOKUP(F698,'Plan Comptable '!$C$5:$D$554,2,0))","v":""},null,{"$f":"IF(H698=\"\",\"\",VLOOKUP(H698,#REF!,2,0))","v":""}]
[null,null,null,null,null,"",{"$f":"IF(D699=\"\",\"\",VLOOKUP(F699,'Plan Comptable '!$C$5:$D$554,2,0))","v":""},null,{"$f":"IF(H699=\"\",\"\",VLOOKUP(H699,#REF!,2,0))","v":""}]
[null,null,null,null,null,"",{"$f":"IF(D700=\"\",\"\",VLOOKUP(F700,'Plan Comptable '!$C$5:$D$554,2,0))","v":""},null,{"$f":"IF(H700=\"\",\"\",VLOOKUP(H700,#REF!,2,0))","v":""}]
[null,null,null,null,null,"",{"$f":"IF(D701=\"\",\"\",VLOOKUP(F701,'Plan Comptable '!$C$5:$D$554,2,0))","v":""},null,{"$f":"IF(H701=\"\",\"\",VLOOKUP(H701,#REF!,2,0))","v":""}]
[null,null,null,null,null,"",{"$f":"IF(D702=\"\",\"\",VLOOKUP(F702,'Plan Comptable '!$C$5:$D$554,2,0))","v":""},null,{"$f":"IF(H702=\"\",\"\",VLOOKUP(H702,#REF!,2,0))","v":""}]
[null,null,null,null,null,"",{"$f":"IF(D703=\"\",\"\",VLOOKUP(F703,'Plan Comptable '!$C$5:$D$554,2,0))","v":""},null,{"$f":"IF(H703=\"\",\"\",VLOOKUP(H703,#REF!,2,0))","v":""}]
[null,null,null,null,null,"",{"$f":"IF(D704=\"\",\"\",VLOOKUP(F704,'Plan Comptable '!$C$5:$D$554,2,0))","v":""},null,{"$f":"IF(H704=\"\",\"\",VLOOKUP(H704,#REF!,2,0))","v":""}]
[null,null,null,null,null,"",{"$f":"IF(D705=\"\",\"\",VLOOKUP(F705,'Plan Comptable '!$C$5:$D$554,2,0))","v":""},null,{"$f":"IF(H705=\"\",\"\",VLOOKUP(H705,#REF!,2,0))","v":""}]
[null,null,null,null,null,"",{"$f":"IF(D706=\"\",\"\",VLOOKUP(F706,'Plan Comptable '!$C$5:$D$554,2,0))","v":""},null,{"$f":"IF(H706=\"\",\"\",VLOOKUP(H706,#REF!,2,0))","v":""}]
[null,null,null,null,null,"",{"$f":"IF(D707=\"\",\"\",VLOOKUP(F707,'Plan Comptable '!$C$5:$D$554,2,0))","v":""},null,{"$f":"IF(H707=\"\",\"\",VLOOKUP(H707,#REF!,2,0))","v":""}]
[null,null,null,null,null,"",{"$f":"IF(D708=\"\",\"\",VLOOKUP(F708,'Plan Comptable '!$C$5:$D$554,2,0))","v":""},null,{"$f":"IF(H708=\"\",\"\",VLOOKUP(H708,#REF!,2,0))","v":""}]
[null,null,null,null,null,"",{"$f":"IF(D709=\"\",\"\",VLOOKUP(F709,'Plan Comptable '!$C$5:$D$554,2,0))","v":""},null,{"$f":"IF(H709=\"\",\"\",VLOOKUP(H709,#REF!,2,0))","v":""}]
[null,null,null,null,null,"",{"$f":"IF(D710=\"\",\"\",VLOOKUP(F710,'Plan Comptable '!$C$5:$D$554,2,0))","v":""},null,{"$f":"IF(H710=\"\",\"\",VLOOKUP(H710,#REF!,2,0))","v":""}]
[null,null,null,null,null,"",{"$f":"IF(D711=\"\",\"\",VLOOKUP(F711,'Plan Comptable '!$C$5:$D$554,2,0))","v":""},null,{"$f":"IF(H711=\"\",\"\",VLOOKUP(H711,#REF!,2,0))","v":""}]
[null,null,null,null,null,"",{"$f":"IF(D712=\"\",\"\",VLOOKUP(F712,'Plan Comptable '!$C$5:$D$554,2,0))","v":""},null,{"$f":"IF(H712=\"\",\"\",VLOOKUP(H712,#REF!,2,0))","v":""}]
[null,null,null,null,null,"",{"$f":"IF(D713=\"\",\"\",VLOOKUP(F713,'Plan Comptable '!$C$5:$D$554,2,0))","v":""},null,{"$f":"IF(H713=\"\",\"\",VLOOKUP(H713,#REF!,2,0))","v":""}]
[null,null,null,null,null,"",{"$f":"IF(D714=\"\",\"\",VLOOKUP(F714,'Plan Comptable '!$C$5:$D$554,2,0))","v":""},null,{"$f":"IF(H714=\"\",\"\",VLOOKUP(H714,#REF!,2,0))","v":""}]
[null,null,null,null,null,"",{"$f":"IF(D715=\"\",\"\",VLOOKUP(F715,'Plan Comptable '!$C$5:$D$554,2,0))","v":""},null,{"$f":"IF(H715=\"\",\"\",VLOOKUP(H715,#REF!,2,0))","v":""}]
[null,null,null,null,null,{"$f":"CONCATENATE(D716,E716)","v":""},{"$f":"IF(D716=\"\",\"\",VLOOKUP(F716,'Plan Comptable '!$C$5:$D$554,2,0))","v":""},null,{"$f":"IF(H716=\"\",\"\",VLOOKUP(H716,#REF!,2,0))","v":""}]
[null,null,null,null,null,"",{"$f":"IF(D717=\"\",\"\",VLOOKUP(F717,'Plan Comptable '!$C$5:$D$554,2,0))","v":""},null,{"$f":"IF(H717=\"\",\"\",VLOOKUP(H717,#REF!,2,0))","v":""}]
[null,null,null,null,null,"",{"$f":"IF(D718=\"\",\"\",VLOOKUP(F718,'Plan Comptable '!$C$5:$D$554,2,0))","v":""},null,{"$f":"IF(H718=\"\",\"\",VLOOKUP(H718,#REF!,2,0))","v":""}]
[null,null,null,null,null,"",{"$f":"IF(D719=\"\",\"\",VLOOKUP(F719,'Plan Comptable '!$C$5:$D$554,2,0))","v":""},null,{"$f":"IF(H719=\"\",\"\",VLOOKUP(H719,#REF!,2,0))","v":""}]
[null,null,null,null,null,"",{"$f":"IF(D720=\"\",\"\",VLOOKUP(F720,'Plan Comptable '!$C$5:$D$554,2,0))","v":""},null,{"$f":"IF(H720=\"\",\"\",VLOOKUP(H720,#REF!,2,0))","v":""}]
[null,null,null,null,null,"",{"$f":"IF(D721=\"\",\"\",VLOOKUP(F721,'Plan Comptable '!$C$5:$D$554,2,0))","v":""},null,{"$f":"IF(H721=\"\",\"\",VLOOKUP(H721,#REF!,2,0))","v":""}]
[null,null,null,null,null,"",{"$f":"IF(D722=\"\",\"\",VLOOKUP(F722,'Plan Comptable '!$C$5:$D$554,2,0))","v":""},null,{"$f":"IF(H722=\"\",\"\",VLOOKUP(H722,#REF!,2,0))","v":""}]
[null,null,null,null,null,"",{"$f":"IF(D723=\"\",\"\",VLOOKUP(F723,'Plan Comptable '!$C$5:$D$554,2,0))","v":""},null,{"$f":"IF(H723=\"\",\"\",VLOOKUP(H723,#REF!,2,0))","v":""}]
[null,null,null,null,null,"",{"$f":"IF(D724=\"\",\"\",VLOOKUP(F724,'Plan Comptable '!$C$5:$D$554,2,0))","v":""},null,{"$f":"IF(H724=\"\",\"\",VLOOKUP(H724,#REF!,2,0))","v":""}]
[null,null,null,null,null,"",{"$f":"IF(D725=\"\",\"\",VLOOKUP(F725,'Plan Comptable '!$C$5:$D$554,2,0))","v":""},null,{"$f":"IF(H725=\"\",\"\",VLOOKUP(H725,#REF!,2,0))","v":""}]
[null,null,null,null,null,"",{"$f":"IF(D726=\"\",\"\",VLOOKUP(F726,'Plan Comptable '!$C$5:$D$554,2,0))","v":""},null,{"$f":"IF(H726=\"\",\"\",VLOOKUP(H726,#REF!,2,0))","v":""}]
[null,null,null,null,null,"",{"$f":"IF(D727=\"\",\"\",VLOOKUP(F727,'Plan Comptable '!$C$5:$D$554,2,0))","v":""},null,{"$f":"IF(H727=\"\",\"\",VLOOKUP(H727,#REF!,2,0))","v":""}]
[null,null,null,null,null,"",{"$f":"IF(D728=\"\",\"\",VLOOKUP(F728,'Plan Comptable '!$C$5:$D$554,2,0))","v":""},null,{"$f":"IF(H728=\"\",\"\",VLOOKUP(H728,#REF!,2,0))","v":""}]
[null,null,null,null,null,"",{"$f":"IF(D729=\"\",\"\",VLOOKUP(F729,'Plan Comptable '!$C$5:$D$554,2,0))","v":""},null,{"$f":"IF(H729=\"\",\"\",VLOOKUP(H729,#REF!,2,0))","v":""}]
[null,null,null,null,null,"",{"$f":"IF(D730=\"\",\"\",VLOOKUP(F730,'Plan Comptable '!$C$5:$D$554,2,0))","v":""},null,{"$f":"IF(H730=\"\",\"\",VLOOKUP(H730,#REF!,2,0))","v":""}]
[null,null,null,null,null,"",{"$f":"IF(D731=\"\",\"\",VLOOKUP(F731,'Plan Comptable '!$C$5:$D$554,2,0))","v":""},null,{"$f":"IF(H731=\"\",\"\",VLOOKUP(H731,#REF!,2,0))","v":""}]
[null,null,null,null,null,"",{"$f":"IF(D732=\"\",\"\",VLOOKUP(F732,'Plan Comptable '!$C$5:$D$554,2,0))","v":""},null,{"$f":"IF(H732=\"\",\"\",VLOOKUP(H732,#REF!,2,0))","v":""}]
[null,null,null,null,null,"",{"$f":"IF(D733=\"\",\"\",VLOOKUP(F733,'Plan Comptable '!$C$5:$D$554,2,0))","v":""},null,{"$f":"IF(H733=\"\",\"\",VLOOKUP(H733,#REF!,2,0))","v":""}]
[null,null,null,null,null,"",{"$f":"IF(D734=\"\",\"\",VLOOKUP(F734,'Plan Comptable '!$C$5:$D$554,2,0))","v":""},null,{"$f":"IF(H734=\"\",\"\",VLOOKUP(H734,#REF!,2,0))","v":""}]
[null,null,null,null,null,"",{"$f":"IF(D735=\"\",\"\",VLOOKUP(F735,'Plan Comptable '!$C$5:$D$554,2,0))","v":""},null,{"$f":"IF(H735=\"\",\"\",VLOOKUP(H735,#REF!,2,0))","v":""}]
[null,null,null,null,null,"",{"$f":"IF(D736=\"\",\"\",VLOOKUP(F736,'Plan Comptable '!$C$5:$D$554,2,0))","v":""},null,{"$f":"IF(H736=\"\",\"\",VLOOKUP(H736,#REF!,2,0))","v":""}]
[null,null,null,null,null,"",{"$f":"IF(D737=\"\",\"\",VLOOKUP(F737,'Plan Comptable '!$C$5:$D$554,2,0))","v":""},null,{"$f":"IF(H737=\"\",\"\",VLOOKUP(H737,#REF!,2,0))","v":""}]
[null,null,null,null,null,"",{"$f":"IF(D738=\"\",\"\",VLOOKUP(F738,'Plan Comptable '!$C$5:$D$554,2,0))","v":""},null,{"$f":"IF(H738=\"\",\"\",VLOOKUP(H738,#REF!,2,0))","v":""}]
[null,null,null,null,null,"",{"$f":"IF(D739=\"\",\"\",VLOOKUP(F739,'Plan Comptable '!$C$5:$D$554,2,0))","v":""},null,{"$f":"IF(H739=\"\",\"\",VLOOKUP(H739,#REF!,2,0))","v":""}]
[null,null,null,null,null,"",{"$f":"IF(D740=\"\",\"\",VLOOKUP(F740,'Plan Comptable '!$C$5:$D$554,2,0))","v":""},null,{"$f":"IF(H740=\"\",\"\",VLOOKUP(H740,#REF!,2,0))","v":""}]
[null,null,null,null,null,"",{"$f":"IF(D741=\"\",\"\",VLOOKUP(F741,'Plan Comptable '!$C$5:$D$554,2,0))","v":""},null,{"$f":"IF(H741=\"\",\"\",VLOOKUP(H741,#REF!,2,0))","v":""}]
[null,null,null,null,null,"",{"$f":"IF(D742=\"\",\"\",VLOOKUP(F742,'Plan Comptable '!$C$5:$D$554,2,0))","v":""},null,{"$f":"IF(H742=\"\",\"\",VLOOKUP(H742,#REF!,2,0))","v":""}]
[null,null,null,null,null,"",{"$f":"IF(D743=\"\",\"\",VLOOKUP(F743,'Plan Comptable '!$C$5:$D$554,2,0))","v":""},null,{"$f":"IF(H743=\"\",\"\",VLOOKUP(H743,#REF!,2,0))","v":""}]
[null,null,null,null,null,"",{"$f":"IF(D744=\"\",\"\",VLOOKUP(F744,'Plan Comptable '!$C$5:$D$554,2,0))","v":""},null,{"$f":"IF(H744=\"\",\"\",VLOOKUP(H744,#REF!,2,0))","v":""}]
[null,null,null,null,null,"",{"$f":"IF(D745=\"\",\"\",VLOOKUP(F745,'Plan Comptable '!$C$5:$D$554,2,0))","v":""},null,{"$f":"IF(H745=\"\",\"\",VLOOKUP(H745,#REF!,2,0))","v":""}]
[null,null,null,null,null,"",{"$f":"IF(D746=\"\",\"\",VLOOKUP(F746,'Plan Comptable '!$C$5:$D$554,2,0))","v":""},null,{"$f":"IF(H746=\"\",\"\",VLOOKUP(H746,#REF!,2,0))","v":""}]
[null,null,null,null,null,"",{"$f":"IF(D747=\"\",\"\",VLOOKUP(F747,'Plan Comptable '!$C$5:$D$554,2,0))","v":""},null,{"$f":"IF(H747=\"\",\"\",VLOOKUP(H747,#REF!,2,0))","v":""}]
[null,null,null,null,null,"",{"$f":"IF(D748=\"\",\"\",VLOOKUP(F748,'Plan Comptable '!$C$5:$D$554,2,0))","v":""},null,{"$f":"IF(H748=\"\",\"\",VLOOKUP(H748,#REF!,2,0))","v":""}]
[null,null,null,null,null,"",{"$f":"IF(D749=\"\",\"\",VLOOKUP(F749,'Plan Comptable '!$C$5:$D$554,2,0))","v":""},null,{"$f":"IF(H749=\"\",\"\",VLOOKUP(H749,#REF!,2,0))","v":""}]
[null,null,null,null,null,"",{"$f":"IF(D750=\"\",\"\",VLOOKUP(F750,'Plan Comptable '!$C$5:$D$554,2,0))","v":""},null,{"$f":"IF(H750=\"\",\"\",VLOOKUP(H750,#REF!,2,0))","v":""}]
[null,null,null,null,null,"",{"$f":"IF(D751=\"\",\"\",VLOOKUP(F751,'Plan Comptable '!$C$5:$D$554,2,0))","v":""},null,{"$f":"IF(H751=\"\",\"\",VLOOKUP(H751,#REF!,2,0))","v":""}]
[null,null,null,null,null,"",{"$f":"IF(D752=\"\",\"\",VLOOKUP(F752,'Plan Comptable '!$C$5:$D$554,2,0))","v":""},null,{"$f":"IF(H752=\"\",\"\",VLOOKUP(H752,#REF!,2,0))","v":""}]
[null,null,null,null,null,"",{"$f":"IF(D753=\"\",\"\",VLOOKUP(F753,'Plan Comptable '!$C$5:$D$554,2,0))","v":""},null,{"$f":"IF(H753=\"\",\"\",VLOOKUP(H753,#REF!,2,0))","v":""}]
[null,null,null,null,null,"",{"$f":"IF(D754=\"\",\"\",VLOOKUP(F754,'Plan Comptable '!$C$5:$D$554,2,0))","v":""},null,{"$f":"IF(H754=\"\",\"\",VLOOKUP(H754,#REF!,2,0))","v":""}]
[null,null,null,null,null,"",{"$f":"IF(D755=\"\",\"\",VLOOKUP(F755,'Plan Comptable '!$C$5:$D$554,2,0))","v":""},null,{"$f":"IF(H755=\"\",\"\",VLOOKUP(H755,#REF!,2,0))","v":""}]
[null,null,null,null,null,"",{"$f":"IF(D756=\"\",\"\",VLOOKUP(F756,'Plan Comptable '!$C$5:$D$554,2,0))","v":""},null,{"$f":"IF(H756=\"\",\"\",VLOOKUP(H756,#REF!,2,0))","v":""}]
[null,null,null,null,null,"",{"$f":"IF(D757=\"\",\"\",VLOOKUP(F757,'Plan Comptable '!$C$5:$D$554,2,0))","v":""},null,{"$f":"IF(H757=\"\",\"\",VLOOKUP(H757,#REF!,2,0))","v":""}]
[null,null,null,null,null,"",{"$f":"IF(D758=\"\",\"\",VLOOKUP(F758,'Plan Comptable '!$C$5:$D$554,2,0))","v":""},null,{"$f":"IF(H758=\"\",\"\",VLOOKUP(H758,#REF!,2,0))","v":""}]
[null,null,null,null,null,"",{"$f":"IF(D759=\"\",\"\",VLOOKUP(F759,'Plan Comptable '!$C$5:$D$554,2,0))","v":""},null,{"$f":"IF(H759=\"\",\"\",VLOOKUP(H759,#REF!,2,0))","v":""}]
[null,null,null,null,null,"",{"$f":"IF(D760=\"\",\"\",VLOOKUP(F760,'Plan Comptable '!$C$5:$D$554,2,0))","v":""},null,{"$f":"IF(H760=\"\",\"\",VLOOKUP(H760,#REF!,2,0))","v":""}]
[null,null,null,null,null,"",{"$f":"IF(D761=\"\",\"\",VLOOKUP(F761,'Plan Comptable '!$C$5:$D$554,2,0))","v":""},null,{"$f":"IF(H761=\"\",\"\",VLOOKUP(H761,#REF!,2,0))","v":""}]
[null,null,null,null,null,"",{"$f":"IF(D762=\"\",\"\",VLOOKUP(F762,'Plan Comptable '!$C$5:$D$554,2,0))","v":""},null,{"$f":"IF(H762=\"\",\"\",VLOOKUP(H762,#REF!,2,0))","v":""}]
[null,null,null,null,null,"",{"$f":"IF(D763=\"\",\"\",VLOOKUP(F763,'Plan Comptable '!$C$5:$D$554,2,0))","v":""},null,{"$f":"IF(H763=\"\",\"\",VLOOKUP(H763,#REF!,2,0))","v":""}]
[null,null,null,null,null,"",{"$f":"IF(D764=\"\",\"\",VLOOKUP(F764,'Plan Comptable '!$C$5:$D$554,2,0))","v":""},null,{"$f":"IF(H764=\"\",\"\",VLOOKUP(H764,#REF!,2,0))","v":""}]
[null,null,null,null,null,"",{"$f":"IF(D765=\"\",\"\",VLOOKUP(F765,'Plan Comptable '!$C$5:$D$554,2,0))","v":""},null,{"$f":"IF(H765=\"\",\"\",VLOOKUP(H765,#REF!,2,0))","v":""}]
[null,null,null,null,null,"",{"$f":"IF(D766=\"\",\"\",VLOOKUP(F766,'Plan Comptable '!$C$5:$D$554,2,0))","v":""},null,{"$f":"IF(H766=\"\",\"\",VLOOKUP(H766,#REF!,2,0))","v":""}]
[null,null,null,null,null,"",{"$f":"IF(D767=\"\",\"\",VLOOKUP(F767,'Plan Comptable '!$C$5:$D$554,2,0))","v":""},null,{"$f":"IF(H767=\"\",\"\",VLOOKUP(H767,#REF!,2,0))","v":""}]
[null,null,null,null,null,"",{"$f":"IF(D768=\"\",\"\",VLOOKUP(F768,'Plan Comptable '!$C$5:$D$554,2,0))","v":""},null,{"$f":"IF(H768=\"\",\"\",VLOOKUP(H768,#REF!,2,0))","v":""}]
[null,null,null,null,null,"",{"$f":"IF(D769=\"\",\"\",VLOOKUP(F769,'Plan Comptable '!$C$5:$D$554,2,0))","v":""},null,{"$f":"IF(H769=\"\",\"\",VLOOKUP(H769,#REF!,2,0))","v":""}]
[null,null,null,null,null,"",{"$f":"IF(D770=\"\",\"\",VLOOKUP(F770,'Plan Comptable '!$C$5:$D$554,2,0))","v":""},null,{"$f":"IF(H770=\"\",\"\",VLOOKUP(H770,#REF!,2,0))","v":""}]
[null,null,null,null,null,"",{"$f":"IF(D771=\"\",\"\",VLOOKUP(F771,'Plan Comptable '!$C$5:$D$554,2,0))","v":""},null,{"$f":"IF(H771=\"\",\"\",VLOOKUP(H771,#REF!,2,0))","v":""}]
[null,null,null,null,null,"",{"$f":"IF(D772=\"\",\"\",VLOOKUP(F772,'Plan Comptable '!$C$5:$D$554,2,0))","v":""},null,{"$f":"IF(H772=\"\",\"\",VLOOKUP(H772,#REF!,2,0))","v":""}]
[null,null,null,null,null,"",{"$f":"IF(D773=\"\",\"\",VLOOKUP(F773,'Plan Comptable '!$C$5:$D$554,2,0))","v":""},null,{"$f":"IF(H773=\"\",\"\",VLOOKUP(H773,#REF!,2,0))","v":""}]
[null,null,null,null,null,"",{"$f":"IF(D774=\"\",\"\",VLOOKUP(F774,'Plan Comptable '!$C$5:$D$554,2,0))","v":""},null,{"$f":"IF(H774=\"\",\"\",VLOOKUP(H774,#REF!,2,0))","v":""}]
[null,null,null,null,null,"",{"$f":"IF(D775=\"\",\"\",VLOOKUP(F775,'Plan Comptable '!$C$5:$D$554,2,0))","v":""},null,{"$f":"IF(H775=\"\",\"\",VLOOKUP(H775,#REF!,2,0))","v":""}]
[null,null,null,null,null,"",{"$f":"IF(D776=\"\",\"\",VLOOKUP(F776,'Plan Comptable '!$C$5:$D$554,2,0))","v":""},null,{"$f":"IF(H776=\"\",\"\",VLOOKUP(H776,#REF!,2,0))","v":""}]
[null,null,null,null,null,"",{"$f":"IF(D777=\"\",\"\",VLOOKUP(F777,'Plan Comptable '!$C$5:$D$554,2,0))","v":""},null,{"$f":"IF(H777=\"\",\"\",VLOOKUP(H777,#REF!,2,0))","v":""}]
[null,null,null,null,null,"",{"$f":"IF(D778=\"\",\"\",VLOOKUP(F778,'Plan Comptable '!$C$5:$D$554,2,0))","v":""},null,{"$f":"IF(H778=\"\",\"\",VLOOKUP(H778,#REF!,2,0))","v":""}]
[null,null,null,null,null,"",{"$f":"IF(D779=\"\",\"\",VLOOKUP(F779,'Plan Comptable '!$C$5:$D$554,2,0))","v":""},null,{"$f":"IF(H779=\"\",\"\",VLOOKUP(H779,#REF!,2,0))","v":""}]
[null,null,null,null,null,{"$f":"CONCATENATE(D780,E780)","v":""},{"$f":"IF(D780=\"\",\"\",VLOOKUP(F780,'Plan Comptable '!$C$5:$D$554,2,0))","v":""},null,{"$f":"IF(H780=\"\",\"\",VLOOKUP(H780,#REF!,2,0))","v":""}]
[null,null,null,null,null,"",{"$f":"IF(D781=\"\",\"\",VLOOKUP(F781,'Plan Comptable '!$C$5:$D$554,2,0))","v":""},null,{"$f":"IF(H781=\"\",\"\",VLOOKUP(H781,#REF!,2,0))","v":""}]
[null,null,null,null,null,"",{"$f":"IF(D782=\"\",\"\",VLOOKUP(F782,'Plan Comptable '!$C$5:$D$554,2,0))","v":""},null,{"$f":"IF(H782=\"\",\"\",VLOOKUP(H782,#REF!,2,0))","v":""}]
[null,null,null,null,null,"",{"$f":"IF(D783=\"\",\"\",VLOOKUP(F783,'Plan Comptable '!$C$5:$D$554,2,0))","v":""},null,{"$f":"IF(H783=\"\",\"\",VLOOKUP(H783,#REF!,2,0))","v":""}]
[null,null,null,null,null,"",{"$f":"IF(D784=\"\",\"\",VLOOKUP(F784,'Plan Comptable '!$C$5:$D$554,2,0))","v":""},null,{"$f":"IF(H784=\"\",\"\",VLOOKUP(H784,#REF!,2,0))","v":""}]
[null,null,null,null,null,"",{"$f":"IF(D785=\"\",\"\",VLOOKUP(F785,'Plan Comptable '!$C$5:$D$554,2,0))","v":""},null,{"$f":"IF(H785=\"\",\"\",VLOOKUP(H785,#REF!,2,0))","v":""}]
[null,null,null,null,null,"",{"$f":"IF(D786=\"\",\"\",VLOOKUP(F786,'Plan Comptable '!$C$5:$D$554,2,0))","v":""},null,{"$f":"IF(H786=\"\",\"\",VLOOKUP(H786,#REF!,2,0))","v":""}]
[null,null,null,null,null,"",{"$f":"IF(D787=\"\",\"\",VLOOKUP(F787,'Plan Comptable '!$C$5:$D$554,2,0))","v":""},null,{"$f":"IF(H787=\"\",\"\",VLOOKUP(H787,#REF!,2,0))","v":""}]
[null,null,null,null,null,"",{"$f":"IF(D788=\"\",\"\",VLOOKUP(F788,'Plan Comptable '!$C$5:$D$554,2,0))","v":""},null,{"$f":"IF(H788=\"\",\"\",VLOOKUP(H788,#REF!,2,0))","v":""}]
[null,null,null,null,null,"",{"$f":"IF(D789=\"\",\"\",VLOOKUP(F789,'Plan Comptable '!$C$5:$D$554,2,0))","v":""},null,{"$f":"IF(H789=\"\",\"\",VLOOKUP(H789,#REF!,2,0))","v":""}]
[null,null,null,null,null,"",{"$f":"IF(D790=\"\",\"\",VLOOKUP(F790,'Plan Comptable '!$C$5:$D$554,2,0))","v":""},null,{"$f":"IF(H790=\"\",\"\",VLOOKUP(H790,#REF!,2,0))","v":""}]
[null,null,null,null,null,"",{"$f":"IF(D791=\"\",\"\",VLOOKUP(F791,'Plan Comptable '!$C$5:$D$554,2,0))","v":""},null,{"$f":"IF(H791=\"\",\"\",VLOOKUP(H791,#REF!,2,0))","v":""}]
[null,null,null,null,null,"",{"$f":"IF(D792=\"\",\"\",VLOOKUP(F792,'Plan Comptable '!$C$5:$D$554,2,0))","v":""},null,{"$f":"IF(H792=\"\",\"\",VLOOKUP(H792,#REF!,2,0))","v":""}]
[null,null,null,null,null,"",{"$f":"IF(D793=\"\",\"\",VLOOKUP(F793,'Plan Comptable '!$C$5:$D$554,2,0))","v":""},null,{"$f":"IF(H793=\"\",\"\",VLOOKUP(H793,#REF!,2,0))","v":""}]
[null,null,null,null,null,"",{"$f":"IF(D794=\"\",\"\",VLOOKUP(F794,'Plan Comptable '!$C$5:$D$554,2,0))","v":""},null,{"$f":"IF(H794=\"\",\"\",VLOOKUP(H794,#REF!,2,0))","v":""}]
[null,null,null,null,null,"",{"$f":"IF(D795=\"\",\"\",VLOOKUP(F795,'Plan Comptable '!$C$5:$D$554,2,0))","v":""},null,{"$f":"IF(H795=\"\",\"\",VLOOKUP(H795,#REF!,2,0))","v":""}]
[null,null,null,null,null,"",{"$f":"IF(D796=\"\",\"\",VLOOKUP(F796,'Plan Comptable '!$C$5:$D$554,2,0))","v":""},null,{"$f":"IF(H796=\"\",\"\",VLOOKUP(H796,#REF!,2,0))","v":""}]
[null,null,null,null,null,"",{"$f":"IF(D797=\"\",\"\",VLOOKUP(F797,'Plan Comptable '!$C$5:$D$554,2,0))","v":""},null,{"$f":"IF(H797=\"\",\"\",VLOOKUP(H797,#REF!,2,0))","v":""}]
[null,null,null,null,null,"",{"$f":"IF(D798=\"\",\"\",VLOOKUP(F798,'Plan Comptable '!$C$5:$D$554,2,0))","v":""},null,{"$f":"IF(H798=\"\",\"\",VLOOKUP(H798,#REF!,2,0))","v":""}]
[null,null,null,null,null,"",{"$f":"IF(D799=\"\",\"\",VLOOKUP(F799,'Plan Comptable '!$C$5:$D$554,2,0))","v":""},null,{"$f":"IF(H799=\"\",\"\",VLOOKUP(H799,#REF!,2,0))","v":""}]
[null,null,null,null,null,"",{"$f":"IF(D800=\"\",\"\",VLOOKUP(F800,'Plan Comptable '!$C$5:$D$554,2,0))","v":""},null,{"$f":"IF(H800=\"\",\"\",VLOOKUP(H800,#REF!,2,0))","v":""}]
[null,null,null,null,null,"",{"$f":"IF(D801=\"\",\"\",VLOOKUP(F801,'Plan Comptable '!$C$5:$D$554,2,0))","v":""},null,{"$f":"IF(H801=\"\",\"\",VLOOKUP(H801,#REF!,2,0))","v":""}]
[null,null,null,null,null,"",{"$f":"IF(D802=\"\",\"\",VLOOKUP(F802,'Plan Comptable '!$C$5:$D$554,2,0))","v":""},null,{"$f":"IF(H802=\"\",\"\",VLOOKUP(H802,#REF!,2,0))","v":""}]
[null,null,null,null,null,"",{"$f":"IF(D803=\"\",\"\",VLOOKUP(F803,'Plan Comptable '!$C$5:$D$554,2,0))","v":""},null,{"$f":"IF(H803=\"\",\"\",VLOOKUP(H803,#REF!,2,0))","v":""}]
[null,null,null,null,null,"",{"$f":"IF(D804=\"\",\"\",VLOOKUP(F804,'Plan Comptable '!$C$5:$D$554,2,0))","v":""},null,{"$f":"IF(H804=\"\",\"\",VLOOKUP(H804,#REF!,2,0))","v":""}]
[null,null,null,null,null,"",{"$f":"IF(D805=\"\",\"\",VLOOKUP(F805,'Plan Comptable '!$C$5:$D$554,2,0))","v":""},null,{"$f":"IF(H805=\"\",\"\",VLOOKUP(H805,#REF!,2,0))","v":""}]
[null,null,null,null,null,"",{"$f":"IF(D806=\"\",\"\",VLOOKUP(F806,'Plan Comptable '!$C$5:$D$554,2,0))","v":""},null,{"$f":"IF(H806=\"\",\"\",VLOOKUP(H806,#REF!,2,0))","v":""}]
[null,null,null,null,null,"",{"$f":"IF(D807=\"\",\"\",VLOOKUP(F807,'Plan Comptable '!$C$5:$D$554,2,0))","v":""},null,{"$f":"IF(H807=\"\",\"\",VLOOKUP(H807,#REF!,2,0))","v":""}]
[null,null,null,null,null,"",{"$f":"IF(D808=\"\",\"\",VLOOKUP(F808,'Plan Comptable '!$C$5:$D$554,2,0))","v":""},null,{"$f":"IF(H808=\"\",\"\",VLOOKUP(H808,#REF!,2,0))","v":""}]
[null,null,null,null,null,"",{"$f":"IF(D809=\"\",\"\",VLOOKUP(F809,'Plan Comptable '!$C$5:$D$554,2,0))","v":""},null,{"$f":"IF(H809=\"\",\"\",VLOOKUP(H809,#REF!,2,0))","v":""}]
[null,null,null,null,null,"",{"$f":"IF(D810=\"\",\"\",VLOOKUP(F810,'Plan Comptable '!$C$5:$D$554,2,0))","v":""},null,{"$f":"IF(H810=\"\",\"\",VLOOKUP(H810,#REF!,2,0))","v":""}]
[null,null,null,null,null,"",{"$f":"IF(D811=\"\",\"\",VLOOKUP(F811,'Plan Comptable '!$C$5:$D$554,2,0))","v":""},null,{"$f":"IF(H811=\"\",\"\",VLOOKUP(H811,#REF!,2,0))","v":""}]
[null,null,null,null,null,"",{"$f":"IF(D812=\"\",\"\",VLOOKUP(F812,'Plan Comptable '!$C$5:$D$554,2,0))","v":""},null,{"$f":"IF(H812=\"\",\"\",VLOOKUP(H812,#REF!,2,0))","v":""}]
[null,null,null,null,null,"",{"$f":"IF(D813=\"\",\"\",VLOOKUP(F813,'Plan Comptable '!$C$5:$D$554,2,0))","v":""},null,{"$f":"IF(H813=\"\",\"\",VLOOKUP(H813,#REF!,2,0))","v":""}]
[null,null,null,null,null,"",{"$f":"IF(D814=\"\",\"\",VLOOKUP(F814,'Plan Comptable '!$C$5:$D$554,2,0))","v":""},null,{"$f":"IF(H814=\"\",\"\",VLOOKUP(H814,#REF!,2,0))","v":""}]
[null,null,null,null,null,"",{"$f":"IF(D815=\"\",\"\",VLOOKUP(F815,'Plan Comptable '!$C$5:$D$554,2,0))","v":""},null,{"$f":"IF(H815=\"\",\"\",VLOOKUP(H815,#REF!,2,0))","v":""}]
[null,null,null,null,null,"",{"$f":"IF(D816=\"\",\"\",VLOOKUP(F816,'Plan Comptable '!$C$5:$D$554,2,0))","v":""},null,{"$f":"IF(H816=\"\",\"\",VLOOKUP(H816,#REF!,2,0))","v":""}]
[null,null,null,null,null,"",{"$f":"IF(D817=\"\",\"\",VLOOKUP(F817,'Plan Comptable '!$C$5:$D$554,2,0))","v":""},null,{"$f":"IF(H817=\"\",\"\",VLOOKUP(H817,#REF!,2,0))","v":""}]
[null,null,null,null,null,"",{"$f":"IF(D818=\"\",\"\",VLOOKUP(F818,'Plan Comptable '!$C$5:$D$554,2,0))","v":""},null,{"$f":"IF(H818=\"\",\"\",VLOOKUP(H818,#REF!,2,0))","v":""}]
[null,null,null,null,null,"",{"$f":"IF(D819=\"\",\"\",VLOOKUP(F819,'Plan Comptable '!$C$5:$D$554,2,0))","v":""},null,{"$f":"IF(H819=\"\",\"\",VLOOKUP(H819,#REF!,2,0))","v":""}]
[null,null,null,null,null,"",{"$f":"IF(D820=\"\",\"\",VLOOKUP(F820,'Plan Comptable '!$C$5:$D$554,2,0))","v":""},null,{"$f":"IF(H820=\"\",\"\",VLOOKUP(H820,#REF!,2,0))","v":""}]
[null,null,null,null,null,"",{"$f":"IF(D821=\"\",\"\",VLOOKUP(F821,'Plan Comptable '!$C$5:$D$554,2,0))","v":""},null,{"$f":"IF(H821=\"\",\"\",VLOOKUP(H821,#REF!,2,0))","v":""}]
[null,null,null,null,null,"",{"$f":"IF(D822=\"\",\"\",VLOOKUP(F822,'Plan Comptable '!$C$5:$D$554,2,0))","v":""},null,{"$f":"IF(H822=\"\",\"\",VLOOKUP(H822,#REF!,2,0))","v":""}]
[null,null,null,null,null,"",{"$f":"IF(D823=\"\",\"\",VLOOKUP(F823,'Plan Comptable '!$C$5:$D$554,2,0))","v":""},null,{"$f":"IF(H823=\"\",\"\",VLOOKUP(H823,#REF!,2,0))","v":""}]
[null,null,null,null,null,"",{"$f":"IF(D824=\"\",\"\",VLOOKUP(F824,'Plan Comptable '!$C$5:$D$554,2,0))","v":""},null,{"$f":"IF(H824=\"\",\"\",VLOOKUP(H824,#REF!,2,0))","v":""}]
[null,null,null,null,null,"",{"$f":"IF(D825=\"\",\"\",VLOOKUP(F825,'Plan Comptable '!$C$5:$D$554,2,0))","v":""},null,{"$f":"IF(H825=\"\",\"\",VLOOKUP(H825,#REF!,2,0))","v":""}]
[null,null,null,null,null,"",{"$f":"IF(D826=\"\",\"\",VLOOKUP(F826,'Plan Comptable '!$C$5:$D$554,2,0))","v":""},null,{"$f":"IF(H826=\"\",\"\",VLOOKUP(H826,#REF!,2,0))","v":""}]
[null,null,null,null,null,"",{"$f":"IF(D827=\"\",\"\",VLOOKUP(F827,'Plan Comptable '!$C$5:$D$554,2,0))","v":""},null,{"$f":"IF(H827=\"\",\"\",VLOOKUP(H827,#REF!,2,0))","v":""}]
[null,null,null,null,null,"",{"$f":"IF(D828=\"\",\"\",VLOOKUP(F828,'Plan Comptable '!$C$5:$D$554,2,0))","v":""},null,{"$f":"IF(H828=\"\",\"\",VLOOKUP(H828,#REF!,2,0))","v":""}]
[null,null,null,null,null,"",{"$f":"IF(D829=\"\",\"\",VLOOKUP(F829,'Plan Comptable '!$C$5:$D$554,2,0))","v":""},null,{"$f":"IF(H829=\"\",\"\",VLOOKUP(H829,#REF!,2,0))","v":""}]
[null,null,null,null,null,"",{"$f":"IF(D830=\"\",\"\",VLOOKUP(F830,'Plan Comptable '!$C$5:$D$554,2,0))","v":""},null,{"$f":"IF(H830=\"\",\"\",VLOOKUP(H830,#REF!,2,0))","v":""}]
[null,null,null,null,null,"",{"$f":"IF(D831=\"\",\"\",VLOOKUP(F831,'Plan Comptable '!$C$5:$D$554,2,0))","v":""},null,{"$f":"IF(H831=\"\",\"\",VLOOKUP(H831,#REF!,2,0))","v":""}]
[null,null,null,null,null,"",{"$f":"IF(D832=\"\",\"\",VLOOKUP(F832,'Plan Comptable '!$C$5:$D$554,2,0))","v":""},null,{"$f":"IF(H832=\"\",\"\",VLOOKUP(H832,#REF!,2,0))","v":""}]
[null,null,null,null,null,"",{"$f":"IF(D833=\"\",\"\",VLOOKUP(F833,'Plan Comptable '!$C$5:$D$554,2,0))","v":""},null,{"$f":"IF(H833=\"\",\"\",VLOOKUP(H833,#REF!,2,0))","v":""}]
[null,null,null,null,null,"",{"$f":"IF(D834=\"\",\"\",VLOOKUP(F834,'Plan Comptable '!$C$5:$D$554,2,0))","v":""},null,{"$f":"IF(H834=\"\",\"\",VLOOKUP(H834,#REF!,2,0))","v":""}]
[null,null,null,null,null,"",{"$f":"IF(D835=\"\",\"\",VLOOKUP(F835,'Plan Comptable '!$C$5:$D$554,2,0))","v":""},null,{"$f":"IF(H835=\"\",\"\",VLOOKUP(H835,#REF!,2,0))","v":""}]
[null,null,null,null,null,"",{"$f":"IF(D836=\"\",\"\",VLOOKUP(F836,'Plan Comptable '!$C$5:$D$554,2,0))","v":""},null,{"$f":"IF(H836=\"\",\"\",VLOOKUP(H836,#REF!,2,0))","v":""}]
[null,null,null,null,null,"",{"$f":"IF(D837=\"\",\"\",VLOOKUP(F837,'Plan Comptable '!$C$5:$D$554,2,0))","v":""},null,{"$f":"IF(H837=\"\",\"\",VLOOKUP(H837,#REF!,2,0))","v":""}]
[null,null,null,null,null,"",{"$f":"IF(D838=\"\",\"\",VLOOKUP(F838,'Plan Comptable '!$C$5:$D$554,2,0))","v":""},null,{"$f":"IF(H838=\"\",\"\",VLOOKUP(H838,#REF!,2,0))","v":""}]
[null,null,null,null,null,"",{"$f":"IF(D839=\"\",\"\",VLOOKUP(F839,'Plan Comptable '!$C$5:$D$554,2,0))","v":""},null,{"$f":"IF(H839=\"\",\"\",VLOOKUP(H839,#REF!,2,0))","v":""}]
[null,null,null,null,null,"",{"$f":"IF(D840=\"\",\"\",VLOOKUP(F840,'Plan Comptable '!$C$5:$D$554,2,0))","v":""},null,{"$f":"IF(H840=\"\",\"\",VLOOKUP(H840,#REF!,2,0))","v":""}]
[null,null,null,null,null,"",{"$f":"IF(D841=\"\",\"\",VLOOKUP(F841,'Plan Comptable '!$C$5:$D$554,2,0))","v":""},null,{"$f":"IF(H841=\"\",\"\",VLOOKUP(H841,#REF!,2,0))","v":""}]
[null,null,null,null,null,"",{"$f":"IF(D842=\"\",\"\",VLOOKUP(F842,'Plan Comptable '!$C$5:$D$554,2,0))","v":""},null,{"$f":"IF(H842=\"\",\"\",VLOOKUP(H842,#REF!,2,0))","v":""}]
[null,null,null,null,null,"",{"$f":"IF(D843=\"\",\"\",VLOOKUP(F843,'Plan Comptable '!$C$5:$D$554,2,0))","v":""},null,{"$f":"IF(H843=\"\",\"\",VLOOKUP(H843,#REF!,2,0))","v":""}]
[null,null,null,null,null,{"$f":"CONCATENATE(D844,E844)","v":""},{"$f":"IF(D844=\"\",\"\",VLOOKUP(F844,'Plan Comptable '!$C$5:$D$554,2,0))","v":""},null,{"$f":"IF(H844=\"\",\"\",VLOOKUP(H844,#REF!,2,0))","v":""}]
[null,null,null,null,null,"",{"$f":"IF(D845=\"\",\"\",VLOOKUP(F845,'Plan Comptable '!$C$5:$D$554,2,0))","v":""},null,{"$f":"IF(H845=\"\",\"\",VLOOKUP(H845,#REF!,2,0))","v":""}]
[null,null,null,null,null,"",{"$f":"IF(D846=\"\",\"\",VLOOKUP(F846,'Plan Comptable '!$C$5:$D$554,2,0))","v":""},null,{"$f":"IF(H846=\"\",\"\",VLOOKUP(H846,#REF!,2,0))","v":""}]
[null,null,null,null,null,"",{"$f":"IF(D847=\"\",\"\",VLOOKUP(F847,'Plan Comptable '!$C$5:$D$554,2,0))","v":""},null,{"$f":"IF(H847=\"\",\"\",VLOOKUP(H847,#REF!,2,0))","v":""}]
[null,null,null,null,null,"",{"$f":"IF(D848=\"\",\"\",VLOOKUP(F848,'Plan Comptable '!$C$5:$D$554,2,0))","v":""},null,{"$f":"IF(H848=\"\",\"\",VLOOKUP(H848,#REF!,2,0))","v":""}]
[null,null,null,null,null,"",{"$f":"IF(D849=\"\",\"\",VLOOKUP(F849,'Plan Comptable '!$C$5:$D$554,2,0))","v":""},null,{"$f":"IF(H849=\"\",\"\",VLOOKUP(H849,#REF!,2,0))","v":""}]
[null,null,null,null,null,"",{"$f":"IF(D850=\"\",\"\",VLOOKUP(F850,'Plan Comptable '!$C$5:$D$554,2,0))","v":""},null,{"$f":"IF(H850=\"\",\"\",VLOOKUP(H850,#REF!,2,0))","v":""}]
[null,null,null,null,null,"",{"$f":"IF(D851=\"\",\"\",VLOOKUP(F851,'Plan Comptable '!$C$5:$D$554,2,0))","v":""},null,{"$f":"IF(H851=\"\",\"\",VLOOKUP(H851,#REF!,2,0))","v":""}]
[null,null,null,null,null,"",{"$f":"IF(D852=\"\",\"\",VLOOKUP(F852,'Plan Comptable '!$C$5:$D$554,2,0))","v":""},null,{"$f":"IF(H852=\"\",\"\",VLOOKUP(H852,#REF!,2,0))","v":""}]
[null,null,null,null,null,"",{"$f":"IF(D853=\"\",\"\",VLOOKUP(F853,'Plan Comptable '!$C$5:$D$554,2,0))","v":""},null,{"$f":"IF(H853=\"\",\"\",VLOOKUP(H853,#REF!,2,0))","v":""}]
[null,null,null,null,null,"",{"$f":"IF(D854=\"\",\"\",VLOOKUP(F854,'Plan Comptable '!$C$5:$D$554,2,0))","v":""},null,{"$f":"IF(H854=\"\",\"\",VLOOKUP(H854,#REF!,2,0))","v":""}]
[null,null,null,null,null,"",{"$f":"IF(D855=\"\",\"\",VLOOKUP(F855,'Plan Comptable '!$C$5:$D$554,2,0))","v":""},null,{"$f":"IF(H855=\"\",\"\",VLOOKUP(H855,#REF!,2,0))","v":""}]
[null,null,null,null,null,"",{"$f":"IF(D856=\"\",\"\",VLOOKUP(F856,'Plan Comptable '!$C$5:$D$554,2,0))","v":""},null,{"$f":"IF(H856=\"\",\"\",VLOOKUP(H856,#REF!,2,0))","v":""}]
[null,null,null,null,null,"",{"$f":"IF(D857=\"\",\"\",VLOOKUP(F857,'Plan Comptable '!$C$5:$D$554,2,0))","v":""},null,{"$f":"IF(H857=\"\",\"\",VLOOKUP(H857,#REF!,2,0))","v":""}]
[null,null,null,null,null,"",{"$f":"IF(D858=\"\",\"\",VLOOKUP(F858,'Plan Comptable '!$C$5:$D$554,2,0))","v":""},null,{"$f":"IF(H858=\"\",\"\",VLOOKUP(H858,#REF!,2,0))","v":""}]
[null,null,null,null,null,"",{"$f":"IF(D859=\"\",\"\",VLOOKUP(F859,'Plan Comptable '!$C$5:$D$554,2,0))","v":""},null,{"$f":"IF(H859=\"\",\"\",VLOOKUP(H859,#REF!,2,0))","v":""}]
[null,null,null,null,null,"",{"$f":"IF(D860=\"\",\"\",VLOOKUP(F860,'Plan Comptable '!$C$5:$D$554,2,0))","v":""},null,{"$f":"IF(H860=\"\",\"\",VLOOKUP(H860,#REF!,2,0))","v":""}]
[null,null,null,null,null,"",{"$f":"IF(D861=\"\",\"\",VLOOKUP(F861,'Plan Comptable '!$C$5:$D$554,2,0))","v":""},null,{"$f":"IF(H861=\"\",\"\",VLOOKUP(H861,#REF!,2,0))","v":""}]
[null,null,null,null,null,"",{"$f":"IF(D862=\"\",\"\",VLOOKUP(F862,'Plan Comptable '!$C$5:$D$554,2,0))","v":""},null,{"$f":"IF(H862=\"\",\"\",VLOOKUP(H862,#REF!,2,0))","v":""}]
[null,null,null,null,null,"",{"$f":"IF(D863=\"\",\"\",VLOOKUP(F863,'Plan Comptable '!$C$5:$D$554,2,0))","v":""},null,{"$f":"IF(H863=\"\",\"\",VLOOKUP(H863,#REF!,2,0))","v":""}]
[null,null,null,null,null,"",{"$f":"IF(D864=\"\",\"\",VLOOKUP(F864,'Plan Comptable '!$C$5:$D$554,2,0))","v":""},null,{"$f":"IF(H864=\"\",\"\",VLOOKUP(H864,#REF!,2,0))","v":""}]
[null,null,null,null,null,"",{"$f":"IF(D865=\"\",\"\",VLOOKUP(F865,'Plan Comptable '!$C$5:$D$554,2,0))","v":""},null,{"$f":"IF(H865=\"\",\"\",VLOOKUP(H865,#REF!,2,0))","v":""}]
[null,null,null,null,null,"",{"$f":"IF(D866=\"\",\"\",VLOOKUP(F866,'Plan Comptable '!$C$5:$D$554,2,0))","v":""},null,{"$f":"IF(H866=\"\",\"\",VLOOKUP(H866,#REF!,2,0))","v":""}]
[null,null,null,null,null,"",{"$f":"IF(D867=\"\",\"\",VLOOKUP(F867,'Plan Comptable '!$C$5:$D$554,2,0))","v":""},null,{"$f":"IF(H867=\"\",\"\",VLOOKUP(H867,#REF!,2,0))","v":""}]
[null,null,null,null,null,"",{"$f":"IF(D868=\"\",\"\",VLOOKUP(F868,'Plan Comptable '!$C$5:$D$554,2,0))","v":""},null,{"$f":"IF(H868=\"\",\"\",VLOOKUP(H868,#REF!,2,0))","v":""}]
[null,null,null,null,null,"",{"$f":"IF(D869=\"\",\"\",VLOOKUP(F869,'Plan Comptable '!$C$5:$D$554,2,0))","v":""},null,{"$f":"IF(H869=\"\",\"\",VLOOKUP(H869,#REF!,2,0))","v":""}]
[null,null,null,null,null,"",{"$f":"IF(D870=\"\",\"\",VLOOKUP(F870,'Plan Comptable '!$C$5:$D$554,2,0))","v":""},null,{"$f":"IF(H870=\"\",\"\",VLOOKUP(H870,#REF!,2,0))","v":""}]
[null,null,null,null,null,"",{"$f":"IF(D871=\"\",\"\",VLOOKUP(F871,'Plan Comptable '!$C$5:$D$554,2,0))","v":""},null,{"$f":"IF(H871=\"\",\"\",VLOOKUP(H871,#REF!,2,0))","v":""}]
[null,null,null,null,null,"",{"$f":"IF(D872=\"\",\"\",VLOOKUP(F872,'Plan Comptable '!$C$5:$D$554,2,0))","v":""},null,{"$f":"IF(H872=\"\",\"\",VLOOKUP(H872,#REF!,2,0))","v":""}]
[null,null,null,null,null,"",{"$f":"IF(D873=\"\",\"\",VLOOKUP(F873,'Plan Comptable '!$C$5:$D$554,2,0))","v":""},null,{"$f":"IF(H873=\"\",\"\",VLOOKUP(H873,#REF!,2,0))","v":""}]
[null,null,null,null,null,"",{"$f":"IF(D874=\"\",\"\",VLOOKUP(F874,'Plan Comptable '!$C$5:$D$554,2,0))","v":""},null,{"$f":"IF(H874=\"\",\"\",VLOOKUP(H874,#REF!,2,0))","v":""}]
[null,null,null,null,null,"",{"$f":"IF(D875=\"\",\"\",VLOOKUP(F875,'Plan Comptable '!$C$5:$D$554,2,0))","v":""},null,{"$f":"IF(H875=\"\",\"\",VLOOKUP(H875,#REF!,2,0))","v":""}]
[null,null,null,null,null,"",{"$f":"IF(D876=\"\",\"\",VLOOKUP(F876,'Plan Comptable '!$C$5:$D$554,2,0))","v":""},null,{"$f":"IF(H876=\"\",\"\",VLOOKUP(H876,#REF!,2,0))","v":""}]
[null,null,null,null,null,"",{"$f":"IF(D877=\"\",\"\",VLOOKUP(F877,'Plan Comptable '!$C$5:$D$554,2,0))","v":""},null,{"$f":"IF(H877=\"\",\"\",VLOOKUP(H877,#REF!,2,0))","v":""}]
[null,null,null,null,null,"",{"$f":"IF(D878=\"\",\"\",VLOOKUP(F878,'Plan Comptable '!$C$5:$D$554,2,0))","v":""},null,{"$f":"IF(H878=\"\",\"\",VLOOKUP(H878,#REF!,2,0))","v":""}]
[null,null,null,null,null,"",{"$f":"IF(D879=\"\",\"\",VLOOKUP(F879,'Plan Comptable '!$C$5:$D$554,2,0))","v":""},null,{"$f":"IF(H879=\"\",\"\",VLOOKUP(H879,#REF!,2,0))","v":""}]
[null,null,null,null,null,"",{"$f":"IF(D880=\"\",\"\",VLOOKUP(F880,'Plan Comptable '!$C$5:$D$554,2,0))","v":""},null,{"$f":"IF(H880=\"\",\"\",VLOOKUP(H880,#REF!,2,0))","v":""}]
[null,null,null,null,null,"",{"$f":"IF(D881=\"\",\"\",VLOOKUP(F881,'Plan Comptable '!$C$5:$D$554,2,0))","v":""},null,{"$f":"IF(H881=\"\",\"\",VLOOKUP(H881,#REF!,2,0))","v":""}]
[null,null,null,null,null,"",{"$f":"IF(D882=\"\",\"\",VLOOKUP(F882,'Plan Comptable '!$C$5:$D$554,2,0))","v":""},null,{"$f":"IF(H882=\"\",\"\",VLOOKUP(H882,#REF!,2,0))","v":""}]
[null,null,null,null,null,"",{"$f":"IF(D883=\"\",\"\",VLOOKUP(F883,'Plan Comptable '!$C$5:$D$554,2,0))","v":""},null,{"$f":"IF(H883=\"\",\"\",VLOOKUP(H883,#REF!,2,0))","v":""}]
[null,null,null,null,null,"",{"$f":"IF(D884=\"\",\"\",VLOOKUP(F884,'Plan Comptable '!$C$5:$D$554,2,0))","v":""},null,{"$f":"IF(H884=\"\",\"\",VLOOKUP(H884,#REF!,2,0))","v":""}]
[null,null,null,null,null,"",{"$f":"IF(D885=\"\",\"\",VLOOKUP(F885,'Plan Comptable '!$C$5:$D$554,2,0))","v":""},null,{"$f":"IF(H885=\"\",\"\",VLOOKUP(H885,#REF!,2,0))","v":""}]
[null,null,null,null,null,"",{"$f":"IF(D886=\"\",\"\",VLOOKUP(F886,'Plan Comptable '!$C$5:$D$554,2,0))","v":""},null,{"$f":"IF(H886=\"\",\"\",VLOOKUP(H886,#REF!,2,0))","v":""}]
[null,null,null,null,null,"",{"$f":"IF(D887=\"\",\"\",VLOOKUP(F887,'Plan Comptable '!$C$5:$D$554,2,0))","v":""},null,{"$f":"IF(H887=\"\",\"\",VLOOKUP(H887,#REF!,2,0))","v":""}]
[null,null,null,null,null,"",{"$f":"IF(D888=\"\",\"\",VLOOKUP(F888,'Plan Comptable '!$C$5:$D$554,2,0))","v":""},null,{"$f":"IF(H888=\"\",\"\",VLOOKUP(H888,#REF!,2,0))","v":""}]
[null,null,null,null,null,"",{"$f":"IF(D889=\"\",\"\",VLOOKUP(F889,'Plan Comptable '!$C$5:$D$554,2,0))","v":""},null,{"$f":"IF(H889=\"\",\"\",VLOOKUP(H889,#REF!,2,0))","v":""}]
[null,null,null,null,null,"",{"$f":"IF(D890=\"\",\"\",VLOOKUP(F890,'Plan Comptable '!$C$5:$D$554,2,0))","v":""},null,{"$f":"IF(H890=\"\",\"\",VLOOKUP(H890,#REF!,2,0))","v":""}]
[null,null,null,null,null,"",{"$f":"IF(D891=\"\",\"\",VLOOKUP(F891,'Plan Comptable '!$C$5:$D$554,2,0))","v":""},null,{"$f":"IF(H891=\"\",\"\",VLOOKUP(H891,#REF!,2,0))","v":""}]
[null,null,null,null,null,"",{"$f":"IF(D892=\"\",\"\",VLOOKUP(F892,'Plan Comptable '!$C$5:$D$554,2,0))","v":""},null,{"$f":"IF(H892=\"\",\"\",VLOOKUP(H892,#REF!,2,0))","v":""}]
[null,null,null,null,null,"",{"$f":"IF(D893=\"\",\"\",VLOOKUP(F893,'Plan Comptable '!$C$5:$D$554,2,0))","v":""},null,{"$f":"IF(H893=\"\",\"\",VLOOKUP(H893,#REF!,2,0))","v":""}]
[null,null,null,null,null,"",{"$f":"IF(D894=\"\",\"\",VLOOKUP(F894,'Plan Comptable '!$C$5:$D$554,2,0))","v":""},null,{"$f":"IF(H894=\"\",\"\",VLOOKUP(H894,#REF!,2,0))","v":""}]
[null,null,null,null,null,"",{"$f":"IF(D895=\"\",\"\",VLOOKUP(F895,'Plan Comptable '!$C$5:$D$554,2,0))","v":""},null,{"$f":"IF(H895=\"\",\"\",VLOOKUP(H895,#REF!,2,0))","v":""}]
[null,null,null,null,null,"",{"$f":"IF(D896=\"\",\"\",VLOOKUP(F896,'Plan Comptable '!$C$5:$D$554,2,0))","v":""},null,{"$f":"IF(H896=\"\",\"\",VLOOKUP(H896,#REF!,2,0))","v":""}]
[null,null,null,null,null,"",{"$f":"IF(D897=\"\",\"\",VLOOKUP(F897,'Plan Comptable '!$C$5:$D$554,2,0))","v":""},null,{"$f":"IF(H897=\"\",\"\",VLOOKUP(H897,#REF!,2,0))","v":""}]
[null,null,null,null,null,"",{"$f":"IF(D898=\"\",\"\",VLOOKUP(F898,'Plan Comptable '!$C$5:$D$554,2,0))","v":""},null,{"$f":"IF(H898=\"\",\"\",VLOOKUP(H898,#REF!,2,0))","v":""}]
[null,null,null,null,null,"",{"$f":"IF(D899=\"\",\"\",VLOOKUP(F899,'Plan Comptable '!$C$5:$D$554,2,0))","v":""},null,{"$f":"IF(H899=\"\",\"\",VLOOKUP(H899,#REF!,2,0))","v":""}]
[null,null,null,null,null,"",{"$f":"IF(D900=\"\",\"\",VLOOKUP(F900,'Plan Comptable '!$C$5:$D$554,2,0))","v":""},null,{"$f":"IF(H900=\"\",\"\",VLOOKUP(H900,#REF!,2,0))","v":""}]
[null,null,null,null,null,"",{"$f":"IF(D901=\"\",\"\",VLOOKUP(F901,'Plan Comptable '!$C$5:$D$554,2,0))","v":""},null,{"$f":"IF(H901=\"\",\"\",VLOOKUP(H901,#REF!,2,0))","v":""}]
[null,null,null,null,null,"",{"$f":"IF(D902=\"\",\"\",VLOOKUP(F902,'Plan Comptable '!$C$5:$D$554,2,0))","v":""},null,{"$f":"IF(H902=\"\",\"\",VLOOKUP(H902,#REF!,2,0))","v":""}]
[null,null,null,null,null,"",{"$f":"IF(D903=\"\",\"\",VLOOKUP(F903,'Plan Comptable '!$C$5:$D$554,2,0))","v":""},null,{"$f":"IF(H903=\"\",\"\",VLOOKUP(H903,#REF!,2,0))","v":""}]
[null,null,null,null,null,"",{"$f":"IF(D904=\"\",\"\",VLOOKUP(F904,'Plan Comptable '!$C$5:$D$554,2,0))","v":""},null,{"$f":"IF(H904=\"\",\"\",VLOOKUP(H904,#REF!,2,0))","v":""}]
[null,null,null,null,null,"",{"$f":"IF(D905=\"\",\"\",VLOOKUP(F905,'Plan Comptable '!$C$5:$D$554,2,0))","v":""},null,{"$f":"IF(H905=\"\",\"\",VLOOKUP(H905,#REF!,2,0))","v":""}]
[null,null,null,null,null,"",{"$f":"IF(D906=\"\",\"\",VLOOKUP(F906,'Plan Comptable '!$C$5:$D$554,2,0))","v":""},null,{"$f":"IF(H906=\"\",\"\",VLOOKUP(H906,#REF!,2,0))","v":""}]
[null,null,null,null,null,"",{"$f":"IF(D907=\"\",\"\",VLOOKUP(F907,'Plan Comptable '!$C$5:$D$554,2,0))","v":""},null,{"$f":"IF(H907=\"\",\"\",VLOOKUP(H907,#REF!,2,0))","v":""}]
[null,null,null,null,null,{"$f":"CONCATENATE(D908,E908)","v":""},{"$f":"IF(D908=\"\",\"\",VLOOKUP(F908,'Plan Comptable '!$C$5:$D$554,2,0))","v":""},null,{"$f":"IF(H908=\"\",\"\",VLOOKUP(H908,#REF!,2,0))","v":""}]
[null,null,null,null,null,"",{"$f":"IF(D909=\"\",\"\",VLOOKUP(F909,'Plan Comptable '!$C$5:$D$554,2,0))","v":""},null,{"$f":"IF(H909=\"\",\"\",VLOOKUP(H909,#REF!,2,0))","v":""}]
[null,null,null,null,null,"",{"$f":"IF(D910=\"\",\"\",VLOOKUP(F910,'Plan Comptable '!$C$5:$D$554,2,0))","v":""},null,{"$f":"IF(H910=\"\",\"\",VLOOKUP(H910,#REF!,2,0))","v":""}]
[null,null,null,null,null,"",{"$f":"IF(D911=\"\",\"\",VLOOKUP(F911,'Plan Comptable '!$C$5:$D$554,2,0))","v":""},null,{"$f":"IF(H911=\"\",\"\",VLOOKUP(H911,#REF!,2,0))","v":""}]
[null,null,null,null,null,"",{"$f":"IF(D912=\"\",\"\",VLOOKUP(F912,'Plan Comptable '!$C$5:$D$554,2,0))","v":""},null,{"$f":"IF(H912=\"\",\"\",VLOOKUP(H912,#REF!,2,0))","v":""}]
[null,null,null,null,null,"",{"$f":"IF(D913=\"\",\"\",VLOOKUP(F913,'Plan Comptable '!$C$5:$D$554,2,0))","v":""},null,{"$f":"IF(H913=\"\",\"\",VLOOKUP(H913,#REF!,2,0))","v":""}]
[null,null,null,null,null,"",{"$f":"IF(D914=\"\",\"\",VLOOKUP(F914,'Plan Comptable '!$C$5:$D$554,2,0))","v":""},null,{"$f":"IF(H914=\"\",\"\",VLOOKUP(H914,#REF!,2,0))","v":""}]
[null,null,null,null,null,"",{"$f":"IF(D915=\"\",\"\",VLOOKUP(F915,'Plan Comptable '!$C$5:$D$554,2,0))","v":""},null,{"$f":"IF(H915=\"\",\"\",VLOOKUP(H915,#REF!,2,0))","v":""}]
[null,null,null,null,null,"",{"$f":"IF(D916=\"\",\"\",VLOOKUP(F916,'Plan Comptable '!$C$5:$D$554,2,0))","v":""},null,{"$f":"IF(H916=\"\",\"\",VLOOKUP(H916,#REF!,2,0))","v":""}]
[null,null,null,null,null,"",{"$f":"IF(D917=\"\",\"\",VLOOKUP(F917,'Plan Comptable '!$C$5:$D$554,2,0))","v":""},null,{"$f":"IF(H917=\"\",\"\",VLOOKUP(H917,#REF!,2,0))","v":""}]
[null,null,null,null,null,"",{"$f":"IF(D918=\"\",\"\",VLOOKUP(F918,'Plan Comptable '!$C$5:$D$554,2,0))","v":""},null,{"$f":"IF(H918=\"\",\"\",VLOOKUP(H918,#REF!,2,0))","v":""}]
[null,null,null,null,null,"",{"$f":"IF(D919=\"\",\"\",VLOOKUP(F919,'Plan Comptable '!$C$5:$D$554,2,0))","v":""},null,{"$f":"IF(H919=\"\",\"\",VLOOKUP(H919,#REF!,2,0))","v":""}]
[null,null,null,null,null,"",{"$f":"IF(D920=\"\",\"\",VLOOKUP(F920,'Plan Comptable '!$C$5:$D$554,2,0))","v":""},null,{"$f":"IF(H920=\"\",\"\",VLOOKUP(H920,#REF!,2,0))","v":""}]
[null,null,null,null,null,"",{"$f":"IF(D921=\"\",\"\",VLOOKUP(F921,'Plan Comptable '!$C$5:$D$554,2,0))","v":""},null,{"$f":"IF(H921=\"\",\"\",VLOOKUP(H921,#REF!,2,0))","v":""}]
[null,null,null,null,null,"",{"$f":"IF(D922=\"\",\"\",VLOOKUP(F922,'Plan Comptable '!$C$5:$D$554,2,0))","v":""},null,{"$f":"IF(H922=\"\",\"\",VLOOKUP(H922,#REF!,2,0))","v":""}]
[null,null,null,null,null,"",{"$f":"IF(D923=\"\",\"\",VLOOKUP(F923,'Plan Comptable '!$C$5:$D$554,2,0))","v":""},null,{"$f":"IF(H923=\"\",\"\",VLOOKUP(H923,#REF!,2,0))","v":""}]
[null,null,null,null,null,"",{"$f":"IF(D924=\"\",\"\",VLOOKUP(F924,'Plan Comptable '!$C$5:$D$554,2,0))","v":""},null,{"$f":"IF(H924=\"\",\"\",VLOOKUP(H924,#REF!,2,0))","v":""}]
[null,null,null,null,null,"",{"$f":"IF(D925=\"\",\"\",VLOOKUP(F925,'Plan Comptable '!$C$5:$D$554,2,0))","v":""},null,{"$f":"IF(H925=\"\",\"\",VLOOKUP(H925,#REF!,2,0))","v":""}]
[null,null,null,null,null,"",{"$f":"IF(D926=\"\",\"\",VLOOKUP(F926,'Plan Comptable '!$C$5:$D$554,2,0))","v":""},null,{"$f":"IF(H926=\"\",\"\",VLOOKUP(H926,#REF!,2,0))","v":""}]
[null,null,null,null,null,"",{"$f":"IF(D927=\"\",\"\",VLOOKUP(F927,'Plan Comptable '!$C$5:$D$554,2,0))","v":""},null,{"$f":"IF(H927=\"\",\"\",VLOOKUP(H927,#REF!,2,0))","v":""}]
[null,null,null,null,null,"",{"$f":"IF(D928=\"\",\"\",VLOOKUP(F928,'Plan Comptable '!$C$5:$D$554,2,0))","v":""},null,{"$f":"IF(H928=\"\",\"\",VLOOKUP(H928,#REF!,2,0))","v":""}]
[null,null,null,null,null,"",{"$f":"IF(D929=\"\",\"\",VLOOKUP(F929,'Plan Comptable '!$C$5:$D$554,2,0))","v":""},null,{"$f":"IF(H929=\"\",\"\",VLOOKUP(H929,#REF!,2,0))","v":""}]
[null,null,null,null,null,"",{"$f":"IF(D930=\"\",\"\",VLOOKUP(F930,'Plan Comptable '!$C$5:$D$554,2,0))","v":""},null,{"$f":"IF(H930=\"\",\"\",VLOOKUP(H930,#REF!,2,0))","v":""}]
[null,null,null,null,null,"",{"$f":"IF(D931=\"\",\"\",VLOOKUP(F931,'Plan Comptable '!$C$5:$D$554,2,0))","v":""},null,{"$f":"IF(H931=\"\",\"\",VLOOKUP(H931,#REF!,2,0))","v":""}]
[null,null,null,null,null,"",{"$f":"IF(D932=\"\",\"\",VLOOKUP(F932,'Plan Comptable '!$C$5:$D$554,2,0))","v":""},null,{"$f":"IF(H932=\"\",\"\",VLOOKUP(H932,#REF!,2,0))","v":""}]
[null,null,null,null,null,"",{"$f":"IF(D933=\"\",\"\",VLOOKUP(F933,'Plan Comptable '!$C$5:$D$554,2,0))","v":""},null,{"$f":"IF(H933=\"\",\"\",VLOOKUP(H933,#REF!,2,0))","v":""}]
[null,null,null,null,null,"",{"$f":"IF(D934=\"\",\"\",VLOOKUP(F934,'Plan Comptable '!$C$5:$D$554,2,0))","v":""},null,{"$f":"IF(H934=\"\",\"\",VLOOKUP(H934,#REF!,2,0))","v":""}]
[null,null,null,null,null,"",{"$f":"IF(D935=\"\",\"\",VLOOKUP(F935,'Plan Comptable '!$C$5:$D$554,2,0))","v":""},null,{"$f":"IF(H935=\"\",\"\",VLOOKUP(H935,#REF!,2,0))","v":""}]
[null,null,null,null,null,"",{"$f":"IF(D936=\"\",\"\",VLOOKUP(F936,'Plan Comptable '!$C$5:$D$554,2,0))","v":""},null,{"$f":"IF(H936=\"\",\"\",VLOOKUP(H936,#REF!,2,0))","v":""}]
[null,null,null,null,null,"",{"$f":"IF(D937=\"\",\"\",VLOOKUP(F937,'Plan Comptable '!$C$5:$D$554,2,0))","v":""},null,{"$f":"IF(H937=\"\",\"\",VLOOKUP(H937,#REF!,2,0))","v":""}]
[null,null,null,null,null,"",{"$f":"IF(D938=\"\",\"\",VLOOKUP(F938,'Plan Comptable '!$C$5:$D$554,2,0))","v":""},null,{"$f":"IF(H938=\"\",\"\",VLOOKUP(H938,#REF!,2,0))","v":""}]
[null,null,null,null,null,"",{"$f":"IF(D939=\"\",\"\",VLOOKUP(F939,'Plan Comptable '!$C$5:$D$554,2,0))","v":""},null,{"$f":"IF(H939=\"\",\"\",VLOOKUP(H939,#REF!,2,0))","v":""}]
[null,null,null,null,null,"",{"$f":"IF(D940=\"\",\"\",VLOOKUP(F940,'Plan Comptable '!$C$5:$D$554,2,0))","v":""},null,{"$f":"IF(H940=\"\",\"\",VLOOKUP(H940,#REF!,2,0))","v":""}]
[null,null,null,null,null,"",{"$f":"IF(D941=\"\",\"\",VLOOKUP(F941,'Plan Comptable '!$C$5:$D$554,2,0))","v":""},null,{"$f":"IF(H941=\"\",\"\",VLOOKUP(H941,#REF!,2,0))","v":""}]
[null,null,null,null,null,"",{"$f":"IF(D942=\"\",\"\",VLOOKUP(F942,'Plan Comptable '!$C$5:$D$554,2,0))","v":""},null,{"$f":"IF(H942=\"\",\"\",VLOOKUP(H942,#REF!,2,0))","v":""}]
[null,null,null,null,null,"",{"$f":"IF(D943=\"\",\"\",VLOOKUP(F943,'Plan Comptable '!$C$5:$D$554,2,0))","v":""},null,{"$f":"IF(H943=\"\",\"\",VLOOKUP(H943,#REF!,2,0))","v":""}]
[null,null,null,null,null,"",{"$f":"IF(D944=\"\",\"\",VLOOKUP(F944,'Plan Comptable '!$C$5:$D$554,2,0))","v":""},null,{"$f":"IF(H944=\"\",\"\",VLOOKUP(H944,#REF!,2,0))","v":""}]
[null,null,null,null,null,"",{"$f":"IF(D945=\"\",\"\",VLOOKUP(F945,'Plan Comptable '!$C$5:$D$554,2,0))","v":""},null,{"$f":"IF(H945=\"\",\"\",VLOOKUP(H945,#REF!,2,0))","v":""}]
[null,null,null,null,null,"",{"$f":"IF(D946=\"\",\"\",VLOOKUP(F946,'Plan Comptable '!$C$5:$D$554,2,0))","v":""},null,{"$f":"IF(H946=\"\",\"\",VLOOKUP(H946,#REF!,2,0))","v":""}]
[null,null,null,null,null,"",{"$f":"IF(D947=\"\",\"\",VLOOKUP(F947,'Plan Comptable '!$C$5:$D$554,2,0))","v":""},null,{"$f":"IF(H947=\"\",\"\",VLOOKUP(H947,#REF!,2,0))","v":""}]
[null,null,null,null,null,"",{"$f":"IF(D948=\"\",\"\",VLOOKUP(F948,'Plan Comptable '!$C$5:$D$554,2,0))","v":""},null,{"$f":"IF(H948=\"\",\"\",VLOOKUP(H948,#REF!,2,0))","v":""}]
[null,null,null,null,null,"",{"$f":"IF(D949=\"\",\"\",VLOOKUP(F949,'Plan Comptable '!$C$5:$D$554,2,0))","v":""},null,{"$f":"IF(H949=\"\",\"\",VLOOKUP(H949,#REF!,2,0))","v":""}]
[null,null,null,null,null,"",{"$f":"IF(D950=\"\",\"\",VLOOKUP(F950,'Plan Comptable '!$C$5:$D$554,2,0))","v":""},null,{"$f":"IF(H950=\"\",\"\",VLOOKUP(H950,#REF!,2,0))","v":""}]
[null,null,null,null,null,"",{"$f":"IF(D951=\"\",\"\",VLOOKUP(F951,'Plan Comptable '!$C$5:$D$554,2,0))","v":""},null,{"$f":"IF(H951=\"\",\"\",VLOOKUP(H951,#REF!,2,0))","v":""}]
[null,null,null,null,null,"",{"$f":"IF(D952=\"\",\"\",VLOOKUP(F952,'Plan Comptable '!$C$5:$D$554,2,0))","v":""},null,{"$f":"IF(H952=\"\",\"\",VLOOKUP(H952,#REF!,2,0))","v":""}]
[null,null,null,null,null,"",{"$f":"IF(D953=\"\",\"\",VLOOKUP(F953,'Plan Comptable '!$C$5:$D$554,2,0))","v":""},null,{"$f":"IF(H953=\"\",\"\",VLOOKUP(H953,#REF!,2,0))","v":""}]
[null,null,null,null,null,"",{"$f":"IF(D954=\"\",\"\",VLOOKUP(F954,'Plan Comptable '!$C$5:$D$554,2,0))","v":""},null,{"$f":"IF(H954=\"\",\"\",VLOOKUP(H954,#REF!,2,0))","v":""}]
[null,null,null,null,null,"",{"$f":"IF(D955=\"\",\"\",VLOOKUP(F955,'Plan Comptable '!$C$5:$D$554,2,0))","v":""},null,{"$f":"IF(H955=\"\",\"\",VLOOKUP(H955,#REF!,2,0))","v":""}]
[null,null,null,null,null,"",{"$f":"IF(D956=\"\",\"\",VLOOKUP(F956,'Plan Comptable '!$C$5:$D$554,2,0))","v":""},null,{"$f":"IF(H956=\"\",\"\",VLOOKUP(H956,#REF!,2,0))","v":""}]
[null,null,null,null,null,"",{"$f":"IF(D957=\"\",\"\",VLOOKUP(F957,'Plan Comptable '!$C$5:$D$554,2,0))","v":""},null,{"$f":"IF(H957=\"\",\"\",VLOOKUP(H957,#REF!,2,0))","v":""}]
[null,null,null,null,null,"",{"$f":"IF(D958=\"\",\"\",VLOOKUP(F958,'Plan Comptable '!$C$5:$D$554,2,0))","v":""},null,{"$f":"IF(H958=\"\",\"\",VLOOKUP(H958,#REF!,2,0))","v":""}]
[null,null,null,null,null,"",{"$f":"IF(D959=\"\",\"\",VLOOKUP(F959,'Plan Comptable '!$C$5:$D$554,2,0))","v":""},null,{"$f":"IF(H959=\"\",\"\",VLOOKUP(H959,#REF!,2,0))","v":""}]
[null,null,null,null,null,"",{"$f":"IF(D960=\"\",\"\",VLOOKUP(F960,'Plan Comptable '!$C$5:$D$554,2,0))","v":""},null,{"$f":"IF(H960=\"\",\"\",VLOOKUP(H960,#REF!,2,0))","v":""}]
[null,null,null,null,null,"",{"$f":"IF(D961=\"\",\"\",VLOOKUP(F961,'Plan Comptable '!$C$5:$D$554,2,0))","v":""},null,{"$f":"IF(H961=\"\",\"\",VLOOKUP(H961,#REF!,2,0))","v":""}]
[null,null,null,null,null,"",{"$f":"IF(D962=\"\",\"\",VLOOKUP(F962,'Plan Comptable '!$C$5:$D$554,2,0))","v":""},null,{"$f":"IF(H962=\"\",\"\",VLOOKUP(H962,#REF!,2,0))","v":""}]
[null,null,null,null,null,"",{"$f":"IF(D963=\"\",\"\",VLOOKUP(F963,'Plan Comptable '!$C$5:$D$554,2,0))","v":""},null,{"$f":"IF(H963=\"\",\"\",VLOOKUP(H963,#REF!,2,0))","v":""}]
[null,null,null,null,null,"",{"$f":"IF(D964=\"\",\"\",VLOOKUP(F964,'Plan Comptable '!$C$5:$D$554,2,0))","v":""},null,{"$f":"IF(H964=\"\",\"\",VLOOKUP(H964,#REF!,2,0))","v":""}]
[null,null,null,null,null,"",{"$f":"IF(D965=\"\",\"\",VLOOKUP(F965,'Plan Comptable '!$C$5:$D$554,2,0))","v":""},null,{"$f":"IF(H965=\"\",\"\",VLOOKUP(H965,#REF!,2,0))","v":""}]
[null,null,null,null,null,"",{"$f":"IF(D966=\"\",\"\",VLOOKUP(F966,'Plan Comptable '!$C$5:$D$554,2,0))","v":""},null,{"$f":"IF(H966=\"\",\"\",VLOOKUP(H966,#REF!,2,0))","v":""}]
[null,null,null,null,null,"",{"$f":"IF(D967=\"\",\"\",VLOOKUP(F967,'Plan Comptable '!$C$5:$D$554,2,0))","v":""},null,{"$f":"IF(H967=\"\",\"\",VLOOKUP(H967,#REF!,2,0))","v":""}]
[null,null,null,null,null,"",{"$f":"IF(D968=\"\",\"\",VLOOKUP(F968,'Plan Comptable '!$C$5:$D$554,2,0))","v":""},null,{"$f":"IF(H968=\"\",\"\",VLOOKUP(H968,#REF!,2,0))","v":""}]
[null,null,null,null,null,"",{"$f":"IF(D969=\"\",\"\",VLOOKUP(F969,'Plan Comptable '!$C$5:$D$554,2,0))","v":""},null,{"$f":"IF(H969=\"\",\"\",VLOOKUP(H969,#REF!,2,0))","v":""}]
[null,null,null,null,null,"",{"$f":"IF(D970=\"\",\"\",VLOOKUP(F970,'Plan Comptable '!$C$5:$D$554,2,0))","v":""},null,{"$f":"IF(H970=\"\",\"\",VLOOKUP(H970,#REF!,2,0))","v":""}]
[null,null,null,null,null,"",{"$f":"IF(D971=\"\",\"\",VLOOKUP(F971,'Plan Comptable '!$C$5:$D$554,2,0))","v":""},null,{"$f":"IF(H971=\"\",\"\",VLOOKUP(H971,#REF!,2,0))","v":""}]
[null,null,null,null,null,{"$f":"CONCATENATE(D972,E972)","v":""},{"$f":"IF(D972=\"\",\"\",VLOOKUP(F972,'Plan Comptable '!$C$5:$D$554,2,0))","v":""},null,{"$f":"IF(H972=\"\",\"\",VLOOKUP(H972,#REF!,2,0))","v":""}]
[null,null,null,null,null,"",{"$f":"IF(D973=\"\",\"\",VLOOKUP(F973,'Plan Comptable '!$C$5:$D$554,2,0))","v":""},null,{"$f":"IF(H973=\"\",\"\",VLOOKUP(H973,#REF!,2,0))","v":""}]
[null,null,null,null,null,"",{"$f":"IF(D974=\"\",\"\",VLOOKUP(F974,'Plan Comptable '!$C$5:$D$554,2,0))","v":""},null,{"$f":"IF(H974=\"\",\"\",VLOOKUP(H974,#REF!,2,0))","v":""}]
[null,null,null,null,null,"",{"$f":"IF(D975=\"\",\"\",VLOOKUP(F975,'Plan Comptable '!$C$5:$D$554,2,0))","v":""},null,{"$f":"IF(H975=\"\",\"\",VLOOKUP(H975,#REF!,2,0))","v":""}]
[null,null,null,null,null,"",{"$f":"IF(D976=\"\",\"\",VLOOKUP(F976,'Plan Comptable '!$C$5:$D$554,2,0))","v":""},null,{"$f":"IF(H976=\"\",\"\",VLOOKUP(H976,#REF!,2,0))","v":""}]
[null,null,null,null,null,"",{"$f":"IF(D977=\"\",\"\",VLOOKUP(F977,'Plan Comptable '!$C$5:$D$554,2,0))","v":""},null,{"$f":"IF(H977=\"\",\"\",VLOOKUP(H977,#REF!,2,0))","v":""}]
[null,null,null,null,null,"",{"$f":"IF(D978=\"\",\"\",VLOOKUP(F978,'Plan Comptable '!$C$5:$D$554,2,0))","v":""},null,{"$f":"IF(H978=\"\",\"\",VLOOKUP(H978,#REF!,2,0))","v":""}]
[null,null,null,null,null,"",{"$f":"IF(D979=\"\",\"\",VLOOKUP(F979,'Plan Comptable '!$C$5:$D$554,2,0))","v":""},null,{"$f":"IF(H979=\"\",\"\",VLOOKUP(H979,#REF!,2,0))","v":""}]
[null,null,null,null,null,"",{"$f":"IF(D980=\"\",\"\",VLOOKUP(F980,'Plan Comptable '!$C$5:$D$554,2,0))","v":""},null,{"$f":"IF(H980=\"\",\"\",VLOOKUP(H980,#REF!,2,0))","v":""}]
[null,null,null,null,null,"",{"$f":"IF(D981=\"\",\"\",VLOOKUP(F981,'Plan Comptable '!$C$5:$D$554,2,0))","v":""},null,{"$f":"IF(H981=\"\",\"\",VLOOKUP(H981,#REF!,2,0))","v":""}]
[null,null,null,null,null,"",{"$f":"IF(D982=\"\",\"\",VLOOKUP(F982,'Plan Comptable '!$C$5:$D$554,2,0))","v":""},null,{"$f":"IF(H982=\"\",\"\",VLOOKUP(H982,#REF!,2,0))","v":""}]
[null,null,null,null,null,"",{"$f":"IF(D983=\"\",\"\",VLOOKUP(F983,'Plan Comptable '!$C$5:$D$554,2,0))","v":""},null,{"$f":"IF(H983=\"\",\"\",VLOOKUP(H983,#REF!,2,0))","v":""}]
[null,null,null,null,null,"",{"$f":"IF(D984=\"\",\"\",VLOOKUP(F984,'Plan Comptable '!$C$5:$D$554,2,0))","v":""},null,{"$f":"IF(H984=\"\",\"\",VLOOKUP(H984,#REF!,2,0))","v":""}]
[null,null,null,null,null,"",{"$f":"IF(D985=\"\",\"\",VLOOKUP(F985,'Plan Comptable '!$C$5:$D$554,2,0))","v":""},null,{"$f":"IF(H985=\"\",\"\",VLOOKUP(H985,#REF!,2,0))","v":""}]
[null,null,null,null,null,"",{"$f":"IF(D986=\"\",\"\",VLOOKUP(F986,'Plan Comptable '!$C$5:$D$554,2,0))","v":""},null,{"$f":"IF(H986=\"\",\"\",VLOOKUP(H986,#REF!,2,0))","v":""}]
[null,null,null,null,null,"",{"$f":"IF(D987=\"\",\"\",VLOOKUP(F987,'Plan Comptable '!$C$5:$D$554,2,0))","v":""},null,{"$f":"IF(H987=\"\",\"\",VLOOKUP(H987,#REF!,2,0))","v":""}]
[null,null,null,null,null,"",{"$f":"IF(D988=\"\",\"\",VLOOKUP(F988,'Plan Comptable '!$C$5:$D$554,2,0))","v":""},null,{"$f":"IF(H988=\"\",\"\",VLOOKUP(H988,#REF!,2,0))","v":""}]
[null,null,null,null,null,"",{"$f":"IF(D989=\"\",\"\",VLOOKUP(F989,'Plan Comptable '!$C$5:$D$554,2,0))","v":""},null,{"$f":"IF(H989=\"\",\"\",VLOOKUP(H989,#REF!,2,0))","v":""}]
[null,null,null,null,null,"",{"$f":"IF(D990=\"\",\"\",VLOOKUP(F990,'Plan Comptable '!$C$5:$D$554,2,0))","v":""},null,{"$f":"IF(H990=\"\",\"\",VLOOKUP(H990,#REF!,2,0))","v":""}]
[null,null,null,null,null,"",{"$f":"IF(D991=\"\",\"\",VLOOKUP(F991,'Plan Comptable '!$C$5:$D$554,2,0))","v":""},null,{"$f":"IF(H991=\"\",\"\",VLOOKUP(H991,#REF!,2,0))","v":""}]
[null,null,null,null,null,"",{"$f":"IF(D992=\"\",\"\",VLOOKUP(F992,'Plan Comptable '!$C$5:$D$554,2,0))","v":""},null,{"$f":"IF(H992=\"\",\"\",VLOOKUP(H992,#REF!,2,0))","v":""}]
[null,null,null,null,null,"",{"$f":"IF(D993=\"\",\"\",VLOOKUP(F993,'Plan Comptable '!$C$5:$D$554,2,0))","v":""},null,{"$f":"IF(H993=\"\",\"\",VLOOKUP(H993,#REF!,2,0))","v":""}]
[null,null,null,null,null,"",{"$f":"IF(D994=\"\",\"\",VLOOKUP(F994,'Plan Comptable '!$C$5:$D$554,2,0))","v":""},null,{"$f":"IF(H994=\"\",\"\",VLOOKUP(H994,#REF!,2,0))","v":""}]
[null,null,null,null,null,"",{"$f":"IF(D995=\"\",\"\",VLOOKUP(F995,'Plan Comptable '!$C$5:$D$554,2,0))","v":""},null,{"$f":"IF(H995=\"\",\"\",VLOOKUP(H995,#REF!,2,0))","v":""}]
[null,null,null,null,null,"",{"$f":"IF(D996=\"\",\"\",VLOOKUP(F996,'Plan Comptable '!$C$5:$D$554,2,0))","v":""},null,{"$f":"IF(H996=\"\",\"\",VLOOKUP(H996,#REF!,2,0))","v":""}]
[null,null,null,null,null,"",{"$f":"IF(D997=\"\",\"\",VLOOKUP(F997,'Plan Comptable '!$C$5:$D$554,2,0))","v":""},null,{"$f":"IF(H997=\"\",\"\",VLOOKUP(H997,#REF!,2,0))","v":""}]
[null,null,null,null,null,"",{"$f":"IF(D998=\"\",\"\",VLOOKUP(F998,'Plan Comptable '!$C$5:$D$554,2,0))","v":""},null,{"$f":"IF(H998=\"\",\"\",VLOOKUP(H998,#REF!,2,0))","v":""}]
[null,null,null,null,null,"",{"$f":"IF(D999=\"\",\"\",VLOOKUP(F999,'Plan Comptable '!$C$5:$D$554,2,0))","v":""},null,{"$f":"IF(H999=\"\",\"\",VLOOKUP(H999,#REF!,2,0))","v":""}]
[null,null,null,null,null,""]
[null,null,null,null,null,""]

{"sheet":"Budget Subvention","index":2,"n_rows":56,"n_cols":38,"rows_kept":56,"cut":false,"hidden":true,"merged":[[0,0,0,23],[0,24,1,28],[1,0,1,6],[1,7,1,23],[8,19,8,27],[7,19,7,27],[6,28,6,32],[6,14,6,18],[2,1,2,37],[3,1,3,37],[4,1,4,8],[5,1,5,5],[5,12,5,17],[8,1,8,8],[8,9,8,12],[8,28,8,31],[5,22,5,25],[6,33,6,37],[7,1,7,8],[7,9,7,12],[7,14,7,17],[7,33,7,36],[6,1,6,8],[6,9,6,13],[9,9,9,12],[9,14,9,17],[9,19,9,27],[6,19,6,27],[9,28,9,31],[8,14,8,17],[9,33,9,36],[9,1,9,8],[8,33,8,36],[11,1,11,8],[11,9,11,12],[12,1,12,8],[12,9,12,12],[16,1,16,8],[10,33,10,36],[10,1,10,8],[10,9,10,12],[12,33,12,36],[12,19,12,27],[12,14,12,17],[10,28,10,31],[10,14,10,17],[10,19,10,27],[12,28,12,31],[11,14,11,17],[11,19,11,27],[11,28,11,31],[11,33,11,36],[13,19,13,27],[13,1,13,8],[16,33,16,36],[15,1,15,8],[15,9,15,12],[15,14,15,17],[16,9,16,12],[16,28,16,31],[15,19,15,27],[13,33,13,36],[13,28,13,31],[15,28,15,31],[15,33,15,36],[14,1,14,8],[14,19,14,27],[14,28,14,31],[14,33,14,36],[13,9,13,12],[13,14,13,17],[16,14,16,17],[16,19,16,27],[17,9,17,12],[17,33,17,36],[19,14,19,17],[19,28,19,31],[19,33,19,36],[20,1,20,8],[20,9,20,12],[20,14,20,17],[20,19,20,27],[18,28,18,31],[17,14,17,17],[17,19,17,27],[18,14,18,17],[18,19,18,27],[17,28,17,31],[20,33,20,36],[19,19,19,27],[19,1,19,8],[19,9,19,12],[18,1,18,8],[18,9,18,12],[18,33,18,36],[17,1,17,8],[23,1,23,8],[21,1,21,8],[21,19,21,27],[22,1,22,8],[20,28,20,31],[23,28,23,31],[22,28,22,31],[22,19,22,27],[22,9,22,12],[21,28,21,31],[26,33,26,36],[24,33,24,36],[25,28,25,31],[25,33,25,36],[22,14,22,17],[23,9,23,12],[23,14,23,17],[25,9,25,12],[24,28,24,31],[23,33,23,36],[22,33,22,36],[23,19,23,27],[26,1,26,8],[26,9,26,12],[27,19,27,27],[26,14,26,17],[26,19,26,27],[26,28,26,31],[25,1,25,8],[24,14,24,17],[24,19,24,27],[25,14,25,17],[25,19,25,27],[24,1,24,8],[24,9,24,12],[28,28,28,31],[28,33,28,36],[29,28,29,31],[29,33,29,36],[27,33,27,36],[29,1,29,8],[29,9,29,12],[29,14,29,17],[29,19,29,27],[28,1,28,8],[28,19,28,27],[27,1,27,8],[27,9,27,12],[27,14,27,17],[27,28,27,31],[32,1,32,8],[32,19,32,27],[32,28,32,31],[32,33,32,36],[30,28,30,31],[30,33,30,36],[31,1,31,8],[31,19,31,27],[31,28,31,31],[31,33,31,36],[30,1,30,8],[30,9,30,12],[30,14,30,17],[30,19,30,27],[34,1,34,8],[34,9,34,12],[34,14,34,17],[34,19,34,27],[38,33,38,36],[35,19,35,27],[36,33,36,36],[33,19,33,27],[33,28,33,31],[33,33,33,36],[34,28,34,31],[34,33,34,36],[38,19,38,27],[36,19,36,27],[37,19,37,27],[38,28,38,31],[35,33,35,36],[36,28,36,31],[36,14,36,17],[36,9,36,12],[35,28,35,31],[35,1,35,8],[35,9,35,12],[35,14,35,17],[40,28,40,31],[42,28,42,31],[40,33,40,36],[41,33,41,36],[40,14,40,17],[40,19,40,23],[41,19,41,27],[42,33,42,36],[39,1,39,8],[39,9,39,12],[39,14,39,17],[39,33,39,36],[39,19,39,27],[39,28,39,31],[42,1,42,8],[42,19,42,27],[40,9,40,12],[41,9,41,12],[41,14,41,17],[41,1,41,8],[40,1,40,8],[40,24,40,27],[38,1,38,8],[45,1,45,8],[36,1,36,8],[46,1,46,8],[46,9,46,12],[47,1,47,8],[44,1,44,8],[44,19,44,27],[46,14,46,17],[45,19,45,27],[43,1,43,8],[43,9,43,12],[43,19,43,27],[43,14,43,17],[44,28,44,31],[44,33,44,36],[43,28,43,31],[43,33,43,36],[47,19,47,27],[45,28,45,31],[45,33,45,36],[46,28,46,31],[46,33,46,36],[46,19,46,27],[51,33,51,36],[48,28,48,31],[48,33,48,36],[50,28,50,31],[50,33,50,36],[49,28,49,31],[49,33,49,36],[48,1,48,8],[48,9,48,12],[48,14,48,17],[48,19,48,27],[49,1,49,8],[49,9,49,12],[49,14,49,17],[49,19,49,27],[51,14,51,17],[51,19,51,27],[50,14,50,17],[50,19,50,27],[50,1,50,8],[50,9,50,12],[51,1,51,8],[51,9,51,12],[51,28,51,31]]}
["Modèle de budget prévisionnel(1)"]
["Nom de l'association:",null,null,null,null,null,null,{"$f":"#REF!","v":{"$error":"#REF!"}}]
[null,"Budget prévisionnel de l'association approuvé par les instances statutaires pour l'exercice."]
[null,"Si votre association est soumise aux obligations du plan comptable, vous n'avez pas besoin de remplir cette partie, mais vous joindrez une copie de votre budget prévisionnel approuvé par les instances statutaires, si celui-ci est établi en respectant la nomenclature du plan comptable associatif."]
[]
[null,"EXERCICE",null,null,null,null,"Date début exercice:",null,null,null,null,null,null,null,null,null,null,null,"Date fin exercice:"]
[null,"DEPENSES",null,null,null,null,null,null,null,"COMPTE DE RESULTAT     N    MONTANT(3) EN EUROS",null,null,null,null,"BUDGET N+1 MONTANT(3)\nEN EUROS",null,null,null,null,"RECETTES(2)",null,null,null,null,null,null,null,null,"COMPTE DE RESULTAT    N     MONTANT(3) EN EUROS",null,null,null,null,"BUDGET N+1 MONTANT(3)\nEN EUROS"]
[null,"60-Achats",null,null,null,null,null,null,null,null,null,null,null,null,null,null,null,null,null,"70-Ventes de produits finis, prestations"]
[null,"Achats d'études et de prestations de services",null,null,null,null,null,null,null,{"$f":"#REF!","v":{"$error":"#REF!"}},null,null,null,"€",null,null,null,null,"€","Marchandises",null,null,null,null,null,null,null,null,{"$f":"#REF!","v":{"$error":"#REF!"}},null,null,null,"€",null,null,null,null,"€"]
[null,"Achats non stockés de matières et fournitures",null,null,null,null,null,null,null,{"$f":"#REF!","v":{"$error":"#REF!"}},null,null,null,"€",null,null,null,null,"€","Prestations de services",null,null,null,null,null,null,null,null,{"$f":"#REF!","v":{"$error":"#REF!"}},null,null,null,"€",null,null,null,null,"€"]
[null,"Fournitures non stockables (eau, énergie)",null,null,null,null,null,null,null,{"$f":"#REF!","v":{"$error":"#REF!"}},null,null,null,"€",null,null,null,null,"€","Produits des activités annexes",null,null,null,null,null,null,null,null,{"$f":"SUM(#REF!:#REF!)-AC9-AC10","v":{"$error":"#REF!"}},null,null,null,"€",null,null,null,null,"€"]
[null,"Fournitures d'entretien et de petit équipement",null,null,null,null,null,null,null,{"$f":"#REF!","v":{"$error":"#REF!"}},null,null,null,"€",null,null,null,null,"€","74-Subventions d'exploitation",null,null,null,null,null,null,null,null,{"$f":"SUM(#REF!)","v":{"$error":"#REF!"}},null,null,null,"€",null,null,null,null,"€"]
[null,"Fournitures administratives",null,null,null,null,null,null,null,{"$f":"#REF!","v":{"$error":"#REF!"}},null,null,null,"€",null,null,null,null,"€"]
[null,"Autres fournitures",null,null,null,null,null,null,null,{"$f":"SUM(#REF!)-J9-J10-J11-J12-J13","v":{"$error":"#REF!"}},null,null,null,"€",null,null,null,null,"€","CNDS Subvention sollicitée",null,null,null,null,null,null,null,null,null,null,null,null,"€",null,null,null,null,"€"]
[null,"61-Services extérieurs",null,null,null,null,null,null,null,null,null,null,null,null,null,null,null,null,null,"Etat (à détailler)",null,null,null,null,null,null,null,null,null,null,null,null,"€",null,null,null,null,"€"]
[null,"Sous traitance générale",null,null,null,null,null,null,null,{"$f":"#REF!","v":{"$error":"#REF!"}},null,null,null,"€",null,null,null,null,"€",null,null,null,null,null,null,null,null,null,null,null,null,null,"€",null,null,null,null,"€"]
[null,"Locations mobilières et immobilières",null,null,null,null,null,null,null,{"$f":"#REF!+#REF!+#REF!","v":{"$error":"#REF!"}},null,null,null,"€",null,null,null,null,"€",null,null,null,null,null,null,null,null,null,null,null,null,null,"€",null,null,null,null,"€"]
[null,"Entretien et réparation",null,null,null,null,null,null,null,{"$f":"#REF!","v":{"$error":"#REF!"}},null,null,null,"€",null,null,null,null,"€",null,null,null,null,null,null,null,null,null,null,null,null,null,"€",null,null,null,null,"€"]
[null,"Assurances",null,null,null,null,null,null,null,{"$f":"#REF!+#REF!+#REF!+#REF!+#REF!+#REF!+#REF!","v":{"$error":"#REF!"}},null,null,null,"€",null,null,null,null,"€",null,null,null,null,null,null,null,null,null,null,null,null,null,"€",null,null,null,null,"€"]
[null,"Documentation",null,null,null,null,null,null,null,{"$f":"#REF!+#REF!","v":{"$error":"#REF!"}},null,null,null,"€",null,null,null,null,"€","Région(s)"]
[null,"Divers",null,null,null,null,null,null,null,{"$f":"SUM(#REF!)-J16-J17-J18-J19-J20","v":{"$error":"#REF!"}},null,null,null,"€",null,null,null,null,"€",null,null,null,null,null,null,null,null,null,null,null,null,null,"€",null,null,null,null,"€"]
[null,"62-Autres services extérieurs",null,null,null,null,null,null,null,null,null,null,null,null,null,null,null,null,null,"Département(s)"]
[null,"Rémunérations intermédiaires et honoraires",null,null,null,null,null,null,null,{"$f":"#REF!","v":{"$error":"#REF!"}},null,null,null,"€",null,null,null,null,"€",null,null,null,null,null,null,null,null,null,null,null,null,null,"€",null,null,null,null,"€"]
[null,"Publicité, publications",null,null,null,null,null,null,null,{"$f":"#REF!","v":{"$error":"#REF!"}},null,null,null,"€",null,null,null,null,"€","Commune(s)"]
[null,"Déplacements, missions et réceptions",null,null,null,null,null,null,null,{"$f":"#REF!+#REF!+#REF!+#REF!","v":{"$error":"#REF!"}},null,null,null,"€",null,null,null,null,"€",null,null,null,null,null,null,null,null,null,null,null,null,null,"€",null,null,null,null,"€"]
[null,"Frais postaux et de télécommunication",null,null,null,null,null,null,null,{"$f":"#REF!","v":{"$error":"#REF!"}},null,null,null,"€",null,null,null,null,"€","Organismes sociaux (à détailler)"]
[null,"Services bancaires",null,null,null,null,null,null,null,{"$f":"#REF!","v":{"$error":"#REF!"}},null,null,null,"€",null,null,null,null,"€",null,null,null,null,null,null,null,null,null,null,null,null,null,"€",null,null,null,null,"€"]
[null,"Divers",null,null,null,null,null,null,null,{"$f":"SUM(#REF!)-J23-J24-J25-J26-J27","v":{"$error":"#REF!"}},null,null,null,"€",null,null,null,null,"€",null,null,null,null,null,null,null,null,null,null,null,null,null,"€",null,null,null,null,"€"]
[null,"63-Impôts et taxes",null,null,null,null,null,null,null,null,null,null,null,null,null,null,null,null,null,null,null,null,null,null,null,null,null,null,null,null,null,null,"€",null,null,null,null,"€"]
[null,"Impôts et taxes sur rémunérations",null,null,null,null,null,null,null,{"$f":"#REF!+#REF!+#REF!+#REF!+#REF!+#REF!","v":{"$error":"#REF!"}},null,null,null,"€",null,null,null,null,"€",null,null,null,null,null,null,null,null,null,null,null,null,null,"€",null,null,null,null,"€"]
[null,"Autres impôts et taxes",null,null,null,null,null,null,null,{"$f":"SUM(#REF!)-J30","v":{"$error":"#REF!"}},null,null,null,"€",null,null,null,null,"€","Fonds européens",null,null,null,null,null,null,null,null,null,null,null,null,"€",null,null,null,null,"€"]
[null,null,null,null,null,null,null,null,null,null,null,null,null,null,null,null,null,null,null,"CNASEA (emplois aidés)",null,null,null,null,null,null,null,null,null,null,null,null,"€",null,null,null,null,"€"]
[null,"64-Charges de personnel",null,null,null,null,null,null,null,null,null,null,null,null,null,null,null,null,null,"Autres (précisez)",null,null,null,null,null,null,null,null,null,null,null,null,"€",null,null,null,null,"€"]
[null,null,null,null,null,null,null,null,null,null,null,null,null,null,null,null,null,null,null,null,null,null,null,null,null,null,null,null,null,null,null,null,"€",null,null,null,null,"€"]
[null,"Rémunérations du personnel",null,null,null,null,null,null,null,{"$f":"#REF!","v":{"$error":"#REF!"}},null,null,null,"€",null,null,null,null,"€",null,null,null,null,null,null,null,null,null,null,null,null,null,"€",null,null,null,null,"€"]
[null,"Charges sociales",null,null,null,null,null,null,null,{"$f":"#REF!+#REF!+#REF!+#REF!","v":{"$error":"#REF!"}},null,null,null,"€",null,null,null,null,"€",null,null,null,null,null,null,null,null,null,null,null,null,null,"€",null,null,null,null,"€"]
[null,"Autres charges de personnel",null,null,null,null,null,null,null,{"$f":"SUM(#REF!)-J35-J36","v":{"$error":"#REF!"}},null,null,null,"€",null,null,null,null,"€",null,null,null,null,null,null,null,null,null,null,null,null,null,"€",null,null,null,null,"€"]
[null,null,null,null,null,null,null,null,null,null,null,null,null,null,null,null,null,null,null,"75-Autres produits de gestion courante"]
[null,null,null,null,null,null,null,null,null,null,null,null,null,null,null,null,null,null,null,"Cotisations",null,null,null,null,null,null,null,null,{"$f":"#REF!","v":{"$error":"#REF!"}},null,null,null,"€",null,null,null,null,"€"]
[null,"65-Autres charges de gestion courante",null,null,null,null,null,null,null,{"$f":"SUM(#REF!)","v":{"$error":"#REF!"}},null,null,null,"€",null,null,null,null,"€","Autres (précisez)",null,null,null,null,null,null,null,null,{"$f":"SUM(#REF!)-AC39","v":{"$error":"#REF!"}},null,null,null,"€",null,null,null,null,"€"]
[null,"66-Charges financières",null,null,null,null,null,null,null,{"$f":"SUM(#REF!)","v":{"$error":"#REF!"}},null,null,null,"€",null,null,null,null,"€","76-Produits financiers",null,null,null,null,null,null,null,null,{"$f":"SUM(#REF!)","v":{"$error":"#REF!"}},null,null,null,"€",null,null,null,null,"€"]
[null,"67-Charges exceptionnelles",null,null,null,null,null,null,null,{"$f":"SUM(#REF!)","v":{"$error":"#REF!"}},null,null,null,"€",null,null,null,null,"€","77-Produits exceptionnels",null,null,null,null,null,null,null,null,null,null,null,null,null,null,null,null,null,"€"]
[null,null,null,null,null,null,null,null,null,null,null,null,null,null,null,null,null,null,null,"Sur opérations de gestion",null,null,null,null,null,null,null,null,{"$f":"SUM(#REF!)-AC44","v":{"$error":"#REF!"}},null,null,null,"€",null,null,null,null,"€"]
[null,"68-Dotation aux amortissements,",null,null,null,null,null,null,null,{"$f":"SUM(#REF!)","v":{"$error":"#REF!"}},null,null,null,"€",null,null,null,null,"€","Sur exercices antérieurs",null,null,null,null,null,null,null,null,{"$f":"#REF!","v":{"$error":"#REF!"}},null,null,null,"€",null,null,null,null,"€"]
[null,"provisions et engagements",null,null,null,null,null,null,null,null,null,null,null,null,null,null,null,null,null,"78-Reprise sur amortissts et provisions",null,null,null,null,null,null,null,null,{"$f":"SUM(#REF!)","v":{"$error":"#REF!"}},null,null,null,"€",null,null,null,null,"€"]
[null,null,null,null,null,null,null,null,null,null,null,null,null,null,null,null,null,null,null,"79-Transfert de charges",null,null,null,null,null,null,null,null,{"$f":"SUM(#REF!)","v":{"$error":"#REF!"}},null,null,null,"€",null,null,null,null,"€"]
[null,"TOTAL DES CHARGES PREVISIONNELLES",null,null,null,null,null,null,null,{"$f":"SUM(J8:M46)","v":{"$error":"#REF!"}},null,null,null,"€",{"$f":"SUM(O8:R46)","v":0},null,null,null,"€","TOTAL DES PRODUITS PREVISIONNELS",null,null,null,null,null,null,null,null,{"$f":"SUM(AC8:AF46)","v":{"$error":"#REF!"}},null,null,null,"€",{"$f":"IF(SUM(AH8:AK46)=O47,SUM(AH8:AK46),\"Déséquilibre\")","v":0},null,null,null,"€"]
[null,"86-Contributions volontaires en nature",null,null,null,null,null,null,null,null,null,null,null,null,null,null,null,null,null,"87-Contributions volontaires en nature"]
[null,"Secours en nature",null,null,null,null,null,null,null,{"$f":"#REF!","v":{"$error":"#REF!"}},null,null,null,"€",null,null,null,null,"€","Bénévolat",null,null,null,null,null,null,null,null,{"$f":"#REF!","v":{"$error":"#REF!"}},null,null,null,"€",null,null,null,null,"€"]
[null,"Mise à dispo gratuite de biens et prestations",null,null,null,null,null,null,null,{"$f":"#REF!","v":{"$error":"#REF!"}},null,null,null,"€",null,null,null,null,"€","Prestations en nature",null,null,null,null,null,null,null,null,{"$f":"#REF!","v":{"$error":"#REF!"}},null,null,null,"€",null,null,null,null,"€"]
[null,"Personnes bénévoles",null,null,null,null,null,null,null,{"$f":"#REF!","v":{"$error":"#REF!"}},null,null,null,"€",null,null,null,null,"€","Dons en nature",null,null,null,null,null,null,null,null,{"$f":"#REF!","v":{"$error":"#REF!"}},null,null,null,"€",null,null,null,null,"€"]
[null,"TOTAL DES CHARGES",null,null,null,null,null,null,null,{"$f":"SUM(J47:M51)","v":{"$error":"#REF!"}},null,null,null,"€",{"$f":"SUM(O47:R51)","v":0},null,null,null,"€","TOTAL DES PRODUITS",null,null,null,null,null,null,null,null,{"$f":"SUM(AC48:AF51)+AC47","v":{"$error":"#REF!"}},null,null,null,"€",{"$f":"SUM(AH47:AK51)","v":0},null,null,null,"€"]
[]
[null,"(1)Seules les rubriques vous concernant sont à remplir"]
[null,"(2)Indiquez à la rubrique correspondante, le montant de la subvention que vous demandez"]
[null,"(3)Ne pas indiquer les centimes d'euros"]