{"text_format":"1","workbook":"xlsx","n_sheets":12,"sheets":["formulaire de saisie (2)","Données (2)","Informations_eleves","formulaire de saisie","PERMANENCES CANTINE ET GARDERIE","GARDERIES","CANTINE","Fiche_eleve","Feuil1","explications","Données","Feuil3"],"not_rendered":{"charts":0,"images":6,"macros":1,"external_links":0,"defined_names":25,"comments":1,"pivot_tables":3},"unopened":[],"bounds":{"document_bytes":16777216,"sheet_cells":100000,"rows_first":2000,"rows_last":500,"rows_between":2000,"halvings":0,"cell_chars":16384,"cell_head_chars":4096},"cells_cut":0,"cells_raw":0,"read":"whole","date_system":"1900"}

{"sheet":"formulaire de saisie (2)","index":0,"n_rows":26,"n_cols":5,"rows_kept":26,"cut":false,"hidden":true,"merged":[]}
[]
[]
[]
[]
[]
[]
[]
[]
[]
[]
[]
[null,null,"Date",null,"2017-03-24"]
[]
[null,null,"Enfant",null,"MEGHELLI Eyleen"]
[]
[null,null,"Age",null,"+ 6 ans"]
[]
[null,null,"Garderie matin",null,"Avant 8H"]
[]
[null,null,"Cantine",null,"Present"]
[]
[null,null,"Garderie Midi",null,"Apres 13H"]
[]
[null,null,"TAP",null,"Present"]
[]
[null,null,"Garderie Soir",null,"Avant 18H"]

{"sheet":"Données (2)","index":1,"n_rows":40,"n_cols":8,"rows_kept":40,"cut":false,"hidden":true,"merged":[]}
["Liste des enfants","Age des enfants à la rentrée scolaire","Garderie Matin","Cantine","Garderie Midi","Garderie Soir","TAP","Age"]
["AKOGLIANIAN Céleste","- 6 ans","Absent","Absent","Absent","Absent","Absent","- 6 ans"]
["AKOGLIANIAN Rose",null,"Avant 8H","Present","Avant 13H","Avant 18H","Present","+ 6 ans"]
["AMRANI Tijani",null,"Apres 8H",null,"Apres 13H","Apres 18H"]
["AMRANI Zayanne"]
["ARTUS Malaury"]
["BARILLER Vincenzo"]
["BESSIÈRE Luce"]
["BODNAR Lorène"]
["BONHOURE Noémi"]
["BOURDIN Étan"]
["BOURDIN Régan"]
["DUBET Angélina"]
["CARON Baptiste"]
["CARON Kenzo"]
["FAVREAU Noham"]
["GASSET Enzo"]
["GASSET Évaé"]
["GASSET Lily"]
["GEOFFROY Rémi"]
["JALBAUD Lana"]
["LACASTAGNERATE Léandro"]
["LACROUX Kerwann"]
["LAURENT Mathéo"]
["MARIOJOULS Mia"]
["MAUREL Alexis"]
["MAUREL Rafaël"]
["MEGHELLI Aaron"]
["MEGHELLI Eyleen"]
["MEGHELLI Nolan"]
["MILLET Sorina"]
["MONSERAT Virginie"]
["ROBERT Chloé"]
["ROBERT Marc"]
["ROUCOULES Jules"]
["SARR Hylame"]
["SARR Shalima"]
["TANT Antoine"]
["TANT Jules"]
["VAN DAMME Tomi"]

{"sheet":"Informations_eleves","index":2,"n_rows":75,"n_cols":7,"rows_kept":75,"cut":false,"hidden":false,"merged":[]}
["Fichiers éleves",null,null,"moins de 6 ans",null,"2019-09-01"]
["Nom de l'enfant","Prénom","Nom enfant pour liste déroulante","date de naissance","Lieu de naissance","Age à la rentrée\n (+) ou (-) de 6 ans","Sexe"]
["AKOGLIANIAN","Céleste",{"$f":"CONCATENATE(A3,\" \",B3)","v":"AKOGLIANIAN Céleste"},"2012-06-21",null,{"$f":"IF(D3=\"\",\"\",DATEDIF(D3,$F$1,\"y\"))","v":7},"F"]
["AKOGLIANIAN","Rose",{"$f":"CONCATENATE(A4,\" \",B4)","v":"AKOGLIANIAN Rose"},"2009-07-03",null,10,"F"]
["AMRANI","Tijani","AMRANI Tijani","2012-06-25",null,7,"M"]
["AMRANI","Zayanne","AMRANI Zayanne",null,null,null,"F"]
["ARTUS","Malaury","ARTUS Malaury",null,null,null,"F"]
["BARILLER","Vincenzo","BARILLER Vincenzo","2011-11-05",null,7,"M"]
["BERNAT","Stanislas","BERNAT Stanislas",null,null,null,"M"]
["BESSIÈRE","Luce","BESSIÈRE Luce",null,null,null,"F"]
["BIDEAU ","Luna","BIDEAU  Luna","2014-07-22",null,{"$f":"IF(D11=\"\",\"\",DATEDIF(D11,$F$1,\"y\"))","v":5},"F"]
["BODNAR","Lorène","BODNAR Lorène","2011-05-03",null,8,"F"]
["BODNAR","Mylène","BODNAR Mylène","2014-08-14",null,5,"F"]
["BONHOURE","Noémi","BONHOURE Noémi",null,null,"","F"]
["BOURDIN","Étan","BOURDIN Étan","2010-02-02",null,9,"M"]
["BOURDIN ","Inaya","BOURDIN  Inaya","2016-09-23",null,2,"F"]
["BOURDIN ","Logan","BOURDIN  Logan","2014-12-08",null,4,"M"]
["BOURDIN","Régan","BOURDIN Régan","2012-01-14",null,7,"M"]
["BOUZIGUES","Ambre","BOUZIGUES Ambre","2016-09-01",null,3,"F"]
["CANAL ","Laura","CANAL  Laura","2009-06-11",null,10,"F"]
["CARON","Baptiste","CARON Baptiste",null,null,"","M"]
["CARON","Kenzo","CARON Kenzo",null,null,"","M"]
["DEMEAUTYS ","Candice","DEMEAUTYS  Candice","2015-07-07",null,4,"F"]
["DEMEAUTYS ","Ethan","DEMEAUTYS  Ethan","2010-03-11",null,9,"M"]
["DEMEAUTYS ","Romy","DEMEAUTYS  Romy","2017-08-11",null,2,"F"]
["DEMEAUTYS ","Tom ","DEMEAUTYS  Tom ","2012-02-26",null,7,"M"]
["DETTONI","Charlotte","DETTONI Charlotte","2011-05-08",null,8,"F"]
["DIJOUX","Téo","DIJOUX Téo","2015-01-30",null,4,"M"]
["DUBET","Angélina","DUBET Angélina",null,null,"","F"]
["FAVREAU","Noham","FAVREAU Noham","2010-04-28",null,9,"M"]
["FRIDEL","Cléo","FRIDEL Cléo","2016-07-13",null,3,"F"]
["FRIDEL ","Laïa","FRIDEL  Laïa","2013-03-13",null,6,"F"]
["GASSET","Aloé","GASSET Aloé","2015-05-04",null,4,"F"]
["GASSET","Enzo","GASSET Enzo",null,null,"","M"]
["GASSET","Évaé","GASSET Évaé","2013-10-23",null,5,"F"]
["GASSET","Lily","GASSET Lily","2011-10-31",null,7,"F"]
["GEOFFROY","Rémi","GEOFFROY Rémi","2013-08-26",null,6,"M"]
["GISQUET ","Cassandra","GISQUET  Cassandra","2016-06-23",null,3,"F"]
["GUYOT ","Laurent","GUYOT  Laurent","2010-09-12",null,8,"M"]
["GUYOT ","Léa ","GUYOT  Léa ","2015-10-06",null,3,"F"]
["GUILLAUME","Yoan","GUILLAUME Yoan","2016-03-26",null,3,"M"]
["JALBAUD","Lana","JALBAUD Lana",null,null,"","F"]
["LACASTAGNERATE","Diego","LACASTAGNERATE Diego","2016-04-11",null,3,"M"]
["LACASTAGNERATE","Léandro","LACASTAGNERATE Léandro","2012-06-06",null,7,"M"]
["LACROUX","Kerwann","LACROUX Kerwann",null,null,""]
["LAURENT","Mathéo","LAURENT Mathéo",null,null,"","M"]
["MARIOJOULS","Mia","MARIOJOULS Mia",null,null,"","F"]
["MARIOJOULS","Tino","MARIOJOULS Tino","2014-06-30",null,5,"M"]
["MAUREL","Alexis","MAUREL Alexis",null,null,"","M"]
["MAUREL","Rafaël","MAUREL Rafaël",null,null,"","M"]
["MEFFRE ","Gabin","MEFFRE  Gabin","2015-06-15",null,4,"M"]
["MEGHELLI PEREZ","Aaron","MEGHELLI PEREZ Aaron","2011-02-22",null,8,"M"]
["MEGHELLI","Eyleen","MEGHELLI Eyleen","2019-05-25",null,0,"F"]
["MEGHELLI","Nolan","MEGHELLI Nolan",null,null,"","M"]
["MILLET","Sorina","MILLET Sorina","2011-06-28",null,8,"F"]
["MONSERAT","Virginie","MONSERAT Virginie",null,null,"","F"]
["PRAT","Rhyan","PRAT Rhyan","2012-03-22",null,7,"M"]
["ROBERT","Chloé","ROBERT Chloé",null,null,"","F"]
["ROBERT","Marc","ROBERT Marc",null,null,"","M"]
["ROSSI","Clara","ROSSI Clara","2013-06-27",null,6,"F"]
["ROUCOULES","Jules","ROUCOULES Jules","2011-12-18",null,7,"M"]
["ROUCOULES","Margaux","ROUCOULES Margaux","2015-01-06",null,4,"F"]
["SARR","Hylame","SARR Hylame",null,null,"","M"]
["SARR","Shalima","SARR Shalima",null,null,"","F"]
["TANT","Antoine","TANT Antoine",null,null,"","M"]
["TANT","Jules","TANT Jules",null,null,"","M"]
["THOMAS","Lola","THOMAS Lola","2017-01-28",null,2,"F"]
["VAN DAMME","Tomi",{"$f":"CONCATENATE(A68,\" \",B68)","v":"VAN DAMME Tomi"},null,null,"","M"]
[null,null," ",null,null,""]
[null,null,null,null,null,""]
[null,null," ",null,null,""]
[null,null," ",null,null,""]
[null,null," ",null,null,""]
[null,null," ",null,null,""]
["Joël",null,{"$f":"CONCATENATE(#REF!,\" \",B75)","v":{"$error":"#REF!"}},null,null,""]

{"sheet":"formulaire de saisie","index":3,"n_rows":38,"n_cols":15,"rows_kept":38,"cut":false,"hidden":false,"merged":[]}
[]
[]
[]
[]
[]
[]
[]
[]
[]
[]
[]
[null,null,"Date du jour",null,"2017-05-08"]
[]
[null,null,"Enfant",null,"AKOGLIANIAN Céleste"]
[]
[null,null,"Age",null,{"$f":"VLOOKUP(E14,Informations_eleves!C3:G74,6,FALSE)","v":{"$error":"#REF!"}}]
[]
[null,null,"Cantine",null,"Présent"]
[null,null,null,null,null,null,null,null,null,null,null,null,null,null,"SI(RECHERCHEV(E14;Informations_eleves!C3:S74;3;5)>6;\"+ de 6 ans\";\"- de 6 ans\")"]
[]
[]
[null,null,"Garderie matin",null,"Présent"]
[]
[null,null,"Garderie Midi",null,"Absent"]
[]
[null,null,"TAP",null,"Present"]
[]
[null,null,"Garderie Soir",null,"Présent"]
[]
[null,null,"Année Scolaire",null,2019]
[]
[]
[]
[]
[]
[]
[]
[null,null,null,null,{"$f":"IF($A:$A=\"\",\"\",VLOOKUP($A:$A,MaBase,2,0))","v":""}]

{"sheet":"PERMANENCES CANTINE ET GARDERIE","index":4,"n_rows":37,"n_cols":8,"rows_kept":37,"cut":false,"hidden":false,"merged":[]}
["Date","Nom Enfant","Age","Cantine","Garderie matin","Garderie Midi","TAP","Garderie Soir"]
["2017-05-08","AKOGLIANIAN Céleste",{"$f":"VLOOKUP(#REF!,Informations_eleves!#REF!,6,FALSE)","v":{"$error":"#REF!"}},1,1,0,null,1]
["2017-05-08","CANAL  Laura",{"$f":"VLOOKUP(#REF!,Informations_eleves!#REF!,3,5)","v":{"$error":"#REF!"}},1,1,0,null,1]
["2017-05-08","BODNAR Mylène",{"$f":"VLOOKUP(#REF!,Informations_eleves!#REF!,3,5)","v":{"$error":"#REF!"}},1,1,0,null,1]
["2017-05-08","AKOGLIANIAN Rose",{"$f":"VLOOKUP(#REF!,Informations_eleves!#REF!,3,5)","v":{"$error":"#REF!"}},1,1,0,null,1]
["2017-05-08","DEMEAUTYS  Romy","- 6 ans",1,1,0,null,1]
["2017-05-08","DEMEAUTYS  Romy","- 6 ans",1,1,0,null,1]
["2017-05-08","DEMEAUTYS  Romy","- 6 ans",1,1,0,null,1]
["2017-05-08","AKOGLIANIAN Céleste","+ 6 ans",1,1,0,null,1]
["2017-05-08","AKOGLIANIAN Céleste","+ 6 ans",0,1,1,null,1]
["2017-05-08","AKOGLIANIAN Céleste","+ 6 ans",0,0,1,null,0]
["2017-05-08","AKOGLIANIAN Céleste","+ 6 ans",1,0,1,null,0]
["2017-06-05","TANT Jules","+ 6 ans",1,1,1,null,1]
["2017-06-16","TANT Jules","+ 6 ans",1,1,1,null,1]
["2017-05-23","SARR Shalima","+ 6 ans",1,1,1,null,1]
["2017-05-19","SARR Shalima","+ 6 ans",1,1,1,null,1]
["2017-04-20","SARR Shalima","+ 6 ans",1,1,1,null,1]
["2017-04-18","SARR Shalima","- 6 ans",1,1,1,null,1]
["2017-04-14","SARR Shalima","- 6 ans",1,1,1,null,1]
["2017-04-11","SARR Shalima","- 6 ans",1,1,1,null,1]
["2017-03-17","SARR Shalima","- 6 ans",1,1,1,null,1]
["2017-03-16","SARR Shalima","- 6 ans",1,1,1,null,1]
["2017-03-14","SARR Shalima","- 6 ans",1,1,1,null,1]
["2017-03-13","SARR Shalima","- 6 ans",1,1,1,null,1]
["2017-01-13","SARR Shalima","- 6 ans",1,1,1,null,1]
["2017-01-12","SARR Shalima","- 6 ans",1,1,1,null,1]
["2017-01-03","SARR Shalima","- 6 ans",1,1,1,null,1]
["2017-01-02","SARR Shalima","- 6 ans",1,1,1,null,1]
["2017-02-10","ROUCOULES Jules","- 6 ans",1,1,1,null,1]
["2017-02-09","ROUCOULES Jules","- 6 ans",1,1,1,null,1]
["2017-02-07","ROUCOULES Jules","- 6 ans",1,1,1,null,1]
["2017-02-06","ROUCOULES Jules","- 6 ans",1,1,1,null,1]
["2017-02-02","ROUCOULES Jules","- 6 ans",1,1,1,null,1]
["2017-01-24","ROUCOULES Jules","- 6 ans",1,1,1,null,1]
["2017-01-19","ROUCOULES Jules","- 6 ans",1,1,1,null,1]
["2017-01-12","ROUCOULES Jules","- 6 ans",1,1,1,null,1]
["2017-03-21","ROUCOULES Jules","- 6 ans",1,1,1,null,1]

{"sheet":"GARDERIES","index":5,"n_rows":30,"n_cols":9,"rows_kept":30,"cut":false,"hidden":false,"merged":[[0,0,0,8],[4,0,28,0],[29,0,29,3],[4,1,12,1],[20,1,20,3],[21,1,27,1],[28,1,28,3],[19,2,19,3],[22,2,22,3],[23,2,26,2],[27,2,27,3],[4,2,6,2],[7,2,7,3],[8,2,11,2],[12,2,12,3],[14,2,18,2],[13,1,13,3],[14,1,19,1]]}
["CALCUL DU MONTANT A REGLER"]
[]
[null,null,null,null,"Valeurs"]
["Trimestres","Mois","Nom Enfant","Date","Garderie Midi ","Garderie matin ","Garderie Soir ","Nombre de garderie ","Calcul garderies "]
["Trimestre1","janv","ROUCOULES Jules","12-janv",1,1,1,3,4.5]
[null,null,null,"19-janv",1,1,1,3,4.5]
[null,null,null,"24-janv",1,1,1,3,4.5]
[null,null,"Total ROUCOULES Jules",null,3,3,3,9,13.5]
[null,null,"SARR Shalima","02-janv",1,1,1,3,4.5]
[null,null,null,"03-janv",1,1,1,3,4.5]
[null,null,null,"12-janv",1,1,1,3,4.5]
[null,null,null,"13-janv",1,1,1,3,4.5]
[null,null,"Total SARR Shalima",null,4,4,4,12,18]
[null,"Total janv",null,null,7,7,7,21,31.5]
[null,"févr","ROUCOULES Jules","02-févr",1,1,1,3,4.5]
[null,null,null,"06-févr",1,1,1,3,4.5]
[null,null,null,"07-févr",1,1,1,3,4.5]
[null,null,null,"09-févr",1,1,1,3,4.5]
[null,null,null,"10-févr",1,1,1,3,4.5]
[null,null,"Total ROUCOULES Jules",null,5,5,5,15,22.5]
[null,"Total févr",null,null,5,5,5,15,22.5]
[null,"mars","ROUCOULES Jules","21-mars",1,1,1,3,4.5]
[null,null,"Total ROUCOULES Jules",null,1,1,1,3,4.5]
[null,null,"SARR Shalima","13-mars",1,1,1,3,4.5]
[null,null,null,"14-mars",1,1,1,3,4.5]
[null,null,null,"16-mars",1,1,1,3,4.5]
[null,null,null,"17-mars",1,1,1,3,4.5]
[null,null,"Total SARR Shalima",null,4,4,4,12,18]
[null,"Total mars",null,null,5,5,5,15,22.5]
["Total Trimestre1",null,null,null,17,17,17,51,76.5]

{"sheet":"CANTINE","index":6,"n_rows":433,"n_cols":3,"rows_kept":433,"cut":false,"hidden":false,"merged":[]}
[]
[]
[null,"Valeurs"]
["Étiquettes de lignes","Somme de Cantine","Somme de Montant_cantine"]
["AKOGLIANIAN Céleste",3]
["Trimestre2"]
["mai"]
["08-mai",3,4.5]
["DEMEAUTYS  Romy",3]
["Trimestre2"]
["mai"]
["08-mai",3,4.5]
["ROUCOULES Jules",9]
["Trimestre1"]
["janv"]
["12-janv",1,1.5]
["19-janv",1,1.5]
["24-janv",1,1.5]
["févr"]
["02-févr",1,1.5]
["06-févr",1,1.5]
["07-févr",1,1.5]
["09-févr",1,1.5]
["10-févr",1,1.5]
["mars"]
["21-mars",1,1.5]
["SARR Shalima",14]
["Trimestre1"]
["janv"]
["02-janv",1,1.5]
["03-janv",1,1.5]
["12-janv",1,1.5]
["13-janv",1,1.5]
["mars"]
["13-mars",1,1.5]
["14-mars",1,1.5]
["16-mars",1,1.5]
["17-mars",1,1.5]
["Trimestre2"]
["avr"]
["11-avr",1,1.5]
["14-avr",1,1.5]
["18-avr",1,1.5]
["20-avr",1,1.5]
["mai"]
["19-mai",1,1.5]
["23-mai",1,1.5]
["TANT Jules",2]
["Trimestre2"]
["juin"]
["05-juin",1,1.5]
["16-juin",1,1.5]
["AKOGLIANIAN Rose",1]
["Trimestre2"]
["mai"]
["08-mai",1,1.5]
["CANAL  Laura",1]
["Trimestre2"]
["mai"]
["08-mai",1,1.5]
["BODNAR Mylène",1]
["Trimestre2"]
["mai"]
["08-mai",1,1.5]
["Nombre (vide)"]
["Nombre 01-janv"]
["Nombre 02-janv",1]
["Nombre 03-janv",1]
["Nombre 04-janv"]
["Nombre 05-janv"]
["Nombre 06-janv"]
["Nombre 07-janv"]
["Nombre 08-janv"]
["Nombre 09-janv"]
["Nombre 10-janv"]
["Nombre 11-janv"]
["Nombre 12-janv",2]
["Nombre 13-janv",1]
["Nombre 14-janv"]
["Nombre 15-janv"]
["Nombre 16-janv"]
["Nombre 17-janv"]
["Nombre 18-janv"]
["Nombre 19-janv",1]
["Nombre 20-janv"]
["Nombre 21-janv"]
["Nombre 22-janv"]
["Nombre 23-janv"]
["Nombre 24-janv",1]
["Nombre 25-janv"]
["Nombre 26-janv"]
["Nombre 27-janv"]
["Nombre 28-janv"]
["Nombre 29-janv"]
["Nombre 30-janv"]
["Nombre 31-janv"]
["Nombre 01-févr"]
["Nombre 02-févr",1]
["Nombre 03-févr"]
["Nombre 04-févr"]
["Nombre 05-févr"]
["Nombre 06-févr",1]
["Nombre 07-févr",1]
["Nombre 08-févr"]
["Nombre 09-févr",1]
["Nombre 10-févr",1]
["Nombre 11-févr"]
["Nombre 12-févr"]
["Nombre 13-févr"]
["Nombre 14-févr"]
["Nombre 15-févr"]
["Nombre 16-févr"]
["Nombre 17-févr"]
["Nombre 18-févr"]
["Nombre 19-févr"]
["Nombre 20-févr"]
["Nombre 21-févr"]
["Nombre 22-févr"]
["Nombre 23-févr"]
["Nombre 24-févr"]
["Nombre 25-févr"]
["Nombre 26-févr"]
["Nombre 27-févr"]
["Nombre 28-févr"]
["Nombre 29-févr"]
["Nombre 01-mars"]
["Nombre 02-mars"]
["Nombre 03-mars"]
["Nombre 04-mars"]
["Nombre 05-mars"]
["Nombre 06-mars"]
["Nombre 07-mars"]
["Nombre 08-mars"]
["Nombre 09-mars"]
["Nombre 10-mars"]
["Nombre 11-mars"]
["Nombre 12-mars"]
["Nombre 13-mars",1]
["Nombre 14-mars",1]
["Nombre 15-mars"]
["Nombre 16-mars",1]
["Nombre 17-mars",1]
["Nombre 18-mars"]
["Nombre 19-mars"]
["Nombre 20-mars"]
["Nombre 21-mars",1]
["Nombre 22-mars"]
["Nombre 23-mars"]
["Nombre 24-mars"]
["Nombre 25-mars"]
["Nombre 26-mars"]
["Nombre 27-mars"]
["Nombre 28-mars"]
["Nombre 29-mars"]
["Nombre 30-mars"]
["Nombre 31-mars"]
["Nombre 01-avr"]
["Nombre 02-avr"]
["Nombre 03-avr"]
["Nombre 04-avr"]
["Nombre 05-avr"]
["Nombre 06-avr"]
["Nombre 07-avr"]
["Nombre 08-avr"]
["Nombre 09-avr"]
["Nombre 10-avr"]
["Nombre 11-avr",1]
["Nombre 12-avr"]
["Nombre 13-avr"]
["Nombre 14-avr",1]
["Nombre 15-avr"]
["Nombre 16-avr"]
["Nombre 17-avr"]
["Nombre 18-avr",1]
["Nombre 19-avr"]
["Nombre 20-avr",1]
["Nombre 21-avr"]
["Nombre 22-avr"]
["Nombre 23-avr"]
["Nombre 24-avr"]
["Nombre 25-avr"]
["Nombre 26-avr"]
["Nombre 27-avr"]
["Nombre 28-avr"]
["Nombre 29-avr"]
["Nombre 30-avr"]
["Nombre 01-mai"]
["Nombre 02-mai"]
["Nombre 03-mai"]
["Nombre 04-mai"]
["Nombre 05-mai"]
["Nombre 06-mai"]
["Nombre 07-mai"]
["Nombre 08-mai",11]
["Nombre 09-mai"]
["Nombre 10-mai"]
["Nombre 11-mai"]
["Nombre 12-mai"]
["Nombre 13-mai"]
["Nombre 14-mai"]
["Nombre 15-mai"]
["Nombre 16-mai"]
["Nombre 17-mai"]
["Nombre 18-mai"]
["Nombre 19-mai",1]
["Nombre 20-mai"]
["Nombre 21-mai"]
["Nombre 22-mai"]
["Nombre 23-mai",1]
["Nombre 24-mai"]
["Nombre 25-mai"]
["Nombre 26-mai"]
["Nombre 27-mai"]
["Nombre 28-mai"]
["Nombre 29-mai"]
["Nombre 30-mai"]
["Nombre 31-mai"]
["Nombre 01-juin"]
["Nombre 02-juin"]
["Nombre 03-juin"]
["Nombre 04-juin"]
["Nombre 05-juin",1]
["Nombre 06-juin"]
["Nombre 07-juin"]
["Nombre 08-juin"]
["Nombre 09-juin"]
["Nombre 10-juin"]
["Nombre 11-juin"]
["Nombre 12-juin"]
["Nombre 13-juin"]
["Nombre 14-juin"]
["Nombre 15-juin"]
["Nombre 16-juin",1]
["Nombre 17-juin"]
["Nombre 18-juin"]
["Nombre 19-juin"]
["Nombre 20-juin"]
["Nombre 21-juin"]
["Nombre 22-juin"]
["Nombre 23-juin"]
["Nombre 24-juin"]
["Nombre 25-juin"]
["Nombre 26-juin"]
["Nombre 27-juin"]
["Nombre 28-juin"]
["Nombre 29-juin"]
["Nombre 30-juin"]
["Nombre 01-juil"]
["Nombre 02-juil"]
["Nombre 03-juil"]
["Nombre 04-juil"]
["Nombre 05-juil"]
["Nombre 06-juil"]
["Nombre 07-juil"]
["Nombre 08-juil"]
["Nombre 09-juil"]
["Nombre 10-juil"]
["Nombre 11-juil"]
["Nombre 12-juil"]
["Nombre 13-juil"]
["Nombre 14-juil"]
["Nombre 15-juil"]
["Nombre 16-juil"]
["Nombre 17-juil"]
["Nombre 18-juil"]
["Nombre 19-juil"]
["Nombre 20-juil"]
["Nombre 21-juil"]
["Nombre 22-juil"]
["Nombre 23-juil"]
["Nombre 24-juil"]
["Nombre 25-juil"]
["Nombre 26-juil"]
["Nombre 27-juil"]
["Nombre 28-juil"]
["Nombre 29-juil"]
["Nombre 30-juil"]
["Nombre 31-juil"]
["Nombre 01-août"]
["Nombre 02-août"]
["Nombre 03-août"]
["Nombre 04-août"]
["Nombre 05-août"]
["Nombre 06-août"]
["Nombre 07-août"]
["Nombre 08-août"]
["Nombre 09-août"]
["Nombre 10-août"]
["Nombre 11-août"]
["Nombre 12-août"]
["Nombre 13-août"]
["Nombre 14-août"]
["Nombre 15-août"]
["Nombre 16-août"]
["Nombre 17-août"]
["Nombre 18-août"]
["Nombre 19-août"]
["Nombre 20-août"]
["Nombre 21-août"]
["Nombre 22-août"]
["Nombre 23-août"]
["Nombre 24-août"]
["Nombre 25-août"]
["Nombre 26-août"]
["Nombre 27-août"]
["Nombre 28-août"]
["Nombre 29-août"]
["Nombre 30-août"]
["Nombre 31-août"]
["Nombre 01-sept"]
["Nombre 02-sept"]
["Nombre 03-sept"]
["Nombre 04-sept"]
["Nombre 05-sept"]
["Nombre 06-sept"]
["Nombre 07-sept"]
["Nombre 08-sept"]
["Nombre 09-sept"]
["Nombre 10-sept"]
["Nombre 11-sept"]
["Nombre (vide)"]
["Nombre 01-janv"]
["Nombre 02-janv",1]
["Nombre 03-janv",1]
["Nombre 04-janv"]
["Nombre 05-janv"]
["Nombre 06-janv"]
["Nombre 07-janv"]
["Nombre 08-janv"]
["Nombre 09-janv"]
["Nombre 10-janv"]
["Nombre 11-janv"]
["Nombre 12-janv",2]
["Nombre 13-janv",1]
["Nombre 14-janv"]
["Nombre 15-janv"]
["Nombre 16-janv"]
["Nombre 17-janv"]
["Nombre 18-janv"]
["Nombre 19-janv",1]
["Nombre 20-janv"]
["Nombre 21-janv"]
["Nombre 22-janv"]
["Nombre 23-janv"]
["Nombre 24-janv",1]
["Nombre 25-janv"]
["Nombre 26-janv"]
["Nombre 27-janv"]
["Nombre 28-janv"]
["Nombre 29-janv"]
["Nombre 30-janv"]
["Nombre 31-janv"]
["Nombre 01-févr"]
["Nombre 02-févr",1]
["Nombre 03-févr"]
["Nombre 04-févr"]
["Nombre 05-févr"]
["Nombre 06-févr",1]
["Nombre 07-févr",1]
["Nombre 08-févr"]
["Nombre 09-févr",1]
["Nombre 10-févr",1]
["Nombre 11-févr"]
["Nombre 12-févr"]
["Nombre 13-févr"]
["Nombre 14-févr"]
["Nombre 15-févr"]
["Nombre 16-févr"]
["Nombre 17-févr"]
["Nombre 18-févr"]
["Nombre 19-févr"]
["Nombre 20-févr"]
["Nombre 21-févr"]
["Nombre 22-févr"]
["Nombre 23-févr"]
["Nombre 24-févr"]
["Nombre 25-févr"]
["Nombre 26-févr"]
["Nombre 27-févr"]
["Nombre 28-févr"]
["Nombre 29-févr"]
["Nombre 01-mars"]
["Nombre 02-mars"]
["Nombre 03-mars"]
["Nombre 04-mars"]
["Nombre 05-mars"]
["Nombre 06-mars"]
["Nombre 07-mars"]
["Nombre 08-mars"]
["Nombre 09-mars"]
["Nombre 10-mars"]
["Nombre 11-mars"]
["Nombre 12-mars"]
["Nombre 13-mars",1]
["Nombre 14-mars",1]
["Nombre 15-mars"]
["Nombre 16-mars",1]
["Nombre 17-mars",1]
["Nombre 18-mars"]
["Nombre 19-mars"]
{"$rows_left_out":34}
{"sheet":"Fiche_eleve","index":7,"n_rows":50,"n_cols":8,"rows_kept":50,"cut":false,"hidden":false,"merged":[[40,0,40,7],[8,0,8,7],[22,0,22,7],[28,0,28,7],[18,3,18,7],[16,0,16,7],[35,0,35,7]]}
[]
[]
[]
[]
[]
[]
[]
[]
["Identité élève"]
[]
[null,"Nom",null,"BONHOURE Noémi",null,"Prénom",null,{"$f":"VLOOKUP(D11,Informations_eleves!A3:G75,2,TRUE)","v":"Noémi"}]
[]
[null,"né(e) le :",null,{"$f":"VLOOKUP(D11,Informations_eleves!A3:G75,4,TRUE)","v":"00:00:00"},null,"à",null,{"$f":"VLOOKUP(D11,Informations_eleves!A3:G75,5,TRUE)","v":0}]
[]
[null,"Age à la rentrée",null,{"$f":"VLOOKUP(D11,Informations_eleves!A3:G75,6,TRUE)","v":""},null,"Sexe",null,{"$f":"VLOOKUP(D11,Informations_eleves!A3:G75,7,TRUE)","v":"F"}]
[]
["Adresse élève"]
[]
[null,"Rue"]
[]
[null,"Code Postal",null,null,null,"Ville"]
[]
["Fils de :"]
[]
[null,"Nom du père",null,null,null,"Tél. du père"]
[]
[null,null,null,null,null,"E.mail du père"]
[]
["et de :"]
[]
[null,"Nom de la mère",null,null,null,"Tél. de la mère"]
[]
[null,null,null,null,null,"E.mail de la mère"]
[]
[]
["Imposition"]
[]
[null,"Imposable"]
[]
[]
["Assurance"]
[]
[null,"ASSURANCE"]
[]
[null,"N° CONTRAT"]
[]
[]
[]
[]
[null,null,null,"Repas avec ou sans porc"]

{"sheet":"Feuil1","index":8,"n_rows":6,"n_cols":6,"rows_kept":6,"cut":false,"hidden":false,"merged":[]}
["Nom Enfant","DEMEAUTYS  Romy"]
[]
[null,"Valeurs"]
["Étiquettes de lignes","Somme de Garderie matin","Somme de Cantine","Somme de Garderie Midi","Somme de TAP","Somme de Garderie Soir"]
["2017-05-08",3,3,0,null,3]
["Total général",3,3,0,null,3]

{"sheet":"explications","index":9,"n_rows":20,"n_cols":4,"rows_kept":20,"cut":false,"hidden":false,"merged":[]}
["Champ calculé"]
["Ordre de résolution","Champ","Formule"]
[1,"Nombre de garderie","='Garderie matin' +'Garderie Midi' +'Garderie Soir'"]
[]
["Élément calculé"]
["Ordre de résolution","Élément","Formule"]
[]
[]
["Commentaire :","Quand une cellule est mise à jour avec plus d'une formule,"]
[null,"la valeur est établie par la dernière formule dans l'ordre de résolution."]
[]
[null,"Pour modifier l'ordre de résolution de plusieurs champs ou éléments calculés,"]
[null,"dans l'onglet Options, groupe Outils, cliquez sur Formules, puis sur Ordre de résolution."]
[]
[]
[]
[]
["Mise en forme conditionnelle"]
["Appliquer une couleur pour faire ressortir dans le tableau tous les enfants de moins de 6 ans à une date précise "]
["Point de départ la veille de la rentrée scolaire soit en 2019",null,null,"01/09/2019 pour la rentrée scolaire 2019/2020"]

{"sheet":"Données","index":10,"n_rows":40,"n_cols":11,"rows_kept":40,"cut":false,"hidden":false,"merged":[]}
["Liste des enfants","Age des enfants à la rentrée scolaire","Garderie Matin","Cantine","Garderie Midi","Garderie Soir","TAP","Age","Imposable","Sexe","Porc"]
["AKOGLIANIAN Céleste","- 6 ans","Absent","Absent","Absent","Absent","Absent","- 6 ans","Oui","F","Avec "]
["AKOGLIANIAN Rose","+ 6 ans","Présent","Présent","Présent","Présent","Present","+ 6 ans","Non","M","SANS"]
["AMRANI Tijani"]
["AMRANI Zayanne"]
["ARTUS Malaury"]
["BARILLER Vincenzo"]
["BESSIÈRE Luce"]
["BODNAR Lorène"]
["BONHOURE Noémi"]
["BOURDIN Étan"]
["BOURDIN Régan"]
["DUBET Angélina"]
["CARON Baptiste"]
["CARON Kenzo"]
["FAVREAU Noham"]
["GASSET Enzo"]
["GASSET Évaé"]
["GASSET Lily"]
["GEOFFROY Rémi"]
["JALBAUD Lana"]
["LACASTAGNERATE Léandro"]
["LACROUX Kerwann"]
["LAURENT Mathéo"]
["MARIOJOULS Mia"]
["MAUREL Alexis"]
["MAUREL Rafaël"]
["MEGHELLI Aaron"]
["MEGHELLI Eyleen"]
["MEGHELLI Nolan"]
["MILLET Sorina"]
["MONSERAT Virginie"]
["ROBERT Chloé"]
["ROBERT Marc"]
["ROUCOULES Jules"]
["SARR Hylame"]
["SARR Shalima"]
["TANT Antoine"]
["TANT Jules"]
["VAN DAMME Tomi"]

{"sheet":"Feuil3","index":11,"n_rows":8,"n_cols":8,"rows_kept":8,"cut":false,"hidden":false,"merged":[]}
[]
[]
[]
[]
["Sheets(\"Feuil1\").Select",null,null,null,null,null,null,"Sub Copier()"]
["Range(\"K1\").Select",null,null,null,null,null,null,"Sheets(1).Range(\"K1\", Range(\"K1\").End(xlDown)).Copy"]
["Range(Selection, Selection.End(xlDown)).Select",null,null,null,null,null,null,"Sheets(\"Feuil2\").Range(\"C1\").PasteSpecial Paste:=xlPasteValues"]
["Selection.Copy Destination:=ThisWorkbook.Sheets(\"Feuil2\").Range(\"C1\")",null,null,null,null,null,null,"End Sub"]