{"text_format":"1","workbook":"xlsx","n_sheets":15,"sheets":["Accueil Produits","Produits","SP","MP","Référentiels","Accueil Menus","BD Menus","Saisie MMR","Modif MMR","Menus MMR","Jours Fériés","Menus VWE","Saisie VWE","Modif VWE","Saisie MJ"],"not_rendered":{"charts":0,"images":2,"macros":1,"external_links":1,"defined_names":67,"comments":4,"pivot_tables":0},"unopened":[],"bounds":{"document_bytes":16777216,"sheet_cells":100000,"rows_first":2000,"rows_last":500,"rows_between":2000,"halvings":0,"cell_chars":16384,"cell_head_chars":4096},"cells_cut":0,"cells_raw":0,"read":"whole","date_system":"1900"}

{"sheet":"Accueil Produits","index":0,"n_rows":3,"n_cols":5,"rows_kept":3,"cut":false,"hidden":false,"merged":[]}
["Accueil Produits"]
[]
[null,null,"Choix Catégorie",null,"Choix Produit"]

{"sheet":"Produits","index":1,"n_rows":146,"n_cols":15,"rows_kept":146,"cut":false,"hidden":false,"merged":[]}
["Intitulé","Numéro création","Code catégorie","Nom catégorie","Code produit","Nom produit","Code jour","Nom jour","Code conditionnement","Nom conditionnement","Code destination","Nom destination","Code à modifier","Nom à modifier","Date création"]
["DMR01-1",1,"CC01","DMR","DMR01","Pomme","CJ05","Lundi à vendredi midis","COCO16","1 sachet de 2 kilogrammes. 1 pomme pour 1 repas","CD02","Menus midi retraite","LCÀM01","Non","2019-08-20"]
["DS01-1",1,"CC02","DS","DS01","Pomme","CJ06","lundi à vendredi soirs","COCO16","1 sachet de 2 kilogrammes. 1 pomme pour 1 repas","CD01","Menus journaliers","LCÀM01","Non","2019-08-20"]
["DWE01-1",1,"CC03","DWE","DWE01","Ananas","CJ10","Samedi et dimanche midis et soirs","COCO30","Unité : 1 pour 4 repas","CD01","Menus journaliers","LCÀM01","Non","2019-08-20"]
["DWE02-2",2,"CC03","DWE","DWE02","Autres fruits","CJ10","Samedi et dimanche midis et soirs","COCO32","Unité : 2 à 4 pour 1 repas","CD01","Menus journaliers","LCÀM01","Non","2019-08-20"]
["DWE03-3",3,"CC03","DWE","DWE03","Avocats","CJ10","Samedi et dimanche midis et soirs","COCO28","Unité : 1 pour 1 repas","CD01","Menus journaliers","LCÀM01","Non","2019-08-20"]
["DWE04-4",4,"CC03","DWE","DWE04","Bananes","CJ10","Samedi et dimanche midis et soirs","COCO28","Unité : 1 pour 1 repas","CD01","Menus journaliers","LCÀM01","Non","2019-08-20"]
["DWE05-5",5,"CC03","DWE","DWE05","Clémentines","CJ10","Samedi et dimanche midis et soirs","COCO32","Unité : 2 à 4 pour 1 repas","CD01","Menus journaliers","LCÀM01","Non","2019-08-20"]
["DWE06-6",6,"CC03","DWE","DWE06","Crème","CJ10","Samedi et dimanche midis et soirs","COCO10","1 pack de 4 pots pour le week-end. 1 pot pour 1 repas","CD01","Menus journaliers","LCÀM01","Non","2019-08-20"]
["DWE07-7",7,"CC03","DWE","DWE07","Dattes","CJ10","Samedi et dimanche midis et soirs","COCO15","1 paquet pour 4 repas","CD01","Menus journaliers","LCÀM01","Non","2019-08-20"]
{"$rows_left_out":137}
{"sheet":"SP","index":2,"n_rows":16,"n_cols":2,"rows_kept":16,"cut":false,"hidden":true,"merged":[[0,0,0,1]]}
["Création d'un produit"]
[]
["Numéro création",{"$f":"MAX(IF(TableProduits[Code catégorie]=$B$4,TableProduits[Numéro création]))+1","v":1}]
["Code catégorie"]
["Nom catégorie",{"$f":"IFERROR(INDEX(Nom_catégorie,MATCH($B$4,Code_catégorie,0)),\"-\")","v":"-"}]
["Code produit"]
["Nom produit",{"$f":"IFERROR(INDEX(Nom_produit,MATCH($B$6,Code_produit,0)),\"-\")","v":"-"}]
["Code jour"]
["Nom jour",{"$f":"IFERROR(INDEX(Nom_jour,MATCH($B$8,Code_jour,0)),\"-\")","v":"-"}]
["Code conditionnement"]
{"$rows_left_out":7}
{"sheet":"MP","index":3,"n_rows":16,"n_cols":2,"rows_kept":16,"cut":false,"hidden":true,"merged":[[0,0,0,1]]}
["Modification d'un produit"]
[]
["Numéro création",3]
["Code catégorie","CC04"]
["Nom catégorie","LMR"]
["Code produit","LMR03"]
["Nom produit","Carottes"]
["Code jour"]
["Nom jour","-"]
["Code conditionnement"]
{"$rows_left_out":7}
{"sheet":"Référentiels","index":4,"n_rows":146,"n_cols":69,"rows_kept":146,"cut":false,"hidden":false,"merged":[]}
["Code catégorie","Nom catégorie","Code produit","Nom produit","Code jour","Nom jour","Code conditionnement","Nom conditionnement","Code destination","Nom destination","Code à modifier","Nom à modifier",null,"Code destination","Nom destination",null,"Code catégorie","Nom catégorie",null,"Code LMR","Nom LMR",null,"Code VMR","Nom VMR",null,"Code DMR","Nom DMR",null,"Code à modifier","Nom à modifier",null,"Code mois","Nom mois",null,"Code férié","Nom férié",null,"Numéro jour","Noms jours",null,"Code VWE","Nom VWE",null,"Code PVWE","Nom PVWE",null,"Code LSLM","Nom LSLM",null,"Code LSMJ","Nom LSMJ",null,"Code LSV","Nom LSV",null,"Code LWED","Nom LWED",null,"Code LWES","Nom LWES",null,"Code VS","Nom VS",null,"Code DS","Nom DS",null,"Code DS","Nom DS"]
["CC01","DMR","DMR01","Pomme","CJ01","Dimanche midi","COCO01","1 bocal ou 1 boîte pour 1 repas","CD01","Menus journaliers","LCÀM01","Non",null,"CD01","Menus journaliers",null,"CC01","DMR",null,"LMR01","Asperges",null,"VMR01","Rôti d'agneau",null,"DMR01","Pomme",null,"LCÀM01","Non",null,"CM01","Janvier",null,"CF01","Jour de l'an",null,"NJ01",1,null,"VWE01","Agneau",null,"PVWE01","premier semestre",null,"LSLM01","Cassoulet",null,"LSMJ01","Macédoine de légumes",null,"LSV01","Asperges",null,"LWED01","Asperges",null,"LWES01","Pâtes à la sauce tomates",null,"VS01","Bifteck haché de bœuf",null,"DS01","Pomme",null,"DWE01","Ananas"]
["CC02","DS","DS01","Pomme","CJ02","Dimanche midi et soir","COCO02","1 boîte de six œufs. 3 œufs pour 1 repas","CD02","Menus midi retraite","LCÀM02","Oui",null,"CD02","Menus midi retraite",null,"CC02","DS",null,"LMR02","Avocat",null,"VMR02","Rôti de bœuf",null,null,null,null,"LCÀM02","Oui",null,"CM02","Février",null,"CF02","Pâques",null,"NJ02",2,null,"VWE02","Bœuf",null,"PVWE02","deuxième semestre",null,"LSLM02","Choucroute",null,"LSMJ02","Petits pois",null,"LSV02","Avocat",null,"LWED02","Chips",null,"LWES02","Pâtes au beurre",null,"VS02","Bifteck haché de cheval",null,null,null,null,"DWE02","Autres fruits"]
["CC03","DWE","DWE01","Ananas","CJ03","Dimanche soir","COCO03","1 boîte ou 1 pot pour 1 repas","CD03","Menus viandes weekend",null,null,null,"CD03","Menus viandes weekend",null,"CC03","DWE",null,"LMR03","Carottes",null,"VMR03","Rôti de cheval",null,null,null,null,null,null,null,"CM03","Mars",null,"CF03","Lundi de Pâques",null,"NJ03",3,null,"VWE03","Cheval",null,null,null,null,"LSLM03","Chou-fleur",null,"LSMJ03","Petits pois et jeunes carottes",null,"LSV03","Betterave rouge",null,"LWED03","Frites",null,"LWES03","Pâtes au fromage râpé",null,"VS03","Bifteck haché de veau",null,null,null,null,"DWE03","Avocats"]
["CC04","LMR","DWE02","Autres fruits","CJ04","Lundi à dimanche soirs","COCO04","1 boîte pour 1 repas",null,null,null,null,null,null,null,null,"CC04","LMR",null,"LMR04","Céleri",null,"VMR04","Rôti de porc",null,null,null,null,null,null,null,"CM04","Avril",null,"CF04","Fête du travail",null,"NJ04",4,null,"VWE04","Dinde",null,null,null,null,"LSLM04","Choux de Bruxelles",null,"LSMJ04","Ratatouille",null,"LSV04","Carottes",null,"LWED04","Haricots verts",null,null,null,null,"VS04","Bouchée à la reine",null,null,null,null,"DWE04","Bananes"]
["CC05","LSLM","DWE03","Avocats","CJ05","Lundi à vendredi midis","COCO05","1 boîte pour 2 repas",null,null,null,null,null,null,null,null,"CC05","LSLM",null,"LMR05","Champignons",null,"VMR05","Rôti de veau",null,null,null,null,null,null,null,"CM05","Mai",null,"CF05","Victoire 1945",null,"NJ05",5,null,"VWE05","Poisson",null,null,null,null,"LSLM05","Couscous",null,"LSMJ05","Raviolis",null,"LSV05","Céleri",null,null,null,null,null,null,null,"VS05","Boudin",null,null,null,null,"DWE05","Clémentines"]
["CC06","LSMJ","DWE04","Bananes","CJ06","lundi à vendredi soirs","COCO06","1 botte ou 1 sachet pour 1 repas",null,null,null,null,null,null,null,null,"CC06","LSMJ",null,"LMR06","Concombre",null,null,null,null,null,null,null,null,null,null,"CM06","Juin",null,"CF06","Jeudi de l'ascension",null,"NJ06",6,null,"VWE06","Porc",null,null,null,null,"LSLM06","Endives",null,"LSMJ06","Tomates pelées",null,"LSV06","Champignons",null,null,null,null,null,null,null,"VS06","Cervelas",null,null,null,null,"DWE06","Crème"]
["CC07","LSV","DWE05","Clémentines","CJ07","Lundi et mardi soirs","COCO07","1 botte ou 1 sachet pour 2 repas",null,null,null,null,null,null,null,null,"CC07","LSV",null,"LMR07","Couscous",null,null,null,null,null,null,null,null,null,null,"CM07","Juillet",null,"CF07","Pentecôte",null,"NJ07",7,null,"VWE07","Veau",null,null,null,null,"LSLM07","Haricots verts",null,null,null,null,"LSV07","Concombre",null,null,null,null,null,null,null,"VS07","Cœur",null,null,null,null,"DWE07","Dattes"]
["CC08","LWED","DWE06","Crème","CJ08","Mercredi et jeudi soirs","COCO08","1 morceau de 400 grammes (Leclerc) pour 3 repas",null,null,null,null,null,null,null,null,"CC08","LWED",null,"LMR08","Maïs",null,null,null,null,null,null,null,null,null,null,"CM08","Août",null,"CF08","Lundi de Pentecôte",null,"NJ08",8,null,null,null,null,null,null,null,"LSLM08","Maïs",null,null,null,null,"LSV08","Radis",null,null,null,null,null,null,null,"VS08","Croque-monsieur",null,null,null,null,"DWE08","Figues"]
["CC09","LWES","DWE07","Dattes","CJ09","Samedi et dimanche midis","COCO09","1 morceau de 500 grammes pour 5 repas",null,null,null,null,null,null,null,null,"CC09","LWES",null,"LMR09","Pâtes à la sauce tomates",null,null,null,null,null,null,null,null,null,null,"CM09","Septembre",null,"CF09","Fête nationale",null,"NJ09",9,null,null,null,null,null,null,null,"LSLM09","Paella",null,null,null,null,"LSV09","Salade",null,null,null,null,null,null,null,"VS09","Foie",null,null,null,null,"DWE09","Fromage blanc"]
{"$rows_left_out":137}
{"sheet":"Accueil Menus","index":5,"n_rows":15,"n_cols":17,"rows_kept":15,"cut":false,"hidden":false,"merged":[]}
["Accueil Menus",null,null,2020]
[]
[]
[]
[]
[]
[null,null,1,"Janvier",{"$f":"$D$1","v":2020},null,null,null,1,"Janvier",{"$f":"$D$1","v":2020},null,null,null,18,"Janvier",{"$f":"$D$1","v":2020}]
[]
[]
[]
{"$rows_left_out":6}
{"sheet":"BD Menus","index":6,"n_rows":23,"n_cols":39,"rows_kept":23,"cut":false,"hidden":false,"merged":[]}
["Date menu","Code menu","Nom menu","Code catégorie légume","Nom catégorie légume","Code produit légume","Nom produit légume","Code jour légume","Nom jour légume","Code conditionnement légume","Nom conditionnement légume","Quantité légume","Code catégorie viande","Nom catégorie viande","Code produit viande","Nom produit viande","Code jour viande","Nom jour viande","Code conditionnement viande","Nom conditionnement viande","Quantité viande","Code catégorie dessert","Nom catégorie dessert","Code produit dessert","Nom produit dessert","Code jour dessert","Nom jour dessert","Code conditionnement dessert","Nom conditionnement dessert","Quantité dessert","Code observation","Nom observation","Code période concernée","Nom période concernée","Date création menu","Code période viande weekend","Nom période viande weekend","Code à modifier","Nom à modifier"]
["2020-01-04","CD03","Menus viandes weekend",null,null,null,null,null,null,null,null,null,"CC15","VWE","VWE07","Veau","CJ09","Samedi et dimanche midis","COCO20","1 tranche pour 1 repas",100,null,null,null,null,null,null,null,null,null,"","","CM01","janvier","2019-09-22","PVWE01","premier semestre","LCÀM01","Non"]
["2020-01-05","CD03","Menus viandes weekend",null,null,null,null,null,null,null,null,null,"CC15","VWE","VWE01","Agneau","CJ09","Samedi et dimanche midis","COCO20","1 tranche pour 1 repas",100,null,null,null,null,null,null,null,null,null,"","","CM01","janvier","2019-09-24","PVWE01","premier semestre","LCÀM01","Non"]
["2020-01-11","CD03","Menus viandes weekend",null,null,null,null,null,null,null,null,null,"CC15","VWE","VWE04","Dinde","CJ09","Samedi et dimanche midis","COCO20","1 tranche pour 1 repas",100,null,null,null,null,null,null,null,null,null,"","","CM01","janvier","2019-09-22","PVWE01","premier semestre","LCÀM01","Non"]
["2020-01-12","CD03","Menus viandes weekend",null,null,null,null,null,null,null,null,null,"CC15","VWE","VWE05","Poisson","CJ09","Samedi et dimanche midis","COCO29","Unité : 1 pour 1 repas",100,null,null,null,null,null,null,null,null,null,"","","CM01","janvier","2019-09-23","PVWE01","premier semestre","LCÀM02","Oui"]
["2020-01-18","CD03","Menus viandes weekend",null,null,null,null,null,null,null,null,null,"CC15","VWE","VWE07","Veau","CJ09","Samedi et dimanche midis","COCO20","1 tranche pour 1 repas",100,null,null,null,null,null,null,null,null,null,"","","CM01","janvier","2019-09-25","PVWE01","premier semestre","LCÀM02","Oui"]
["2020-03-22","CD03","Menus viandes weekend",null,null,null,null,null,null,null,null,null,"CC15","VWE","VWE05","Poisson","CJ09","Samedi et dimanche midis","COCO29","Unité : 1 pour 1 repas",100,null,null,null,null,null,null,null,null,null,"","","CM03","mars","2019-09-23","PVWE01","premier semestre","LCÀM02","Oui"]
["2020-04-12","CD03","Menus viandes weekend",null,null,null,null,null,null,null,null,null,"CC15","VWE","VWE01","Agneau","CJ09","Samedi et dimanche midis","COCO20","1 tranche pour 1 repas",100,null,null,null,null,null,null,null,null,null,"CF02","Pâques","CM04","avril","2019-09-25","PVWE02","premier semestre","LCÀM02","Oui"]
["2020-05-21","CD02","Menus midi retraite","CC04","LMR","LMR02","Avocat","CJ05","Lundi à vendredi midis","COCO28","Unité : 1 pour 1 repas",1,"CC13","VMR","VMR01","Rôti d'agneau","CJ05","Lundi à vendredi midis","COCO09","1 morceau de 500 grammes pour 5 repas",100,"CC01","DMR","DMR01","Pomme","CJ05","Lundi à vendredi midis","COCO16","1 sachet de 2 kilogrammes. 1 pomme pour 1 repas",1,"CF06","Jeudi de l'ascension","CM05","mai","2019-09-21",null,null,"LCÀM02","Oui"]
["2020-05-31","CD03","Menus viandes weekend",null,null,null,null,null,null,null,null,null,"CC15","VWE","VWE02","Bœuf","CJ09","Samedi et dimanche midis","COCO20","1 tranche pour 1 repas",100,null,null,null,null,null,null,null,null,null,"CF07","Pentecôte","CM05","mai","2019-09-25","PVWE02","premier semestre","LCÀM02","Oui"]
{"$rows_left_out":14}
{"sheet":"Saisie MMR","index":7,"n_rows":21,"n_cols":8,"rows_kept":21,"cut":false,"hidden":false,"merged":[[8,0,8,1],[8,3,8,4],[8,6,8,7]]}
[{"$f":"\"Création Menu Midi Retraite \"&'Accueil Menus'!$D$1","v":"Création Menu Midi Retraite 2020"}]
[]
["Code menu","CD02",null,"Code observation",{"$f":"IFERROR(INDEX(ListeCodesFériés,MATCH(E4,ListeNomsFériés,0)),\"\")","v":"CF01"},null,"Code à modifier","LCÀM02"]
["Nom menu",{"$f":"IFERROR(INDEX(ListeNomsDestination,MATCH(B3,ListeCodesDestination,0)),\"-\")","v":"Menus midi retraite"},null,"Nom observation",{"$f":"IF(COUNTIF('Jours Fériés'!$B$3:$B$15,B7)=0,\"\",INDEX('Jours Fériés'!$A$3:$A$15,MATCH(B7,'Jours Fériés'!$B$3:$B$15,0)))","v":"Jour de l'an"},null,"Nom à modifier",{"$f":"IFERROR(INDEX(ListeNomsAModifier,MATCH(H3,ListeCodesAModifier,0)),\"-\")","v":"Oui"}]
[null,null,null,"Code période concernée",{"$f":"IFERROR(INDEX(ListeCodesMois,MATCH(E6,ListeNomsMois,0)),\"-\")","v":"CM01"}]
[null,null,null,"Nom période concernée",{"$f":"IF(B7=\"\",\"\",TEXT(B7,\"mmmm\"))","v":"janvier"}]
["Date du menu","2020-01-01",null,"Date création menu",{"$f":"TODAY()","v":"2019-09-26"}]
[]
["Légume",null,null,"Viande",null,null,"Dessert"]
["Code catégorie","CC04",null,"Code catégorie","CC13",null,"Code catégorie","CC01"]
{"$rows_left_out":12}
{"sheet":"Modif MMR","index":8,"n_rows":21,"n_cols":8,"rows_kept":21,"cut":false,"hidden":true,"merged":[[8,0,8,1],[8,3,8,4],[8,6,8,7]]}
[{"$f":"\"Modification Menu Midi Retraite \"&'Accueil Menus'!$D$1","v":"Modification Menu Midi Retraite 2020"}]
[]
["Code menu","CD02",null,"Code observation",{"$f":"IFERROR(INDEX(ListeCodesFériés,MATCH(E4,ListeNomsFériés,0)),\"\")","v":"CF06"},null,"Code à modifier","LCÀM02"]
["Nom menu",{"$f":"IFERROR(INDEX(ListeNomsDestination,MATCH(B3,ListeCodesDestination,0)),\"-\")","v":"Menus midi retraite"},null,"Nom observation",{"$f":"IF(COUNTIF('Jours Fériés'!$B$3:$B$15,B7)=0,\"\",INDEX('Jours Fériés'!$A$3:$A$15,MATCH(B7,'Jours Fériés'!$B$3:$B$15,0)))","v":"Jeudi de l'ascension"},null,"Nom à modifier",{"$f":"IFERROR(INDEX(ListeNomsAModifier,MATCH(H3,ListeCodesAModifier,0)),\"-\")","v":"Oui"}]
[null,null,null,"Code période concernée",{"$f":"IFERROR(INDEX(ListeCodesMois,MATCH(E6,ListeNomsMois,0)),\"-\")","v":"CM05"}]
[null,null,null,"Nom période concernée",{"$f":"IF(B7=\"\",\"\",TEXT(B7,\"mmmm\"))","v":"mai"}]
["Date du menu","2020-05-21",null,"Date création menu","2019-09-21"]
[]
["Légume",null,null,"Viande",null,null,"Dessert"]
["Code catégorie","CC04",null,"Code catégorie","CC13",null,"Code catégorie","CC01"]
{"$rows_left_out":12}
{"sheet":"Menus MMR","index":9,"n_rows":325,"n_cols":7,"rows_kept":325,"cut":false,"hidden":false,"merged":[]}
[{"$f":"'Accueil Menus'!$D$1","v":2020}]
[null,null,null,null,""]
[1,{"$f":"\"Menus midi retraite du mois de \"&TEXT(A5,\"mmmm\")&\" \"&$A$1","v":"Menus midi retraite du mois de janvier 2020"}]
["Date du menu","Légume","Viande","Dessert","Observation","Nature du menu","Numéro menu"]
[{"$f":"IF(WEEKDAY(DATE($A$1,$A3,1),2)<=5,DATE($A$1,$A3,1),DATE($A$1,$A3,1)+8-WEEKDAY(DATE($A$1,$A3,1),2))","v":"2020-01-01"},null,null,null,null,{"$f":"IF(COUNTA(A5:D5)>1,\"Menus midi retraite \" &TEXT(A5,\"mmmm\"),\"\")","v":""},{"$f":"IF(F5<>\"\",\"MMR\" & TEXT(COUNTA($A$5:A5)-COUNTBLANK($A$5:A5),\"00\"),\"\")","v":""}]
[{"$f":"A5+IF(WEEKDAY(A5,2)<5,1,3)","v":"2020-01-02"},null,null,null,null,{"$f":"IF(COUNTA(A6:D6)>1,\"Menus midi retraite \" &TEXT(A6,\"mmmm\"),\"\")","v":""},{"$f":"IF(F6<>\"\",\"MMR\" & TEXT(COUNTA($A$5:A6)-COUNTBLANK($A$5:A6),\"00\"),\"\")","v":""}]
[{"$f":"A6+IF(WEEKDAY(A6,2)<5,1,3)","v":"2020-01-03"},null,null,null,null,"",{"$f":"IF(F7<>\"\",\"MMR\" & TEXT(COUNTA($A$5:A7)-COUNTBLANK($A$5:A7),\"00\"),\"\")","v":""}]
["2020-01-06",null,null,null,null,"",{"$f":"IF(F8<>\"\",\"MMR\" & TEXT(COUNTA($A$5:A8)-COUNTBLANK($A$5:A8),\"00\"),\"\")","v":""}]
["2020-01-07",null,null,null,null,"",{"$f":"IF(F9<>\"\",\"MMR\" & TEXT(COUNTA($A$5:A9)-COUNTBLANK($A$5:A9),\"00\"),\"\")","v":""}]
["2020-01-08",null,null,null,null,"",{"$f":"IF(F10<>\"\",\"MMR\" & TEXT(COUNTA($A$5:A10)-COUNTBLANK($A$5:A10),\"00\"),\"\")","v":""}]
{"$rows_left_out":316}
{"sheet":"Jours Fériés","index":10,"n_rows":19,"n_cols":2,"rows_kept":19,"cut":false,"hidden":true,"merged":[]}
[]
["Jours fériés et fêtes",{"$f":"'Accueil Menus'!$D$1","v":2020}]
["Jour de l'an",{"$f":"DATE(B2,1,1)","v":"2020-01-01"}]
["Pâques",{"$f":"DATE(YEAR(B3),3,29.56+0.979*MOD(204-11*MOD(YEAR(B3),19),30)-WEEKDAY(DATE(YEAR(B3),3,28.56+0.979*MOD(204-11*MOD(YEAR(B3),19),30))))","v":"2020-04-12"}]
["Lundi de Pâques",{"$f":"B4+1","v":"2020-04-13"}]
["Fête du travail",{"$f":"DATE(B2,5,1)","v":"2020-05-01"}]
["Victoire 1945",{"$f":"DATE(B2,5,8)","v":"2020-05-08"}]
["Jeudi de l'ascension",{"$f":"B5+38","v":"2020-05-21"}]
["Pentecôte",{"$f":"B4+49","v":"2020-05-31"}]
["Lundi de Pentecôte",{"$f":"B9+1","v":"2020-06-01"}]
{"$rows_left_out":10}
{"sheet":"Menus VWE","index":11,"n_rows":117,"n_cols":6,"rows_kept":117,"cut":false,"hidden":false,"merged":[]}
[{"$f":"'Accueil Menus'!D1","v":2020}]
[]
[1,{"$f":"\"Menus viande weekend \"&IF(A3=1,\"premier\",\"deuxième\")&\" semestre\"","v":"Menus viande weekend premier semestre"}]
["Date du menu","Nom viande","Nom observation","Nature du menu","Numéro menu","Nom période viande weekend"]
[{"$f":"IF(WEEKDAY(DATE($A$1,A3*6-5,1),2)>=6,DATE($A$1,A3*6-5,1),DATE($A$1,A3*6-5,1)+7-WEEKDAY(DATE($A$1,A3*6-5,1)))","v":"2020-01-04"},"Veau",null,{"$f":"IF(COUNTA(A5:B5)>1,\"Menus viandes weekend  \" &TEXT(F5,\"\"),\"\")","v":"Menus viandes weekend  premier semestre"},{"$f":"IF(COUNTA(A5:B5)>1,\"MVWE\" & TEXT(COUNTA($A$5:A5)-COUNTBLANK($A$5:A5),\"00\"),\"\")","v":"MVWE01"},"premier semestre"]
[{"$f":"A5+IF(WEEKDAY(A5,2)=6,1,6)","v":"2020-01-05"},"Agneau",null,{"$f":"IF(COUNTA(A6:B6)>1,\"Menus viandes weekend  \" &TEXT(F6,\"\"),\"\")","v":"Menus viandes weekend  premier semestre"},{"$f":"IF(COUNTA(A6:B6)>1,\"MVWE\" & TEXT(COUNTA($A$5:A6)-COUNTBLANK($A$5:A6),\"00\"),\"\")","v":"MVWE02"},"premier semestre"]
[{"$f":"A6+IF(WEEKDAY(A6,2)=6,1,6)","v":"2020-01-11"},"Dinde",null,"Menus viandes weekend  premier semestre",{"$f":"IF(COUNTA(A7:B7)>1,\"MVWE\" & TEXT(COUNTA($A$5:A7)-COUNTBLANK($A$5:A7),\"00\"),\"\")","v":"MVWE03"},"premier semestre"]
["2020-01-12","Poisson",null,"Menus viandes weekend  premier semestre",{"$f":"IF(COUNTA(A8:B8)>1,\"MVWE\" & TEXT(COUNTA($A$5:A8)-COUNTBLANK($A$5:A8),\"00\"),\"\")","v":"MVWE04"},"premier semestre"]
["2020-01-18","Veau","","Menus viandes weekend  premier semestre",{"$f":"IF(COUNTA(A9:B9)>1,\"MVWE\" & TEXT(COUNTA($A$5:A9)-COUNTBLANK($A$5:A9),\"00\"),\"\")","v":"MVWE05"},"premier semestre"]
["2020-01-19",null,null,"",{"$f":"IF(COUNTA(A10:B10)>1,\"MVWE\" & TEXT(COUNTA($A$5:A10)-COUNTBLANK($A$5:A10),\"00\"),\"\")","v":""}]
{"$rows_left_out":108}
{"sheet":"Saisie VWE","index":12,"n_rows":20,"n_cols":8,"rows_kept":20,"cut":false,"hidden":true,"merged":[]}
[{"$f":"\"Création menus viandes weekend \"&'Accueil Menus'!D1","v":"Création menus viandes weekend 2020"}]
[]
["Code menu","CD03",null,"Code observation",{"$f":"IFERROR(INDEX(ListeCodesFériés,MATCH(E4,ListeNomsFériés,0)),\"\")","v":""},null,"Code à modifier","LCÀM02"]
["Nom menu",{"$f":"IFERROR(INDEX(ListeNomsDestination,MATCH($B$3,ListeCodesDestination,0)),\"-\")","v":"Menus viandes weekend"},null,"Nom observation",{"$f":"IF(COUNTIF('Jours Fériés'!$B$3:$B$15,B7)=0,\"\",INDEX('Jours Fériés'!$A$3:$A$15,MATCH(B7,'Jours Fériés'!$B$3:$B$15,0)))","v":""},null,"Nom à modifier",{"$f":"IFERROR(INDEX(ListeNomsAModifier,MATCH($H$3,ListeCodesAModifier,0)),\"-\")","v":"Oui"}]
[null,null,null,"Code période concernée",{"$f":"IFERROR(INDEX(ListeCodesMois,MATCH(E6,ListeNomsMois,0)),\"-\")","v":"CM01"}]
[null,null,null,"Nom période concernée",{"$f":"IF(B7=\"\",\"\",TEXT(B7,\"mmmm\"))","v":"janvier"}]
["Date du menu","2020-01-18",null,"Date création menu",{"$f":"TODAY()","v":"2019-09-26"}]
[]
[]
["Code catégorie","CC15"]
{"$rows_left_out":11}
{"sheet":"Modif VWE","index":13,"n_rows":20,"n_cols":8,"rows_kept":20,"cut":false,"hidden":true,"merged":[]}
[{"$f":"\"Modification menus viandes weekend \"&'Accueil Menus'!D1","v":"Modification menus viandes weekend 2020"}]
[]
["Code menu","CD03",null,"Code observation",{"$f":"IFERROR(INDEX(ListeCodesFériés,MATCH(E4,ListeNomsFériés,0)),\"\")","v":""},null,"Code à modifier","LCÀM01"]
["Nom menu",{"$f":"IFERROR(INDEX(ListeNomsDestination,MATCH(B3,ListeCodesDestination,0)),\"-\")","v":"Menus viandes weekend"},null,"Nom observation",{"$f":"IF(COUNTIF('Jours Fériés'!$B$3:$B$15,B7)=0,\"\",INDEX('Jours Fériés'!$A$3:$A$15,MATCH(B7,'Jours Fériés'!$B$3:$B$15,0)))","v":""},null,"Nom à modifier",{"$f":"IFERROR(INDEX(ListeNomsAModifier,MATCH(H3,ListeCodesAModifier,0)),\"-\")","v":"Non"}]
[null,null,null,"Code période concernée",{"$f":"IFERROR(INDEX(ListeCodesMois,MATCH(E6,ListeNomsMois,0)),\"-\")","v":"CM07"}]
[null,null,null,"Nom période concernée",{"$f":"IF(B7=\"\",\"\",TEXT(B7,\"mmmm\"))","v":"juillet"}]
["Date du menu","2020-07-04",null,"Date création menu",{"$f":"TODAY()","v":"2019-09-26"}]
[]
[]
["Code catégorie","CC15"]
{"$rows_left_out":11}
{"sheet":"Saisie MJ","index":14,"n_rows":21,"n_cols":8,"rows_kept":21,"cut":false,"hidden":false,"merged":[[8,0,8,1],[8,3,8,4],[8,6,8,7]]}
[{"$f":"\"Création Menu journalier \"&'Accueil Menus'!$D$1","v":"Création Menu journalier 2020"}]
[]
["Code menu","CD01",null,"Code observation",{"$f":"IFERROR(INDEX(ListeCodesFériés,MATCH(E4,ListeNomsFériés,0)),\"\")","v":"CF01"},null,"Code à modifier","LCÀM02"]
["Nom menu",{"$f":"IFERROR(INDEX(ListeNomsDestination,MATCH(B3,ListeCodesDestination,0)),\"-\")","v":"Menus journaliers"},null,"Nom observation",{"$f":"IF(COUNTIF('Jours Fériés'!$B$3:$B$15,B7)=0,\"\",INDEX('Jours Fériés'!$A$3:$A$15,MATCH(B7,'Jours Fériés'!$B$3:$B$15,0)))","v":"Jour de l'an"},null,"Nom à modifier",{"$f":"IFERROR(INDEX(ListeNomsAModifier,MATCH(H3,ListeCodesAModifier,0)),\"-\")","v":"Oui"}]
[null,null,null,"Code période concernée",{"$f":"IFERROR(INDEX(ListeCodesMois,MATCH(E6,ListeNomsMois,0)),\"-\")","v":"CM01"}]
[null,null,null,"Nom période concernée",{"$f":"IF(B7=\"\",\"\",TEXT(B7,\"mmmm\"))","v":"janvier"}]
["Date du menu","2020-01-01",null,"Date création menu",{"$f":"TODAY()","v":"2019-09-26"}]
[]
["Légume",null,null,"Viande",null,null,"Dessert"]
["Code catégorie",{"$f":"IF(WEEKDAY($B$7,2)<=2,\"CC05\",IF(WEEKDAY($B$7,2)<=4,\"CC06\",IF(WEEKDAY($B$7,2)=5,\"CC07\",IF(WEEKDAY($B$7,2)=6,\"CC09\",IF(WEEKDAY($B$7,2)=7,\"CC08\",\"\")))))","v":"CC06"},null,"Code catégorie","CC13",null,"Code catégorie","CC01"]
{"$rows_left_out":11}