{"text_format":"1","workbook":"xlsx","n_sheets":15,"sheets":["Accueil","Formulaire Préventif","Formulaire Curatif","Manuel_d'utilisation","Login","Accueil 2","Planning_général","Planification du préventif","Feuil1","Planning","Histo maintenances Préventif","Historique maintenances Curatif","Pense-bête","Ressources","Membres"],"not_rendered":{"charts":0,"images":35,"macros":1,"external_links":0,"defined_names":57,"comments":2,"pivot_tables":0},"unopened":[],"bounds":{"document_bytes":16777216,"sheet_cells":100000,"rows_first":2000,"rows_last":500,"rows_between":2000,"halvings":0,"cell_chars":16384,"cell_head_chars":4096},"cells_cut":0,"cells_raw":0,"read":"whole","date_system":"1900"}

{"sheet":"Accueil","index":0,"n_rows":0,"n_cols":0,"rows_kept":0,"cut":false,"hidden":false,"merged":[[0,0,4,2]]}

{"sheet":"Formulaire Préventif","index":1,"n_rows":6,"n_cols":7,"rows_kept":6,"cut":false,"hidden":false,"merged":[[0,1,2,6]]}
[null,"Préventif"]
[]
[]
[]
[null,"Pôle","Équipement","Type de maintenance","Mois de la maintenance","Date du jour","ÉTAT"]
[null,null,null,null,{"$f":"IFERROR(INDEX('Planification du préventif'!H4:H92,MATCH('Formulaire Préventif'!D6,'Planification du préventif'!B4:B92,0)),\"\")","v":""},{"$f":"TODAY()","v":"2019-08-21"},{"$f":"IFERROR(_xlfn.IFS(F6>E6,\"En retard de \"&(F6-E6)&\" jours\",E6>F6,\"En avance de \"&E6-F6&\" jours\",E6=F6,\"Date Prévue\"),\"\")","v":""}]

{"sheet":"Formulaire Curatif","index":2,"n_rows":3,"n_cols":8,"rows_kept":3,"cut":false,"hidden":false,"merged":[[0,2,0,7]]}
[null,null,"Curatif"]
[]
[null,null,"Pôle","Équipement","Problème","Action réalisé","Date de réparation","Intervenant"]

{"sheet":"Manuel_d'utilisation","index":3,"n_rows":8,"n_cols":6,"rows_kept":8,"cut":false,"hidden":false,"merged":[[1,3,2,7],[7,3,7,4],[5,4,5,7],[7,5,7,8]]}
[]
[null,null,null,"Manuel d'utilisation"]
[]
[]
[]
[null,null,null,"Technicien :","D:\\Petit Armand Taff\\IUT\\Bonnin Méca Spé\\GMAO\\Plan de maintenance\\Excel Corrective et Préventif\\Manuel d'utilisation\\Manuel Technicien.odp"]
[]
[null,null,null,"Responsable maintenance :",null,"D:\\Petit Armand Taff\\IUT\\Bonnin Méca Spé\\GMAO\\Plan de maintenance\\Excel Corrective et Préventif\\Manuel d'utilisation\\Manuel Responsable Maintenance.odp"]

{"sheet":"Login","index":4,"n_rows":0,"n_cols":0,"rows_kept":0,"cut":false,"hidden":true,"merged":[]}

{"sheet":"Accueil 2","index":5,"n_rows":0,"n_cols":0,"rows_kept":0,"cut":false,"hidden":false,"merged":[]}

{"sheet":"Planning_général","index":6,"n_rows":116,"n_cols":16,"rows_kept":116,"cut":false,"hidden":false,"merged":[[1,42,3,46],[23,46,25,63],[14,45,17,45],[14,46,17,46],[14,47,17,47],[14,48,17,48],[14,49,17,49],[14,50,17,50],[14,51,17,51],[14,52,17,52],[14,53,17,53],[14,54,17,54],[14,55,17,55],[14,56,17,56],[4,42,4,46],[5,42,6,46],[14,74,17,74],[14,75,17,75],[14,70,17,70],[14,71,17,71],[14,72,17,72],[14,73,17,73],[14,67,17,67],[14,68,17,68],[14,69,17,69],[14,62,17,62],[14,63,17,63],[14,64,17,64],[14,65,17,65],[14,66,17,66],[14,59,17,59],[14,60,17,60],[14,57,17,57],[14,58,17,58],[14,61,17,61]]}
[]
[]
[]
[]
[]
[]
[]
[]
[]
[]
{"$rows_left_out":107}
{"sheet":"Planification du préventif","index":7,"n_rows":102,"n_cols":41,"rows_kept":102,"cut":false,"hidden":false,"merged":[[1,6,1,7],[1,9,1,11],[1,33,1,37],[1,28,1,32]]}
[]
[null,null,null,null,null,null,"Mois d'intervention",null,"Tps inter","Périodicité",null,null,null,null,null,null,null,null,null,null,null,null,null,null,null,null,null,null,"test information issue de la list",null,null,null,null,"Calcul du Nbr de Jours",null,null,null,null,"Som Nbr Jrs","Test H=\"\" et I<>\"\"","Nbr Pen Jrs"]
["N° Équipement","Opérations de maintenance","Descriptif","Materiels","Fiche procédure","Sécurité","Anterieure","Prochain","Tps inter(h)","P ","Unité","en jrs","ÉTAT",null,null,null,null,null,null,null,null,null,null,null,null,null,null,null,"Jours","Semaine","Mois","Année","Années","Jours","Semaine","Mois","Année","Années","Somme 1","Test","P en jours"]
["ES1_Compresseur_GENESIS","Vidange Huile 3 - 4 L",null,null,null,null,"2019-12-30",{"$f":"IFERROR(IF(Tableau1[[#This Row],[Anterieure]]=\"\",\"\",Tableau1[[#This Row],[Anterieure]]+Tableau1[[#This Row],[en jrs]]),\"Voir Technicien\")","v":"2020-03-29"},null,3,"Mois",{"$f":"AO4","v":90},{"$f":"IFERROR(_xlfn.IFS(TODAY()>Tableau1[[#This Row],[Prochain]],\"En retard de \"&(TODAY()-Tableau1[[#This Row],[Prochain]])&\" jours\",Tableau1[[#This Row],[Prochain]]>TODAY(),\"À faire dans \"&Tableau1[[#This Row],[Prochain]]-TODAY()&\" jours\",Tableau1[[#This Row],[Prochain]]=TODAY(),\"À faire\"&Tableau1[[#This Row],[Prochain]]= TODAY()&\"jours\"),\"\")","v":"À faire dans 221 jours"},null,null,null,null,null,null,null,null,null,null,null,null,null,null,null,{"$f":"IF($K4=\"Jours\",1,0)","v":0},{"$f":"IF($K4=\"Semaine\",1,0)","v":0},{"$f":"IF($K4=\"Mois\",1,0)","v":1},{"$f":"IF($K4=\"Année\",1,0)","v":0},{"$f":"IF($K4=\"Années\",1,0)","v":0},{"$f":"IF($AC4=1,$J4*1,0)","v":0},{"$f":"IF($AD4=1,$J4*7,0)","v":0},{"$f":"IF($AE4=1,$J4*30,0)","v":90},{"$f":"IF($AF4=1,$J4*365,0)","v":0},{"$f":"IF($AG4=1,$J4*365,0)","v":0},{"$f":"IF(AND($J4>1,$K4=\"Année\"),\"Erreur de saisie\",ROUND(SUM($AH4:$AL4),0))","v":90},{"$f":"IF(AND($K4>0,$J4=\"\"),0,1)","v":1},{"$f":"IF(AND($AM4=0,$AN4=0),\"Erreur de saisie\", $AM4)","v":90}]
["ES1_Compresseur_GENESIS","Changement Filtres Oléophiles Blanc",null,null,null,null,"2019-12-30",{"$f":"IFERROR(IF(Tableau1[[#This Row],[Anterieure]]=\"\",\"\",Tableau1[[#This Row],[Anterieure]]+Tableau1[[#This Row],[en jrs]]),\"Voir Technicien\")","v":"2020-05-28"},null,5,"Mois",150,{"$f":"IFERROR(_xlfn.IFS(TODAY()>Tableau1[[#This Row],[Prochain]],\"En retard de \"&(TODAY()-Tableau1[[#This Row],[Prochain]])&\" jours\",Tableau1[[#This Row],[Prochain]]>TODAY(),\"À faire dans \"&Tableau1[[#This Row],[Prochain]]-TODAY()&\" jours\",Tableau1[[#This Row],[Prochain]]=TODAY(),\"À faire\"&Tableau1[[#This Row],[Prochain]]= TODAY()&\"jours\"),\"\")","v":"À faire dans 281 jours"},null,null,null,null,null,null,null,null,null,null,null,null,null,null,null,{"$f":"IF($K5=\"Jours\",1,0)","v":0},{"$f":"IF($K5=\"Semaine\",1,0)","v":0},{"$f":"IF($K5=\"Mois\",1,0)","v":1},{"$f":"IF($K5=\"Année\",1,0)","v":0},{"$f":"IF($K5=\"Années\",1,0)","v":0},0,0,150,0,0,150,{"$f":"IF(AND($K5>0,$J5=\"\"),0,1)","v":1},150]
["ES1_Compresseur_GENESIS","Changement KIT A : Filtre à huile - Cartouche de séparation - Filtre Final - Panneau filtrant ventilation",null,null,null,null,"2019-12-30",{"$f":"IFERROR(IF(Tableau1[[#This Row],[Anterieure]]=\"\",\"\",Tableau1[[#This Row],[Anterieure]]+Tableau1[[#This Row],[en jrs]]),\"Voir Technicien\")","v":"2020-06-27"},null,6,"Mois",180,{"$f":"IFERROR(_xlfn.IFS(TODAY()>Tableau1[[#This Row],[Prochain]],\"En retard de \"&(TODAY()-Tableau1[[#This Row],[Prochain]])&\" jours\",Tableau1[[#This Row],[Prochain]]>TODAY(),\"À faire dans \"&Tableau1[[#This Row],[Prochain]]-TODAY()&\" jours\",Tableau1[[#This Row],[Prochain]]=TODAY(),\"À faire\"&Tableau1[[#This Row],[Prochain]]= TODAY()&\"jours\"),\"\")","v":"À faire dans 311 jours"},null,null,null,null,null,null,null,null,null,null,null,null,null,null,null,0,0,1,0,0,0,0,180,0,0,180,1,180]
["ES1_Compresseur_GENESIS","Changement Filtres Charbon Noir",null,null,null,null,"2019-12-30",{"$f":"IFERROR(IF(Tableau1[[#This Row],[Anterieure]]=\"\",\"\",Tableau1[[#This Row],[Anterieure]]+Tableau1[[#This Row],[en jrs]]),\"Voir Technicien\")","v":"2020-12-29"},null,1,"Année",365,{"$f":"IFERROR(_xlfn.IFS(TODAY()>Tableau1[[#This Row],[Prochain]],\"En retard de \"&(TODAY()-Tableau1[[#This Row],[Prochain]])&\" jours\",Tableau1[[#This Row],[Prochain]]>TODAY(),\"À faire dans \"&Tableau1[[#This Row],[Prochain]]-TODAY()&\" jours\",Tableau1[[#This Row],[Prochain]]=TODAY(),\"À faire\"&Tableau1[[#This Row],[Prochain]]= TODAY()&\"jours\"),\"\")","v":"À faire dans 496 jours"},null,null,null,null,null,null,null,null,null,null,null,null,null,null,null,0,0,0,1,0,0,0,0,365,0,365,1,365]
["ES1_Compresseur_GENESIS","Changement KIT B Soupapes",null,null,null,null,"2019-12-30",{"$f":"IFERROR(IF(Tableau1[[#This Row],[Anterieure]]=\"\",\"\",Tableau1[[#This Row],[Anterieure]]+Tableau1[[#This Row],[en jrs]]),\"Voir Technicien\")","v":"2021-12-29"},null,2,"Années",730,{"$f":"IFERROR(_xlfn.IFS(TODAY()>Tableau1[[#This Row],[Prochain]],\"En retard de \"&(TODAY()-Tableau1[[#This Row],[Prochain]])&\" jours\",Tableau1[[#This Row],[Prochain]]>TODAY(),\"À faire dans \"&Tableau1[[#This Row],[Prochain]]-TODAY()&\" jours\",Tableau1[[#This Row],[Prochain]]=TODAY(),\"À faire\"&Tableau1[[#This Row],[Prochain]]= TODAY()&\"jours\"),\"\")","v":"À faire dans 861 jours"},null,null,null,null,null,null,null,null,null,null,null,null,null,null,null,0,0,0,0,1,0,0,0,0,730,730,1,730]
["ES2_Groupe_FROID_ROBOFORM200","Nettoyage Filtre à air",null,null,null,null,"2019-12-30",{"$f":"IFERROR(IF(Tableau1[[#This Row],[Anterieure]]=\"\",\"\",Tableau1[[#This Row],[Anterieure]]+Tableau1[[#This Row],[en jrs]]),\"Voir Technicien\")","v":"2020-06-27"},null,6,"Mois",180,{"$f":"IFERROR(_xlfn.IFS(TODAY()>Tableau1[[#This Row],[Prochain]],\"En retard de \"&(TODAY()-Tableau1[[#This Row],[Prochain]])&\" jours\",Tableau1[[#This Row],[Prochain]]>TODAY(),\"À faire dans \"&Tableau1[[#This Row],[Prochain]]-TODAY()&\" jours\",Tableau1[[#This Row],[Prochain]]=TODAY(),\"À faire\"&Tableau1[[#This Row],[Prochain]]= TODAY()&\"jours\"),\"\")","v":"À faire dans 311 jours"},null,null,null,null,null,null,null,null,null,null,null,null,null,null,null,0,0,1,0,0,0,0,180,0,0,180,1,180]
["EC1_MMT_DEA_GAMMA_1103","Nettoyer le marbre (acétone)",null,null,null,null,"2019-12-30",{"$f":"IFERROR(IF(Tableau1[[#This Row],[Anterieure]]=\"\",\"\",Tableau1[[#This Row],[Anterieure]]+Tableau1[[#This Row],[en jrs]]),\"Voir Technicien\")","v":"2020-01-29"},null,1,"Mois",30,{"$f":"IFERROR(_xlfn.IFS(TODAY()>Tableau1[[#This Row],[Prochain]],\"En retard de \"&(TODAY()-Tableau1[[#This Row],[Prochain]])&\" jours\",Tableau1[[#This Row],[Prochain]]>TODAY(),\"À faire dans \"&Tableau1[[#This Row],[Prochain]]-TODAY()&\" jours\",Tableau1[[#This Row],[Prochain]]=TODAY(),\"À faire\"&Tableau1[[#This Row],[Prochain]]= TODAY()&\"jours\"),\"\")","v":"À faire dans 161 jours"},null,null,null,null,null,null,null,null,null,null,null,null,null,null,null,0,0,1,0,0,0,0,30,0,0,30,1,30]
{"$rows_left_out":93}
{"sheet":"Feuil1","index":8,"n_rows":0,"n_cols":0,"rows_kept":0,"cut":false,"hidden":false,"merged":[]}

{"sheet":"Planning","index":9,"n_rows":16,"n_cols":11,"rows_kept":16,"cut":false,"hidden":false,"merged":[[1,9,1,10]]}
[]
[null,null,null,null,null,null,null,null,null,"PLANNING PERSONNEL"]
[]
[]
[null,null,null,null,null,"Technicien"]
[null,null,null,null,null,"Christophe",null,null,"N° Équipement","Opérations de maintenance","Mois pro intervention"]
[null,null,null,null,null,null,null,null,"E01_Érosion_CN_Enfonçage_ROBOFORM200","Changement des 4 filtres diélectriques",{"$f":"IFERROR(INDEX('Planification du préventif'!$H$4:$H$92,MATCH(Planning!J7,'Planification du préventif'!$B$4:$B$92,0)),\"\")","v":"2020-04-28"}]
[null,null,null,null,null,null,null,null,null,"Niveau d'huile pour glissière + vidange récipient de récupération",{"$f":"IFERROR(INDEX('Planification du préventif'!$H$4:$H$92,MATCH(Planning!J8,'Planification du préventif'!$B$4:$B$92,0)),\"\")","v":"2020-06-27"}]
[null,null,null,null,null,null,null,null,null,"Soufflage Filtre groupe froid",{"$f":"IFERROR(INDEX('Planification du préventif'!$H$4:$H$92,MATCH(Planning!J9,'Planification du préventif'!$B$4:$B$92,0)),\"\")","v":"2020-06-27"}]
[null,null,null,null,null,null,null,null,null,"Remplacement liquide diélectrique",{"$f":"IFERROR(INDEX('Planification du préventif'!$H$4:$H$92,MATCH(Planning!J10,'Planification du préventif'!$B$4:$B$92,0)),\"\")","v":"2021-12-29"}]
{"$rows_left_out":7}
{"sheet":"Histo maintenances Préventif","index":10,"n_rows":5,"n_cols":6,"rows_kept":5,"cut":false,"hidden":false,"merged":[]}
[]
[null,"Pôle","Equipement","Maintenance","Date","État"]
[null,"Érosion","E01_Érosion_CN_Enfonçage_ROBOFORM200","Changement des 4 filtres diélectriques","20/08/2019","Effectuée En avance de 156 jours"]
[null,"Fraisage","F01_Centre_usinage_3_axes_VICTOR","Lubrification glissière","20/08/2019","Effectuée En avance de 115 jours"]
[null,"Tournage","T02_Tour_Conv_MÉTAFLEX","Nettoyage approdondi. Contrôler l'usure de tous les engrenages et de toutes les garnitures. Stabilité du corps de la machine (Serrer les boulons d'ancrage du corps de la machine au sol et stabiliser le corps de la machine)","20/08/2019","Effectuée En avance de 200 jours"]

{"sheet":"Historique maintenances Curatif","index":11,"n_rows":6,"n_cols":10,"rows_kept":6,"cut":false,"hidden":false,"merged":[[5,9,7,11]]}
[]
[]
[null,"Pôle","Équipement","Problème","Tâches Planifiées","Date de maintenance","Utilisateur assigné"]
[null,"Fraisage","F01_Centre_usinage_3_axes_VICTOR","efz","qerf","31/12/1899","zef"]
[null,"Érosion","E02_Érosion_CN_Enfonçage_EDM_FORM20","Courroie","Remplacement courroie","24/08/2019","Benoit.C"]
[null,null,null,null,null,null,null,null,null,"Curatif"]

{"sheet":"Pense-bête","index":12,"n_rows":41,"n_cols":6,"rows_kept":41,"cut":false,"hidden":false,"merged":[[0,2,2,2],[4,5,6,8]]}
[null,null,"Fiche procédure Récapitulatif"]
[]
[]
[]
[null,null,null,null,null,"Préventif"]
[]
[]
[]
[]
[]
{"$rows_left_out":32}
{"sheet":"Ressources","index":13,"n_rows":81,"n_cols":40,"rows_kept":81,"cut":false,"hidden":false,"merged":[[0,0,3,3],[0,4,3,7]]}
["/!\\ NE PAS SUPPRIMER OU MODIFIER L'EXISTANT",null,null,null,"☺  JUSTE RAJOUTER DES INFORMATIONS "]
[]
[]
[]
[]
[]
[null,null,null,null,null,null,null,null,null,null,null,"Benoit.C","Benoit.C","Benoit.M","Benoit.M","Benoit.M","Romain","Michel","Michel","Alexandre","Alexandre","Loïc","Christophe","Christophe","Loïc","Loïc","Christophe","Damien / Henrique / Samuel","Damien / Henrique / Samuel","Jeremy / Jean-Yves","Jeremy / Jean - Yves","Guillaume / Alexis","Manuel","Olivier","Yoann.G","Yoann.G","Olivier","Yannis","Yoann.P","Yoann.P"]
["Pôle","Fraisage","Tournage","Érosion","Rectification","Ajustage","Débit","Équipement_de_support","Équipement_de_contrôle",null,"Équipement","ES1_Compresseur_GENESIS","ES2_Groupe_FROID_ROBOFORM200","EC1_MMT_DEA_GAMMA_1103","EC2_Projecteur_de_profil_SAGEM","EC3_Colonne_de_mesure_TRIMOS","D1_Scie_Ruban_KASTO","A1_Fraiseuse_GAMBIN","A2_Fraiseuse_HOLKE","A3_MICROBILLEUSE","A4_SABLEUSE","RO3_Rectification_CN","E01_Érosion_CN_Enfonçage_ROBOFORM200","E02_Érosion_CN_Enfonçage_EDM_FORM20","E03_Érosion_CN_Découpe_Fil_ROBOFIL2020","E04_Érosion_CN_Découpe_Fil_CUT300","E05_Perçage_Microforage_CCR_Technologie_CR200","F01_Centre_usinage_3_axes_VICTOR","F02_Centre_usinage_3_axes_FEELER","F03_Fraiseuse_5_axes_FPT_TESSEN","F04_Fraiseuse_5_axes_HEDELIUS_BC100","F05_Fraiseuse_5_axes_HEDELIUS_TILENTA_7","F06_Fraiseuse_3_axes_KIHEUNG","T01_Tour_Conv_HERNAULT","T02_Tour_Conv_MÉTAFLEX","T03_Tour_MICROCUT_omnitechnique","T04_Tour_3_et_4_axes_CMZ_TL20M","T05_Tour_3_et_4_axes_CMZ_TA30Y","T06_STARMECA","T07_CAZENEUVE"]
["Fraisage","F01_Centre_usinage_3_axes_VICTOR","T01_Tour_Conv_HERNAULT","E01_Érosion_CN_Enfonçage_ROBOFORM200","RO3_Rectification_CN","A1_Fraiseuse_GAMBIN","D1_Scie_Ruban_KASTO","ES1_Compresseur_GENESIS","EC1_MMT_DEA_GAMMA_1103",null,"ES1_Compresseur_GENESIS","Vidange Huile 3 - 4 L","Nettoyage Filtre à air","Nettoyer le marbre (acétone)","Nettoyage (à l'aide d'une brosse pour le nettoyage optique)","Nettoyage du marbre (acétone)","Vérifier état courroie + variateur","Nettoyage au poste","Nettoyage au poste","Vider le récipient à poussière","Vider le pot à poussière","Lubrifier les glissières - Niveau huile de coupe +ajustage si nécessaire - Huile pneumatique + ajustage si nécessaire","Changement des 4 filtres diélectriques","Changement des 2 filtres diélectriques","Vérification et changement si nécessaire du filtre résidu","Vérification et changement si nécessaire du filtre résidu","Nettoyer pour enlever les résidus","Lubrifier les axes et la broche","Lubrifier les axes et la broche","Nettoyage en profondeur de l'espace de travail de la machine. Examiner l'état du lubrifiant. \nSouffler le filtre à air\nContrôler et ajuster le niveau de graisse blanche(broches)","Nettoyage du double filtre, remplacement si nécessaire","Nettoyage en profondeur de l'espace de travail de la machine. Examiner l'état du lubrifiant. \nSouffler le filtre à air\nContrôler les salissures du fitre fin","Examiner l'état du lubrifiant. \nSouffler le filtre à air. \nContrôler et ajouter si nécessaire de la graisse blanche pour les broches ","Nettoyage complet de toute la poussière, les copeaux et les corps étrangers des pièces mobiles","Nettoyage complet de toute la poussière, les copeaux et les corps étrangers des pièces mobiles","Inspection et si besoin remplissage de l'huile glissière","Inspection et si besoin remplissage de l'huile glissière\nInspection et si besoin remplissage de l'huile hydraulique","Inspection et si besoin remplissage de l'huile glissière\nInspection et si besoin remplissage d l'huile hydraulique","Inspection et si besoin remplissage de l'huile glissière","Inspection et si besoin remplissage de l'huile glissière"]
["Tournage","F02_Centre_usinage_3_axes_FEELER","T02_Tour_Conv_MÉTAFLEX","E02_Érosion_CN_Enfonçage_EDM_FORM20",null,"A2_Fraiseuse_HOLKE",null,"ES2_Groupe_FROID_ROBOFORM200","EC2_Projecteur_de_profil_SAGEM",null,"ES2_Groupe_FROID_ROBOFORM200","Changement Filtres Oléophiles Blanc",null,"Nettoyer et graisser le coulisseau (acétone)",null,null,"Vérifier et Huiler (coupe) si nécessaire - \nVérifier état de la scie\nNettoyer Crépine","Nettoyage approfondi de la machine","Nettoyage approfondi de la machine","Nettoyer le sac","Changer ou nettoyer le filtre","Vidanger le bac à lubrifiant et graisser les axes","Niveau d'huile pour glissière + vidange récipient de récupération","Niveau d'huile pour glissière + vidange récipient de récupération","Changement des 16 filtres eau ","Changement des filtres eau","Soufflage filtre armoire","Lubrification glissière","Lubrification glissière","Nettoyage général du convoyeur à copeaux\nNettoyage général de la machine\nContrôler et ajuster le niveau d'huile hydraulique","Nettoyer en profondeur l'espace de travail de la machine. Examiner l'état du lubrifiant\nSouffler le filtre à air","Nettoyage général du convoyeur à copeaux\nContrôler et ajuster le niveau d'huile pneumatique\nContrôler et ajuster le niveau de lubrification pour les glissières\nNettoyage général de la machine","Nettoyage général du convoyeur à copeaux et du réservoir de lubrifiant.\nContrôler et ajuster le niveau d'huile hydraulique.\nContrôler et ajuster le niveau de lubrification pour les glissières","Nettoyage approdondi. Contrôler l'usure de tous les engrenages et de toutes les garnitures. Stabilité du corps de la machine (Serrer les boulons d'ancrage du corps de la machine au sol et stabiliser le corps de la machine)","Nettoyage approdondi. Contrôler l'usure de tous les engrenages et de toutes les garnitures. Stabilité du corps de la machine (Serrer les boulons d'ancrage du corps de la machine au sol et stabiliser le corps de la machine)","Nettoyage approfondi\nNettoyage filtre à air (armoire électrique)\nNettoyage protection des gissières","Nettoyage approfondi\nNettoyage filtre à air (armoire électrique)\nNettoyage protection des gissières","Nettoyage approfondi\nNettoyage filtre à air (armoire électrique)\nNettoyage protection des gissières","Nettoyage approfondi\nNettoyage filtre à air (armoire électrique)\nNettoyage protection des gissières","Nettoyage approfondi\nNettoyage filtre à air (armoire électrique)\nNettoyage protection des gissières"]
{"$rows_left_out":72}
{"sheet":"Membres","index":14,"n_rows":5,"n_cols":3,"rows_kept":5,"cut":false,"hidden":false,"merged":[]}
[]
[]
[null,"Utilisateur","Mot_de_passe"]
[null,"Jean-Bernard","stage"]
[null,"Benoît","stage"]