{"text_format":"1","workbook":"xlsx","n_sheets":13,"sheets":["Janvier","Février","Mars","Avril","Mai","Juin","Juillet","Août","Septembre","Octobre","Novembre","Décembre","synthe"],"not_rendered":{"charts":0,"images":0,"macros":1,"external_links":0,"defined_names":13,"comments":0,"pivot_tables":0},"unopened":[],"bounds":{"document_bytes":16777216,"sheet_cells":100000,"rows_first":2000,"rows_last":500,"rows_between":2000,"halvings":0,"cell_chars":16384,"cell_head_chars":4096},"cells_cut":0,"cells_raw":0,"read":"whole","date_system":"1900"}

{"sheet":"Janvier","index":0,"n_rows":61,"n_cols":8,"rows_kept":61,"cut":false,"hidden":false,"merged":[[0,1,0,5],[1,1,1,5],[1,7,1,10]]}
[null,"Janvier"]
[{"$f":"synthe!A2","v":"Dépenses"},"Detail",null,null,null,null,"total","commentaire"]
[{"$f":"synthe!A3","v":"abonnement sud ouest"},45,null,null,null,null,{"$f":"SUM(B3:F3)","v":45}]
[{"$f":"synthe!A4","v":"assurance"},125,null,null,null,null,{"$f":"SUM(B4:F4)","v":125}]
[{"$f":"synthe!A5","v":"baie"},3,null,null,null,null,3]
[{"$f":"synthe!A6","v":"bar"},10,null,null,null,null,10]
[{"$f":"synthe!A7","v":"bas"},null,null,75,null,null,75]
[{"$f":"synthe!A8","v":"boulengerie"},null,20,null,null,null,{"$f":"SUM(B8:F8)","v":20}]
[{"$f":"synthe!A9","v":"cadeaux enfant+ journée"},null,null,30,null,null,{"$f":"SUM(B9:F9)","v":30}]
[{"$f":"synthe!A10","v":0},null,null,null,null,null,{"$f":"SUM(B10:F10)","v":0}]
{"$rows_left_out":52}
{"sheet":"Février","index":1,"n_rows":61,"n_cols":8,"rows_kept":61,"cut":false,"hidden":false,"merged":[[0,1,0,5],[1,1,1,5],[1,7,1,10]]}
[null,"Février"]
[{"$f":"synthe!A2","v":"Dépenses"},"Detail",null,null,null,null,"total","commentaire"]
[{"$f":"synthe!A3","v":"abonnement sud ouest"},null,null,null,null,null,{"$f":"SUM(B3:F3)","v":0}]
[{"$f":"synthe!A4","v":"assurance"},null,null,null,null,null,{"$f":"SUM(B4:F4)","v":0}]
[{"$f":"synthe!A5","v":"baie"},null,null,null,null,null,0]
[{"$f":"synthe!A6","v":"bar"},null,null,null,null,null,{"$f":"SUM(B6:F6)","v":0}]
[{"$f":"synthe!A7","v":"bas"},null,null,null,null,null,{"$f":"SUM(B7:F7)","v":0}]
[{"$f":"synthe!A8","v":"boulengerie"},null,null,null,null,null,{"$f":"SUM(B8:F8)","v":0}]
[{"$f":"synthe!A9","v":"cadeaux enfant+ journée"},null,null,null,null,null,{"$f":"SUM(B9:F9)","v":0}]
[{"$f":"synthe!A10","v":0},null,null,null,null,null,{"$f":"SUM(B10:F10)","v":0}]
{"$rows_left_out":52}
{"sheet":"Mars","index":2,"n_rows":61,"n_cols":8,"rows_kept":61,"cut":false,"hidden":false,"merged":[[1,7,1,10],[0,1,0,5],[1,1,1,5]]}
[null,"Mars"]
[{"$f":"synthe!A2","v":"Dépenses"},"Detail",null,null,null,null,"total","commentaire"]
[{"$f":"synthe!A3","v":"abonnement sud ouest"},10]
[{"$f":"synthe!A4","v":"assurance"},null,20]
[{"$f":"synthe!A5","v":"baie"},null,null,30]
[{"$f":"synthe!A6","v":"bar"}]
[{"$f":"synthe!A7","v":"bas"},null,null,null,40]
[{"$f":"synthe!A8","v":"boulengerie"},null,null,null,null,50]
[{"$f":"synthe!A9","v":"cadeaux enfant+ journée"},60]
[{"$f":"synthe!A10","v":0}]
{"$rows_left_out":52}
{"sheet":"Avril","index":3,"n_rows":61,"n_cols":8,"rows_kept":61,"cut":false,"hidden":false,"merged":[[0,1,0,5],[1,1,1,5],[1,7,1,10]]}
[null,"Avril"]
[{"$f":"synthe!A2","v":"Dépenses"},"Detail",null,null,null,null,"total","commentaire"]
[{"$f":"synthe!A3","v":"abonnement sud ouest"},null,null,null,null,null,{"$f":"SUM(B3:F3)","v":0}]
[{"$f":"synthe!A4","v":"assurance"},null,null,null,null,null,{"$f":"SUM(B4:F4)","v":0}]
[{"$f":"synthe!A5","v":"baie"},null,null,null,null,null,0]
[{"$f":"synthe!A6","v":"bar"},null,null,null,null,null,{"$f":"SUM(B6:F6)","v":0}]
[{"$f":"synthe!A7","v":"bas"},null,null,null,null,null,{"$f":"SUM(B7:F7)","v":0}]
[{"$f":"synthe!A8","v":"boulengerie"},null,null,null,null,null,{"$f":"SUM(B8:F8)","v":0}]
[{"$f":"synthe!A9","v":"cadeaux enfant+ journée"},null,null,null,null,null,{"$f":"SUM(B9:F9)","v":0}]
[{"$f":"synthe!A10","v":0},null,null,null,null,null,{"$f":"SUM(B10:F10)","v":0}]
{"$rows_left_out":52}
{"sheet":"Mai","index":4,"n_rows":61,"n_cols":8,"rows_kept":61,"cut":false,"hidden":false,"merged":[[0,1,0,5],[1,1,1,5],[1,7,1,10]]}
[null,"Mai"]
[{"$f":"synthe!A2","v":"Dépenses"},"Detail",null,null,null,null,"total","commentaire"]
[{"$f":"synthe!A3","v":"abonnement sud ouest"},null,null,null,null,null,{"$f":"SUM(B3:F3)","v":0}]
[{"$f":"synthe!A4","v":"assurance"},null,null,null,null,null,{"$f":"SUM(B4:F4)","v":0}]
[{"$f":"synthe!A5","v":"baie"},null,null,null,null,null,0]
[{"$f":"synthe!A6","v":"bar"},null,null,null,null,null,{"$f":"SUM(B6:F6)","v":0}]
[{"$f":"synthe!A7","v":"bas"},null,null,null,null,null,{"$f":"SUM(B7:F7)","v":0}]
[{"$f":"synthe!A8","v":"boulengerie"},null,null,null,null,null,{"$f":"SUM(B8:F8)","v":0}]
[{"$f":"synthe!A9","v":"cadeaux enfant+ journée"},null,null,null,null,null,{"$f":"SUM(B9:F9)","v":0}]
[{"$f":"synthe!A10","v":0},null,null,null,null,null,{"$f":"SUM(B10:F10)","v":0}]
{"$rows_left_out":52}
{"sheet":"Juin","index":5,"n_rows":61,"n_cols":8,"rows_kept":61,"cut":false,"hidden":false,"merged":[[0,1,0,5],[1,1,1,5],[1,7,1,10]]}
[null,"Juin"]
[{"$f":"synthe!A2","v":"Dépenses"},"Detail",null,null,null,null,"total","commentaire"]
[{"$f":"synthe!A3","v":"abonnement sud ouest"},null,null,null,null,null,{"$f":"SUM(B3:F3)","v":0}]
[{"$f":"synthe!A4","v":"assurance"},null,null,null,null,null,{"$f":"SUM(B4:F4)","v":0}]
[{"$f":"synthe!A5","v":"baie"},null,null,null,null,null,0]
[{"$f":"synthe!A6","v":"bar"},null,null,null,null,null,{"$f":"SUM(B6:F6)","v":0}]
[{"$f":"synthe!A7","v":"bas"},null,null,null,null,null,{"$f":"SUM(B7:F7)","v":0}]
[{"$f":"synthe!A8","v":"boulengerie"},null,null,null,null,null,{"$f":"SUM(B8:F8)","v":0}]
[{"$f":"synthe!A9","v":"cadeaux enfant+ journée"},null,null,null,null,null,{"$f":"SUM(B9:F9)","v":0}]
[{"$f":"synthe!A10","v":0},null,null,null,null,null,{"$f":"SUM(B10:F10)","v":0}]
{"$rows_left_out":52}
{"sheet":"Juillet","index":6,"n_rows":61,"n_cols":8,"rows_kept":61,"cut":false,"hidden":false,"merged":[[0,1,0,5],[1,1,1,5],[1,7,1,10]]}
[null,"Juillet"]
[{"$f":"synthe!A2","v":"Dépenses"},"Detail",null,null,null,null,"total","commentaire"]
[{"$f":"synthe!A3","v":"abonnement sud ouest"},null,null,null,null,null,{"$f":"SUM(B3:F3)","v":0}]
[{"$f":"synthe!A4","v":"assurance"},null,null,null,null,null,{"$f":"SUM(B4:F4)","v":0}]
[{"$f":"synthe!A5","v":"baie"},null,null,null,null,null,0]
[{"$f":"synthe!A6","v":"bar"},null,null,null,null,null,{"$f":"SUM(B6:F6)","v":0}]
[{"$f":"synthe!A7","v":"bas"},null,null,null,null,null,{"$f":"SUM(B7:F7)","v":0}]
[{"$f":"synthe!A8","v":"boulengerie"},null,null,null,null,null,{"$f":"SUM(B8:F8)","v":0}]
[{"$f":"synthe!A9","v":"cadeaux enfant+ journée"},null,null,null,null,null,{"$f":"SUM(B9:F9)","v":0}]
[{"$f":"synthe!A10","v":0},null,null,null,null,null,{"$f":"SUM(B10:F10)","v":0}]
{"$rows_left_out":52}
{"sheet":"Août","index":7,"n_rows":61,"n_cols":8,"rows_kept":61,"cut":false,"hidden":false,"merged":[[0,1,0,5],[1,1,1,5],[1,7,1,10]]}
[null,"Août"]
[{"$f":"synthe!A2","v":"Dépenses"},"Detail",null,null,null,null,"total","commentaire"]
[{"$f":"synthe!A3","v":"abonnement sud ouest"},null,null,null,null,null,{"$f":"SUM(B3:F3)","v":0}]
[{"$f":"synthe!A4","v":"assurance"},null,null,null,null,null,{"$f":"SUM(B4:F4)","v":0}]
[{"$f":"synthe!A5","v":"baie"},null,null,null,null,null,0]
[{"$f":"synthe!A6","v":"bar"},null,null,null,null,null,{"$f":"SUM(B6:F6)","v":0}]
[{"$f":"synthe!A7","v":"bas"},null,null,null,null,null,{"$f":"SUM(B7:F7)","v":0}]
[{"$f":"synthe!A8","v":"boulengerie"},null,null,null,null,null,{"$f":"SUM(B8:F8)","v":0}]
[{"$f":"synthe!A9","v":"cadeaux enfant+ journée"},null,null,null,null,null,{"$f":"SUM(B9:F9)","v":0}]
[{"$f":"synthe!A10","v":0},null,null,null,null,null,{"$f":"SUM(B10:F10)","v":0}]
{"$rows_left_out":52}
{"sheet":"Septembre","index":8,"n_rows":61,"n_cols":8,"rows_kept":61,"cut":false,"hidden":false,"merged":[[0,1,0,5],[1,1,1,5],[1,7,1,10]]}
[null,"Septembre"]
[{"$f":"synthe!A2","v":"Dépenses"},"Detail",null,null,null,null,"total","commentaire"]
[{"$f":"synthe!A3","v":"abonnement sud ouest"},null,null,null,null,null,{"$f":"SUM(B3:F3)","v":0}]
[{"$f":"synthe!A4","v":"assurance"},null,null,null,null,null,{"$f":"SUM(B4:F4)","v":0}]
[{"$f":"synthe!A5","v":"baie"},null,null,null,null,null,0]
[{"$f":"synthe!A6","v":"bar"},null,null,null,null,null,{"$f":"SUM(B6:F6)","v":0}]
[{"$f":"synthe!A7","v":"bas"},null,null,null,null,null,{"$f":"SUM(B7:F7)","v":0}]
[{"$f":"synthe!A8","v":"boulengerie"},null,null,null,null,null,{"$f":"SUM(B8:F8)","v":0}]
[{"$f":"synthe!A9","v":"cadeaux enfant+ journée"},null,null,null,null,null,{"$f":"SUM(B9:F9)","v":0}]
[{"$f":"synthe!A10","v":0},null,null,null,null,null,{"$f":"SUM(B10:F10)","v":0}]
{"$rows_left_out":52}
{"sheet":"Octobre","index":9,"n_rows":61,"n_cols":8,"rows_kept":61,"cut":false,"hidden":false,"merged":[[0,1,0,5],[1,1,1,5],[1,7,1,10]]}
[null,"Octobre"]
[{"$f":"synthe!A2","v":"Dépenses"},"Detail",null,null,null,null,"total","commentaire"]
[{"$f":"synthe!A3","v":"abonnement sud ouest"},null,null,null,null,null,{"$f":"SUM(B3:F3)","v":0}]
[{"$f":"synthe!A4","v":"assurance"},null,null,null,null,null,{"$f":"SUM(B4:F4)","v":0}]
[{"$f":"synthe!A5","v":"baie"},null,null,null,null,null,0]
[{"$f":"synthe!A6","v":"bar"},null,null,null,null,null,{"$f":"SUM(B6:F6)","v":0}]
[{"$f":"synthe!A7","v":"bas"},null,null,null,null,null,{"$f":"SUM(B7:F7)","v":0}]
[{"$f":"synthe!A8","v":"boulengerie"},null,null,null,null,null,{"$f":"SUM(B8:F8)","v":0}]
[{"$f":"synthe!A9","v":"cadeaux enfant+ journée"},null,null,null,null,null,{"$f":"SUM(B9:F9)","v":0}]
[{"$f":"synthe!A10","v":0},null,null,null,null,null,{"$f":"SUM(B10:F10)","v":0}]
{"$rows_left_out":52}
{"sheet":"Novembre","index":10,"n_rows":61,"n_cols":8,"rows_kept":61,"cut":false,"hidden":false,"merged":[[0,1,0,5],[1,1,1,5],[1,7,1,10]]}
[null,"Novembre"]
[{"$f":"synthe!A2","v":"Dépenses"},"Detail",null,null,null,null,"total","commentaire"]
[{"$f":"synthe!A3","v":"abonnement sud ouest"},null,null,null,null,null,{"$f":"SUM(B3:F3)","v":0}]
[{"$f":"synthe!A4","v":"assurance"},null,null,null,null,null,{"$f":"SUM(B4:F4)","v":0}]
[{"$f":"synthe!A5","v":"baie"},null,null,null,null,null,0]
[{"$f":"synthe!A6","v":"bar"},null,null,null,null,null,{"$f":"SUM(B6:F6)","v":0}]
[{"$f":"synthe!A7","v":"bas"},null,null,null,null,null,{"$f":"SUM(B7:F7)","v":0}]
[{"$f":"synthe!A8","v":"boulengerie"},null,null,null,null,null,{"$f":"SUM(B8:F8)","v":0}]
[{"$f":"synthe!A9","v":"cadeaux enfant+ journée"},null,null,null,null,null,{"$f":"SUM(B9:F9)","v":0}]
[{"$f":"synthe!A10","v":0},null,null,null,null,null,{"$f":"SUM(B10:F10)","v":0}]
{"$rows_left_out":52}
{"sheet":"Décembre","index":11,"n_rows":61,"n_cols":8,"rows_kept":61,"cut":false,"hidden":false,"merged":[[0,1,0,5],[1,1,1,5],[1,7,1,10]]}
[null,"Décembre"]
[{"$f":"synthe!A2","v":"Dépenses"},"Detail",null,null,null,null,"total","commentaire"]
[{"$f":"synthe!A3","v":"abonnement sud ouest"},null,null,null,null,null,{"$f":"SUM(B3:F3)","v":0}]
[{"$f":"synthe!A4","v":"assurance"},null,null,null,null,null,{"$f":"SUM(B4:F4)","v":0}]
[{"$f":"synthe!A5","v":"baie"},null,null,null,null,null,0]
[{"$f":"synthe!A6","v":"bar"},null,null,null,null,null,{"$f":"SUM(B6:F6)","v":0}]
[{"$f":"synthe!A7","v":"bas"},null,null,null,null,null,{"$f":"SUM(B7:F7)","v":0}]
[{"$f":"synthe!A8","v":"boulengerie"},null,null,null,null,null,{"$f":"SUM(B8:F8)","v":0}]
[{"$f":"synthe!A9","v":"cadeaux enfant+ journée"},null,null,null,null,null,{"$f":"SUM(B9:F9)","v":0}]
[{"$f":"synthe!A10","v":0},null,null,null,null,null,{"$f":"SUM(B10:F10)","v":0}]
{"$rows_left_out":52}
{"sheet":"synthe","index":12,"n_rows":61,"n_cols":16,"rows_kept":61,"cut":false,"hidden":false,"merged":[]}
[]
["Dépenses","Mar","Avr","Mai","Juin","Juil","Aou","Sep","Oct","Nov","Déc","Jan","Fev","Total","Total N-1","Diff"]
["abonnement sud ouest",{"$f":"INDEX(Mars!$G$3:$G$47,MATCH($A3,Mars!$A$3:$A$47,0))","v":0},{"$f":"INDEX(Avril!$G$3:$G$47,MATCH($A3,Avril!$A$3:$A$47,0))","v":0},{"$f":"INDEX(Mai!$G$3:$G$47,MATCH($A3,Mai!$A$3:$A$47,0))","v":0},{"$f":"INDEX(Juin!$G$3:$G$47,MATCH($A3,Juin!$A$3:$A$47,0))","v":0},{"$f":"INDEX(Juillet!$G$3:$G$47,MATCH($A3,Juillet!$A$3:$A$47,0))","v":0},{"$f":"INDEX(Août!$G$3:$G$47,MATCH($A3,Août!$A$3:$A$47,0))","v":0},{"$f":"INDEX(Septembre!$G$3:$G$47,MATCH($A3,Septembre!$A$3:$A$47,0))","v":0},{"$f":"INDEX(Octobre!$G$3:$G$47,MATCH($A3,Octobre!$A$3:$A$47,0))","v":0},{"$f":"INDEX(Novembre!$G$3:$G$47,MATCH($A3,Novembre!$A$3:$A$47,0))","v":0},{"$f":"INDEX(Décembre!$G$3:$G$47,MATCH($A3,Décembre!$A$3:$A$47,0))","v":0},{"$f":"INDEX(Janvier!$G$3:$G$47,MATCH($A3,Janvier!$A$3:$A$47,0))","v":45},{"$f":"INDEX(Février!$G$3:$G$47,MATCH($A3,Février!$A$3:$A$47,0))","v":0},{"$f":"SUM(Tableau1[[#This Row],[Mar]:[Fev]])","v":45}]
["assurance",{"$f":"INDEX(Mars!$G$3:$G$47,MATCH($A4,Mars!$A$3:$A$47,0))","v":0},{"$f":"INDEX(Avril!$G$3:$G$47,MATCH($A4,Avril!$A$3:$A$47,0))","v":0},{"$f":"INDEX(Mai!$G$3:$G$47,MATCH($A4,Mai!$A$3:$A$47,0))","v":0},{"$f":"INDEX(Juin!$G$3:$G$47,MATCH($A4,Juin!$A$3:$A$47,0))","v":0},{"$f":"INDEX(Juillet!$G$3:$G$47,MATCH($A4,Juillet!$A$3:$A$47,0))","v":0},{"$f":"INDEX(Août!$G$3:$G$47,MATCH($A4,Août!$A$3:$A$47,0))","v":0},{"$f":"INDEX(Septembre!$G$3:$G$47,MATCH($A4,Septembre!$A$3:$A$47,0))","v":0},{"$f":"INDEX(Octobre!$G$3:$G$47,MATCH($A4,Octobre!$A$3:$A$47,0))","v":0},{"$f":"INDEX(Novembre!$G$3:$G$47,MATCH($A4,Novembre!$A$3:$A$47,0))","v":0},{"$f":"INDEX(Décembre!$G$3:$G$47,MATCH($A4,Décembre!$A$3:$A$47,0))","v":0},{"$f":"INDEX(Janvier!$G$3:$G$47,MATCH($A4,Janvier!$A$3:$A$47,0))","v":125},{"$f":"INDEX(Février!$G$3:$G$47,MATCH($A4,Février!$A$3:$A$47,0))","v":0},{"$f":"SUM(Tableau1[[#This Row],[Mar]:[Fev]])","v":125}]
["baie",{"$f":"INDEX(Mars!$G$3:$G$47,MATCH($A5,Mars!$A$3:$A$47,0))","v":0},{"$f":"INDEX(Avril!$G$3:$G$47,MATCH($A5,Avril!$A$3:$A$47,0))","v":0},{"$f":"INDEX(Mai!$G$3:$G$47,MATCH($A5,Mai!$A$3:$A$47,0))","v":0},{"$f":"INDEX(Juin!$G$3:$G$47,MATCH($A5,Juin!$A$3:$A$47,0))","v":0},{"$f":"INDEX(Juillet!$G$3:$G$47,MATCH($A5,Juillet!$A$3:$A$47,0))","v":0},{"$f":"INDEX(Août!$G$3:$G$47,MATCH($A5,Août!$A$3:$A$47,0))","v":0},{"$f":"INDEX(Septembre!$G$3:$G$47,MATCH($A5,Septembre!$A$3:$A$47,0))","v":0},{"$f":"INDEX(Octobre!$G$3:$G$47,MATCH($A5,Octobre!$A$3:$A$47,0))","v":0},{"$f":"INDEX(Novembre!$G$3:$G$47,MATCH($A5,Novembre!$A$3:$A$47,0))","v":0},{"$f":"INDEX(Décembre!$G$3:$G$47,MATCH($A5,Décembre!$A$3:$A$47,0))","v":0},{"$f":"INDEX(Janvier!$G$3:$G$47,MATCH($A5,Janvier!$A$3:$A$47,0))","v":3},{"$f":"INDEX(Février!$G$3:$G$47,MATCH($A5,Février!$A$3:$A$47,0))","v":0},{"$f":"SUM(Tableau1[[#This Row],[Mar]:[Fev]])","v":3}]
["bar",{"$f":"INDEX(Mars!$G$3:$G$47,MATCH($A6,Mars!$A$3:$A$47,0))","v":0},{"$f":"INDEX(Avril!$G$3:$G$47,MATCH($A6,Avril!$A$3:$A$47,0))","v":0},{"$f":"INDEX(Mai!$G$3:$G$47,MATCH($A6,Mai!$A$3:$A$47,0))","v":0},{"$f":"INDEX(Juin!$G$3:$G$47,MATCH($A6,Juin!$A$3:$A$47,0))","v":0},{"$f":"INDEX(Juillet!$G$3:$G$47,MATCH($A6,Juillet!$A$3:$A$47,0))","v":0},{"$f":"INDEX(Août!$G$3:$G$47,MATCH($A6,Août!$A$3:$A$47,0))","v":0},{"$f":"INDEX(Septembre!$G$3:$G$47,MATCH($A6,Septembre!$A$3:$A$47,0))","v":0},{"$f":"INDEX(Octobre!$G$3:$G$47,MATCH($A6,Octobre!$A$3:$A$47,0))","v":0},{"$f":"INDEX(Novembre!$G$3:$G$47,MATCH($A6,Novembre!$A$3:$A$47,0))","v":0},{"$f":"INDEX(Décembre!$G$3:$G$47,MATCH($A6,Décembre!$A$3:$A$47,0))","v":0},{"$f":"INDEX(Janvier!$G$3:$G$47,MATCH($A6,Janvier!$A$3:$A$47,0))","v":10},{"$f":"INDEX(Février!$G$3:$G$47,MATCH($A6,Février!$A$3:$A$47,0))","v":0},{"$f":"SUM(Tableau1[[#This Row],[Mar]:[Fev]])","v":10}]
["bas",{"$f":"INDEX(Mars!$G$3:$G$47,MATCH($A7,Mars!$A$3:$A$47,0))","v":0},{"$f":"INDEX(Avril!$G$3:$G$47,MATCH($A7,Avril!$A$3:$A$47,0))","v":0},{"$f":"INDEX(Mai!$G$3:$G$47,MATCH($A7,Mai!$A$3:$A$47,0))","v":0},{"$f":"INDEX(Juin!$G$3:$G$47,MATCH($A7,Juin!$A$3:$A$47,0))","v":0},{"$f":"INDEX(Juillet!$G$3:$G$47,MATCH($A7,Juillet!$A$3:$A$47,0))","v":0},{"$f":"INDEX(Août!$G$3:$G$47,MATCH($A7,Août!$A$3:$A$47,0))","v":0},{"$f":"INDEX(Septembre!$G$3:$G$47,MATCH($A7,Septembre!$A$3:$A$47,0))","v":0},{"$f":"INDEX(Octobre!$G$3:$G$47,MATCH($A7,Octobre!$A$3:$A$47,0))","v":0},{"$f":"INDEX(Novembre!$G$3:$G$47,MATCH($A7,Novembre!$A$3:$A$47,0))","v":0},{"$f":"INDEX(Décembre!$G$3:$G$47,MATCH($A7,Décembre!$A$3:$A$47,0))","v":0},{"$f":"INDEX(Janvier!$G$3:$G$47,MATCH($A7,Janvier!$A$3:$A$47,0))","v":75},{"$f":"INDEX(Février!$G$3:$G$47,MATCH($A7,Février!$A$3:$A$47,0))","v":0},{"$f":"SUM(Tableau1[[#This Row],[Mar]:[Fev]])","v":75}]
["boulengerie",{"$f":"INDEX(Mars!$G$3:$G$47,MATCH($A8,Mars!$A$3:$A$47,0))","v":0},{"$f":"INDEX(Avril!$G$3:$G$47,MATCH($A8,Avril!$A$3:$A$47,0))","v":0},{"$f":"INDEX(Mai!$G$3:$G$47,MATCH($A8,Mai!$A$3:$A$47,0))","v":0},{"$f":"INDEX(Juin!$G$3:$G$47,MATCH($A8,Juin!$A$3:$A$47,0))","v":0},{"$f":"INDEX(Juillet!$G$3:$G$47,MATCH($A8,Juillet!$A$3:$A$47,0))","v":0},{"$f":"INDEX(Août!$G$3:$G$47,MATCH($A8,Août!$A$3:$A$47,0))","v":0},{"$f":"INDEX(Septembre!$G$3:$G$47,MATCH($A8,Septembre!$A$3:$A$47,0))","v":0},{"$f":"INDEX(Octobre!$G$3:$G$47,MATCH($A8,Octobre!$A$3:$A$47,0))","v":0},{"$f":"INDEX(Novembre!$G$3:$G$47,MATCH($A8,Novembre!$A$3:$A$47,0))","v":0},{"$f":"INDEX(Décembre!$G$3:$G$47,MATCH($A8,Décembre!$A$3:$A$47,0))","v":0},{"$f":"INDEX(Janvier!$G$3:$G$47,MATCH($A8,Janvier!$A$3:$A$47,0))","v":20},{"$f":"INDEX(Février!$G$3:$G$47,MATCH($A8,Février!$A$3:$A$47,0))","v":0},{"$f":"SUM(Tableau1[[#This Row],[Mar]:[Fev]])","v":20}]
["cadeaux enfant+ journée",{"$f":"INDEX(Mars!$G$3:$G$47,MATCH($A9,Mars!$A$3:$A$47,0))","v":0},{"$f":"INDEX(Avril!$G$3:$G$47,MATCH($A9,Avril!$A$3:$A$47,0))","v":0},{"$f":"INDEX(Mai!$G$3:$G$47,MATCH($A9,Mai!$A$3:$A$47,0))","v":0},{"$f":"INDEX(Juin!$G$3:$G$47,MATCH($A9,Juin!$A$3:$A$47,0))","v":0},{"$f":"INDEX(Juillet!$G$3:$G$47,MATCH($A9,Juillet!$A$3:$A$47,0))","v":0},{"$f":"INDEX(Août!$G$3:$G$47,MATCH($A9,Août!$A$3:$A$47,0))","v":0},{"$f":"INDEX(Septembre!$G$3:$G$47,MATCH($A9,Septembre!$A$3:$A$47,0))","v":0},{"$f":"INDEX(Octobre!$G$3:$G$47,MATCH($A9,Octobre!$A$3:$A$47,0))","v":0},{"$f":"INDEX(Novembre!$G$3:$G$47,MATCH($A9,Novembre!$A$3:$A$47,0))","v":0},{"$f":"INDEX(Décembre!$G$3:$G$47,MATCH($A9,Décembre!$A$3:$A$47,0))","v":0},{"$f":"INDEX(Janvier!$G$3:$G$47,MATCH($A9,Janvier!$A$3:$A$47,0))","v":30},{"$f":"INDEX(Février!$G$3:$G$47,MATCH($A9,Février!$A$3:$A$47,0))","v":0},{"$f":"SUM(Tableau1[[#This Row],[Mar]:[Fev]])","v":30}]
[null,{"$f":"INDEX(Mars!$G$3:$G$47,MATCH($A10,Mars!$A$3:$A$47,0))","v":0},{"$f":"INDEX(Avril!$G$3:$G$47,MATCH($A10,Avril!$A$3:$A$47,0))","v":0},{"$f":"INDEX(Mai!$G$3:$G$47,MATCH($A10,Mai!$A$3:$A$47,0))","v":0},{"$f":"INDEX(Juin!$G$3:$G$47,MATCH($A10,Juin!$A$3:$A$47,0))","v":0},{"$f":"INDEX(Juillet!$G$3:$G$47,MATCH($A10,Juillet!$A$3:$A$47,0))","v":0},{"$f":"INDEX(Août!$G$3:$G$47,MATCH($A10,Août!$A$3:$A$47,0))","v":0},{"$f":"INDEX(Septembre!$G$3:$G$47,MATCH($A10,Septembre!$A$3:$A$47,0))","v":0},{"$f":"INDEX(Octobre!$G$3:$G$47,MATCH($A10,Octobre!$A$3:$A$47,0))","v":0},{"$f":"INDEX(Novembre!$G$3:$G$47,MATCH($A10,Novembre!$A$3:$A$47,0))","v":0},{"$f":"INDEX(Décembre!$G$3:$G$47,MATCH($A10,Décembre!$A$3:$A$47,0))","v":0},{"$f":"INDEX(Janvier!$G$3:$G$47,MATCH($A10,Janvier!$A$3:$A$47,0))","v":0},{"$f":"INDEX(Février!$G$3:$G$47,MATCH($A10,Février!$A$3:$A$47,0))","v":0},{"$f":"SUM(Tableau1[[#This Row],[Mar]:[Fev]])","v":0}]
{"$rows_left_out":51}